lucene-dev mailing list archives

Site index · List index
Message view « Date » · « Thread »
Top « Date » · « Thread »
From Policeman Jenkins Server <jenk...@thetaphi.de>
Subject [JENKINS] Lucene-Solr-trunk-Linux (64bit/jdk1.8.0_72) - Build # 15892 - Failure!
Date Mon, 15 Feb 2016 19:33:45 GMT
Build: http://jenkins.thetaphi.de/job/Lucene-Solr-trunk-Linux/15892/
Java: 64bit/jdk1.8.0_72 -XX:+UseCompressedOops -XX:+UseConcMarkSweepGC

2 tests failed.
FAILED:  org.apache.solr.client.solrj.ConnectionReuseTest.test

Error Message:
We expected all communication via streaming client to use one connection! expected=128 got=125

Stack Trace:
java.lang.AssertionError: We expected all communication via streaming client to use one connection! expected=128 got=125
	at __randomizedtesting.SeedInfo.seed([E9A53D57A79CF6B8:61F1028D09609B40]:0)
	at org.junit.Assert.fail(Assert.java:93)
	at org.junit.Assert.assertTrue(Assert.java:43)
	at org.apache.solr.client.solrj.ConnectionReuseTest.test(ConnectionReuseTest.java:150)
	at sun.reflect.NativeMethodAccessorImpl.invoke0(Native Method)
	at sun.reflect.NativeMethodAccessorImpl.invoke(NativeMethodAccessorImpl.java:62)
	at sun.reflect.DelegatingMethodAccessorImpl.invoke(DelegatingMethodAccessorImpl.java:43)
	at java.lang.reflect.Method.invoke(Method.java:498)
	at com.carrotsearch.randomizedtesting.RandomizedRunner.invoke(RandomizedRunner.java:1764)
	at com.carrotsearch.randomizedtesting.RandomizedRunner$8.evaluate(RandomizedRunner.java:871)
	at com.carrotsearch.randomizedtesting.RandomizedRunner$9.evaluate(RandomizedRunner.java:907)
	at com.carrotsearch.randomizedtesting.RandomizedRunner$10.evaluate(RandomizedRunner.java:921)
	at org.apache.solr.BaseDistributedSearchTestCase$ShardsRepeatRule$ShardsFixedStatement.callStatement(BaseDistributedSearchTestCase.java:964)
	at org.apache.solr.BaseDistributedSearchTestCase$ShardsRepeatRule$ShardsStatement.evaluate(BaseDistributedSearchTestCase.java:939)
	at com.carrotsearch.randomizedtesting.rules.SystemPropertiesRestoreRule$1.evaluate(SystemPropertiesRestoreRule.java:57)
	at org.apache.lucene.util.TestRuleSetupTeardownChained$1.evaluate(TestRuleSetupTeardownChained.java:49)
	at org.apache.lucene.util.AbstractBeforeAfterRule$1.evaluate(AbstractBeforeAfterRule.java:45)
	at org.apache.lucene.util.TestRuleThreadAndTestName$1.evaluate(TestRuleThreadAndTestName.java:48)
	at org.apache.lucene.util.TestRuleIgnoreAfterMaxFailures$1.evaluate(TestRuleIgnoreAfterMaxFailures.java:64)
	at org.apache.lucene.util.TestRuleMarkFailure$1.evaluate(TestRuleMarkFailure.java:47)
	at com.carrotsearch.randomizedtesting.rules.StatementAdapter.evaluate(StatementAdapter.java:36)
	at com.carrotsearch.randomizedtesting.ThreadLeakControl$StatementRunner.run(ThreadLeakControl.java:367)
	at com.carrotsearch.randomizedtesting.ThreadLeakControl.forkTimeoutingTask(ThreadLeakControl.java:809)
	at com.carrotsearch.randomizedtesting.ThreadLeakControl$3.evaluate(ThreadLeakControl.java:460)
	at com.carrotsearch.randomizedtesting.RandomizedRunner.runSingleTest(RandomizedRunner.java:880)
	at com.carrotsearch.randomizedtesting.RandomizedRunner$5.evaluate(RandomizedRunner.java:781)
	at com.carrotsearch.randomizedtesting.RandomizedRunner$6.evaluate(RandomizedRunner.java:816)
	at com.carrotsearch.randomizedtesting.RandomizedRunner$7.evaluate(RandomizedRunner.java:827)
	at com.carrotsearch.randomizedtesting.rules.StatementAdapter.evaluate(StatementAdapter.java:36)
	at com.carrotsearch.randomizedtesting.rules.SystemPropertiesRestoreRule$1.evaluate(SystemPropertiesRestoreRule.java:57)
	at org.apache.lucene.util.AbstractBeforeAfterRule$1.evaluate(AbstractBeforeAfterRule.java:45)
	at com.carrotsearch.randomizedtesting.rules.StatementAdapter.evaluate(StatementAdapter.java:36)
	at org.apache.lucene.util.TestRuleStoreClassName$1.evaluate(TestRuleStoreClassName.java:41)
	at com.carrotsearch.randomizedtesting.rules.NoShadowingOrOverridesOnMethodsRule$1.evaluate(NoShadowingOrOverridesOnMethodsRule.java:40)
	at com.carrotsearch.randomizedtesting.rules.NoShadowingOrOverridesOnMethodsRule$1.evaluate(NoShadowingOrOverridesOnMethodsRule.java:40)
	at com.carrotsearch.randomizedtesting.rules.StatementAdapter.evaluate(StatementAdapter.java:36)
	at com.carrotsearch.randomizedtesting.rules.StatementAdapter.evaluate(StatementAdapter.java:36)
	at com.carrotsearch.randomizedtesting.rules.StatementAdapter.evaluate(StatementAdapter.java:36)
	at org.apache.lucene.util.TestRuleAssertionsRequired$1.evaluate(TestRuleAssertionsRequired.java:53)
	at org.apache.lucene.util.TestRuleMarkFailure$1.evaluate(TestRuleMarkFailure.java:47)
	at org.apache.lucene.util.TestRuleIgnoreAfterMaxFailures$1.evaluate(TestRuleIgnoreAfterMaxFailures.java:64)
	at org.apache.lucene.util.TestRuleIgnoreTestSuites$1.evaluate(TestRuleIgnoreTestSuites.java:54)
	at com.carrotsearch.randomizedtesting.rules.StatementAdapter.evaluate(StatementAdapter.java:36)
	at com.carrotsearch.randomizedtesting.ThreadLeakControl$StatementRunner.run(ThreadLeakControl.java:367)
	at java.lang.Thread.run(Thread.java:745)


FAILED:  org.apache.solr.cloud.ChaosMonkeyNothingIsSafeTest.test

Error Message:
Error from server at http://127.0.0.1:35258: collection already exists: testcollection

Stack Trace:
org.apache.solr.client.solrj.impl.HttpSolrClient$RemoteSolrException: Error from server at http://127.0.0.1:35258: collection already exists: testcollection
	at __randomizedtesting.SeedInfo.seed([E9A53D57A79CF6B8:61F1028D09609B40]:0)
	at org.apache.solr.client.solrj.impl.HttpSolrClient.executeMethod(HttpSolrClient.java:577)
	at org.apache.solr.client.solrj.impl.HttpSolrClient.request(HttpSolrClient.java:241)
	at org.apache.solr.client.solrj.impl.HttpSolrClient.request(HttpSolrClient.java:230)
	at org.apache.solr.client.solrj.impl.LBHttpSolrClient.doRequest(LBHttpSolrClient.java:372)
	at org.apache.solr.client.solrj.impl.LBHttpSolrClient.request(LBHttpSolrClient.java:325)
	at org.apache.solr.client.solrj.impl.CloudSolrClient.sendRequest(CloudSolrClient.java:1099)
	at org.apache.solr.client.solrj.impl.CloudSolrClient.requestWithRetryOnStaleState(CloudSolrClient.java:870)
	at org.apache.solr.client.solrj.impl.CloudSolrClient.request(CloudSolrClient.java:806)
	at org.apache.solr.client.solrj.SolrClient.request(SolrClient.java:1219)
	at org.apache.solr.cloud.AbstractFullDistribZkTestBase.createCollection(AbstractFullDistribZkTestBase.java:1593)
	at org.apache.solr.cloud.AbstractFullDistribZkTestBase.createCollection(AbstractFullDistribZkTestBase.java:1614)
	at org.apache.solr.cloud.ChaosMonkeyNothingIsSafeTest.test(ChaosMonkeyNothingIsSafeTest.java:249)
	at sun.reflect.NativeMethodAccessorImpl.invoke0(Native Method)
	at sun.reflect.NativeMethodAccessorImpl.invoke(NativeMethodAccessorImpl.java:62)
	at sun.reflect.DelegatingMethodAccessorImpl.invoke(DelegatingMethodAccessorImpl.java:43)
	at java.lang.reflect.Method.invoke(Method.java:498)
	at com.carrotsearch.randomizedtesting.RandomizedRunner.invoke(RandomizedRunner.java:1764)
	at com.carrotsearch.randomizedtesting.RandomizedRunner$8.evaluate(RandomizedRunner.java:871)
	at com.carrotsearch.randomizedtesting.RandomizedRunner$9.evaluate(RandomizedRunner.java:907)
	at com.carrotsearch.randomizedtesting.RandomizedRunner$10.evaluate(RandomizedRunner.java:921)
	at org.apache.solr.BaseDistributedSearchTestCase$ShardsRepeatRule$ShardsFixedStatement.callStatement(BaseDistributedSearchTestCase.java:964)
	at org.apache.solr.BaseDistributedSearchTestCase$ShardsRepeatRule$ShardsStatement.evaluate(BaseDistributedSearchTestCase.java:939)
	at com.carrotsearch.randomizedtesting.rules.SystemPropertiesRestoreRule$1.evaluate(SystemPropertiesRestoreRule.java:57)
	at org.apache.lucene.util.TestRuleSetupTeardownChained$1.evaluate(TestRuleSetupTeardownChained.java:49)
	at org.apache.lucene.util.AbstractBeforeAfterRule$1.evaluate(AbstractBeforeAfterRule.java:45)
	at org.apache.lucene.util.TestRuleThreadAndTestName$1.evaluate(TestRuleThreadAndTestName.java:48)
	at org.apache.lucene.util.TestRuleIgnoreAfterMaxFailures$1.evaluate(TestRuleIgnoreAfterMaxFailures.java:64)
	at org.apache.lucene.util.TestRuleMarkFailure$1.evaluate(TestRuleMarkFailure.java:47)
	at com.carrotsearch.randomizedtesting.rules.StatementAdapter.evaluate(StatementAdapter.java:36)
	at com.carrotsearch.randomizedtesting.ThreadLeakControl$StatementRunner.run(ThreadLeakControl.java:367)
	at com.carrotsearch.randomizedtesting.ThreadLeakControl.forkTimeoutingTask(ThreadLeakControl.java:809)
	at com.carrotsearch.randomizedtesting.ThreadLeakControl$3.evaluate(ThreadLeakControl.java:460)
	at com.carrotsearch.randomizedtesting.RandomizedRunner.runSingleTest(RandomizedRunner.java:880)
	at com.carrotsearch.randomizedtesting.RandomizedRunner$5.evaluate(RandomizedRunner.java:781)
	at com.carrotsearch.randomizedtesting.RandomizedRunner$6.evaluate(RandomizedRunner.java:816)
	at com.carrotsearch.randomizedtesting.RandomizedRunner$7.evaluate(RandomizedRunner.java:827)
	at com.carrotsearch.randomizedtesting.rules.StatementAdapter.evaluate(StatementAdapter.java:36)
	at com.carrotsearch.randomizedtesting.rules.SystemPropertiesRestoreRule$1.evaluate(SystemPropertiesRestoreRule.java:57)
	at org.apache.lucene.util.AbstractBeforeAfterRule$1.evaluate(AbstractBeforeAfterRule.java:45)
	at com.carrotsearch.randomizedtesting.rules.StatementAdapter.evaluate(StatementAdapter.java:36)
	at org.apache.lucene.util.TestRuleStoreClassName$1.evaluate(TestRuleStoreClassName.java:41)
	at com.carrotsearch.randomizedtesting.rules.NoShadowingOrOverridesOnMethodsRule$1.evaluate(NoShadowingOrOverridesOnMethodsRule.java:40)
	at com.carrotsearch.randomizedtesting.rules.NoShadowingOrOverridesOnMethodsRule$1.evaluate(NoShadowingOrOverridesOnMethodsRule.java:40)
	at com.carrotsearch.randomizedtesting.rules.StatementAdapter.evaluate(StatementAdapter.java:36)
	at com.carrotsearch.randomizedtesting.rules.StatementAdapter.evaluate(StatementAdapter.java:36)
	at com.carrotsearch.randomizedtesting.rules.StatementAdapter.evaluate(StatementAdapter.java:36)
	at org.apache.lucene.util.TestRuleAssertionsRequired$1.evaluate(TestRuleAssertionsRequired.java:53)
	at org.apache.lucene.util.TestRuleMarkFailure$1.evaluate(TestRuleMarkFailure.java:47)
	at org.apache.lucene.util.TestRuleIgnoreAfterMaxFailures$1.evaluate(TestRuleIgnoreAfterMaxFailures.java:64)
	at org.apache.lucene.util.TestRuleIgnoreTestSuites$1.evaluate(TestRuleIgnoreTestSuites.java:54)
	at com.carrotsearch.randomizedtesting.rules.StatementAdapter.evaluate(StatementAdapter.java:36)
	at com.carrotsearch.randomizedtesting.ThreadLeakControl$StatementRunner.run(ThreadLeakControl.java:367)
	at java.lang.Thread.run(Thread.java:745)




Build Log:
[...truncated 10858 lines...]
   [junit4] Suite: org.apache.solr.client.solrj.ConnectionReuseTest
   [junit4]   2> Creating dataDir: /home/jenkins/workspace/Lucene-Solr-trunk-Linux/solr/build/solr-core/test/J0/temp/solr.client.solrj.ConnectionReuseTest_E9A53D57A79CF6B8-001/init-core-data-001
   [junit4]   2> 621511 INFO  (SUITE-ConnectionReuseTest-seed#[E9A53D57A79CF6B8]-worker) [    ] o.a.s.BaseDistributedSearchTestCase Setting hostContext system property: /
   [junit4]   2> 621513 INFO  (TEST-ConnectionReuseTest.test-seed#[E9A53D57A79CF6B8]) [    ] o.a.s.c.ZkTestServer STARTING ZK TEST SERVER
   [junit4]   2> 621513 INFO  (Thread-988) [    ] o.a.s.c.ZkTestServer client port:0.0.0.0/0.0.0.0:0
   [junit4]   2> 621513 INFO  (Thread-988) [    ] o.a.s.c.ZkTestServer Starting server
   [junit4]   2> 621613 INFO  (TEST-ConnectionReuseTest.test-seed#[E9A53D57A79CF6B8]) [    ] o.a.s.c.ZkTestServer start zk server on port:35539
   [junit4]   2> 621613 INFO  (TEST-ConnectionReuseTest.test-seed#[E9A53D57A79CF6B8]) [    ] o.a.s.c.c.SolrZkClient Using default ZkCredentialsProvider
   [junit4]   2> 621613 INFO  (TEST-ConnectionReuseTest.test-seed#[E9A53D57A79CF6B8]) [    ] o.a.s.c.c.ConnectionManager Waiting for client to connect to ZooKeeper
   [junit4]   2> 621615 INFO  (zkCallback-318-thread-1) [    ] o.a.s.c.c.ConnectionManager Watcher org.apache.solr.common.cloud.ConnectionManager@5ff84ad7 name:ZooKeeperConnection Watcher:127.0.0.1:35539 got event WatchedEvent state:SyncConnected type:None path:null path:null type:None
   [junit4]   2> 621615 INFO  (TEST-ConnectionReuseTest.test-seed#[E9A53D57A79CF6B8]) [    ] o.a.s.c.c.ConnectionManager Client is connected to ZooKeeper
   [junit4]   2> 621616 INFO  (TEST-ConnectionReuseTest.test-seed#[E9A53D57A79CF6B8]) [    ] o.a.s.c.c.SolrZkClient Using default ZkACLProvider
   [junit4]   2> 621616 INFO  (TEST-ConnectionReuseTest.test-seed#[E9A53D57A79CF6B8]) [    ] o.a.s.c.c.SolrZkClient makePath: /solr
   [junit4]   2> 621617 INFO  (TEST-ConnectionReuseTest.test-seed#[E9A53D57A79CF6B8]) [    ] o.a.s.c.c.SolrZkClient Using default ZkCredentialsProvider
   [junit4]   2> 621617 INFO  (TEST-ConnectionReuseTest.test-seed#[E9A53D57A79CF6B8]) [    ] o.a.s.c.c.ConnectionManager Waiting for client to connect to ZooKeeper
   [junit4]   2> 621618 INFO  (zkCallback-319-thread-1) [    ] o.a.s.c.c.ConnectionManager Watcher org.apache.solr.common.cloud.ConnectionManager@4b95e1ca name:ZooKeeperConnection Watcher:127.0.0.1:35539/solr got event WatchedEvent state:SyncConnected type:None path:null path:null type:None
   [junit4]   2> 621618 INFO  (TEST-ConnectionReuseTest.test-seed#[E9A53D57A79CF6B8]) [    ] o.a.s.c.c.ConnectionManager Client is connected to ZooKeeper
   [junit4]   2> 621618 INFO  (TEST-ConnectionReuseTest.test-seed#[E9A53D57A79CF6B8]) [    ] o.a.s.c.c.SolrZkClient Using default ZkACLProvider
   [junit4]   2> 621618 INFO  (TEST-ConnectionReuseTest.test-seed#[E9A53D57A79CF6B8]) [    ] o.a.s.c.c.SolrZkClient makePath: /collections/collection1
   [junit4]   2> 621619 INFO  (TEST-ConnectionReuseTest.test-seed#[E9A53D57A79CF6B8]) [    ] o.a.s.c.c.SolrZkClient makePath: /collections/collection1/shards
   [junit4]   2> 621619 INFO  (TEST-ConnectionReuseTest.test-seed#[E9A53D57A79CF6B8]) [    ] o.a.s.c.c.SolrZkClient makePath: /collections/control_collection
   [junit4]   2> 621619 INFO  (TEST-ConnectionReuseTest.test-seed#[E9A53D57A79CF6B8]) [    ] o.a.s.c.c.SolrZkClient makePath: /collections/control_collection/shards
   [junit4]   2> 621620 INFO  (TEST-ConnectionReuseTest.test-seed#[E9A53D57A79CF6B8]) [    ] o.a.s.c.AbstractZkTestCase put /home/jenkins/workspace/Lucene-Solr-trunk-Linux/solr/core/src/test-files/solr/collection1/conf/solrconfig-tlog.xml to /configs/conf1/solrconfig.xml
   [junit4]   2> 621620 INFO  (TEST-ConnectionReuseTest.test-seed#[E9A53D57A79CF6B8]) [    ] o.a.s.c.c.SolrZkClient makePath: /configs/conf1/solrconfig.xml
   [junit4]   2> 621620 INFO  (TEST-ConnectionReuseTest.test-seed#[E9A53D57A79CF6B8]) [    ] o.a.s.c.AbstractZkTestCase put /home/jenkins/workspace/Lucene-Solr-trunk-Linux/solr/core/src/test-files/solr/collection1/conf/schema.xml to /configs/conf1/schema.xml
   [junit4]   2> 621620 INFO  (TEST-ConnectionReuseTest.test-seed#[E9A53D57A79CF6B8]) [    ] o.a.s.c.c.SolrZkClient makePath: /configs/conf1/schema.xml
   [junit4]   2> 621621 INFO  (TEST-ConnectionReuseTest.test-seed#[E9A53D57A79CF6B8]) [    ] o.a.s.c.AbstractZkTestCase put /home/jenkins/workspace/Lucene-Solr-trunk-Linux/solr/core/src/test-files/solr/collection1/conf/solrconfig.snippet.randomindexconfig.xml to /configs/conf1/solrconfig.snippet.randomindexconfig.xml
   [junit4]   2> 621621 INFO  (TEST-ConnectionReuseTest.test-seed#[E9A53D57A79CF6B8]) [    ] o.a.s.c.c.SolrZkClient makePath: /configs/conf1/solrconfig.snippet.randomindexconfig.xml
   [junit4]   2> 621622 INFO  (TEST-ConnectionReuseTest.test-seed#[E9A53D57A79CF6B8]) [    ] o.a.s.c.AbstractZkTestCase put /home/jenkins/workspace/Lucene-Solr-trunk-Linux/solr/core/src/test-files/solr/collection1/conf/stopwords.txt to /configs/conf1/stopwords.txt
   [junit4]   2> 621622 INFO  (TEST-ConnectionReuseTest.test-seed#[E9A53D57A79CF6B8]) [    ] o.a.s.c.c.SolrZkClient makePath: /configs/conf1/stopwords.txt
   [junit4]   2> 621622 INFO  (TEST-ConnectionReuseTest.test-seed#[E9A53D57A79CF6B8]) [    ] o.a.s.c.AbstractZkTestCase put /home/jenkins/workspace/Lucene-Solr-trunk-Linux/solr/core/src/test-files/solr/collection1/conf/protwords.txt to /configs/conf1/protwords.txt
   [junit4]   2> 621622 INFO  (TEST-ConnectionReuseTest.test-seed#[E9A53D57A79CF6B8]) [    ] o.a.s.c.c.SolrZkClient makePath: /configs/conf1/protwords.txt
   [junit4]   2> 621623 INFO  (TEST-ConnectionReuseTest.test-seed#[E9A53D57A79CF6B8]) [    ] o.a.s.c.AbstractZkTestCase put /home/jenkins/workspace/Lucene-Solr-trunk-Linux/solr/core/src/test-files/solr/collection1/conf/currency.xml to /configs/conf1/currency.xml
   [junit4]   2> 621623 INFO  (TEST-ConnectionReuseTest.test-seed#[E9A53D57A79CF6B8]) [    ] o.a.s.c.c.SolrZkClient makePath: /configs/conf1/currency.xml
   [junit4]   2> 621623 INFO  (TEST-ConnectionReuseTest.test-seed#[E9A53D57A79CF6B8]) [    ] o.a.s.c.AbstractZkTestCase put /home/jenkins/workspace/Lucene-Solr-trunk-Linux/solr/core/src/test-files/solr/collection1/conf/enumsConfig.xml to /configs/conf1/enumsConfig.xml
   [junit4]   2> 621623 INFO  (TEST-ConnectionReuseTest.test-seed#[E9A53D57A79CF6B8]) [    ] o.a.s.c.c.SolrZkClient makePath: /configs/conf1/enumsConfig.xml
   [junit4]   2> 621624 INFO  (TEST-ConnectionReuseTest.test-seed#[E9A53D57A79CF6B8]) [    ] o.a.s.c.AbstractZkTestCase put /home/jenkins/workspace/Lucene-Solr-trunk-Linux/solr/core/src/test-files/solr/collection1/conf/open-exchange-rates.json to /configs/conf1/open-exchange-rates.json
   [junit4]   2> 621624 INFO  (TEST-ConnectionReuseTest.test-seed#[E9A53D57A79CF6B8]) [    ] o.a.s.c.c.SolrZkClient makePath: /configs/conf1/open-exchange-rates.json
   [junit4]   2> 621624 INFO  (TEST-ConnectionReuseTest.test-seed#[E9A53D57A79CF6B8]) [    ] o.a.s.c.AbstractZkTestCase put /home/jenkins/workspace/Lucene-Solr-trunk-Linux/solr/core/src/test-files/solr/collection1/conf/mapping-ISOLatin1Accent.txt to /configs/conf1/mapping-ISOLatin1Accent.txt
   [junit4]   2> 621624 INFO  (TEST-ConnectionReuseTest.test-seed#[E9A53D57A79CF6B8]) [    ] o.a.s.c.c.SolrZkClient makePath: /configs/conf1/mapping-ISOLatin1Accent.txt
   [junit4]   2> 621625 INFO  (TEST-ConnectionReuseTest.test-seed#[E9A53D57A79CF6B8]) [    ] o.a.s.c.AbstractZkTestCase put /home/jenkins/workspace/Lucene-Solr-trunk-Linux/solr/core/src/test-files/solr/collection1/conf/old_synonyms.txt to /configs/conf1/old_synonyms.txt
   [junit4]   2> 621625 INFO  (TEST-ConnectionReuseTest.test-seed#[E9A53D57A79CF6B8]) [    ] o.a.s.c.c.SolrZkClient makePath: /configs/conf1/old_synonyms.txt
   [junit4]   2> 621625 INFO  (TEST-ConnectionReuseTest.test-seed#[E9A53D57A79CF6B8]) [    ] o.a.s.c.AbstractZkTestCase put /home/jenkins/workspace/Lucene-Solr-trunk-Linux/solr/core/src/test-files/solr/collection1/conf/synonyms.txt to /configs/conf1/synonyms.txt
   [junit4]   2> 621625 INFO  (TEST-ConnectionReuseTest.test-seed#[E9A53D57A79CF6B8]) [    ] o.a.s.c.c.SolrZkClient makePath: /configs/conf1/synonyms.txt
   [junit4]   2> 621665 INFO  (TEST-ConnectionReuseTest.test-seed#[E9A53D57A79CF6B8]) [    ] o.a.s.SolrTestCaseJ4 Writing core.properties file to /home/jenkins/workspace/Lucene-Solr-trunk-Linux/solr/build/solr-core/test/J0/temp/solr.client.solrj.ConnectionReuseTest_E9A53D57A79CF6B8-001/control-001/cores/collection1
   [junit4]   2> 621665 INFO  (TEST-ConnectionReuseTest.test-seed#[E9A53D57A79CF6B8]) [    ] o.e.j.s.Server jetty-9.2.13.v20150730
   [junit4]   2> 621667 INFO  (TEST-ConnectionReuseTest.test-seed#[E9A53D57A79CF6B8]) [    ] o.e.j.s.h.ContextHandler Started o.e.j.s.ServletContextHandler@17c09d0f{/,null,AVAILABLE}
   [junit4]   2> 621668 INFO  (TEST-ConnectionReuseTest.test-seed#[E9A53D57A79CF6B8]) [    ] o.e.j.s.ServerConnector Started ServerConnector@bd857f8{HTTP/1.1}{127.0.0.1:34271}
   [junit4]   2> 621669 INFO  (TEST-ConnectionReuseTest.test-seed#[E9A53D57A79CF6B8]) [    ] o.e.j.s.Server Started @623078ms
   [junit4]   2> 621669 INFO  (TEST-ConnectionReuseTest.test-seed#[E9A53D57A79CF6B8]) [    ] o.a.s.c.s.e.JettySolrRunner Jetty properties: {solr.data.dir=/home/jenkins/workspace/Lucene-Solr-trunk-Linux/solr/build/solr-core/test/J0/temp/solr.client.solrj.ConnectionReuseTest_E9A53D57A79CF6B8-001/tempDir-001/control/data, hostContext=/, hostPort=34271, coreRootDirectory=/home/jenkins/workspace/Lucene-Solr-trunk-Linux/solr/build/solr-core/test/J0/temp/solr.client.solrj.ConnectionReuseTest_E9A53D57A79CF6B8-001/control-001/cores}
   [junit4]   2> 621669 INFO  (TEST-ConnectionReuseTest.test-seed#[E9A53D57A79CF6B8]) [    ] o.a.s.s.SolrDispatchFilter SolrDispatchFilter.init(): sun.misc.Launcher$AppClassLoader@73d16e93
   [junit4]   2> 621669 INFO  (TEST-ConnectionReuseTest.test-seed#[E9A53D57A79CF6B8]) [    ] o.a.s.c.SolrResourceLoader new SolrResourceLoader for directory: '/home/jenkins/workspace/Lucene-Solr-trunk-Linux/solr/build/solr-core/test/J0/temp/solr.client.solrj.ConnectionReuseTest_E9A53D57A79CF6B8-001/control-001'
   [junit4]   2> 621669 INFO  (TEST-ConnectionReuseTest.test-seed#[E9A53D57A79CF6B8]) [    ] o.a.s.c.SolrResourceLoader JNDI not configured for solr (NoInitialContextEx)
   [junit4]   2> 621669 INFO  (TEST-ConnectionReuseTest.test-seed#[E9A53D57A79CF6B8]) [    ] o.a.s.c.SolrResourceLoader solr home defaulted to 'solr/' (could not find system property or JNDI)
   [junit4]   2> 621669 INFO  (TEST-ConnectionReuseTest.test-seed#[E9A53D57A79CF6B8]) [    ] o.a.s.c.c.SolrZkClient Using default ZkCredentialsProvider
   [junit4]   2> 621669 INFO  (TEST-ConnectionReuseTest.test-seed#[E9A53D57A79CF6B8]) [    ] o.a.s.c.c.ConnectionManager Waiting for client to connect to ZooKeeper
   [junit4]   2> 621670 INFO  (zkCallback-320-thread-1) [    ] o.a.s.c.c.ConnectionManager Watcher org.apache.solr.common.cloud.ConnectionManager@20649c96 name:ZooKeeperConnection Watcher:127.0.0.1:35539/solr got event WatchedEvent state:SyncConnected type:None path:null path:null type:None
   [junit4]   2> 621670 INFO  (TEST-ConnectionReuseTest.test-seed#[E9A53D57A79CF6B8]) [    ] o.a.s.c.c.ConnectionManager Client is connected to ZooKeeper
   [junit4]   2> 621670 INFO  (TEST-ConnectionReuseTest.test-seed#[E9A53D57A79CF6B8]) [    ] o.a.s.c.c.SolrZkClient Using default ZkACLProvider
   [junit4]   2> 621671 INFO  (TEST-ConnectionReuseTest.test-seed#[E9A53D57A79CF6B8]) [    ] o.a.s.s.SolrDispatchFilter Loading solr.xml from SolrHome (not found in ZooKeeper)
   [junit4]   2> 621671 INFO  (TEST-ConnectionReuseTest.test-seed#[E9A53D57A79CF6B8]) [    ] o.a.s.c.SolrXmlConfig Loading container configuration from /home/jenkins/workspace/Lucene-Solr-trunk-Linux/solr/build/solr-core/test/J0/temp/solr.client.solrj.ConnectionReuseTest_E9A53D57A79CF6B8-001/control-001/solr.xml
   [junit4]   2> 621674 INFO  (TEST-ConnectionReuseTest.test-seed#[E9A53D57A79CF6B8]) [    ] o.a.s.c.CorePropertiesLocator Config-defined core root directory: /home/jenkins/workspace/Lucene-Solr-trunk-Linux/solr/build/solr-core/test/J0/temp/solr.client.solrj.ConnectionReuseTest_E9A53D57A79CF6B8-001/control-001/cores
   [junit4]   2> 621674 INFO  (TEST-ConnectionReuseTest.test-seed#[E9A53D57A79CF6B8]) [    ] o.a.s.c.CoreContainer New CoreContainer 1612590653
   [junit4]   2> 621674 INFO  (TEST-ConnectionReuseTest.test-seed#[E9A53D57A79CF6B8]) [    ] o.a.s.c.CoreContainer Loading cores into CoreContainer [instanceDir=/home/jenkins/workspace/Lucene-Solr-trunk-Linux/solr/build/solr-core/test/J0/temp/solr.client.solrj.ConnectionReuseTest_E9A53D57A79CF6B8-001/control-001]
   [junit4]   2> 621674 WARN  (TEST-ConnectionReuseTest.test-seed#[E9A53D57A79CF6B8]) [    ] o.a.s.c.CoreContainer Couldn't add files from /home/jenkins/workspace/Lucene-Solr-trunk-Linux/solr/build/solr-core/test/J0/temp/solr.client.solrj.ConnectionReuseTest_E9A53D57A79CF6B8-001/control-001/lib to classpath: /home/jenkins/workspace/Lucene-Solr-trunk-Linux/solr/build/solr-core/test/J0/temp/solr.client.solrj.ConnectionReuseTest_E9A53D57A79CF6B8-001/control-001/lib
   [junit4]   2> 621674 INFO  (TEST-ConnectionReuseTest.test-seed#[E9A53D57A79CF6B8]) [    ] o.a.s.h.c.HttpShardHandlerFactory created with socketTimeout : 90000,urlScheme : ,connTimeout : 15000,maxConnectionsPerHost : 20,maxConnections : 10000,corePoolSize : 0,maximumPoolSize : 2147483647,maxThreadIdleTime : 5,sizeOfQueue : -1,fairnessPolicy : false,useRetries : false,
   [junit4]   2> 621675 INFO  (TEST-ConnectionReuseTest.test-seed#[E9A53D57A79CF6B8]) [    ] o.a.s.u.UpdateShardHandler Creating UpdateShardHandler HTTP client with params: socketTimeout=340000&connTimeout=45000&retry=true
   [junit4]   2> 621675 INFO  (TEST-ConnectionReuseTest.test-seed#[E9A53D57A79CF6B8]) [    ] o.a.s.l.LogWatcher SLF4J impl is org.slf4j.impl.Log4jLoggerFactory
   [junit4]   2> 621675 INFO  (TEST-ConnectionReuseTest.test-seed#[E9A53D57A79CF6B8]) [    ] o.a.s.l.LogWatcher Registering Log Listener [Log4j (org.slf4j.impl.Log4jLoggerFactory)]
   [junit4]   2> 621675 INFO  (TEST-ConnectionReuseTest.test-seed#[E9A53D57A79CF6B8]) [    ] o.a.s.c.ZkContainer Zookeeper client=127.0.0.1:35539/solr
   [junit4]   2> 621675 INFO  (TEST-ConnectionReuseTest.test-seed#[E9A53D57A79CF6B8]) [    ] o.a.s.c.ZkController zkHost includes chroot
   [junit4]   2> 621675 INFO  (TEST-ConnectionReuseTest.test-seed#[E9A53D57A79CF6B8]) [    ] o.a.s.c.c.SolrZkClient Using default ZkCredentialsProvider
   [junit4]   2> 621675 INFO  (TEST-ConnectionReuseTest.test-seed#[E9A53D57A79CF6B8]) [    ] o.a.s.c.c.ConnectionManager Waiting for client to connect to ZooKeeper
   [junit4]   2> 621676 INFO  (zkCallback-323-thread-1) [    ] o.a.s.c.c.ConnectionManager Watcher org.apache.solr.common.cloud.ConnectionManager@6efad04f name:ZooKeeperConnection Watcher:127.0.0.1:35539 got event WatchedEvent state:SyncConnected type:None path:null path:null type:None
   [junit4]   2> 621677 INFO  (TEST-ConnectionReuseTest.test-seed#[E9A53D57A79CF6B8]) [    ] o.a.s.c.c.ConnectionManager Client is connected to ZooKeeper
   [junit4]   2> 621677 INFO  (TEST-ConnectionReuseTest.test-seed#[E9A53D57A79CF6B8]) [    ] o.a.s.c.c.SolrZkClient Using default ZkACLProvider
   [junit4]   2> 621678 INFO  (TEST-ConnectionReuseTest.test-seed#[E9A53D57A79CF6B8]) [n:127.0.0.1:34271_    ] o.a.s.c.c.ConnectionManager Waiting for client to connect to ZooKeeper
   [junit4]   2> 621678 INFO  (zkCallback-324-thread-1-processing-n:127.0.0.1:34271_) [n:127.0.0.1:34271_    ] o.a.s.c.c.ConnectionManager Watcher org.apache.solr.common.cloud.ConnectionManager@5f9c51ef name:ZooKeeperConnection Watcher:127.0.0.1:35539/solr got event WatchedEvent state:SyncConnected type:None path:null path:null type:None
   [junit4]   2> 621678 INFO  (TEST-ConnectionReuseTest.test-seed#[E9A53D57A79CF6B8]) [n:127.0.0.1:34271_    ] o.a.s.c.c.ConnectionManager Client is connected to ZooKeeper
   [junit4]   2> 621679 INFO  (TEST-ConnectionReuseTest.test-seed#[E9A53D57A79CF6B8]) [n:127.0.0.1:34271_    ] o.a.s.c.c.SolrZkClient makePath: /overseer/queue
   [junit4]   2> 621679 INFO  (TEST-ConnectionReuseTest.test-seed#[E9A53D57A79CF6B8]) [n:127.0.0.1:34271_    ] o.a.s.c.c.SolrZkClient makePath: /overseer/collection-queue-work
   [junit4]   2> 621680 INFO  (TEST-ConnectionReuseTest.test-seed#[E9A53D57A79CF6B8]) [n:127.0.0.1:34271_    ] o.a.s.c.c.SolrZkClient makePath: /overseer/collection-map-running
   [junit4]   2> 621681 INFO  (TEST-ConnectionReuseTest.test-seed#[E9A53D57A79CF6B8]) [n:127.0.0.1:34271_    ] o.a.s.c.c.SolrZkClient makePath: /overseer/collection-map-completed
   [junit4]   2> 621681 INFO  (TEST-ConnectionReuseTest.test-seed#[E9A53D57A79CF6B8]) [n:127.0.0.1:34271_    ] o.a.s.c.c.SolrZkClient makePath: /overseer/collection-map-failure
   [junit4]   2> 621682 INFO  (TEST-ConnectionReuseTest.test-seed#[E9A53D57A79CF6B8]) [n:127.0.0.1:34271_    ] o.a.s.c.c.SolrZkClient makePath: /live_nodes
   [junit4]   2> 621682 INFO  (TEST-ConnectionReuseTest.test-seed#[E9A53D57A79CF6B8]) [n:127.0.0.1:34271_    ] o.a.s.c.c.SolrZkClient makePath: /aliases.json
   [junit4]   2> 621682 INFO  (TEST-ConnectionReuseTest.test-seed#[E9A53D57A79CF6B8]) [n:127.0.0.1:34271_    ] o.a.s.c.c.SolrZkClient makePath: /clusterstate.json
   [junit4]   2> 621683 INFO  (TEST-ConnectionReuseTest.test-seed#[E9A53D57A79CF6B8]) [n:127.0.0.1:34271_    ] o.a.s.c.c.SolrZkClient makePath: /security.json
   [junit4]   2> 621683 INFO  (TEST-ConnectionReuseTest.test-seed#[E9A53D57A79CF6B8]) [n:127.0.0.1:34271_    ] o.a.s.c.ZkController Register node as live in ZooKeeper:/live_nodes/127.0.0.1:34271_
   [junit4]   2> 621683 INFO  (TEST-ConnectionReuseTest.test-seed#[E9A53D57A79CF6B8]) [n:127.0.0.1:34271_    ] o.a.s.c.c.SolrZkClient makePath: /live_nodes/127.0.0.1:34271_
   [junit4]   2> 621684 INFO  (TEST-ConnectionReuseTest.test-seed#[E9A53D57A79CF6B8]) [n:127.0.0.1:34271_    ] o.a.s.c.c.SolrZkClient makePath: /overseer_elect
   [junit4]   2> 621684 INFO  (TEST-ConnectionReuseTest.test-seed#[E9A53D57A79CF6B8]) [n:127.0.0.1:34271_    ] o.a.s.c.c.SolrZkClient makePath: /overseer_elect/election
   [junit4]   2> 621684 INFO  (TEST-ConnectionReuseTest.test-seed#[E9A53D57A79CF6B8]) [n:127.0.0.1:34271_    ] o.a.s.c.Overseer Overseer (id=null) closing
   [junit4]   2> 621684 INFO  (TEST-ConnectionReuseTest.test-seed#[E9A53D57A79CF6B8]) [n:127.0.0.1:34271_    ] o.a.s.c.LeaderElector Joined leadership election with path: /overseer_elect/election/95391788484132868-127.0.0.1:34271_-n_0000000000
   [junit4]   2> 621684 INFO  (TEST-ConnectionReuseTest.test-seed#[E9A53D57A79CF6B8]) [n:127.0.0.1:34271_    ] o.a.s.c.OverseerElectionContext I am going to be the leader 127.0.0.1:34271_
   [junit4]   2> 621684 INFO  (TEST-ConnectionReuseTest.test-seed#[E9A53D57A79CF6B8]) [n:127.0.0.1:34271_    ] o.a.s.c.c.SolrZkClient makePath: /overseer_elect/leader
   [junit4]   2> 621685 INFO  (TEST-ConnectionReuseTest.test-seed#[E9A53D57A79CF6B8]) [n:127.0.0.1:34271_    ] o.a.s.c.Overseer Overseer (id=95391788484132868-127.0.0.1:34271_-n_0000000000) starting
   [junit4]   2> 621685 INFO  (TEST-ConnectionReuseTest.test-seed#[E9A53D57A79CF6B8]) [n:127.0.0.1:34271_    ] o.a.s.c.c.SolrZkClient makePath: /overseer/queue-work
   [junit4]   2> 621687 INFO  (TEST-ConnectionReuseTest.test-seed#[E9A53D57A79CF6B8]) [n:127.0.0.1:34271_    ] o.a.s.c.OverseerAutoReplicaFailoverThread Starting OverseerAutoReplicaFailoverThread autoReplicaFailoverWorkLoopDelay=10000 autoReplicaFailoverWaitAfterExpiration=30000 autoReplicaFailoverBadNodeExpiration=60000
   [junit4]   2> 621687 INFO  (TEST-ConnectionReuseTest.test-seed#[E9A53D57A79CF6B8]) [n:127.0.0.1:34271_    ] o.a.s.c.c.ZkStateReader Updating cluster state from ZooKeeper... 
   [junit4]   2> 621687 INFO  (OverseerCollectionConfigSetProcessor-95391788484132868-127.0.0.1:34271_-n_0000000000) [n:127.0.0.1:34271_    ] o.a.s.c.OverseerTaskProcessor Process current queue of overseer operations
   [junit4]   2> 621688 INFO  (OverseerStateUpdate-95391788484132868-127.0.0.1:34271_-n_0000000000) [n:127.0.0.1:34271_    ] o.a.s.c.Overseer Starting to work on the main queue
   [junit4]   2> 621702 INFO  (TEST-ConnectionReuseTest.test-seed#[E9A53D57A79CF6B8]) [n:127.0.0.1:34271_    ] o.a.s.c.CoreContainer Security conf doesn't exist. Skipping setup for authorization module.
   [junit4]   2> 621702 INFO  (TEST-ConnectionReuseTest.test-seed#[E9A53D57A79CF6B8]) [n:127.0.0.1:34271_    ] o.a.s.c.CoreContainer No authentication plugin used.
   [junit4]   2> 621702 INFO  (TEST-ConnectionReuseTest.test-seed#[E9A53D57A79CF6B8]) [n:127.0.0.1:34271_    ] o.a.s.c.CorePropertiesLocator Looking for core definitions underneath /home/jenkins/workspace/Lucene-Solr-trunk-Linux/solr/build/solr-core/test/J0/temp/solr.client.solrj.ConnectionReuseTest_E9A53D57A79CF6B8-001/control-001/cores
   [junit4]   2> 621703 INFO  (TEST-ConnectionReuseTest.test-seed#[E9A53D57A79CF6B8]) [n:127.0.0.1:34271_    ] o.a.s.c.CoreDescriptor Created CoreDescriptor: {name=collection1, config=solrconfig.xml, transient=false, schema=schema.xml, loadOnStartup=true, configSetProperties=configsetprops.json, collection=control_collection, coreNodeName=, dataDir=data/, shard=}
   [junit4]   2> 621703 INFO  (TEST-ConnectionReuseTest.test-seed#[E9A53D57A79CF6B8]) [n:127.0.0.1:34271_    ] o.a.s.c.CorePropertiesLocator Found core collection1 in /home/jenkins/workspace/Lucene-Solr-trunk-Linux/solr/build/solr-core/test/J0/temp/solr.client.solrj.ConnectionReuseTest_E9A53D57A79CF6B8-001/control-001/cores/collection1
   [junit4]   2> 621703 INFO  (TEST-ConnectionReuseTest.test-seed#[E9A53D57A79CF6B8]) [n:127.0.0.1:34271_    ] o.a.s.c.CorePropertiesLocator Found 1 core definitions
   [junit4]   2> 621703 INFO  (TEST-ConnectionReuseTest.test-seed#[E9A53D57A79CF6B8]) [n:127.0.0.1:34271_    ] o.a.s.s.SolrDispatchFilter user.dir=/home/jenkins/workspace/Lucene-Solr-trunk-Linux/solr/build/solr-core/test/J0
   [junit4]   2> 621703 INFO  (TEST-ConnectionReuseTest.test-seed#[E9A53D57A79CF6B8]) [n:127.0.0.1:34271_    ] o.a.s.s.SolrDispatchFilter SolrDispatchFilter.init() done
   [junit4]   2> 621704 INFO  (coreLoadExecutor-1343-thread-1-processing-n:127.0.0.1:34271_) [n:127.0.0.1:34271_ c:control_collection   x:collection1] o.a.s.c.ZkController publishing state=down
   [junit4]   2> 621704 INFO  (coreLoadExecutor-1343-thread-1-processing-n:127.0.0.1:34271_) [n:127.0.0.1:34271_ c:control_collection   x:collection1] o.a.s.c.ZkController numShards not found on descriptor - reading it from system property
   [junit4]   2> 621704 INFO  (OverseerStateUpdate-95391788484132868-127.0.0.1:34271_-n_0000000000) [n:127.0.0.1:34271_    ] o.a.s.c.Overseer processMessage: queueSize: 1, message = {
   [junit4]   2>   "core":"collection1",
   [junit4]   2>   "roles":null,
   [junit4]   2>   "base_url":"http://127.0.0.1:34271",
   [junit4]   2>   "node_name":"127.0.0.1:34271_",
   [junit4]   2>   "numShards":"1",
   [junit4]   2>   "state":"down",
   [junit4]   2>   "shard":null,
   [junit4]   2>   "collection":"control_collection",
   [junit4]   2>   "operation":"state"} current state version: 0
   [junit4]   2> 621704 INFO  (coreLoadExecutor-1343-thread-1-processing-n:127.0.0.1:34271_) [n:127.0.0.1:34271_ c:control_collection   x:collection1] o.a.s.c.ZkController look for our core node name
   [junit4]   2> 621704 INFO  (OverseerStateUpdate-95391788484132868-127.0.0.1:34271_-n_0000000000) [n:127.0.0.1:34271_    ] o.a.s.c.o.ReplicaMutator Update state numShards=1 message={
   [junit4]   2>   "core":"collection1",
   [junit4]   2>   "roles":null,
   [junit4]   2>   "base_url":"http://127.0.0.1:34271",
   [junit4]   2>   "node_name":"127.0.0.1:34271_",
   [junit4]   2>   "numShards":"1",
   [junit4]   2>   "state":"down",
   [junit4]   2>   "shard":null,
   [junit4]   2>   "collection":"control_collection",
   [junit4]   2>   "operation":"state"}
   [junit4]   2> 621704 INFO  (OverseerStateUpdate-95391788484132868-127.0.0.1:34271_-n_0000000000) [n:127.0.0.1:34271_    ] o.a.s.c.o.ClusterStateMutator building a new cName: control_collection
   [junit4]   2> 621705 INFO  (OverseerStateUpdate-95391788484132868-127.0.0.1:34271_-n_0000000000) [n:127.0.0.1:34271_    ] o.a.s.c.o.ReplicaMutator Assigning new node to shard shard=shard1
   [junit4]   2> 621705 INFO  (zkCallback-324-thread-1-processing-n:127.0.0.1:34271_) [n:127.0.0.1:34271_    ] o.a.s.c.c.ZkStateReader A cluster state change: [WatchedEvent state:SyncConnected type:NodeDataChanged path:/clusterstate.json], has occurred - updating... (live nodes size: [1])
   [junit4]   2> 622704 INFO  (coreLoadExecutor-1343-thread-1-processing-n:127.0.0.1:34271_) [n:127.0.0.1:34271_ c:control_collection   x:collection1] o.a.s.c.ZkController waiting to find shard id in clusterstate for collection1
   [junit4]   2> 622705 INFO  (coreLoadExecutor-1343-thread-1-processing-n:127.0.0.1:34271_) [n:127.0.0.1:34271_ c:control_collection   x:collection1] o.a.s.c.ZkController Check for collection zkNode:control_collection
   [junit4]   2> 622705 INFO  (coreLoadExecutor-1343-thread-1-processing-n:127.0.0.1:34271_) [n:127.0.0.1:34271_ c:control_collection   x:collection1] o.a.s.c.ZkController Collection zkNode exists
   [junit4]   2> 622705 INFO  (coreLoadExecutor-1343-thread-1-processing-n:127.0.0.1:34271_) [n:127.0.0.1:34271_ c:control_collection   x:collection1] o.a.s.c.c.ZkStateReader Load collection config from: [/collections/control_collection]
   [junit4]   2> 622705 INFO  (coreLoadExecutor-1343-thread-1-processing-n:127.0.0.1:34271_) [n:127.0.0.1:34271_ c:control_collection   x:collection1] o.a.s.c.c.ZkStateReader path=[/collections/control_collection] [configName]=[conf1] specified config exists in ZooKeeper
   [junit4]   2> 622705 INFO  (coreLoadExecutor-1343-thread-1-processing-n:127.0.0.1:34271_) [n:127.0.0.1:34271_ c:control_collection   x:collection1] o.a.s.c.SolrResourceLoader new SolrResourceLoader for directory: '/home/jenkins/workspace/Lucene-Solr-trunk-Linux/solr/build/solr-core/test/J0/temp/solr.client.solrj.ConnectionReuseTest_E9A53D57A79CF6B8-001/control-001/cores/collection1'
   [junit4]   2> 622705 INFO  (coreLoadExecutor-1343-thread-1-processing-n:127.0.0.1:34271_) [n:127.0.0.1:34271_ c:control_collection   x:collection1] o.a.s.c.SolrResourceLoader JNDI not configured for solr (NoInitialContextEx)
   [junit4]   2> 622705 INFO  (coreLoadExecutor-1343-thread-1-processing-n:127.0.0.1:34271_) [n:127.0.0.1:34271_ c:control_collection   x:collection1] o.a.s.c.SolrResourceLoader solr home defaulted to 'solr/' (could not find system property or JNDI)
   [junit4]   2> 622706 INFO  (coreLoadExecutor-1343-thread-1-processing-n:127.0.0.1:34271_) [n:127.0.0.1:34271_ c:control_collection   x:collection1] o.a.s.c.Config loaded config solrconfig.xml with version 0 
   [junit4]   2> 622710 INFO  (coreLoadExecutor-1343-thread-1-processing-n:127.0.0.1:34271_) [n:127.0.0.1:34271_ c:control_collection   x:collection1] o.a.s.c.SolrConfig current version of requestparams : -1
   [junit4]   2> 622713 INFO  (coreLoadExecutor-1343-thread-1-processing-n:127.0.0.1:34271_) [n:127.0.0.1:34271_ c:control_collection   x:collection1] o.a.s.c.SolrConfig Using Lucene MatchVersion: 6.0.0
   [junit4]   2> 622717 INFO  (coreLoadExecutor-1343-thread-1-processing-n:127.0.0.1:34271_) [n:127.0.0.1:34271_ c:control_collection   x:collection1] o.a.s.c.SolrConfig Loaded SolrConfig: solrconfig.xml
   [junit4]   2> 622721 INFO  (coreLoadExecutor-1343-thread-1-processing-n:127.0.0.1:34271_) [n:127.0.0.1:34271_ c:control_collection   x:collection1] o.a.s.s.IndexSchema [collection1] Schema name=test
   [junit4]   2> 622773 INFO  (coreLoadExecutor-1343-thread-1-processing-n:127.0.0.1:34271_) [n:127.0.0.1:34271_ c:control_collection   x:collection1] o.a.s.s.OpenExchangeRatesOrgProvider Initialized with rates=open-exchange-rates.json, refreshInterval=1440.
   [junit4]   2> 622776 INFO  (coreLoadExecutor-1343-thread-1-processing-n:127.0.0.1:34271_) [n:127.0.0.1:34271_ c:control_collection   x:collection1] o.a.s.s.IndexSchema default search field in schema is text
   [junit4]   2> 622777 INFO  (coreLoadExecutor-1343-thread-1-processing-n:127.0.0.1:34271_) [n:127.0.0.1:34271_ c:control_collection   x:collection1] o.a.s.s.IndexSchema unique key field: id
   [junit4]   2> 622781 INFO  (coreLoadExecutor-1343-thread-1-processing-n:127.0.0.1:34271_) [n:127.0.0.1:34271_ c:control_collection   x:collection1] o.a.s.s.FileExchangeRateProvider Reloading exchange rates from file currency.xml
   [junit4]   2> 622782 INFO  (coreLoadExecutor-1343-thread-1-processing-n:127.0.0.1:34271_) [n:127.0.0.1:34271_ c:control_collection   x:collection1] o.a.s.s.FileExchangeRateProvider Reloading exchange rates from file currency.xml
   [junit4]   2> 622783 INFO  (coreLoadExecutor-1343-thread-1-processing-n:127.0.0.1:34271_) [n:127.0.0.1:34271_ c:control_collection   x:collection1] o.a.s.s.OpenExchangeRatesOrgProvider Reloading exchange rates from open-exchange-rates.json
   [junit4]   2> 622783 INFO  (coreLoadExecutor-1343-thread-1-processing-n:127.0.0.1:34271_) [n:127.0.0.1:34271_ c:control_collection   x:collection1] o.a.s.s.OpenExchangeRatesOrgProvider Reloading exchange rates from open-exchange-rates.json
   [junit4]   2> 622784 INFO  (coreLoadExecutor-1343-thread-1-processing-n:127.0.0.1:34271_) [n:127.0.0.1:34271_ c:control_collection   x:collection1] o.a.s.c.ConfigSetProperties Did not find ConfigSet properties, assuming default properties: Can't find resource 'configsetprops.json' in classpath or '/configs/conf1', cwd=/home/jenkins/workspace/Lucene-Solr-trunk-Linux/solr/build/solr-core/test/J0
   [junit4]   2> 622784 INFO  (coreLoadExecutor-1343-thread-1-processing-n:127.0.0.1:34271_) [n:127.0.0.1:34271_ c:control_collection   x:collection1] o.a.s.c.CoreContainer Creating SolrCore 'collection1' using configuration from collection control_collection
   [junit4]   2> 622784 INFO  (coreLoadExecutor-1343-thread-1-processing-n:127.0.0.1:34271_) [n:127.0.0.1:34271_ c:control_collection s:shard1 r:core_node1 x:collection1] o.a.s.c.SolrCore org.apache.solr.core.MockDirectoryFactory
   [junit4]   2> 622784 INFO  (coreLoadExecutor-1343-thread-1-processing-n:127.0.0.1:34271_) [n:127.0.0.1:34271_ c:control_collection s:shard1 r:core_node1 x:collection1] o.a.s.c.SolrCore [[collection1] ] Opening new SolrCore at [/home/jenkins/workspace/Lucene-Solr-trunk-Linux/solr/build/solr-core/test/J0/temp/solr.client.solrj.ConnectionReuseTest_E9A53D57A79CF6B8-001/control-001/cores/collection1], dataDir=[/home/jenkins/workspace/Lucene-Solr-trunk-Linux/solr/build/solr-core/test/J0/temp/solr.client.solrj.ConnectionReuseTest_E9A53D57A79CF6B8-001/control-001/cores/collection1/data/]
   [junit4]   2> 622784 INFO  (coreLoadExecutor-1343-thread-1-processing-n:127.0.0.1:34271_) [n:127.0.0.1:34271_ c:control_collection s:shard1 r:core_node1 x:collection1] o.a.s.c.JmxMonitoredMap JMX monitoring is enabled. Adding Solr mbeans to JMX Server: com.sun.jmx.mbeanserver.JmxMBeanServer@7bd83f3a
   [junit4]   2> 622784 INFO  (coreLoadExecutor-1343-thread-1-processing-n:127.0.0.1:34271_) [n:127.0.0.1:34271_ c:control_collection s:shard1 r:core_node1 x:collection1] o.a.s.c.CachingDirectoryFactory return new directory for /home/jenkins/workspace/Lucene-Solr-trunk-Linux/solr/build/solr-core/test/J0/temp/solr.client.solrj.ConnectionReuseTest_E9A53D57A79CF6B8-001/control-001/cores/collection1/data
   [junit4]   2> 622784 INFO  (coreLoadExecutor-1343-thread-1-processing-n:127.0.0.1:34271_) [n:127.0.0.1:34271_ c:control_collection s:shard1 r:core_node1 x:collection1] o.a.s.c.SolrCore New index directory detected: old=null new=/home/jenkins/workspace/Lucene-Solr-trunk-Linux/solr/build/solr-core/test/J0/temp/solr.client.solrj.ConnectionReuseTest_E9A53D57A79CF6B8-001/control-001/cores/collection1/data/index/
   [junit4]   2> 622784 WARN  (coreLoadExecutor-1343-thread-1-processing-n:127.0.0.1:34271_) [n:127.0.0.1:34271_ c:control_collection s:shard1 r:core_node1 x:collection1] o.a.s.c.SolrCore [collection1] Solr index directory '/home/jenkins/workspace/Lucene-Solr-trunk-Linux/solr/build/solr-core/test/J0/temp/solr.client.solrj.ConnectionReuseTest_E9A53D57A79CF6B8-001/control-001/cores/collection1/data/index' doesn't exist. Creating new index...
   [junit4]   2> 622784 INFO  (coreLoadExecutor-1343-thread-1-processing-n:127.0.0.1:34271_) [n:127.0.0.1:34271_ c:control_collection s:shard1 r:core_node1 x:collection1] o.a.s.c.CachingDirectoryFactory return new directory for /home/jenkins/workspace/Lucene-Solr-trunk-Linux/solr/build/solr-core/test/J0/temp/solr.client.solrj.ConnectionReuseTest_E9A53D57A79CF6B8-001/control-001/cores/collection1/data/index
   [junit4]   2> 622785 INFO  (coreLoadExecutor-1343-thread-1-processing-n:127.0.0.1:34271_) [n:127.0.0.1:34271_ c:control_collection s:shard1 r:core_node1 x:collection1] o.a.s.u.RandomMergePolicy RandomMergePolicy wrapping class org.apache.lucene.index.TieredMergePolicy: [TieredMergePolicy: maxMergeAtOnce=28, maxMergeAtOnceExplicit=21, maxMergedSegmentMB=81.75390625, floorSegmentMB=1.05078125, forceMergeDeletesPctAllowed=8.259929496761862, segmentsPerTier=39.0, maxCFSSegmentSizeMB=8.796093022207999E12, noCFSRatio=0.0
   [junit4]   2> 622785 INFO  (coreLoadExecutor-1343-thread-1-processing-n:127.0.0.1:34271_) [n:127.0.0.1:34271_ c:control_collection s:shard1 r:core_node1 x:collection1] o.a.s.c.SolrDeletionPolicy SolrDeletionPolicy.onCommit: commits: num=1
   [junit4]   2> 	commit{dir=MockDirectoryWrapper(RAMDirectory@36690d37 lockFactory=org.apache.lucene.store.SingleInstanceLockFactory@6ce93d91),segFN=segments_1,generation=1}
   [junit4]   2> 622785 INFO  (coreLoadExecutor-1343-thread-1-processing-n:127.0.0.1:34271_) [n:127.0.0.1:34271_ c:control_collection s:shard1 r:core_node1 x:collection1] o.a.s.c.SolrDeletionPolicy newest commit generation = 1
   [junit4]   2> 622785 INFO  (OldIndexDirectoryCleanupThreadForCore-collection1) [n:127.0.0.1:34271_ c:control_collection s:shard1 r:core_node1 x:collection1] o.a.s.c.SolrCore Looking for old index directories to cleanup for core collection1 in /home/jenkins/workspace/Lucene-Solr-trunk-Linux/solr/build/solr-core/test/J0/temp/solr.client.solrj.ConnectionReuseTest_E9A53D57A79CF6B8-001/control-001/cores/collection1/data/
   [junit4]   2> 622785 WARN  (OldIndexDirectoryCleanupThreadForCore-collection1) [n:127.0.0.1:34271_ c:control_collection s:shard1 r:core_node1 x:collection1] o.a.s.c.DirectoryFactory /home/jenkins/workspace/Lucene-Solr-trunk-Linux/solr/build/solr-core/test/J0/temp/solr.client.solrj.ConnectionReuseTest_E9A53D57A79CF6B8-001/control-001/cores/collection1/data/ does not point to a valid data directory; skipping clean-up of old index directories.
   [junit4]   2> 622787 INFO  (coreLoadExecutor-1343-thread-1-processing-n:127.0.0.1:34271_) [n:127.0.0.1:34271_ c:control_collection s:shard1 r:core_node1 x:collection1] o.a.s.u.p.UpdateRequestProcessorChain creating updateRequestProcessorChain "nodistrib"
   [junit4]   2> 622787 INFO  (coreLoadExecutor-1343-thread-1-processing-n:127.0.0.1:34271_) [n:127.0.0.1:34271_ c:control_collection s:shard1 r:core_node1 x:collection1] o.a.s.u.p.UpdateRequestProcessorChain creating updateRequestProcessorChain "dedupe"
   [junit4]   2> 622787 INFO  (coreLoadExecutor-1343-thread-1-processing-n:127.0.0.1:34271_) [n:127.0.0.1:34271_ c:control_collection s:shard1 r:core_node1 x:collection1] o.a.s.u.p.UpdateRequestProcessorChain inserting DistributedUpdateProcessorFactory into updateRequestProcessorChain "dedupe"
   [junit4]   2> 622787 INFO  (coreLoadExecutor-1343-thread-1-processing-n:127.0.0.1:34271_) [n:127.0.0.1:34271_ c:control_collection s:shard1 r:core_node1 x:collection1] o.a.s.u.p.UpdateRequestProcessorChain creating updateRequestProcessorChain "stored_sig"
   [junit4]   2> 622788 INFO  (coreLoadExecutor-1343-thread-1-processing-n:127.0.0.1:34271_) [n:127.0.0.1:34271_ c:control_collection s:shard1 r:core_node1 x:collection1] o.a.s.u.p.UpdateRequestProcessorChain inserting DistributedUpdateProcessorFactory into updateRequestProcessorChain "stored_sig"
   [junit4]   2> 622788 INFO  (coreLoadExecutor-1343-thread-1-processing-n:127.0.0.1:34271_) [n:127.0.0.1:34271_ c:control_collection s:shard1 r:core_node1 x:collection1] o.a.s.u.p.UpdateRequestProcessorChain creating updateRequestProcessorChain "distrib-dup-test-chain-explicit"
   [junit4]   2> 622788 INFO  (coreLoadExecutor-1343-thread-1-processing-n:127.0.0.1:34271_) [n:127.0.0.1:34271_ c:control_collection s:shard1 r:core_node1 x:collection1] o.a.s.u.p.UpdateRequestProcessorChain creating updateRequestProcessorChain "distrib-dup-test-chain-implicit"
   [junit4]   2> 622788 INFO  (coreLoadExecutor-1343-thread-1-processing-n:127.0.0.1:34271_) [n:127.0.0.1:34271_ c:control_collection s:shard1 r:core_node1 x:collection1] o.a.s.u.p.UpdateRequestProcessorChain inserting DistributedUpdateProcessorFactory into updateRequestProcessorChain "distrib-dup-test-chain-implicit"
   [junit4]   2> 622788 INFO  (coreLoadExecutor-1343-thread-1-processing-n:127.0.0.1:34271_) [n:127.0.0.1:34271_ c:control_collection s:shard1 r:core_node1 x:collection1] o.a.s.c.SolrCore no updateRequestProcessorChain defined as default, creating implicit default
   [junit4]   2> 622788 WARN  (coreLoadExecutor-1343-thread-1-processing-n:127.0.0.1:34271_) [n:127.0.0.1:34271_ c:control_collection s:shard1 r:core_node1 x:collection1] o.a.s.c.RequestHandlers INVALID paramSet a in requestHandler {type = requestHandler,name = /dump,class = DumpRequestHandler,args = {defaults={a=A,b=B}}}
   [junit4]   2> 622789 INFO  (coreLoadExecutor-1343-thread-1-processing-n:127.0.0.1:34271_) [n:127.0.0.1:34271_ c:control_collection s:shard1 r:core_node1 x:collection1] o.a.s.h.l.XMLLoader xsltCacheLifetimeSeconds=60
   [junit4]   2> 622789 INFO  (coreLoadExecutor-1343-thread-1-processing-n:127.0.0.1:34271_) [n:127.0.0.1:34271_ c:control_collection s:shard1 r:core_node1 x:collection1] o.a.s.h.l.XMLLoader xsltCacheLifetimeSeconds=60
   [junit4]   2> 622790 INFO  (coreLoadExecutor-1343-thread-1-processing-n:127.0.0.1:34271_) [n:127.0.0.1:34271_ c:control_collection s:shard1 r:core_node1 x:collection1] o.a.s.h.l.XMLLoader xsltCacheLifetimeSeconds=60
   [junit4]   2> 622790 INFO  (coreLoadExecutor-1343-thread-1-processing-n:127.0.0.1:34271_) [n:127.0.0.1:34271_ c:control_collection s:shard1 r:core_node1 x:collection1] o.a.s.h.l.XMLLoader xsltCacheLifetimeSeconds=60
   [junit4]   2> 622792 INFO  (coreLoadExecutor-1343-thread-1-processing-n:127.0.0.1:34271_) [n:127.0.0.1:34271_ c:control_collection s:shard1 r:core_node1 x:collection1] o.a.s.c.RequestHandlers Registered paths: /admin/mbeans,standard,/dump,/update/csv,/sql,/update/json/docs,/admin/luke,/export,/admin/segments,/get,/admin/system,/replication,/admin/properties,/config,/stream,/schema,/admin/plugins,/admin/logging,/update/json,/admin/threads,/admin/ping,/update,/admin/file
   [junit4]   2> 622793 INFO  (coreLoadExecutor-1343-thread-1-processing-n:127.0.0.1:34271_) [n:127.0.0.1:34271_ c:control_collection s:shard1 r:core_node1 x:collection1] o.a.s.c.SolrCore Using default statsCache cache: org.apache.solr.search.stats.LocalStatsCache
   [junit4]   2> 622793 INFO  (coreLoadExecutor-1343-thread-1-processing-n:127.0.0.1:34271_) [n:127.0.0.1:34271_ c:control_collection s:shard1 r:core_node1 x:collection1] o.a.s.u.UpdateHandler Using UpdateLog implementation: org.apache.solr.update.UpdateLog
   [junit4]   2> 622793 INFO  (coreLoadExecutor-1343-thread-1-processing-n:127.0.0.1:34271_) [n:127.0.0.1:34271_ c:control_collection s:shard1 r:core_node1 x:collection1] o.a.s.u.UpdateLog Initializing UpdateLog: dataDir= defaultSyncLevel=FLUSH numRecordsToKeep=100 maxNumLogsToKeep=10 numVersionBuckets=65536
   [junit4]   2> 622793 INFO  (coreLoadExecutor-1343-thread-1-processing-n:127.0.0.1:34271_) [n:127.0.0.1:34271_ c:control_collection s:shard1 r:core_node1 x:collection1] o.a.s.u.CommitTracker Hard AutoCommit: disabled
   [junit4]   2> 622793 INFO  (coreLoadExecutor-1343-thread-1-processing-n:127.0.0.1:34271_) [n:127.0.0.1:34271_ c:control_collection s:shard1 r:core_node1 x:collection1] o.a.s.u.CommitTracker Soft AutoCommit: disabled
   [junit4]   2> 622794 INFO  (coreLoadExecutor-1343-thread-1-processing-n:127.0.0.1:34271_) [n:127.0.0.1:34271_ c:control_collection s:shard1 r:core_node1 x:collection1] o.a.s.u.RandomMergePolicy RandomMergePolicy wrapping class org.apache.lucene.index.LogByteSizeMergePolicy: [LogByteSizeMergePolicy: minMergeSize=1677721, mergeFactor=41, maxMergeSize=2147483648, maxMergeSizeForForcedMerge=9223372036854775807, calibrateSizeByDeletes=true, maxMergeDocs=2147483647, maxCFSSegmentSizeMB=8.796093022207999E12, noCFSRatio=1.0]
   [junit4]   2> 622794 INFO  (coreLoadExecutor-1343-thread-1-processing-n:127.0.0.1:34271_) [n:127.0.0.1:34271_ c:control_collection s:shard1 r:core_node1 x:collection1] o.a.s.c.SolrDeletionPolicy SolrDeletionPolicy.onInit: commits: num=1
   [junit4]   2> 	commit{dir=MockDirectoryWrapper(RAMDirectory@36690d37 lockFactory=org.apache.lucene.store.SingleInstanceLockFactory@6ce93d91),segFN=segments_1,generation=1}
   [junit4]   2> 622794 INFO  (coreLoadExecutor-1343-thread-1-processing-n:127.0.0.1:34271_) [n:127.0.0.1:34271_ c:control_collection s:shard1 r:core_node1 x:collection1] o.a.s.c.SolrDeletionPolicy newest commit generation = 1
   [junit4]   2> 622794 INFO  (coreLoadExecutor-1343-thread-1-processing-n:127.0.0.1:34271_) [n:127.0.0.1:34271_ c:control_collection s:shard1 r:core_node1 x:collection1] o.a.s.s.SolrIndexSearcher Opening [Searcher@76074ada[collection1] main]
   [junit4]   2> 622794 INFO  (coreLoadExecutor-1343-thread-1-processing-n:127.0.0.1:34271_) [n:127.0.0.1:34271_ c:control_collection s:shard1 r:core_node1 x:collection1] o.a.s.c.c.ZkStateReader Load collection config from: [/collections/control_collection]
   [junit4]   2> 622794 INFO  (coreLoadExecutor-1343-thread-1-processing-n:127.0.0.1:34271_) [n:127.0.0.1:34271_ c:control_collection s:shard1 r:core_node1 x:collection1] o.a.s.c.c.ZkStateReader path=[/collections/control_collection] [configName]=[conf1] specified config exists in ZooKeeper
   [junit4]   2> 622794 INFO  (coreLoadExecutor-1343-thread-1-processing-n:127.0.0.1:34271_) [n:127.0.0.1:34271_ c:control_collection s:shard1 r:core_node1 x:collection1] o.a.s.r.ManagedResourceStorage Setting up ZooKeeper-based storage for the RestManager with znodeBase: /configs/conf1
   [junit4]   2> 622795 INFO  (coreLoadExecutor-1343-thread-1-processing-n:127.0.0.1:34271_) [n:127.0.0.1:34271_ c:control_collection s:shard1 r:core_node1 x:collection1] o.a.s.r.ManagedResourceStorage Configured ZooKeeperStorageIO with znodeBase: /configs/conf1
   [junit4]   2> 622795 INFO  (coreLoadExecutor-1343-thread-1-processing-n:127.0.0.1:34271_) [n:127.0.0.1:34271_ c:control_collection s:shard1 r:core_node1 x:collection1] o.a.s.r.RestManager Initializing RestManager with initArgs: {}
   [junit4]   2> 622795 INFO  (coreLoadExecutor-1343-thread-1-processing-n:127.0.0.1:34271_) [n:127.0.0.1:34271_ c:control_collection s:shard1 r:core_node1 x:collection1] o.a.s.r.ManagedResourceStorage Reading _rest_managed.json using ZooKeeperStorageIO:path=/configs/conf1
   [junit4]   2> 622795 INFO  (coreLoadExecutor-1343-thread-1-processing-n:127.0.0.1:34271_) [n:127.0.0.1:34271_ c:control_collection s:shard1 r:core_node1 x:collection1] o.a.s.r.ManagedResourceStorage No data found for znode /configs/conf1/_rest_managed.json
   [junit4]   2> 622795 INFO  (coreLoadExecutor-1343-thread-1-processing-n:127.0.0.1:34271_) [n:127.0.0.1:34271_ c:control_collection s:shard1 r:core_node1 x:collection1] o.a.s.r.ManagedResourceStorage Loaded null at path _rest_managed.json using ZooKeeperStorageIO:path=/configs/conf1
   [junit4]   2> 622795 INFO  (coreLoadExecutor-1343-thread-1-processing-n:127.0.0.1:34271_) [n:127.0.0.1:34271_ c:control_collection s:shard1 r:core_node1 x:collection1] o.a.s.r.RestManager Initializing 0 registered ManagedResources
   [junit4]   2> 622795 INFO  (coreLoadExecutor-1343-thread-1-processing-n:127.0.0.1:34271_) [n:127.0.0.1:34271_ c:control_collection s:shard1 r:core_node1 x:collection1] o.a.s.h.ReplicationHandler Commits will be reserved for  10000
   [junit4]   2> 622795 INFO  (searcherExecutor-1344-thread-1-processing-n:127.0.0.1:34271_ x:collection1 s:shard1 c:control_collection r:core_node1) [n:127.0.0.1:34271_ c:control_collection s:shard1 r:core_node1 x:collection1] o.a.s.c.SolrCore [collection1] Registered new searcher Searcher@76074ada[collection1] main{ExitableDirectoryReader(UninvertingDirectoryReader())}
   [junit4]   2> 622795 INFO  (coreLoadExecutor-1343-thread-1-processing-n:127.0.0.1:34271_) [n:127.0.0.1:34271_ c:control_collection s:shard1 r:core_node1 x:collection1] o.a.s.u.UpdateLog Looking up max value of version field to seed version buckets
   [junit4]   2> 622796 INFO  (coreLoadExecutor-1343-thread-1-processing-n:127.0.0.1:34271_) [n:127.0.0.1:34271_ c:control_collection s:shard1 r:core_node1 x:collection1] o.a.s.u.VersionInfo Refreshing highest value of _version_ for 65536 version buckets from index
   [junit4]   2> 622796 INFO  (coreLoadExecutor-1343-thread-1-processing-n:127.0.0.1:34271_) [n:127.0.0.1:34271_ c:control_collection s:shard1 r:core_node1 x:collection1] o.a.s.u.VersionInfo No terms found for _version_, cannot seed version bucket highest value from index
   [junit4]   2> 622796 INFO  (coreLoadExecutor-1343-thread-1-processing-n:127.0.0.1:34271_) [n:127.0.0.1:34271_ c:control_collection s:shard1 r:core_node1 x:collection1] o.a.s.u.UpdateLog Could not find max version in index or recent updates, using new clock 1526268617090400256
   [junit4]   2> 622797 INFO  (coreLoadExecutor-1343-thread-1-processing-n:127.0.0.1:34271_) [n:127.0.0.1:34271_ c:control_collection s:shard1 r:core_node1 x:collection1] o.a.s.u.UpdateLog Took 1.0ms to seed version buckets with highest version 1526268617090400256
   [junit4]   2> 622797 INFO  (coreLoadExecutor-1343-thread-1-processing-n:127.0.0.1:34271_) [n:127.0.0.1:34271_ c:control_collection s:shard1 r:core_node1 x:collection1] o.a.s.c.ZkController watch zkdir /configs/conf1
   [junit4]   2> 622797 INFO  (coreLoadExecutor-1343-thread-1-processing-n:127.0.0.1:34271_) [n:127.0.0.1:34271_ c:control_collection s:shard1 r:core_node1 x:collection1] o.a.s.c.CoreContainer registering core: collection1
   [junit4]   2> 622798 INFO  (coreZkRegister-1337-thread-1-processing-n:127.0.0.1:34271_ x:collection1 s:shard1 c:control_collection r:core_node1) [n:127.0.0.1:34271_ c:control_collection s:shard1 r:core_node1 x:collection1] o.a.s.c.ZkController Register replica - core:collection1 address:http://127.0.0.1:34271 collection:control_collection shard:shard1
   [junit4]   2> 622798 INFO  (coreZkRegister-1337-thread-1-processing-n:127.0.0.1:34271_ x:collection1 s:shard1 c:control_collection r:core_node1) [n:127.0.0.1:34271_ c:control_collection s:shard1 r:core_node1 x:collection1] o.a.s.c.c.SolrZkClient makePath: /collections/control_collection/leader_elect/shard1/election
   [junit4]   2> 622799 INFO  (coreZkRegister-1337-thread-1-processing-n:127.0.0.1:34271_ x:collection1 s:shard1 c:control_collection r:core_node1) [n:127.0.0.1:34271_ c:control_collection s:shard1 r:core_node1 x:collection1] o.a.s.c.LeaderElector Joined leadership election with path: /collections/control_collection/leader_elect/shard1/election/95391788484132868-core_node1-n_0000000000
   [junit4]   2> 622799 INFO  (coreZkRegister-1337-thread-1-processing-n:127.0.0.1:34271_ x:collection1 s:shard1 c:control_collection r:core_node1) [n:127.0.0.1:34271_ c:control_collection s:shard1 r:core_node1 x:collection1] o.a.s.c.ShardLeaderElectionContext Running the leader process for shard=shard1 and weAreReplacement=false and leaderVoteWait=10000
   [junit4]   2> 622800 INFO  (coreZkRegister-1337-thread-1-processing-n:127.0.0.1:34271_ x:collection1 s:shard1 c:control_collection r:core_node1) [n:127.0.0.1:34271_ c:control_collection s:shard1 r:core_node1 x:collection1] o.a.s.c.ShardLeaderElectionContext Enough replicas found to continue.
   [junit4]   2> 622800 INFO  (coreZkRegister-1337-thread-1-processing-n:127.0.0.1:34271_ x:collection1 s:shard1 c:control_collection r:core_node1) [n:127.0.0.1:34271_ c:control_collection s:shard1 r:core_node1 x:collection1] o.a.s.c.ShardLeaderElectionContext I may be the new leader - try and sync
   [junit4]   2> 622800 INFO  (coreZkRegister-1337-thread-1-processing-n:127.0.0.1:34271_ x:collection1 s:shard1 c:control_collection r:core_node1) [n:127.0.0.1:34271_ c:control_collection s:shard1 r:core_node1 x:collection1] o.a.s.c.SyncStrategy Sync replicas to http://127.0.0.1:34271/collection1/
   [junit4]   2> 622800 INFO  (OverseerStateUpdate-95391788484132868-127.0.0.1:34271_-n_0000000000) [n:127.0.0.1:34271_    ] o.a.s.c.Overseer processMessage: queueSize: 1, message = {
   [junit4]   2>   "operation":"leader",
   [junit4]   2>   "shard":"shard1",
   [junit4]   2>   "collection":"control_collection"} current state version: 1
   [junit4]   2> 622800 INFO  (coreZkRegister-1337-thread-1-processing-n:127.0.0.1:34271_ x:collection1 s:shard1 c:control_collection r:core_node1) [n:127.0.0.1:34271_ c:control_collection s:shard1 r:core_node1 x:collection1] o.a.s.c.SyncStrategy Sync Success - now sync replicas to me
   [junit4]   2> 622800 INFO  (coreZkRegister-1337-thread-1-processing-n:127.0.0.1:34271_ x:collection1 s:shard1 c:control_collection r:core_node1) [n:127.0.0.1:34271_ c:control_collection s:shard1 r:core_node1 x:collection1] o.a.s.c.SyncStrategy http://127.0.0.1:34271/collection1/ has no replicas
   [junit4]   2> 622800 INFO  (coreZkRegister-1337-thread-1-processing-n:127.0.0.1:34271_ x:collection1 s:shard1 c:control_collection r:core_node1) [n:127.0.0.1:34271_ c:control_collection s:shard1 r:core_node1 x:collection1] o.a.s.c.c.SolrZkClient makePath: /collections/control_collection/leaders/shard1
   [junit4]   2> 622801 INFO  (coreZkRegister-1337-thread-1-processing-n:127.0.0.1:34271_ x:collection1 s:shard1 c:control_collection r:core_node1) [n:127.0.0.1:34271_ c:control_collection s:shard1 r:core_node1 x:collection1] o.a.s.c.ShardLeaderElectionContextBase Creating leader registration node
   [junit4]   2> 622801 INFO  (coreZkRegister-1337-thread-1-processing-n:127.0.0.1:34271_ x:collection1 s:shard1 c:control_collection r:core_node1) [n:127.0.0.1:34271_ c:control_collection s:shard1 r:core_node1 x:collection1] o.a.s.c.ShardLeaderElectionContext I am the new leader: http://127.0.0.1:34271/collection1/ shard1
   [junit4]   2> 622802 INFO  (OverseerStateUpdate-95391788484132868-127.0.0.1:34271_-n_0000000000) [n:127.0.0.1:34271_    ] o.a.s.c.Overseer processMessage: queueSize: 1, message = {
   [junit4]   2>   "operation":"leader",
   [junit4]   2>   "shard":"shard1",
   [junit4]   2>   "collection":"control_collection",
   [junit4]   2>   "base_url":"http://127.0.0.1:34271",
   [junit4]   2>   "core":"collection1",
   [junit4]   2>   "state":"active"} current state version: 1
   [junit4]   2> 622902 INFO  (zkCallback-324-thread-1-processing-n:127.0.0.1:34271_) [n:127.0.0.1:34271_    ] o.a.s.c.c.ZkStateReader A cluster state change: [WatchedEvent state:SyncConnected type:NodeDataChanged path:/clusterstate.json], has occurred - updating... (live nodes size: [1])
   [junit4]   2> 622952 INFO  (coreZkRegister-1337-thread-1-processing-n:127.0.0.1:34271_ x:collection1 s:shard1 c:control_collection r:core_node1) [n:127.0.0.1:34271_ c:control_collection s:shard1 r:core_node1 x:collection1] o.a.s.c.ZkController We are http://127.0.0.1:34271/collection1/ and leader is http://127.0.0.1:34271/collection1/
   [junit4]   2> 622952 INFO  (coreZkRegister-1337-thread-1-processing-n:127.0.0.1:34271_ x:collection1 s:shard1 c:control_collection r:core_node1) [n:127.0.0.1:34271_ c:control_collection s:shard1 r:core_node1 x:collection1] o.a.s.c.ZkController No LogReplay needed for core=collection1 baseURL=http://127.0.0.1:34271
   [junit4]   2> 622952 INFO  (coreZkRegister-1337-thread-1-processing-n:127.0.0.1:34271_ x:collection1 s:shard1 c:control_collection r:core_node1) [n:127.0.0.1:34271_ c:control_collection s:shard1 r:core_node1 x:collection1] o.a.s.c.ZkController I am the leader, no recovery necessary
   [junit4]   2> 622952 INFO  (coreZkRegister-1337-thread-1-processing-n:127.0.0.1:34271_ x:collection1 s:shard1 c:control_collection r:core_node1) [n:127.0.0.1:34271_ c:control_collection s:shard1 r:core_node1 x:collection1] o.a.s.c.ZkController publishing state=active
   [junit4]   2> 622952 INFO  (coreZkRegister-1337-thread-1-processing-n:127.0.0.1:34271_ x:collection1 s:shard1 c:control_collection r:core_node1) [n:127.0.0.1:34271_ c:control_collection s:shard1 r:core_node1 x:collection1] o.a.s.c.ZkController numShards not found on descriptor - reading it from system property
   [junit4]   2> 622953 INFO  (OverseerStateUpdate-95391788484132868-127.0.0.1:34271_-n_0000000000) [n:127.0.0.1:34271_    ] o.a.s.c.Overseer processMessage: queueSize: 1, message = {
   [junit4]   2>   "core":"collection1",
   [junit4]   2>   "core_node_name":"core_node1",
   [junit4]   2>   "roles":null,
   [junit4]   2>   "base_url":"http://127.0.0.1:34271",
   [junit4]   2>   "node_name":"127.0.0.1:34271_",
   [junit4]   2>   "numShards":"1",
   [junit4]   2>   "state":"active",
   [junit4]   2>   "shard":"shard1",
   [junit4]   2>   "collection":"control_collection",
   [junit4]   2>   "operation":"state"} current state version: 2
   [junit4]   2> 622953 INFO  (OverseerStateUpdate-95391788484132868-127.0.0.1:34271_-n_0000000000) [n:127.0.0.1:34271_    ] o.a.s.c.o.ReplicaMutator Update state numShards=1 message={
   [junit4]   2>   "core":"collection1",
   [junit4]   2>   "core_node_name":"core_node1",
   [junit4]   2>   "roles":null,
   [junit4]   2>   "base_url":"http://127.0.0.1:34271",
   [junit4]   2>   "node_name":"127.0.0.1:34271_",
   [junit4]   2>   "numShards":"1",
   [junit4]   2>   "state":"active",
   [junit4]   2>   "shard":"shard1",
   [junit4]   2>   "collection":"control_collection",
   [junit4]   2>   "operation":"state"}
   [junit4]   2> 623054 INFO  (zkCallback-324-thread-1-processing-n:127.0.0.1:34271_) [n:127.0.0.1:34271_    ] o.a.s.c.c.ZkStateReader A cluster state change: [WatchedEvent state:SyncConnected type:NodeDataChanged path:/clusterstate.json], has occurred - updating... (live nodes size: [1])
   [junit4]   2> 623205 INFO  (TEST-ConnectionReuseTest.test-seed#[E9A53D57A79CF6B8]) [    ] o.a.s.c.c.SolrZkClient Using default ZkCredentialsProvider
   [junit4]   2> 623205 INFO  (TEST-ConnectionReuseTest.test-seed#[E9A53D57A79CF6B8]) [    ] o.a.s.c.c.ConnectionManager Waiting for client to connect to ZooKeeper
   [junit4]   2> 623206 INFO  (zkCallback-326-thread-1) [    ] o.a.s.c.c.ConnectionManager Watcher org.apache.solr.common.cloud.ConnectionManager@50450f7b name:ZooKeeperConnection Watcher:127.0.0.1:35539/solr got event WatchedEvent state:SyncConnected type:None path:null path:null type:None
   [junit4]   2> 623206 INFO  (TEST-ConnectionReuseTest.test-seed#[E9A53D57A79CF6B8]) [    ] o.a.s.c.c.ConnectionManager Client is connected to ZooKeeper
   [junit4]   2> 623206 INFO  (TEST-ConnectionReuseTest.test-seed#[E9A53D57A79CF6B8]) [    ] o.a.s.c.c.SolrZkClient Using default ZkACLProvider
   [junit4]   2> 623206 INFO  (TEST-ConnectionReuseTest.test-seed#[E9A53D57A79CF6B8]) [    ] o.a.s.c.c.ZkStateReader Updating cluster state from ZooKeeper... 
   [junit4]   2> 623207 INFO  (TEST-ConnectionReuseTest.test-seed#[E9A53D57A79CF6B8]) [    ] o.a.s.c.ChaosMonkey monkey: init - expire sessions:false cause connection loss:false
   [junit4]   2> 623248 INFO  (TEST-ConnectionReuseTest.test-seed#[E9A53D57A79CF6B8]) [    ] o.a.s.SolrTestCaseJ4 Writing core.properties file to /home/jenkins/workspace/Lucene-Solr-trunk-Linux/solr/build/solr-core/test/J0/temp/solr.client.solrj.ConnectionReuseTest_E9A53D57A79CF6B8-001/shard-1-001/cores/collection1
   [junit4]   2> 623248 INFO  (TEST-ConnectionReuseTest.test-seed#[E9A53D57A79CF6B8]) [    ] o.a.s.c.AbstractFullDistribZkTestBase create jetty 1 in directory /home/jenkins/workspace/Lucene-Solr-trunk-Linux/solr/build/solr-core/test/J0/temp/solr.client.solrj.ConnectionReuseTest_E9A53D57A79CF6B8-001/shard-1-001
   [junit4]   2> 623248 INFO  (TEST-ConnectionReuseTest.test-seed#[E9A53D57A79CF6B8]) [    ] o.e.j.s.Server jetty-9.2.13.v20150730
   [junit4]   2> 623249 INFO  (TEST-ConnectionReuseTest.test-seed#[E9A53D57A79CF6B8]) [    ] o.e.j.s.h.ContextHandler Started o.e.j.s.ServletContextHandler@657aee26{/,null,AVAILABLE}
   [junit4]   2> 623250 INFO  (TEST-ConnectionReuseTest.test-seed#[E9A53D57A79CF6B8]) [    ] o.e.j.s.ServerConnector Started ServerConnector@5c4a4700{HTTP/1.1}{127.0.0.1:50696}
   [junit4]   2> 623250 INFO  (TEST-ConnectionReuseTest.test-seed#[E9A53D57A79CF6B8]) [    ] o.e.j.s.Server Started @624659ms
   [junit4]   2> 623250 INFO  (TEST-ConnectionReuseTest.test-seed#[E9A53D57A79CF6B8]) [    ] o.a.s.c.s.e.JettySolrRunner Jetty properties: {solr.data.dir=/home/jenkins/workspace/Lucene-Solr-trunk-Linux/solr/build/solr-core/test/J0/temp/solr.client.solrj.ConnectionReuseTest_E9A53D57A79CF6B8-001/tempDir-001/jetty1, solrconfig=solrconfig.xml, hostContext=/, hostPort=50696, coreRootDirectory=/home/jenkins/workspace/Lucene-Solr-trunk-Linux/solr/build/solr-core/test/J0/../../../../../../../../../home/jenkins/workspace/Lucene-Solr-trunk-Linux/solr/build/solr-core/test/J0/temp/solr.client.solrj.ConnectionReuseTest_E9A53D57A79CF6B8-001/shard-1-001/cores}
   [junit4]   2> 623250 INFO  (TEST-ConnectionReuseTest.test-seed#[E9A53D57A79CF6B8]) [    ] o.a.s.s.SolrDispatchFilter SolrDispatchFilter.init(): sun.misc.Launcher$AppClassLoader@73d16e93
   [junit4]   2> 623250 INFO  (TEST-ConnectionReuseTest.test-seed#[E9A53D57A79CF6B8]) [    ] o.a.s.c.SolrResourceLoader new SolrResourceLoader for directory: '/home/jenkins/workspace/Lucene-Solr-trunk-Linux/solr/build/solr-core/test/J0/temp/solr.client.solrj.ConnectionReuseTest_E9A53D57A79CF6B8-001/shard-1-001'
   [junit4]   2> 623250 INFO  (TEST-ConnectionReuseTest.test-seed#[E9A53D57A79CF6B8]) [    ] o.a.s.c.SolrResourceLoader JNDI not configured for solr (NoInitialContextEx)
   [junit4]   2> 623250 INFO  (TEST-ConnectionReuseTest.test-seed#[E9A53D57A79CF6B8]) [    ] o.a.s.c.SolrResourceLoader solr home defaulted to 'solr/' (could not find system property or JNDI)
   [junit4]   2> 623250 INFO  (TEST-ConnectionReuseTest.test-seed#[E9A53D57A79CF6B8]) [    ] o.a.s.c.c.SolrZkClient Using default ZkCredentialsProvider
   [junit4]   2> 623250 INFO  (TEST-ConnectionReuseTest.test-seed#[E9A53D57A79CF6B8]) [    ] o.a.s.c.c.ConnectionManager Waiting for client to connect to ZooKeeper
   [junit4]   2> 623251 INFO  (zkCallback-327-thread-1) [    ] o.a.s.c.c.ConnectionManager Watcher org.apache.solr.common.cloud.ConnectionManager@28015749 name:ZooKeeperConnection Watcher:127.0.0.1:35539/solr got event WatchedEvent state:SyncConnected type:None path:null path:null type:None
   [junit4]   2> 623251 INFO  (TEST-ConnectionReuseTest.test-seed#[E9A53D57A79CF6B8]) [    ] o.a.s.c.c.ConnectionManager Client is connected to ZooKeeper
   [junit4]   2> 623251 INFO  (TEST-ConnectionReuseTest.test-seed#[E9A53D57A79CF6B8]) [    ] o.a.s.c.c.SolrZkClient Using default ZkACLProvider
   [junit4]   2> 623252 INFO  (TEST-ConnectionReuseTest.test-seed#[E9A53D57A79CF6B8]) [    ] o.a.s.s.SolrDispatchFilter Loading solr.xml from SolrHome (not found in ZooKeeper)
   [junit4]   2> 623252 INFO  (TEST-ConnectionReuseTest.test-seed#[E9A53D57A79CF6B8]) [    ] o.a.s.c.SolrXmlConfig Loading container configuration from /home/jenkins/workspace/Lucene-Solr-trunk-Linux/solr/build/solr-core/test/J0/temp/solr.client.solrj.ConnectionReuseTest_E9A53D57A79CF6B8-001/shard-1-001/solr.xml
   [junit4]   2> 623255 INFO  (TEST-ConnectionReuseTest.test-seed#[E9A53D57A79CF6B8]) [    ] o.a.s.c.CorePropertiesLocator Config-defined core root directory: /home/jenkins/workspace/Lucene-Solr-trunk-Linux/solr/build/solr-core/test/J0/../../../../../../../../../home/jenkins/workspace/Lucene-Solr-trunk-Linux/solr/build/solr-core/test/J0/temp/solr.client.solrj.ConnectionReuseTest_E9A53D57A79CF6B8-001/shard-1-001/cores
   [junit4]   2> 623255 INFO  (TEST-ConnectionReuseTest.test-seed#[E9A53D57A79CF6B8]) [    ] o.a.s.c.CoreContainer New CoreContainer 2007050972
   [junit4]   2> 623255 INFO  (TEST-ConnectionReuseTest.test-seed#[E9A53D57A79CF6B8]) [    ] o.a.s.c.CoreContainer Loading cores into CoreContainer [instanceDir=/home/jenkins/workspace/Lucene-Solr-trunk-Linux/solr/build/solr-core/test/J0/temp/solr.client.solrj.ConnectionReuseTest_E9A53D57A79CF6B8-001/shard-1-001]
   [junit4]   2> 623255 WARN  (TEST-ConnectionReuseTest.test-seed#[E9A53D57A79CF6B8]) [    ] o.a.s.c.CoreContainer Couldn't add files from /home/jenkins/workspace/Lucene-Solr-trunk-Linux/solr/build/solr-core/test/J0/temp/solr.client.solrj.ConnectionReuseTest_E9A53D57A79CF6B8-001/shard-1-001/lib to classpath: /home/jenkins/workspace/Lucene-Solr-trunk-Linux/solr/build/solr-core/test/J0/temp/solr.client.solrj.ConnectionReuseTest_E9A53D57A79CF6B8-001/shard-1-001/lib
   [junit4]   2> 623255 INFO  (TEST-ConnectionReuseTest.test-seed#[E9A53D57A79CF6B8]) [    ] o.a.s.h.c.HttpShardHandlerFactory created with socketTimeout : 90000,urlScheme : ,connTimeout : 15000,maxConnectionsPerHost : 20,maxConnections : 10000,corePoolSize : 0,maximumPoolSize : 2147483647,maxThreadIdleTime : 5,sizeOfQueue : -1,fairnessPolicy : false,useRetries : false,
   [junit4]   2> 623256 INFO  (TEST-ConnectionReuseTest.test-seed#[E9A53D57A79CF6B8]) [    ] o.a.s.u.UpdateShardHandler Creating UpdateShardHandler HTTP client with params: socketTimeout=340000&connTimeout=45000&retry=true
   [junit4]   2> 623256 INFO  (TEST-ConnectionReuseTest.test-seed#[E9A53D57A79CF6B8]) [    ] o.a.s.l.LogWatcher SLF4J impl is org.slf4j.impl.Log4jLoggerFactory
   [junit4]   2> 623256 INFO  (TEST-ConnectionReuseTest.test-seed#[E9A53D57A79CF6B8]) [    ] o.a.s.l.LogWatcher Registering Log Listener [Log4j (org.slf4j.impl.Log4jLoggerFactory)]
   [junit4]   2> 623256 INFO  (TEST-ConnectionReuseTest.test-seed#[E9A53D57A79CF6B8]) [    ] o.a.s.c.ZkContainer Zookeeper client=127.0.0.1:35539/solr
   [junit4]   2> 623256 INFO  (TEST-ConnectionReuseTest.test-seed#[E9A53D57A79CF6B8]) [    ] o.a.s.c.ZkController zkHost includes chroot
   [junit4]   2> 623256 INFO  (TEST-ConnectionReuseTest.test-seed#[E9A53D57A79CF6B8]) [    ] o.a.s.c.c.SolrZkClient Using default ZkCredentialsProvider
   [junit4]   2> 623257 INFO  (TEST-ConnectionReuseTest.test-seed#[E9A53D57A79CF6B8]) [    ] o.a.s.c.c.ConnectionManager Waiting for client to connect to ZooKeeper
   [junit4]   2> 623258 INFO  (zkCallback-330-thread-1) [    ] o.a.s.c.c.ConnectionManager Watcher org.apache.solr.common.cloud.ConnectionManager@76a6511f name:ZooKeeperConnection Watcher:127.0.0.1:35539 got event WatchedEvent state:SyncConnected type:None path:null path:null type:None
   [junit4]   2> 623258 INFO  (TEST-ConnectionReuseTest.test-seed#[E9A53D57A79CF6B8]) [    ] o.a.s.c.c.ConnectionManager Client is connected to ZooKeeper
   [junit4]   2> 623259 INFO  (TEST-ConnectionReuseTest.test-seed#[E9A53D57A79CF6B8]) [    ] o.a.s.c.c.SolrZkClient Using default ZkACLProvider
   [junit4]   2> 623260 INFO  (TEST-ConnectionReuseTest.test-seed#[E9A53D57A79CF6B8]) [n:127.0.0.1:50696_    ] o.a.s.c.c.ConnectionManager Waiting for client to connect to ZooKeeper
   [junit4]   2> 623260 INFO  (zkCallback-331-thread-1-processing-n:127.0.0.1:50696_) [n:127.0.0.1:50696_    ] o.a.s.c.c.ConnectionManager Watcher org.apache.solr.common.cloud.ConnectionManager@5cbb16f2 name:ZooKeeperConnection Watcher:127.0.0.1:35539/solr got event WatchedEvent state:SyncConnected type:None path:null path:null type:None
   [junit4]   2> 623260 INFO  (TEST-ConnectionReuseTest.test-seed#[E9A53D57A79CF6B8]) [n:127.0.0.1:50696_    ] o.a.s.c.c.ConnectionManager Client is connected to ZooKeeper
   [junit4]   2> 623262 INFO  (TEST-ConnectionReuseTest.test-seed#[E9A53D57A79CF6B8]) [n:127.0.0.1:50696_    ] o.a.s.c.c.ZkStateReader Updating cluster state from ZooKeeper... 
   [junit4]   2> 624264 INFO  (TEST-ConnectionReuseTest.test-seed#[E9A53D57A79CF6B8]) [n:127.0.0.1:50696_    ] o.a.s.c.ZkController Register node as live in ZooKeeper:/live_nodes/127.0.0.1:50696_
   [junit4]   2> 629238 INFO  (TEST-ConnectionReuseTest.test-seed#[E9A53D57A79CF6B8]) [n:127.0.0.1:50696_    ] o.a.s.c.c.SolrZkClient makePath: /live_nodes/127.0.0.1:50696_
   [junit4]   2> 629240 INFO  (zkCallback-326-thread-1) [    ] o.a.s.c.c.ZkStateReader A live node change: [WatchedEvent state:SyncConnected type:NodeChildrenChanged path:/live_nodes], has occurred - updating... (live nodes size: [1])
   [junit4]   2> 629240 INFO  (zkCallback-331-thread-1-processing-n:127.0.0.1:50696_) [n:127.0.0.1:50696_    ] o.a.s.c.c.ZkStateReader A live node change: [WatchedEvent state:SyncConnected type:NodeChildrenChanged path:/live_nodes], has occurred - updating... (live nodes size: [1])
   [junit4]   2> 629240 INFO  (zkCallback-324-thread-2-processing-n:127.0.0.1:34271_) [n:127.0.0.1:34271_    ] o.a.s.c.c.ZkStateReader A live node change: [WatchedEvent state:SyncConnected type:NodeChildrenChanged path:/live_nodes], has occurred - updating... (live nodes size: [1])
   [junit4]   2> 629241 INFO  (TEST-ConnectionReuseTest.test-seed#[E9A53D57A79CF6B8]) [n:127.0.0.1:50696_    ] o.a.s.c.Overseer Overseer (id=null) closing
   [junit4]   2> 629242 INFO  (TEST-ConnectionReuseTest.test-seed#[E9A53D57A79CF6B8]) [n:127.0.0.1:50696_    ] o.a.s.c.LeaderElector Joined leadership election with path: /overseer_elect/election/95391788484132872-127.0.0.1:50696_-n_0000000001
   [junit4]   2> 629242 INFO  (TEST-ConnectionReuseTest.test-seed#[E9A53D57A79CF6B8]) [n:127.0.0.1:50696_    ] o.a.s.c.LeaderElector Watching path /overseer_elect/election/95391788484132868-127.0.0.1:34271_-n_0000000000 to know if I could be the leader
   [junit4]   2> 629251 INFO  (TEST-ConnectionReuseTest.test-seed#[E9A53D57A79CF6B8]) [n:127.0.0.1:50696_    ] o.a.s.c.CoreContainer Security conf doesn't exist. Skipping setup for authorization module.
   [junit4]   2> 629251 INFO  (TEST-ConnectionReuseTest.test-seed#[E9A53D57A79CF6B8]) [n:127.0.0.1:50696_    ] o.a.s.c.CoreContainer No authentication plugin used.
   [junit4]   2> 629251 INFO  (TEST-ConnectionReuseTest.test-seed#[E9A53D57A79CF6B8]) [n:127.0.0.1:50696_    ] o.a.s.c.CorePropertiesLocator Looking for core definitions underneath /home/jenkins/workspace/Lucene-Solr-trunk-Linux/solr/build/solr-core/test/J0/../../../../../../../../../home/jenkins/workspace/Lucene-Solr-trunk-Linux/solr/build/solr-core/test/J0/temp/solr.client.solrj.ConnectionReuseTest_E9A53D57A79CF6B8-001/shard-1-001/cores
   [junit4]   2> 629252 INFO  (TEST-ConnectionReuseTest.test-seed#[E9A53D57A79CF6B8]) [n:127.0.0.1:50696_    ] o.a.s.c.CoreDescriptor Created CoreDescriptor: {name=collection1, config=solrconfig.xml, transient=false, schema=schema.xml, loadOnStartup=true, configSetProperties=configsetprops.json, collection=collection1, coreNodeName=, dataDir=data/, shard=}
   [junit4]   2> 629252 INFO  (TEST-ConnectionReuseTest.test-seed#[E9A53D57A79CF6B8]) [n:127.0.0.1:50696_    ] o.a.s.c.CorePropertiesLocator Found core collection1 in /home/jenkins/workspace/Lucene-Solr-trunk-Linux/solr/build/solr-core/test/J0/../../../../../../../../../home/jenkins/workspace/Lucene-Solr-trunk-Linux/solr/build/solr-core/test/J0/temp/solr.client.solrj.ConnectionReuseTest_E9A53D57A79CF6B8-001/shard-1-001/cores/collection1
   [junit4]   2> 629252 INFO  (TEST-ConnectionReuseTest.test-seed#[E9A53D57A79CF6B8]) [n:127.0.0.1:50696_    ] o.a.s.c.CorePropertiesLocator Found 1 core definitions
   [junit4]   2> 629253 INFO  (TEST-ConnectionReuseTest.test-seed#[E9A53D57A79CF6B8]) [n:127.0.0.1:50696_    ] o.a.s.s.SolrDispatchFilter user.dir=/home/jenkins/workspace/Lucene-Solr-trunk-Linux/solr/build/solr-core/test/J0
   [junit4]   2> 629253 INFO  (TEST-ConnectionReuseTest.test-seed#[E9A53D57A79CF6B8]) [n:127.0.0.1:50696_    ] o.a.s.s.SolrDispatchFilter SolrDispatchFilter.init() done
   [junit4]   2> 629253 INFO  (coreLoadExecutor-1354-thread-1-processing-n:127.0.0.1:50696_) [n:127.0.0.1:50696_ c:collection1   x:collection1] o.a.s.c.ZkController publishing state=down
   [junit4]   2> 629253 INFO  (coreLoadExecutor-1354-thread-1-processing-n:127.0.0.1:50696_) [n:127.0.0.1:50696_ c:collection1   x:collection1] o.a.s.c.ZkController numShards not found on descriptor - reading it from system property
   [junit4]   2> 629254 INFO  (coreLoadExecutor-1354-thread-1-processing-n:127.0.0.1:50696_) [n:127.0.0.1:50696_ c:collection1   x:collection1] o.a.s.c.ZkController look for our core node name
   [junit4]   2> 629254 INFO  (OverseerStateUpdate-95391788484132868-127.0.0.1:34271_-n_0000000000) [n:127.0.0.1:34271_    ] o.a.s.c.Overseer processMessage: queueSize: 1, message = {
   [junit4]   2>   "core":"collection1",
   [junit4]   2>   "roles":null,
   [junit4]   2>   "base_url":"http://127.0.0.1:50696",
   [junit4]   2>   "node_name":"127.0.0.1:50696_",
   [junit4]   2>   "numShards":"1",
   [junit4]   2>   "state":"down",
   [junit4]   2>   "shard":null,
   [junit4]   2>   "collection":"collection1",
   [junit4]   2>   "operation":"state"} current state version: 3
   [junit4]   2> 629254 INFO  (OverseerStateUpdate-95391788484132868-127.0.0.1:34271_-n_0000000000) [n:127.0.0.1:34271_    ] o.a.s.c.o.ReplicaMutator Update state numShards=1 message={
   [junit4]   2>   "core":"collection1",
   [junit4]   2>   "roles":null,
   [junit4]   2>   "base_url":"http://127.0.0.1:50696",
   [junit4]   2>   "node_name":"127.0.0.1:50696_",
   [junit4]   2>   "numShards":"1",
   [junit4]   2>   "state":"down",
   [junit4]   2>   "shard":null,
   [junit4]   2>   "collection":"collection1",
   [junit4]   2>   "operation":"state"}
   [junit4]   2> 629254 INFO  (OverseerStateUpdate-95391788484132868-127.0.0.1:34271_-n_0000000000) [n:127.0.0.1:34271_    ] o.a.s.c.o.ClusterStateMutator building a new cName: collection1
   [junit4]   2> 629254 INFO  (OverseerStateUpdate-95391788484132868-127.0.0.1:34271_-n_0000000000) [n:127.0.0.1:34271_    ] o.a.s.c.o.ReplicaMutator Assigning new node to shard shard=shard1
   [junit4]   2> 629255 INFO  (zkCallback-324-thread-2-processing-n:127.0.0.1:34271_) [n:127.0.0.1:34271_    ] o.a.s.c.c.ZkStateReader A cluster state change: [WatchedEvent state:SyncConnected type:NodeDataChanged path:/clusterstate.json], has occurred - updating... (live nodes size: [2])
   [junit4]   2> 629255 INFO  (zkCallback-326-thread-1) [    ] o.a.s.c.c.ZkStateReader A cluster state change: [WatchedEvent state:SyncConnected type:NodeDataChanged path:/clusterstate.json], has occurred - updating... (live nodes size: [2])
   [junit4]   2> 629255 INFO  (zkCallback-331-thread-1-processing-n:127.0.0.1:50696_) [n:127.0.0.1:50696_    ] o.a.s.c.c.ZkStateReader A cluster state change: [WatchedEvent state:SyncConnected type:NodeDataChanged path:/clusterstate.json], has occurred - updating... (live nodes size: [2])
   [junit4]   2> 630254 INFO  (coreLoadExecutor-1354-thread-1-processing-n:127.0.0.1:50696_) [n:127.0.0.1:50696_ c:collection1   x:collection1] o.a.s.c.ZkController waiting to find shard id in clusterstate for collection1
   [junit4]   2> 630254 INFO  (coreLoadExecutor-1354-thread-1-processing-n:127.0.0.1:50696_) [n:127.0.0.1:50696_ c:collection1   x:collection1] o.a.s.c.ZkController Check for collection zkNode:collection1
   [junit4]   2> 630254 INFO  (coreLoadExecutor-1354-thread-1-processing-n:127.0.0.1:50696_) [n:127.0.0.1:50696_ c:collection1   x:collection1] o.a.s.c.ZkController Collection zkNode exists
   [junit4]   2> 630254 INFO  (coreLoadExecutor-1354-thread-1-processing-n:127.0.0.1:50696_) [n:127.0.0.1:50696_ c:collection1   x:collection1] o.a.s.c.c.ZkStateReader Load collection config from: [/collections/collection1]
   [junit4]   2> 630255 INFO  (coreLoadExecutor-1354-thread-1-processing-n:127.0.0.1:50696_) [n:127.0.0.1:50696_ c:collection1   x:collection1] o.a.s.c.c.ZkStateReader path=[/collections/collection1] [configName]=[conf1] specified config exists in ZooKeeper
   [junit4]   2> 630255 INFO  (coreLoadExecutor-1354-thread-1-processing-n:127.0.0.1:50696_) [n:127.0.0.1:50696_ c:collection1   x:collection1] o.a.s.c.SolrResourceLoader new SolrResourceLoader for directory: '/home/jenkins/workspace/Lucene-Solr-trunk-Linux/solr/build/solr-core/test/J0/temp/solr.client.solrj.ConnectionReuseTest_E9A53D57A79CF6B8-001/shard-1-001/cores/collection1'
   [junit4]   2> 630255 INFO  (coreLoadExecutor-1354-thread-1-processing-n:127.0.0.1:50696_) [n:127.0.0.1:50696_ c:collection1   x:collection1] o.a.s.c.SolrResourceLoader JNDI not configured for solr (NoInitialContextEx)
   [junit4]   2> 630255 INFO  (coreLoadExecutor-1354-thread-1-processing-n:127.0.0.1:50696_) [n:127.0.0.1:50696_ c:collection1   x:collection1] o.a.s.c.SolrResourceLoader solr home defaulted to 'solr/' (could not find system property or JNDI)
   [junit4]   2> 630256 INFO  (coreLoadExecutor-1354-thread-1-processing-n:127.0.0.1:50696_) [n:127.0.0.1:50696_ c:collection1   x:collection1] o.a.s.c.Config loaded config solrconfig.xml with version 0 
   [junit4]   2> 630260 INFO  (coreLoadExecutor-1354-thread-1-processing-n:127.0.0.1:50696_) [n:127.0.0.1:50696_ c:collection1   x:collection1] o.a.s.c.SolrConfig current version of requestparams : -1
   [junit4]   2> 630262 INFO  (coreLoadExecutor-1354-thread-1-processing-n:127.0.0.1:50696_) [n:127.0.0.1:50696_ c:collection1   x:collection1] o.a.s.c.SolrConfig Using Lucene MatchVersion: 6.0.0
   [junit4]   2> 630273 INFO  (coreLoadExecutor-1354-thread-1-processing-n:127.0.0.1:50696_) [n:127.0.0.1:50696_ c:collection1   x:collection1] o.a.s.c.SolrConfig Loaded SolrConfig: solrconfig.xml
   [junit4]   2> 630277 INFO  (coreLoadExecutor-1354-thread-1-processing-n:127.0.0.1:50696_) [n:127.0.0.1:50696_ c:collection1   x:collection1] o.a.s.s.IndexSchema [collection1] Schema name=test
   [junit4]   2> 630330 INFO  (coreLoadExecutor-1354-thread-1-processing-n:127.0.0.1:50696_) [n:127.0.0.1:50696_ c:collection1   x:collection1] o.a.s.s.OpenExchangeRatesOrgProvider Initialized with rates=open-exchange-rates.json, refreshInterval=1440.
   [junit4]   2> 630333 INFO  (coreLoadExecutor-1354-thread-1-processing-n:127.0.0.1:50696_) [n:127.0.0.1:50696_ c:collection1   x:collection1] o.a.s.s.IndexSchema default search field in schema is text
   [junit4]   2> 630334 INFO  (coreLoadExecutor-1354-thread-1-processing-n:127.0.0.1:50696_) [n:127.0.0.1:50696_ c:collection1   x:collection1] o.a.s.s.IndexSchema unique key field: id
   [junit4]   2> 630338 INFO  (coreLoadExecutor-1354-thread-1-processing-n:127.0.0.1:50696_) [n:127.0.0.1:50696_ c:collection1   x:collection1] o.a.s.s.FileExchangeRateProvider Reloading exchange rates from file currency.xml
   [junit4]   2> 630339 INFO  (coreLoadExecutor-1354-thread-1-processing-n:127.0.0.1:50696_) [n:127.0.0.1:50696_ c:collection1   x:collection1] o.a.s.s.FileExchangeRateProvider Reloading exchange rates from file currency.xml
   [junit4]   2> 630340 INFO  (coreLoadExecutor-1354-thread-1-processing-n:127.0.0.1:50696_) [n:127.0.0.1:50696_ c:collection1   x:collection1] o.a.s.s.OpenExchangeRatesOrgProvider Reloading exchange rates from open-exchange-rates.json
   [junit4]   2> 630340 INFO  (coreLoadExecutor-1354-thread-1-processing-n:127.0.0.1:50696_) [n:127.0.0.1:50696_ c:collection1   x:collection1] o.a.s.s.OpenExchangeRatesOrgProvider Reloading exchange rates from open-exchange-rates.json
   [junit4]   2> 630341 INFO  (coreLoadExecutor-1354-thread-1-processing-n:127.0.0.1:50696_) [n:127.0.0.1:50696_ c:collection1   x:collection1] o.a.s.c.ConfigSetProperties Did not find ConfigSet properties, assuming default properties: Can't find resource 'configsetprops.json' in classpath or '/configs/conf1', cwd=/home/jenkins/workspace/Lucene-Solr-trunk-Linux/solr/build/solr-core/test/J0
   [junit4]   2> 630341 INFO  (coreLoadExecutor-1354-thread-1-processing-n:127.0.0.1:50696_) [n:127.0.0.1:50696_ c:collection1   x:collection1] o.a.s.c.CoreContainer Creating SolrCore 'collection1' using configuration from collection collection1
   [junit4]   2> 630341 INFO  (coreLoadExecutor-1354-thread-1-processing-n:127.0.0.1:50696_) [n:127.0.0.1:50696_ c:collection1 s:shard1 r:core_node1 x:collection1] o.a.s.c.SolrCore org.apache.solr.core.MockDirectoryFactory
   [junit4]   2> 630341 INFO  (coreLoadExecutor-1354-thread-1-processing-n:127.0.0.1:50696_) [n:127.0.0.1:50696_ c:collection1 s:shard1 r:core_node1 x:collection1] o.a.s.c.SolrCore [[collection1] ] Opening new SolrCore at [/home/jenkins/workspace/Lucene-Solr-trunk-Linux/solr/build/solr-core/test/J0/temp/solr.client.solrj.ConnectionReuseTest_E9A53D57A79CF6B8-001/shard-1-001/cores/collection1], dataDir=[/home/jenkins/workspace/Lucene-Solr-trunk-Linux/solr/build/solr-core/test/J0/../../../../../../../../../home/jenkins/workspace/Lucene-Solr-trunk-Linux/solr/build/solr-core/test/J0/temp/solr.client.solrj.ConnectionReuseTest_E9A53D57A79CF6B8-001/shard-1-001/cores/collection1/data/]
   [junit4]   2> 630341 INFO  (coreLoadExecutor-1354-thread-1-processing-n:127.0.0.1:50696_) [n:127.0.0.1:50696_ c:collection1 s:shard1 r:core_node1 x:collection1] o.a.s.c.JmxMonitoredMap JMX monitoring is enabled. Adding Solr mbeans to JMX Server: com.sun.jmx.mbeanserver.JmxMBeanServer@7bd83f3a
   [junit4]   2> 630342 INFO  (coreLoadExecutor-1354-thread-1-processing-n:127.0.0.1:50696_) [n:127.0.0.1:50696_ c:collection1 s:shard1 r:core_node1 x:collection1] o.a.s.c.CachingDirectoryFactory return new directory for /home/jenkins/workspace/Lucene-Solr-trunk-Linux/solr/build/solr-core/test/J0/../../../../../../../../../home/jenkins/workspace/Lucene-Solr-trunk-Linux/solr/build/solr-core/test/J0/temp/solr.client.solrj.ConnectionReuseTest_E9A53D57A79CF6B8-001/shard-1-001/cores/collection1/data
   [junit4]   2> 630342 INFO  (coreLoadExecutor-1354-thread-1-processing-n:127.0.0.1:50696_) [n:127.0.0.1:50696_ c:collection1 s:shard1 r:core_node1 x:collection1] o.a.s.c.SolrCore New index directory detected: old=null new=/home/jenkins/workspace/Lucene-Solr-trunk-Linux/solr/build/solr-core/test/J0/../../../../../../../../../home/jenkins/workspace/Lucene-Solr-trunk-Linux/solr/build/solr-core/test/J0/temp/solr.client.solrj.ConnectionReuseTest_E9A53D57A79CF6B8-001/shard-1-001/cores/collection1/data/index/
   [junit4]   2> 630342 WARN  (coreLoadExecutor-1354-thread-1-processing-n:127.0.0.1:50696_) [n:127.0.0.1:50696_ c:collection1 s:shard1 r:core_node1 x:collection1] o.a.s.c.SolrCore [collection1] Solr index directory '/home/jenkins/workspace/Lucene-Solr-trunk-Linux/solr/build/solr-core/test/J0/../../../../../../../../../home/jenkins/workspace/Lucene-Solr-trunk-Linux/solr/build/solr-core/test/J0/temp/solr.client.solrj.ConnectionReuseTest_E9A53D57A79CF6B8-001/shard-1-001/cores/collection1/data/index' doesn't exist. Creating new index...
   [junit4]   2> 630342 INFO  (coreLoadExecutor-1354-thread-1-processing-n:127.0.0.1:50696_) [n:127.0.0.1:50696_ c:collection1 s:shard1 r:core_node1 x:collection1] o.a.s.c.CachingDirectoryFactory return new directory for /home/jenkins/workspace/Lucene-Solr-trunk-Linux/solr/build/solr-core/test/J0/../../../../../../../../../home/jenkins/workspace/Lucene-Solr-trunk-Linux/solr/build/solr-core/test/J0/temp/solr.client.solrj.ConnectionReuseTest_E9A53D57A79CF6B8-001/shard-1-001/cores/colle

[...truncated too long message...]

6B8-001/shard-2-001/cores/collection1/data [CachedDir<<refCount=0;path=/home/jenkins/workspace/Lucene-Solr-trunk-Linux/solr/build/solr-core/test/J1/temp/solr.cloud.ChaosMonkeyNothingIsSafeTest_E9A53D57A79CF6B8-001/shard-2-001/cores/collection1/data;done=false>>]
   [junit4]   2> 904185 INFO  (coreCloseExecutor-2917-thread-1) [n:127.0.0.1:35258_ c:collection1 s:shard1 r:core_node2 x:collection1] o.a.s.c.CachingDirectoryFactory Closing directory: /home/jenkins/workspace/Lucene-Solr-trunk-Linux/solr/build/solr-core/test/J1/temp/solr.cloud.ChaosMonkeyNothingIsSafeTest_E9A53D57A79CF6B8-001/shard-2-001/cores/collection1/data
   [junit4]   2> 904185 INFO  (coreCloseExecutor-2917-thread-1) [n:127.0.0.1:35258_ c:collection1 s:shard1 r:core_node2 x:collection1] o.a.s.c.CachingDirectoryFactory looking to close /home/jenkins/workspace/Lucene-Solr-trunk-Linux/solr/build/solr-core/test/J1/temp/solr.cloud.ChaosMonkeyNothingIsSafeTest_E9A53D57A79CF6B8-001/shard-2-001/cores/collection1/data/index [CachedDir<<refCount=0;path=/home/jenkins/workspace/Lucene-Solr-trunk-Linux/solr/build/solr-core/test/J1/temp/solr.cloud.ChaosMonkeyNothingIsSafeTest_E9A53D57A79CF6B8-001/shard-2-001/cores/collection1/data/index;done=false>>]
   [junit4]   2> 904185 INFO  (coreCloseExecutor-2917-thread-1) [n:127.0.0.1:35258_ c:collection1 s:shard1 r:core_node2 x:collection1] o.a.s.c.CachingDirectoryFactory Closing directory: /home/jenkins/workspace/Lucene-Solr-trunk-Linux/solr/build/solr-core/test/J1/temp/solr.cloud.ChaosMonkeyNothingIsSafeTest_E9A53D57A79CF6B8-001/shard-2-001/cores/collection1/data/index
   [junit4]   2> 904186 INFO  (TEST-ChaosMonkeyNothingIsSafeTest.test-seed#[E9A53D57A79CF6B8]) [    ] o.a.s.c.Overseer Overseer (id=95391796136771595-127.0.0.1:35258_-n_0000000002) closing
   [junit4]   2> 904186 INFO  (OverseerStateUpdate-95391796136771595-127.0.0.1:35258_-n_0000000002) [n:127.0.0.1:35258_    ] o.a.s.c.Overseer Overseer Loop exiting : 127.0.0.1:35258_
   [junit4]   2> 904209 INFO  (zkCallback-797-thread-4-processing-n:127.0.0.1:35258_) [n:127.0.0.1:35258_    ] o.a.s.c.c.ZkStateReader A live node change: [WatchedEvent state:SyncConnected type:NodeChildrenChanged path:/live_nodes], has occurred - updating... (live nodes size: [1])
   [junit4]   2> 904209 WARN  (zkCallback-797-thread-4-processing-n:127.0.0.1:35258_) [n:127.0.0.1:35258_    ] o.a.s.c.c.ZkStateReader ZooKeeper watch triggered, but Solr cannot talk to ZK: [KeeperErrorCode = Session expired for /live_nodes]
   [junit4]   2> 904211 INFO  (TEST-ChaosMonkeyNothingIsSafeTest.test-seed#[E9A53D57A79CF6B8]) [    ] o.e.j.s.ServerConnector Stopped ServerConnector@34072d89{HTTP/1.1}{127.0.0.1:0}
   [junit4]   2> 904211 INFO  (TEST-ChaosMonkeyNothingIsSafeTest.test-seed#[E9A53D57A79CF6B8]) [    ] o.e.j.s.h.ContextHandler Stopped o.e.j.s.ServletContextHandler@7c51b3de{/,null,UNAVAILABLE}
   [junit4]   2> 904212 INFO  (TEST-ChaosMonkeyNothingIsSafeTest.test-seed#[E9A53D57A79CF6B8]) [    ] o.a.s.c.ZkTestServer connecting to 127.0.0.1:60619 60619
   [junit4]   2> 904321 INFO  (Thread-2271) [    ] o.a.s.c.ZkTestServer connecting to 127.0.0.1:60619 60619
   [junit4]   2> 904321 WARN  (Thread-2271) [    ] o.a.s.c.ZkTestServer Watch limit violations: 
   [junit4]   2> Maximum concurrent children watches above limit:
   [junit4]   2> 
   [junit4]   2> 	7	/solr/overseer/queue
   [junit4]   2> 
   [junit4]   2> NOTE: reproduce with: ant test  -Dtestcase=ChaosMonkeyNothingIsSafeTest -Dtests.method=test -Dtests.seed=E9A53D57A79CF6B8 -Dtests.multiplier=3 -Dtests.slow=true -Dtests.locale=ko -Dtests.timezone=Europe/Andorra -Dtests.asserts=true -Dtests.file.encoding=UTF-8
   [junit4] ERROR    166s J1 | ChaosMonkeyNothingIsSafeTest.test <<<
   [junit4]    > Throwable #1: org.apache.solr.client.solrj.impl.HttpSolrClient$RemoteSolrException: Error from server at http://127.0.0.1:35258: collection already exists: testcollection
   [junit4]    > 	at __randomizedtesting.SeedInfo.seed([E9A53D57A79CF6B8:61F1028D09609B40]:0)
   [junit4]    > 	at org.apache.solr.client.solrj.impl.HttpSolrClient.executeMethod(HttpSolrClient.java:577)
   [junit4]    > 	at org.apache.solr.client.solrj.impl.HttpSolrClient.request(HttpSolrClient.java:241)
   [junit4]    > 	at org.apache.solr.client.solrj.impl.HttpSolrClient.request(HttpSolrClient.java:230)
   [junit4]    > 	at org.apache.solr.client.solrj.impl.LBHttpSolrClient.doRequest(LBHttpSolrClient.java:372)
   [junit4]    > 	at org.apache.solr.client.solrj.impl.LBHttpSolrClient.request(LBHttpSolrClient.java:325)
   [junit4]    > 	at org.apache.solr.client.solrj.impl.CloudSolrClient.sendRequest(CloudSolrClient.java:1099)
   [junit4]    > 	at org.apache.solr.client.solrj.impl.CloudSolrClient.requestWithRetryOnStaleState(CloudSolrClient.java:870)
   [junit4]    > 	at org.apache.solr.client.solrj.impl.CloudSolrClient.request(CloudSolrClient.java:806)
   [junit4]    > 	at org.apache.solr.client.solrj.SolrClient.request(SolrClient.java:1219)
   [junit4]    > 	at org.apache.solr.cloud.AbstractFullDistribZkTestBase.createCollection(AbstractFullDistribZkTestBase.java:1593)
   [junit4]    > 	at org.apache.solr.cloud.AbstractFullDistribZkTestBase.createCollection(AbstractFullDistribZkTestBase.java:1614)
   [junit4]    > 	at org.apache.solr.cloud.ChaosMonkeyNothingIsSafeTest.test(ChaosMonkeyNothingIsSafeTest.java:249)
   [junit4]    > 	at org.apache.solr.BaseDistributedSearchTestCase$ShardsRepeatRule$ShardsFixedStatement.callStatement(BaseDistributedSearchTestCase.java:964)
   [junit4]    > 	at org.apache.solr.BaseDistributedSearchTestCase$ShardsRepeatRule$ShardsStatement.evaluate(BaseDistributedSearchTestCase.java:939)
   [junit4]    > 	at java.lang.Thread.run(Thread.java:745)
   [junit4]   2> 904333 INFO  (SUITE-ChaosMonkeyNothingIsSafeTest-seed#[E9A53D57A79CF6B8]-worker) [    ] o.a.s.SolrTestCaseJ4 ###deleteCore
   [junit4]   2> NOTE: leaving temporary files on disk at: /home/jenkins/workspace/Lucene-Solr-trunk-Linux/solr/build/solr-core/test/J1/temp/solr.cloud.ChaosMonkeyNothingIsSafeTest_E9A53D57A79CF6B8-001
   [junit4]   2> Feb 15, 2016 7:11:01 PM com.carrotsearch.randomizedtesting.ThreadLeakControl checkThreadLeaks
   [junit4]   2> WARNING: Will linger awaiting termination of 1 leaked thread(s).
   [junit4]   2> NOTE: test params are: codec=Asserting(Lucene60): {rnd_b=PostingsFormat(name=Memory doPackFST= true), _version_=TestBloomFilteredLucenePostings(BloomFilteringPostingsFormat(Lucene50(blocksize=128))), a_t=TestBloomFilteredLucenePostings(BloomFilteringPostingsFormat(Lucene50(blocksize=128))), a_i=PostingsFormat(name=Memory doPackFST= true), id=PostingsFormat(name=Memory doPackFST= true)}, docValues:{}, sim=RandomSimilarity(queryNorm=true,coord=crazy): {}, locale=ko, timezone=Europe/Andorra
   [junit4]   2> NOTE: Linux 3.19.0-47-generic amd64/Oracle Corporation 1.8.0_72 (64-bit)/cpus=12,threads=1,free=158271512,total=515899392
   [junit4]   2> NOTE: All tests run in this JVM: [SolrCmdDistributorTest, TestSortingResponseWriter, TestRecoveryHdfs, TestDynamicFieldResource, TestSolrDynamicMBean, DistanceFunctionTest, TestWordDelimiterFilterFactory, TestBM25SimilarityFactory, HdfsWriteToMultipleCollectionsTest, TermVectorComponentTest, MinimalSchemaTest, SpellPossibilityIteratorTest, ClusterStateUpdateTest, TimeZoneUtilsTest, HdfsCollectionsAPIDistributedZkTest, OverseerTaskQueueTest, TestQuerySenderListener, ShardRoutingCustomTest, SortByFunctionTest, TestReplicaProperties, CdcrReplicationHandlerTest, TestUseDocValuesAsStored2, SharedFSAutoReplicaFailoverTest, TestSolrQueryParserResource, OpenExchangeRatesOrgProviderTest, TestEmbeddedSolrServerConstructors, TestFileDictionaryLookup, TestHashPartitioner, SpatialRPTFieldTypeTest, TestInitQParser, TestDFRSimilarityFactory, TestQuerySenderNoQuery, SolrPluginUtilsTest, ExitableDirectoryReaderTest, AliasIntegrationTest, TestQueryUtils, TestCollapseQParserPlugin, DistributedExpandComponentTest, FastVectorHighlighterTest, DistributedTermsComponentTest, DocValuesTest, HdfsThreadLeakTest, TestConfigSets, CollectionReloadTest, TestMacros, TestJsonRequest, TestShortCircuitedRequests, CollectionsAPIDistributedZkTest, TestConfigSetsAPI, TestDefaultStatsCache, FileUtilsTest, TestUpdate, TestManagedSchemaFieldResource, MultiTermTest, AnalysisErrorHandlingTest, ParsingFieldUpdateProcessorsTest, TestExclusionRuleCollectionAccess, ZkCLITest, FacetPivotSmallTest, TestCloudInspectUtil, GraphQueryTest, DistribJoinFromCollectionTest, DateRangeFieldTest, LeaderInitiatedRecoveryOnCommitTest, TestCoreContainer, SchemaVersionSpecificBehaviorTest, TestSimpleQParserPlugin, IndexBasedSpellCheckerTest, ChaosMonkeyNothingIsSafeTest]
   [junit4] Completed [186/579 (2!)] on J1 in 166.66s, 1 test, 1 error <<< FAILURES!

[...truncated 1298 lines...]
BUILD FAILED
/home/jenkins/workspace/Lucene-Solr-trunk-Linux/build.xml:740: The following error occurred while executing this line:
/home/jenkins/workspace/Lucene-Solr-trunk-Linux/build.xml:684: The following error occurred while executing this line:
/home/jenkins/workspace/Lucene-Solr-trunk-Linux/build.xml:59: The following error occurred while executing this line:
/home/jenkins/workspace/Lucene-Solr-trunk-Linux/solr/build.xml:233: The following error occurred while executing this line:
/home/jenkins/workspace/Lucene-Solr-trunk-Linux/solr/common-build.xml:524: The following error occurred while executing this line:
/home/jenkins/workspace/Lucene-Solr-trunk-Linux/lucene/common-build.xml:1457: The following error occurred while executing this line:
/home/jenkins/workspace/Lucene-Solr-trunk-Linux/lucene/common-build.xml:1014: There were test failures: 579 suites (8 ignored), 2331 tests, 1 error, 1 failure, 117 ignored (72 assumptions) [seed: E9A53D57A79CF6B8]

Total time: 56 minutes 25 seconds
Build step 'Invoke Ant' marked build as failure
Archiving artifacts
[WARNINGS] Skipping publisher since build result is FAILURE
Recording test results
Email was triggered for: Failure - Any
Sending email for trigger: Failure - Any



Mime
View raw message