lucene-dev mailing list archives

Site index · List index
Message view « Date » · « Thread »
Top « Date » · « Thread »
From Policeman Jenkins Server <jenk...@thetaphi.de>
Subject [JENKINS] Lucene-Solr-5.x-Linux (32bit/jdk1.7.0_80) - Build # 15537 - Failure!
Date Wed, 10 Feb 2016 20:05:36 GMT
Build: http://jenkins.thetaphi.de/job/Lucene-Solr-5.x-Linux/15537/
Java: 32bit/jdk1.7.0_80 -server -XX:+UseG1GC

1 tests failed.
FAILED:  org.apache.solr.cloud.ClusterStateUpdateTest.testCoreRegistration

Error Message:


Stack Trace:
java.lang.AssertionError
	at __randomizedtesting.SeedInfo.seed([68B83D687D84F5F:B800E579FEA2416A]:0)
	at org.junit.Assert.fail(Assert.java:92)
	at org.junit.Assert.assertTrue(Assert.java:43)
	at org.junit.Assert.assertTrue(Assert.java:54)
	at org.apache.solr.cloud.ClusterStateUpdateTest.testCoreRegistration(ClusterStateUpdateTest.java:234)
	at sun.reflect.NativeMethodAccessorImpl.invoke0(Native Method)
	at sun.reflect.NativeMethodAccessorImpl.invoke(NativeMethodAccessorImpl.java:57)
	at sun.reflect.DelegatingMethodAccessorImpl.invoke(DelegatingMethodAccessorImpl.java:43)
	at java.lang.reflect.Method.invoke(Method.java:606)
	at com.carrotsearch.randomizedtesting.RandomizedRunner.invoke(RandomizedRunner.java:1764)
	at com.carrotsearch.randomizedtesting.RandomizedRunner$8.evaluate(RandomizedRunner.java:871)
	at com.carrotsearch.randomizedtesting.RandomizedRunner$9.evaluate(RandomizedRunner.java:907)
	at com.carrotsearch.randomizedtesting.RandomizedRunner$10.evaluate(RandomizedRunner.java:921)
	at com.carrotsearch.randomizedtesting.rules.SystemPropertiesRestoreRule$1.evaluate(SystemPropertiesRestoreRule.java:57)
	at org.apache.lucene.util.TestRuleSetupTeardownChained$1.evaluate(TestRuleSetupTeardownChained.java:49)
	at org.apache.lucene.util.AbstractBeforeAfterRule$1.evaluate(AbstractBeforeAfterRule.java:45)
	at org.apache.lucene.util.TestRuleThreadAndTestName$1.evaluate(TestRuleThreadAndTestName.java:48)
	at org.apache.lucene.util.TestRuleIgnoreAfterMaxFailures$1.evaluate(TestRuleIgnoreAfterMaxFailures.java:64)
	at org.apache.lucene.util.TestRuleMarkFailure$1.evaluate(TestRuleMarkFailure.java:47)
	at com.carrotsearch.randomizedtesting.rules.StatementAdapter.evaluate(StatementAdapter.java:36)
	at com.carrotsearch.randomizedtesting.ThreadLeakControl$StatementRunner.run(ThreadLeakControl.java:367)
	at com.carrotsearch.randomizedtesting.ThreadLeakControl.forkTimeoutingTask(ThreadLeakControl.java:809)
	at com.carrotsearch.randomizedtesting.ThreadLeakControl$3.evaluate(ThreadLeakControl.java:460)
	at com.carrotsearch.randomizedtesting.RandomizedRunner.runSingleTest(RandomizedRunner.java:880)
	at com.carrotsearch.randomizedtesting.RandomizedRunner$5.evaluate(RandomizedRunner.java:781)
	at com.carrotsearch.randomizedtesting.RandomizedRunner$6.evaluate(RandomizedRunner.java:816)
	at com.carrotsearch.randomizedtesting.RandomizedRunner$7.evaluate(RandomizedRunner.java:827)
	at com.carrotsearch.randomizedtesting.rules.StatementAdapter.evaluate(StatementAdapter.java:36)
	at com.carrotsearch.randomizedtesting.rules.SystemPropertiesRestoreRule$1.evaluate(SystemPropertiesRestoreRule.java:57)
	at org.apache.lucene.util.AbstractBeforeAfterRule$1.evaluate(AbstractBeforeAfterRule.java:45)
	at com.carrotsearch.randomizedtesting.rules.StatementAdapter.evaluate(StatementAdapter.java:36)
	at org.apache.lucene.util.TestRuleStoreClassName$1.evaluate(TestRuleStoreClassName.java:41)
	at com.carrotsearch.randomizedtesting.rules.NoShadowingOrOverridesOnMethodsRule$1.evaluate(NoShadowingOrOverridesOnMethodsRule.java:40)
	at com.carrotsearch.randomizedtesting.rules.NoShadowingOrOverridesOnMethodsRule$1.evaluate(NoShadowingOrOverridesOnMethodsRule.java:40)
	at com.carrotsearch.randomizedtesting.rules.StatementAdapter.evaluate(StatementAdapter.java:36)
	at com.carrotsearch.randomizedtesting.rules.StatementAdapter.evaluate(StatementAdapter.java:36)
	at com.carrotsearch.randomizedtesting.rules.StatementAdapter.evaluate(StatementAdapter.java:36)
	at org.apache.lucene.util.TestRuleAssertionsRequired$1.evaluate(TestRuleAssertionsRequired.java:53)
	at org.apache.lucene.util.TestRuleMarkFailure$1.evaluate(TestRuleMarkFailure.java:47)
	at org.apache.lucene.util.TestRuleIgnoreAfterMaxFailures$1.evaluate(TestRuleIgnoreAfterMaxFailures.java:64)
	at org.apache.lucene.util.TestRuleIgnoreTestSuites$1.evaluate(TestRuleIgnoreTestSuites.java:54)
	at com.carrotsearch.randomizedtesting.rules.StatementAdapter.evaluate(StatementAdapter.java:36)
	at com.carrotsearch.randomizedtesting.ThreadLeakControl$StatementRunner.run(ThreadLeakControl.java:367)
	at java.lang.Thread.run(Thread.java:745)




Build Log:
[...truncated 11503 lines...]
   [junit4] Suite: org.apache.solr.cloud.ClusterStateUpdateTest
   [junit4]   2> Creating dataDir: /home/jenkins/workspace/Lucene-Solr-5.x-Linux/solr/build/solr-core/test/J0/temp/solr.cloud.ClusterStateUpdateTest_68B83D687D84F5F-001/init-core-data-001
   [junit4]   2> 1125830 INFO  (SUITE-ClusterStateUpdateTest-seed#[68B83D687D84F5F]-worker) [    ] o.a.s.SolrTestCaseJ4 Randomized ssl (false) and clientAuth (false)
   [junit4]   2> 1125834 INFO  (TEST-ClusterStateUpdateTest.testCoreRegistration-seed#[68B83D687D84F5F]) [    ] o.a.s.SolrTestCaseJ4 ###Starting testCoreRegistration
   [junit4]   2> 1125834 INFO  (TEST-ClusterStateUpdateTest.testCoreRegistration-seed#[68B83D687D84F5F]) [    ] o.a.s.c.ZkTestServer STARTING ZK TEST SERVER
   [junit4]   2> 1125834 INFO  (Thread-3042) [    ] o.a.s.c.ZkTestServer client port:0.0.0.0/0.0.0.0:0
   [junit4]   2> 1125834 INFO  (Thread-3042) [    ] o.a.s.c.ZkTestServer Starting server
   [junit4]   2> 1125934 INFO  (TEST-ClusterStateUpdateTest.testCoreRegistration-seed#[68B83D687D84F5F]) [    ] o.a.s.c.ZkTestServer start zk server on port:60804
   [junit4]   2> 1125934 INFO  (TEST-ClusterStateUpdateTest.testCoreRegistration-seed#[68B83D687D84F5F]) [    ] o.a.s.c.c.SolrZkClient Using default ZkCredentialsProvider
   [junit4]   2> 1125935 INFO  (TEST-ClusterStateUpdateTest.testCoreRegistration-seed#[68B83D687D84F5F]) [    ] o.a.s.c.c.ConnectionManager Waiting for client to connect to ZooKeeper
   [junit4]   2> 1125937 INFO  (zkCallback-1014-thread-1) [    ] o.a.s.c.c.ConnectionManager Watcher org.apache.solr.common.cloud.ConnectionManager@da6278 name:ZooKeeperConnection Watcher:127.0.0.1:60804 got event WatchedEvent state:SyncConnected type:None path:null path:null type:None
   [junit4]   2> 1125937 INFO  (TEST-ClusterStateUpdateTest.testCoreRegistration-seed#[68B83D687D84F5F]) [    ] o.a.s.c.c.ConnectionManager Client is connected to ZooKeeper
   [junit4]   2> 1125937 INFO  (TEST-ClusterStateUpdateTest.testCoreRegistration-seed#[68B83D687D84F5F]) [    ] o.a.s.c.c.SolrZkClient Using default ZkACLProvider
   [junit4]   2> 1125937 INFO  (TEST-ClusterStateUpdateTest.testCoreRegistration-seed#[68B83D687D84F5F]) [    ] o.a.s.c.c.SolrZkClient makePath: /solr
   [junit4]   2> 1125938 INFO  (TEST-ClusterStateUpdateTest.testCoreRegistration-seed#[68B83D687D84F5F]) [    ] o.a.s.c.c.SolrZkClient Using default ZkCredentialsProvider
   [junit4]   2> 1125939 INFO  (TEST-ClusterStateUpdateTest.testCoreRegistration-seed#[68B83D687D84F5F]) [    ] o.a.s.c.c.ConnectionManager Waiting for client to connect to ZooKeeper
   [junit4]   2> 1125940 INFO  (zkCallback-1015-thread-1) [    ] o.a.s.c.c.ConnectionManager Watcher org.apache.solr.common.cloud.ConnectionManager@4a6b4b name:ZooKeeperConnection Watcher:127.0.0.1:60804/solr got event WatchedEvent state:SyncConnected type:None path:null path:null type:None
   [junit4]   2> 1125940 INFO  (TEST-ClusterStateUpdateTest.testCoreRegistration-seed#[68B83D687D84F5F]) [    ] o.a.s.c.c.ConnectionManager Client is connected to ZooKeeper
   [junit4]   2> 1125940 INFO  (TEST-ClusterStateUpdateTest.testCoreRegistration-seed#[68B83D687D84F5F]) [    ] o.a.s.c.c.SolrZkClient Using default ZkACLProvider
   [junit4]   2> 1125941 INFO  (TEST-ClusterStateUpdateTest.testCoreRegistration-seed#[68B83D687D84F5F]) [    ] o.a.s.c.c.SolrZkClient makePath: /collections/collection1
   [junit4]   2> 1125941 INFO  (TEST-ClusterStateUpdateTest.testCoreRegistration-seed#[68B83D687D84F5F]) [    ] o.a.s.c.c.SolrZkClient makePath: /collections/collection1/shards
   [junit4]   2> 1125942 INFO  (TEST-ClusterStateUpdateTest.testCoreRegistration-seed#[68B83D687D84F5F]) [    ] o.a.s.c.c.SolrZkClient makePath: /collections/control_collection
   [junit4]   2> 1125942 INFO  (TEST-ClusterStateUpdateTest.testCoreRegistration-seed#[68B83D687D84F5F]) [    ] o.a.s.c.c.SolrZkClient makePath: /collections/control_collection/shards
   [junit4]   2> 1125943 INFO  (TEST-ClusterStateUpdateTest.testCoreRegistration-seed#[68B83D687D84F5F]) [    ] o.a.s.c.AbstractZkTestCase put /home/jenkins/workspace/Lucene-Solr-5.x-Linux/solr/core/src/test-files/solr/collection1/conf/solrconfig.xml to /configs/conf1/solrconfig.xml
   [junit4]   2> 1125943 INFO  (TEST-ClusterStateUpdateTest.testCoreRegistration-seed#[68B83D687D84F5F]) [    ] o.a.s.c.c.SolrZkClient makePath: /configs/conf1/solrconfig.xml
   [junit4]   2> 1125944 INFO  (TEST-ClusterStateUpdateTest.testCoreRegistration-seed#[68B83D687D84F5F]) [    ] o.a.s.c.AbstractZkTestCase put /home/jenkins/workspace/Lucene-Solr-5.x-Linux/solr/core/src/test-files/solr/collection1/conf/schema.xml to /configs/conf1/schema.xml
   [junit4]   2> 1125944 INFO  (TEST-ClusterStateUpdateTest.testCoreRegistration-seed#[68B83D687D84F5F]) [    ] o.a.s.c.c.SolrZkClient makePath: /configs/conf1/schema.xml
   [junit4]   2> 1125945 INFO  (TEST-ClusterStateUpdateTest.testCoreRegistration-seed#[68B83D687D84F5F]) [    ] o.a.s.c.AbstractZkTestCase put /home/jenkins/workspace/Lucene-Solr-5.x-Linux/solr/core/src/test-files/solr/collection1/conf/solrconfig.snippet.randomindexconfig.xml to /configs/conf1/solrconfig.snippet.randomindexconfig.xml
   [junit4]   2> 1125945 INFO  (TEST-ClusterStateUpdateTest.testCoreRegistration-seed#[68B83D687D84F5F]) [    ] o.a.s.c.c.SolrZkClient makePath: /configs/conf1/solrconfig.snippet.randomindexconfig.xml
   [junit4]   2> 1125946 INFO  (TEST-ClusterStateUpdateTest.testCoreRegistration-seed#[68B83D687D84F5F]) [    ] o.a.s.c.AbstractZkTestCase put /home/jenkins/workspace/Lucene-Solr-5.x-Linux/solr/core/src/test-files/solr/collection1/conf/stopwords.txt to /configs/conf1/stopwords.txt
   [junit4]   2> 1125946 INFO  (TEST-ClusterStateUpdateTest.testCoreRegistration-seed#[68B83D687D84F5F]) [    ] o.a.s.c.c.SolrZkClient makePath: /configs/conf1/stopwords.txt
   [junit4]   2> 1125947 INFO  (TEST-ClusterStateUpdateTest.testCoreRegistration-seed#[68B83D687D84F5F]) [    ] o.a.s.c.AbstractZkTestCase put /home/jenkins/workspace/Lucene-Solr-5.x-Linux/solr/core/src/test-files/solr/collection1/conf/protwords.txt to /configs/conf1/protwords.txt
   [junit4]   2> 1125947 INFO  (TEST-ClusterStateUpdateTest.testCoreRegistration-seed#[68B83D687D84F5F]) [    ] o.a.s.c.c.SolrZkClient makePath: /configs/conf1/protwords.txt
   [junit4]   2> 1125948 INFO  (TEST-ClusterStateUpdateTest.testCoreRegistration-seed#[68B83D687D84F5F]) [    ] o.a.s.c.AbstractZkTestCase put /home/jenkins/workspace/Lucene-Solr-5.x-Linux/solr/core/src/test-files/solr/collection1/conf/currency.xml to /configs/conf1/currency.xml
   [junit4]   2> 1125948 INFO  (TEST-ClusterStateUpdateTest.testCoreRegistration-seed#[68B83D687D84F5F]) [    ] o.a.s.c.c.SolrZkClient makePath: /configs/conf1/currency.xml
   [junit4]   2> 1125949 INFO  (TEST-ClusterStateUpdateTest.testCoreRegistration-seed#[68B83D687D84F5F]) [    ] o.a.s.c.AbstractZkTestCase put /home/jenkins/workspace/Lucene-Solr-5.x-Linux/solr/core/src/test-files/solr/collection1/conf/enumsConfig.xml to /configs/conf1/enumsConfig.xml
   [junit4]   2> 1125949 INFO  (TEST-ClusterStateUpdateTest.testCoreRegistration-seed#[68B83D687D84F5F]) [    ] o.a.s.c.c.SolrZkClient makePath: /configs/conf1/enumsConfig.xml
   [junit4]   2> 1125949 INFO  (TEST-ClusterStateUpdateTest.testCoreRegistration-seed#[68B83D687D84F5F]) [    ] o.a.s.c.AbstractZkTestCase put /home/jenkins/workspace/Lucene-Solr-5.x-Linux/solr/core/src/test-files/solr/collection1/conf/open-exchange-rates.json to /configs/conf1/open-exchange-rates.json
   [junit4]   2> 1125949 INFO  (TEST-ClusterStateUpdateTest.testCoreRegistration-seed#[68B83D687D84F5F]) [    ] o.a.s.c.c.SolrZkClient makePath: /configs/conf1/open-exchange-rates.json
   [junit4]   2> 1125950 INFO  (TEST-ClusterStateUpdateTest.testCoreRegistration-seed#[68B83D687D84F5F]) [    ] o.a.s.c.AbstractZkTestCase put /home/jenkins/workspace/Lucene-Solr-5.x-Linux/solr/core/src/test-files/solr/collection1/conf/mapping-ISOLatin1Accent.txt to /configs/conf1/mapping-ISOLatin1Accent.txt
   [junit4]   2> 1125950 INFO  (TEST-ClusterStateUpdateTest.testCoreRegistration-seed#[68B83D687D84F5F]) [    ] o.a.s.c.c.SolrZkClient makePath: /configs/conf1/mapping-ISOLatin1Accent.txt
   [junit4]   2> 1125951 INFO  (TEST-ClusterStateUpdateTest.testCoreRegistration-seed#[68B83D687D84F5F]) [    ] o.a.s.c.AbstractZkTestCase put /home/jenkins/workspace/Lucene-Solr-5.x-Linux/solr/core/src/test-files/solr/collection1/conf/old_synonyms.txt to /configs/conf1/old_synonyms.txt
   [junit4]   2> 1125951 INFO  (TEST-ClusterStateUpdateTest.testCoreRegistration-seed#[68B83D687D84F5F]) [    ] o.a.s.c.c.SolrZkClient makePath: /configs/conf1/old_synonyms.txt
   [junit4]   2> 1125952 INFO  (TEST-ClusterStateUpdateTest.testCoreRegistration-seed#[68B83D687D84F5F]) [    ] o.a.s.c.AbstractZkTestCase put /home/jenkins/workspace/Lucene-Solr-5.x-Linux/solr/core/src/test-files/solr/collection1/conf/synonyms.txt to /configs/conf1/synonyms.txt
   [junit4]   2> 1125952 INFO  (TEST-ClusterStateUpdateTest.testCoreRegistration-seed#[68B83D687D84F5F]) [    ] o.a.s.c.c.SolrZkClient makePath: /configs/conf1/synonyms.txt
   [junit4]   2> 1125953 INFO  (TEST-ClusterStateUpdateTest.testCoreRegistration-seed#[68B83D687D84F5F]) [    ] o.a.s.c.ClusterStateUpdateTest ####SETUP_START testCoreRegistration
   [junit4]   2> 1125953 INFO  (TEST-ClusterStateUpdateTest.testCoreRegistration-seed#[68B83D687D84F5F]) [    ] o.a.s.c.SolrResourceLoader new SolrResourceLoader for directory: '/home/jenkins/workspace/Lucene-Solr-5.x-Linux/solr/build/solr-core/test/J0/temp/solr.cloud.ClusterStateUpdateTest_68B83D687D84F5F-001/tempDir-001'
   [junit4]   2> 1125954 INFO  (TEST-ClusterStateUpdateTest.testCoreRegistration-seed#[68B83D687D84F5F]) [    ] o.a.s.c.SolrResourceLoader JNDI not configured for solr (NoInitialContextEx)
   [junit4]   2> 1125954 INFO  (TEST-ClusterStateUpdateTest.testCoreRegistration-seed#[68B83D687D84F5F]) [    ] o.a.s.c.SolrResourceLoader using system property solr.solr.home: /home/jenkins/workspace/Lucene-Solr-5.x-Linux/solr/core/src/test-files/solr
   [junit4]   2> 1125954 INFO  (TEST-ClusterStateUpdateTest.testCoreRegistration-seed#[68B83D687D84F5F]) [    ] o.a.s.c.SolrXmlConfig Loading container configuration from /home/jenkins/workspace/Lucene-Solr-5.x-Linux/solr/build/solr-core/test/J0/temp/solr.cloud.ClusterStateUpdateTest_68B83D687D84F5F-001/tempDir-001/solr.xml
   [junit4]   2> 1125964 INFO  (TEST-ClusterStateUpdateTest.testCoreRegistration-seed#[68B83D687D84F5F]) [    ] o.a.s.c.CorePropertiesLocator Config-defined core root directory: /home/jenkins/workspace/Lucene-Solr-5.x-Linux/solr/build/solr-core/test/J0/temp/solr.cloud.ClusterStateUpdateTest_68B83D687D84F5F-001/tempDir-001/.
   [junit4]   2> 1125964 INFO  (TEST-ClusterStateUpdateTest.testCoreRegistration-seed#[68B83D687D84F5F]) [    ] o.a.s.c.CoreContainer New CoreContainer 16483048
   [junit4]   2> 1125964 INFO  (TEST-ClusterStateUpdateTest.testCoreRegistration-seed#[68B83D687D84F5F]) [    ] o.a.s.c.CoreContainer Loading cores into CoreContainer [instanceDir=/home/jenkins/workspace/Lucene-Solr-5.x-Linux/solr/build/solr-core/test/J0/temp/solr.cloud.ClusterStateUpdateTest_68B83D687D84F5F-001/tempDir-001]
   [junit4]   2> 1125964 WARN  (TEST-ClusterStateUpdateTest.testCoreRegistration-seed#[68B83D687D84F5F]) [    ] o.a.s.c.CoreContainer Couldn't add files from /home/jenkins/workspace/Lucene-Solr-5.x-Linux/solr/build/solr-core/test/J0/temp/solr.cloud.ClusterStateUpdateTest_68B83D687D84F5F-001/tempDir-001/lib to classpath: /home/jenkins/workspace/Lucene-Solr-5.x-Linux/solr/build/solr-core/test/J0/temp/solr.cloud.ClusterStateUpdateTest_68B83D687D84F5F-001/tempDir-001/lib
   [junit4]   2> 1125964 INFO  (TEST-ClusterStateUpdateTest.testCoreRegistration-seed#[68B83D687D84F5F]) [    ] o.a.s.h.c.HttpShardHandlerFactory created with socketTimeout : 90000,urlScheme : ,connTimeout : 15000,maxConnectionsPerHost : 20,maxConnections : 10000,corePoolSize : 0,maximumPoolSize : 2147483647,maxThreadIdleTime : 5,sizeOfQueue : -1,fairnessPolicy : false,useRetries : false,
   [junit4]   2> 1125965 INFO  (TEST-ClusterStateUpdateTest.testCoreRegistration-seed#[68B83D687D84F5F]) [    ] o.a.s.u.UpdateShardHandler Creating UpdateShardHandler HTTP client with params: socketTimeout=340000&connTimeout=45000&retry=true
   [junit4]   2> 1125966 INFO  (TEST-ClusterStateUpdateTest.testCoreRegistration-seed#[68B83D687D84F5F]) [    ] o.a.s.l.LogWatcher SLF4J impl is org.slf4j.impl.Log4jLoggerFactory
   [junit4]   2> 1125966 INFO  (TEST-ClusterStateUpdateTest.testCoreRegistration-seed#[68B83D687D84F5F]) [    ] o.a.s.l.LogWatcher Registering Log Listener [Log4j (org.slf4j.impl.Log4jLoggerFactory)]
   [junit4]   2> 1125966 INFO  (TEST-ClusterStateUpdateTest.testCoreRegistration-seed#[68B83D687D84F5F]) [    ] o.a.s.c.ZkContainer Zookeeper client=127.0.0.1:60804/solr
   [junit4]   2> 1125966 INFO  (TEST-ClusterStateUpdateTest.testCoreRegistration-seed#[68B83D687D84F5F]) [    ] o.a.s.c.ZkController zkHost includes chroot
   [junit4]   2> 1125966 INFO  (TEST-ClusterStateUpdateTest.testCoreRegistration-seed#[68B83D687D84F5F]) [    ] o.a.s.c.c.SolrZkClient Using default ZkCredentialsProvider
   [junit4]   2> 1125966 INFO  (TEST-ClusterStateUpdateTest.testCoreRegistration-seed#[68B83D687D84F5F]) [    ] o.a.s.c.c.ConnectionManager Waiting for client to connect to ZooKeeper
   [junit4]   2> 1125967 INFO  (zkCallback-1018-thread-1) [    ] o.a.s.c.c.ConnectionManager Watcher org.apache.solr.common.cloud.ConnectionManager@21adeb name:ZooKeeperConnection Watcher:127.0.0.1:60804 got event WatchedEvent state:SyncConnected type:None path:null path:null type:None
   [junit4]   2> 1125968 INFO  (TEST-ClusterStateUpdateTest.testCoreRegistration-seed#[68B83D687D84F5F]) [    ] o.a.s.c.c.ConnectionManager Client is connected to ZooKeeper
   [junit4]   2> 1125968 INFO  (TEST-ClusterStateUpdateTest.testCoreRegistration-seed#[68B83D687D84F5F]) [    ] o.a.s.c.c.SolrZkClient Using default ZkACLProvider
   [junit4]   2> 1125969 INFO  (TEST-ClusterStateUpdateTest.testCoreRegistration-seed#[68B83D687D84F5F]) [n:127.0.0.1:1661_solr    ] o.a.s.c.c.ConnectionManager Waiting for client to connect to ZooKeeper
   [junit4]   2> 1125970 INFO  (zkCallback-1019-thread-1-processing-n:127.0.0.1:1661_solr) [n:127.0.0.1:1661_solr    ] o.a.s.c.c.ConnectionManager Watcher org.apache.solr.common.cloud.ConnectionManager@22a8c name:ZooKeeperConnection Watcher:127.0.0.1:60804/solr got event WatchedEvent state:SyncConnected type:None path:null path:null type:None
   [junit4]   2> 1125970 INFO  (TEST-ClusterStateUpdateTest.testCoreRegistration-seed#[68B83D687D84F5F]) [n:127.0.0.1:1661_solr    ] o.a.s.c.c.ConnectionManager Client is connected to ZooKeeper
   [junit4]   2> 1125971 INFO  (TEST-ClusterStateUpdateTest.testCoreRegistration-seed#[68B83D687D84F5F]) [n:127.0.0.1:1661_solr    ] o.a.s.c.c.SolrZkClient makePath: /overseer/queue
   [junit4]   2> 1125972 INFO  (TEST-ClusterStateUpdateTest.testCoreRegistration-seed#[68B83D687D84F5F]) [n:127.0.0.1:1661_solr    ] o.a.s.c.c.SolrZkClient makePath: /overseer/collection-queue-work
   [junit4]   2> 1125973 INFO  (TEST-ClusterStateUpdateTest.testCoreRegistration-seed#[68B83D687D84F5F]) [n:127.0.0.1:1661_solr    ] o.a.s.c.c.SolrZkClient makePath: /overseer/collection-map-running
   [junit4]   2> 1125973 INFO  (TEST-ClusterStateUpdateTest.testCoreRegistration-seed#[68B83D687D84F5F]) [n:127.0.0.1:1661_solr    ] o.a.s.c.c.SolrZkClient makePath: /overseer/collection-map-completed
   [junit4]   2> 1125974 INFO  (TEST-ClusterStateUpdateTest.testCoreRegistration-seed#[68B83D687D84F5F]) [n:127.0.0.1:1661_solr    ] o.a.s.c.c.SolrZkClient makePath: /overseer/collection-map-failure
   [junit4]   2> 1125975 INFO  (TEST-ClusterStateUpdateTest.testCoreRegistration-seed#[68B83D687D84F5F]) [n:127.0.0.1:1661_solr    ] o.a.s.c.c.SolrZkClient makePath: /live_nodes
   [junit4]   2> 1125976 INFO  (TEST-ClusterStateUpdateTest.testCoreRegistration-seed#[68B83D687D84F5F]) [n:127.0.0.1:1661_solr    ] o.a.s.c.c.SolrZkClient makePath: /aliases.json
   [junit4]   2> 1125976 INFO  (TEST-ClusterStateUpdateTest.testCoreRegistration-seed#[68B83D687D84F5F]) [n:127.0.0.1:1661_solr    ] o.a.s.c.c.SolrZkClient makePath: /clusterstate.json
   [junit4]   2> 1125976 INFO  (TEST-ClusterStateUpdateTest.testCoreRegistration-seed#[68B83D687D84F5F]) [n:127.0.0.1:1661_solr    ] o.a.s.c.c.SolrZkClient makePath: /security.json
   [junit4]   2> 1125977 INFO  (TEST-ClusterStateUpdateTest.testCoreRegistration-seed#[68B83D687D84F5F]) [n:127.0.0.1:1661_solr    ] o.a.s.c.ZkController Register node as live in ZooKeeper:/live_nodes/127.0.0.1:1661_solr
   [junit4]   2> 1125977 INFO  (TEST-ClusterStateUpdateTest.testCoreRegistration-seed#[68B83D687D84F5F]) [n:127.0.0.1:1661_solr    ] o.a.s.c.c.SolrZkClient makePath: /live_nodes/127.0.0.1:1661_solr
   [junit4]   2> 1125977 INFO  (TEST-ClusterStateUpdateTest.testCoreRegistration-seed#[68B83D687D84F5F]) [n:127.0.0.1:1661_solr    ] o.a.s.c.c.SolrZkClient makePath: /overseer_elect
   [junit4]   2> 1125978 INFO  (TEST-ClusterStateUpdateTest.testCoreRegistration-seed#[68B83D687D84F5F]) [n:127.0.0.1:1661_solr    ] o.a.s.c.c.SolrZkClient makePath: /overseer_elect/election
   [junit4]   2> 1125979 INFO  (TEST-ClusterStateUpdateTest.testCoreRegistration-seed#[68B83D687D84F5F]) [n:127.0.0.1:1661_solr    ] o.a.s.c.Overseer Overseer (id=null) closing
   [junit4]   2> 1125979 INFO  (TEST-ClusterStateUpdateTest.testCoreRegistration-seed#[68B83D687D84F5F]) [n:127.0.0.1:1661_solr    ] o.a.s.c.LeaderElector Joined leadership election with path: /overseer_elect/election/95363665457250307-127.0.0.1:1661_solr-n_0000000000
   [junit4]   2> 1125979 INFO  (TEST-ClusterStateUpdateTest.testCoreRegistration-seed#[68B83D687D84F5F]) [n:127.0.0.1:1661_solr    ] o.a.s.c.OverseerElectionContext I am going to be the leader 127.0.0.1:1661_solr
   [junit4]   2> 1125979 INFO  (TEST-ClusterStateUpdateTest.testCoreRegistration-seed#[68B83D687D84F5F]) [n:127.0.0.1:1661_solr    ] o.a.s.c.c.SolrZkClient makePath: /overseer_elect/leader
   [junit4]   2> 1125980 INFO  (TEST-ClusterStateUpdateTest.testCoreRegistration-seed#[68B83D687D84F5F]) [n:127.0.0.1:1661_solr    ] o.a.s.c.Overseer Overseer (id=95363665457250307-127.0.0.1:1661_solr-n_0000000000) starting
   [junit4]   2> 1125981 INFO  (TEST-ClusterStateUpdateTest.testCoreRegistration-seed#[68B83D687D84F5F]) [n:127.0.0.1:1661_solr    ] o.a.s.c.c.SolrZkClient makePath: /overseer/queue-work
   [junit4]   2> 1125983 INFO  (TEST-ClusterStateUpdateTest.testCoreRegistration-seed#[68B83D687D84F5F]) [n:127.0.0.1:1661_solr    ] o.a.s.c.OverseerAutoReplicaFailoverThread Starting OverseerAutoReplicaFailoverThread autoReplicaFailoverWorkLoopDelay=10000 autoReplicaFailoverWaitAfterExpiration=30000 autoReplicaFailoverBadNodeExpiration=60000
   [junit4]   2> 1125983 INFO  (OverseerCollectionConfigSetProcessor-95363665457250307-127.0.0.1:1661_solr-n_0000000000) [n:127.0.0.1:1661_solr    ] o.a.s.c.OverseerTaskProcessor Process current queue of overseer operations
   [junit4]   2> 1125983 INFO  (TEST-ClusterStateUpdateTest.testCoreRegistration-seed#[68B83D687D84F5F]) [n:127.0.0.1:1661_solr    ] o.a.s.c.c.ZkStateReader Updating cluster state from ZooKeeper... 
   [junit4]   2> 1125983 INFO  (OverseerStateUpdate-95363665457250307-127.0.0.1:1661_solr-n_0000000000) [n:127.0.0.1:1661_solr    ] o.a.s.c.Overseer Starting to work on the main queue
   [junit4]   2> 1126011 INFO  (TEST-ClusterStateUpdateTest.testCoreRegistration-seed#[68B83D687D84F5F]) [n:127.0.0.1:1661_solr    ] o.a.s.c.CoreContainer Security conf doesn't exist. Skipping setup for authorization module.
   [junit4]   2> 1126011 INFO  (TEST-ClusterStateUpdateTest.testCoreRegistration-seed#[68B83D687D84F5F]) [n:127.0.0.1:1661_solr    ] o.a.s.c.CoreContainer No authentication plugin used.
   [junit4]   2> 1126012 INFO  (TEST-ClusterStateUpdateTest.testCoreRegistration-seed#[68B83D687D84F5F]) [n:127.0.0.1:1661_solr    ] o.a.s.c.CorePropertiesLocator Looking for core definitions underneath /home/jenkins/workspace/Lucene-Solr-5.x-Linux/solr/build/solr-core/test/J0/temp/solr.cloud.ClusterStateUpdateTest_68B83D687D84F5F-001/tempDir-001/.
   [junit4]   2> 1126013 INFO  (TEST-ClusterStateUpdateTest.testCoreRegistration-seed#[68B83D687D84F5F]) [n:127.0.0.1:1661_solr    ] o.a.s.c.CoreDescriptor Created CoreDescriptor: {configSetProperties=configsetprops.json, schema=schema.xml, loadOnStartup=true, config=solrconfig.xml, dataDir=data/, name=., transient=false}
   [junit4]   2> 1126013 INFO  (TEST-ClusterStateUpdateTest.testCoreRegistration-seed#[68B83D687D84F5F]) [n:127.0.0.1:1661_solr    ] o.a.s.c.CorePropertiesLocator Found core . in /home/jenkins/workspace/Lucene-Solr-5.x-Linux/solr/build/solr-core/test/J0/temp/solr.cloud.ClusterStateUpdateTest_68B83D687D84F5F-001/tempDir-001/.
   [junit4]   2> 1126013 INFO  (TEST-ClusterStateUpdateTest.testCoreRegistration-seed#[68B83D687D84F5F]) [n:127.0.0.1:1661_solr    ] o.a.s.c.CorePropertiesLocator Found 1 core definitions
   [junit4]   2> 1126013 INFO  (coreLoadExecutor-3393-thread-1-processing-n:127.0.0.1:1661_solr) [n:127.0.0.1:1661_solr c:.  r:127.0.0.1:1661_solr_. x:.] o.a.s.c.ZkController publishing state=down
   [junit4]   2> 1126013 INFO  (coreLoadExecutor-3393-thread-1-processing-n:127.0.0.1:1661_solr) [n:127.0.0.1:1661_solr c:.  r:127.0.0.1:1661_solr_. x:.] o.a.s.c.ZkController numShards not found on descriptor - reading it from system property
   [junit4]   2> 1126014 INFO  (coreLoadExecutor-3393-thread-1-processing-n:127.0.0.1:1661_solr) [n:127.0.0.1:1661_solr c:.  r:127.0.0.1:1661_solr_. x:.] o.a.s.c.ZkController waiting to find shard id in clusterstate for .
   [junit4]   2> 1126014 INFO  (OverseerStateUpdate-95363665457250307-127.0.0.1:1661_solr-n_0000000000) [n:127.0.0.1:1661_solr    ] o.a.s.c.Overseer processMessage: queueSize: 1, message = {
   [junit4]   2>   "core_node_name":"127.0.0.1:1661_solr_.",
   [junit4]   2>   "core":".",
   [junit4]   2>   "node_name":"127.0.0.1:1661_solr",
   [junit4]   2>   "roles":null,
   [junit4]   2>   "collection":".",
   [junit4]   2>   "operation":"state",
   [junit4]   2>   "shard":null,
   [junit4]   2>   "base_url":"http://127.0.0.1:1661/solr",
   [junit4]   2>   "state":"down"} current state version: 0
   [junit4]   2> 1126015 INFO  (OverseerStateUpdate-95363665457250307-127.0.0.1:1661_solr-n_0000000000) [n:127.0.0.1:1661_solr    ] o.a.s.c.o.ReplicaMutator Update state numShards=null message={
   [junit4]   2>   "core_node_name":"127.0.0.1:1661_solr_.",
   [junit4]   2>   "core":".",
   [junit4]   2>   "node_name":"127.0.0.1:1661_solr",
   [junit4]   2>   "roles":null,
   [junit4]   2>   "collection":".",
   [junit4]   2>   "operation":"state",
   [junit4]   2>   "shard":null,
   [junit4]   2>   "base_url":"http://127.0.0.1:1661/solr",
   [junit4]   2>   "state":"down"}
   [junit4]   2> 1126015 INFO  (OverseerStateUpdate-95363665457250307-127.0.0.1:1661_solr-n_0000000000) [n:127.0.0.1:1661_solr    ] o.a.s.c.o.ReplicaMutator Assigning new node to shard shard=shard1
   [junit4]   2> 1126016 INFO  (zkCallback-1019-thread-1-processing-n:127.0.0.1:1661_solr) [n:127.0.0.1:1661_solr    ] o.a.s.c.c.ZkStateReader A cluster state change: [WatchedEvent state:SyncConnected type:NodeDataChanged path:/clusterstate.json], has occurred - updating... (live nodes size: [1])
   [junit4]   2> 1127015 INFO  (coreLoadExecutor-3393-thread-1-processing-n:127.0.0.1:1661_solr) [n:127.0.0.1:1661_solr c:.  r:127.0.0.1:1661_solr_. x:.] o.a.s.c.ZkController Check for collection zkNode:.
   [junit4]   2> 1127016 ERROR (coreLoadExecutor-3393-thread-1-processing-n:127.0.0.1:1661_solr) [n:127.0.0.1:1661_solr c:.  r:127.0.0.1:1661_solr_. x:.] o.a.s.c.CoreContainer Error creating core [.]: Invalid path string "/collections/." caused by relative paths not allowed @13
   [junit4]   2> java.lang.IllegalArgumentException: Invalid path string "/collections/." caused by relative paths not allowed @13
   [junit4]   2> 	at org.apache.zookeeper.common.PathUtils.validatePath(PathUtils.java:99)
   [junit4]   2> 	at org.apache.zookeeper.ZooKeeper.exists(ZooKeeper.java:1024)
   [junit4]   2> 	at org.apache.solr.common.cloud.SolrZkClient$5.execute(SolrZkClient.java:311)
   [junit4]   2> 	at org.apache.solr.common.cloud.SolrZkClient$5.execute(SolrZkClient.java:308)
   [junit4]   2> 	at org.apache.solr.common.cloud.ZkCmdExecutor.retryOperation(ZkCmdExecutor.java:60)
   [junit4]   2> 	at org.apache.solr.common.cloud.SolrZkClient.exists(SolrZkClient.java:308)
   [junit4]   2> 	at org.apache.solr.cloud.ZkController.createCollectionZkNode(ZkController.java:1290)
   [junit4]   2> 	at org.apache.solr.cloud.CloudConfigSetService.createCoreResourceLoader(CloudConfigSetService.java:35)
   [junit4]   2> 	at org.apache.solr.core.ConfigSetService.getConfig(ConfigSetService.java:75)
   [junit4]   2> 	at org.apache.solr.core.CoreContainer.create(CoreContainer.java:812)
   [junit4]   2> 	at org.apache.solr.core.CoreContainer.access$000(CoreContainer.java:87)
   [junit4]   2> 	at org.apache.solr.core.CoreContainer$1.call(CoreContainer.java:467)
   [junit4]   2> 	at org.apache.solr.core.CoreContainer$1.call(CoreContainer.java:458)
   [junit4]   2> 	at java.util.concurrent.FutureTask.run(FutureTask.java:262)
   [junit4]   2> 	at org.apache.solr.common.util.ExecutorUtil$MDCAwareThreadPoolExecutor$1.run(ExecutorUtil.java:231)
   [junit4]   2> 	at java.util.concurrent.ThreadPoolExecutor.runWorker(ThreadPoolExecutor.java:1145)
   [junit4]   2> 	at java.util.concurrent.ThreadPoolExecutor$Worker.run(ThreadPoolExecutor.java:615)
   [junit4]   2> 	at java.lang.Thread.run(Thread.java:745)
   [junit4]   2> 1127017 INFO  (TEST-ClusterStateUpdateTest.testCoreRegistration-seed#[68B83D687D84F5F]) [n:127.0.0.1:1661_solr    ] o.a.s.c.SolrResourceLoader new SolrResourceLoader for directory: '/home/jenkins/workspace/Lucene-Solr-5.x-Linux/solr/build/solr-core/test/J0/temp/solr.cloud.ClusterStateUpdateTest_68B83D687D84F5F-001/tempDir-001'
   [junit4]   2> 1127017 INFO  (TEST-ClusterStateUpdateTest.testCoreRegistration-seed#[68B83D687D84F5F]) [n:127.0.0.1:1661_solr    ] o.a.s.c.SolrResourceLoader JNDI not configured for solr (NoInitialContextEx)
   [junit4]   2> 1127017 INFO  (TEST-ClusterStateUpdateTest.testCoreRegistration-seed#[68B83D687D84F5F]) [n:127.0.0.1:1661_solr    ] o.a.s.c.SolrResourceLoader using system property solr.solr.home: /home/jenkins/workspace/Lucene-Solr-5.x-Linux/solr/core/src/test-files/solr
   [junit4]   2> 1127017 INFO  (TEST-ClusterStateUpdateTest.testCoreRegistration-seed#[68B83D687D84F5F]) [n:127.0.0.1:1661_solr    ] o.a.s.c.SolrXmlConfig Loading container configuration from /home/jenkins/workspace/Lucene-Solr-5.x-Linux/solr/build/solr-core/test/J0/temp/solr.cloud.ClusterStateUpdateTest_68B83D687D84F5F-001/tempDir-001/solr.xml
   [junit4]   2> 1127024 INFO  (TEST-ClusterStateUpdateTest.testCoreRegistration-seed#[68B83D687D84F5F]) [n:127.0.0.1:1661_solr    ] o.a.s.c.CorePropertiesLocator Config-defined core root directory: /home/jenkins/workspace/Lucene-Solr-5.x-Linux/solr/build/solr-core/test/J0/temp/solr.cloud.ClusterStateUpdateTest_68B83D687D84F5F-001/tempDir-001/.
   [junit4]   2> 1127024 INFO  (TEST-ClusterStateUpdateTest.testCoreRegistration-seed#[68B83D687D84F5F]) [n:127.0.0.1:1661_solr    ] o.a.s.c.CoreContainer New CoreContainer 5021420
   [junit4]   2> 1127024 INFO  (TEST-ClusterStateUpdateTest.testCoreRegistration-seed#[68B83D687D84F5F]) [n:127.0.0.1:1661_solr    ] o.a.s.c.CoreContainer Loading cores into CoreContainer [instanceDir=/home/jenkins/workspace/Lucene-Solr-5.x-Linux/solr/build/solr-core/test/J0/temp/solr.cloud.ClusterStateUpdateTest_68B83D687D84F5F-001/tempDir-001]
   [junit4]   2> 1127025 WARN  (TEST-ClusterStateUpdateTest.testCoreRegistration-seed#[68B83D687D84F5F]) [n:127.0.0.1:1661_solr    ] o.a.s.c.CoreContainer Couldn't add files from /home/jenkins/workspace/Lucene-Solr-5.x-Linux/solr/build/solr-core/test/J0/temp/solr.cloud.ClusterStateUpdateTest_68B83D687D84F5F-001/tempDir-001/lib to classpath: /home/jenkins/workspace/Lucene-Solr-5.x-Linux/solr/build/solr-core/test/J0/temp/solr.cloud.ClusterStateUpdateTest_68B83D687D84F5F-001/tempDir-001/lib
   [junit4]   2> 1127025 INFO  (TEST-ClusterStateUpdateTest.testCoreRegistration-seed#[68B83D687D84F5F]) [n:127.0.0.1:1661_solr    ] o.a.s.h.c.HttpShardHandlerFactory created with socketTimeout : 90000,urlScheme : ,connTimeout : 15000,maxConnectionsPerHost : 20,maxConnections : 10000,corePoolSize : 0,maximumPoolSize : 2147483647,maxThreadIdleTime : 5,sizeOfQueue : -1,fairnessPolicy : false,useRetries : false,
   [junit4]   2> 1127026 INFO  (TEST-ClusterStateUpdateTest.testCoreRegistration-seed#[68B83D687D84F5F]) [n:127.0.0.1:1661_solr    ] o.a.s.u.UpdateShardHandler Creating UpdateShardHandler HTTP client with params: socketTimeout=340000&connTimeout=45000&retry=true
   [junit4]   2> 1127026 INFO  (TEST-ClusterStateUpdateTest.testCoreRegistration-seed#[68B83D687D84F5F]) [n:127.0.0.1:1661_solr    ] o.a.s.l.LogWatcher SLF4J impl is org.slf4j.impl.Log4jLoggerFactory
   [junit4]   2> 1127026 INFO  (TEST-ClusterStateUpdateTest.testCoreRegistration-seed#[68B83D687D84F5F]) [n:127.0.0.1:1661_solr    ] o.a.s.l.LogWatcher Registering Log Listener [Log4j (org.slf4j.impl.Log4jLoggerFactory)]
   [junit4]   2> 1127026 INFO  (TEST-ClusterStateUpdateTest.testCoreRegistration-seed#[68B83D687D84F5F]) [n:127.0.0.1:1661_solr    ] o.a.s.c.ZkContainer Zookeeper client=127.0.0.1:60804/solr
   [junit4]   2> 1127026 INFO  (TEST-ClusterStateUpdateTest.testCoreRegistration-seed#[68B83D687D84F5F]) [n:127.0.0.1:1661_solr    ] o.a.s.c.ZkController zkHost includes chroot
   [junit4]   2> 1127026 INFO  (TEST-ClusterStateUpdateTest.testCoreRegistration-seed#[68B83D687D84F5F]) [n:127.0.0.1:1661_solr    ] o.a.s.c.c.SolrZkClient Using default ZkCredentialsProvider
   [junit4]   2> 1127027 INFO  (TEST-ClusterStateUpdateTest.testCoreRegistration-seed#[68B83D687D84F5F]) [n:127.0.0.1:1661_solr    ] o.a.s.c.c.ConnectionManager Waiting for client to connect to ZooKeeper
   [junit4]   2> 1127028 INFO  (zkCallback-1022-thread-1-processing-n:127.0.0.1:1661_solr) [n:127.0.0.1:1661_solr    ] o.a.s.c.c.ConnectionManager Watcher org.apache.solr.common.cloud.ConnectionManager@2bd0cf name:ZooKeeperConnection Watcher:127.0.0.1:60804 got event WatchedEvent state:SyncConnected type:None path:null path:null type:None
   [junit4]   2> 1127029 INFO  (TEST-ClusterStateUpdateTest.testCoreRegistration-seed#[68B83D687D84F5F]) [n:127.0.0.1:1661_solr    ] o.a.s.c.c.ConnectionManager Client is connected to ZooKeeper
   [junit4]   2> 1127029 INFO  (TEST-ClusterStateUpdateTest.testCoreRegistration-seed#[68B83D687D84F5F]) [n:127.0.0.1:1661_solr    ] o.a.s.c.c.SolrZkClient Using default ZkACLProvider
   [junit4]   2> 1127030 INFO  (TEST-ClusterStateUpdateTest.testCoreRegistration-seed#[68B83D687D84F5F]) [n:127.0.0.1:1662_solr    ] o.a.s.c.c.ConnectionManager Waiting for client to connect to ZooKeeper
   [junit4]   2> 1127031 INFO  (zkCallback-1023-thread-1-processing-n:127.0.0.1:1662_solr) [n:127.0.0.1:1662_solr    ] o.a.s.c.c.ConnectionManager Watcher org.apache.solr.common.cloud.ConnectionManager@156783a name:ZooKeeperConnection Watcher:127.0.0.1:60804/solr got event WatchedEvent state:SyncConnected type:None path:null path:null type:None
   [junit4]   2> 1127031 INFO  (TEST-ClusterStateUpdateTest.testCoreRegistration-seed#[68B83D687D84F5F]) [n:127.0.0.1:1662_solr    ] o.a.s.c.c.ConnectionManager Client is connected to ZooKeeper
   [junit4]   2> 1127033 INFO  (TEST-ClusterStateUpdateTest.testCoreRegistration-seed#[68B83D687D84F5F]) [n:127.0.0.1:1662_solr    ] o.a.s.c.c.ZkStateReader Updating cluster state from ZooKeeper... 
   [junit4]   2> 1128036 INFO  (TEST-ClusterStateUpdateTest.testCoreRegistration-seed#[68B83D687D84F5F]) [n:127.0.0.1:1662_solr    ] o.a.s.c.ZkController Register node as live in ZooKeeper:/live_nodes/127.0.0.1:1662_solr
   [junit4]   2> 1128036 INFO  (TEST-ClusterStateUpdateTest.testCoreRegistration-seed#[68B83D687D84F5F]) [n:127.0.0.1:1662_solr    ] o.a.s.c.c.SolrZkClient makePath: /live_nodes/127.0.0.1:1662_solr
   [junit4]   2> 1128036 INFO  (zkCallback-1023-thread-1-processing-n:127.0.0.1:1662_solr) [n:127.0.0.1:1662_solr    ] o.a.s.c.c.ZkStateReader A live node change: [WatchedEvent state:SyncConnected type:NodeChildrenChanged path:/live_nodes], has occurred - updating... (live nodes size: [1])
   [junit4]   2> 1128036 INFO  (zkCallback-1019-thread-1-processing-n:127.0.0.1:1661_solr) [n:127.0.0.1:1661_solr    ] o.a.s.c.c.ZkStateReader A live node change: [WatchedEvent state:SyncConnected type:NodeChildrenChanged path:/live_nodes], has occurred - updating... (live nodes size: [1])
   [junit4]   2> 1128037 INFO  (TEST-ClusterStateUpdateTest.testCoreRegistration-seed#[68B83D687D84F5F]) [n:127.0.0.1:1662_solr    ] o.a.s.c.Overseer Overseer (id=null) closing
   [junit4]   2> 1128037 INFO  (TEST-ClusterStateUpdateTest.testCoreRegistration-seed#[68B83D687D84F5F]) [n:127.0.0.1:1662_solr    ] o.a.s.c.LeaderElector Joined leadership election with path: /overseer_elect/election/95363665457250309-127.0.0.1:1662_solr-n_0000000001
   [junit4]   2> 1128038 INFO  (TEST-ClusterStateUpdateTest.testCoreRegistration-seed#[68B83D687D84F5F]) [n:127.0.0.1:1662_solr    ] o.a.s.c.LeaderElector Watching path /overseer_elect/election/95363665457250307-127.0.0.1:1661_solr-n_0000000000 to know if I could be the leader
   [junit4]   2> 1128071 INFO  (TEST-ClusterStateUpdateTest.testCoreRegistration-seed#[68B83D687D84F5F]) [n:127.0.0.1:1662_solr    ] o.a.s.c.CoreContainer Security conf doesn't exist. Skipping setup for authorization module.
   [junit4]   2> 1128071 INFO  (TEST-ClusterStateUpdateTest.testCoreRegistration-seed#[68B83D687D84F5F]) [n:127.0.0.1:1662_solr    ] o.a.s.c.CoreContainer No authentication plugin used.
   [junit4]   2> 1128072 INFO  (TEST-ClusterStateUpdateTest.testCoreRegistration-seed#[68B83D687D84F5F]) [n:127.0.0.1:1662_solr    ] o.a.s.c.CorePropertiesLocator Looking for core definitions underneath /home/jenkins/workspace/Lucene-Solr-5.x-Linux/solr/build/solr-core/test/J0/temp/solr.cloud.ClusterStateUpdateTest_68B83D687D84F5F-001/tempDir-001/.
   [junit4]   2> 1128072 INFO  (TEST-ClusterStateUpdateTest.testCoreRegistration-seed#[68B83D687D84F5F]) [n:127.0.0.1:1662_solr    ] o.a.s.c.CoreDescriptor Created CoreDescriptor: {dataDir=data/, name=., schema=schema.xml, transient=false, loadOnStartup=true, configSetProperties=configsetprops.json, config=solrconfig.xml}
   [junit4]   2> 1128072 INFO  (TEST-ClusterStateUpdateTest.testCoreRegistration-seed#[68B83D687D84F5F]) [n:127.0.0.1:1662_solr    ] o.a.s.c.CorePropertiesLocator Found core . in /home/jenkins/workspace/Lucene-Solr-5.x-Linux/solr/build/solr-core/test/J0/temp/solr.cloud.ClusterStateUpdateTest_68B83D687D84F5F-001/tempDir-001/.
   [junit4]   2> 1128072 INFO  (TEST-ClusterStateUpdateTest.testCoreRegistration-seed#[68B83D687D84F5F]) [n:127.0.0.1:1662_solr    ] o.a.s.c.CorePropertiesLocator Found 1 core definitions
   [junit4]   2> 1128073 INFO  (coreLoadExecutor-3399-thread-1-processing-n:127.0.0.1:1662_solr) [n:127.0.0.1:1662_solr c:.  r:127.0.0.1:1662_solr_. x:.] o.a.s.c.ZkController publishing state=down
   [junit4]   2> 1128073 INFO  (coreLoadExecutor-3399-thread-1-processing-n:127.0.0.1:1662_solr) [n:127.0.0.1:1662_solr c:.  r:127.0.0.1:1662_solr_. x:.] o.a.s.c.ZkController numShards not found on descriptor - reading it from system property
   [junit4]   2> 1128073 INFO  (coreLoadExecutor-3399-thread-1-processing-n:127.0.0.1:1662_solr) [n:127.0.0.1:1662_solr c:.  r:127.0.0.1:1662_solr_. x:.] o.a.s.c.ZkController Registering watch for collection .
   [junit4]   2> 1128073 INFO  (coreLoadExecutor-3399-thread-1-processing-n:127.0.0.1:1662_solr) [n:127.0.0.1:1662_solr c:.  r:127.0.0.1:1662_solr_. x:.] o.a.s.c.c.ZkStateReader addZkWatch [.]
   [junit4]   2> 1128073 ERROR (coreLoadExecutor-3399-thread-1-processing-n:127.0.0.1:1662_solr) [n:127.0.0.1:1662_solr c:.  r:127.0.0.1:1662_solr_. x:.] o.a.s.c.CoreContainer Error creating core [.]: Invalid path string "/collections/./state.json" caused by relative paths not allowed @13
   [junit4]   2> java.lang.IllegalArgumentException: Invalid path string "/collections/./state.json" caused by relative paths not allowed @13
   [junit4]   2> 	at org.apache.zookeeper.common.PathUtils.validatePath(PathUtils.java:99)
   [junit4]   2> 	at org.apache.zookeeper.ZooKeeper.getData(ZooKeeper.java:1137)
   [junit4]   2> 	at org.apache.solr.common.cloud.SolrZkClient$7.execute(SolrZkClient.java:345)
   [junit4]   2> 	at org.apache.solr.common.cloud.SolrZkClient$7.execute(SolrZkClient.java:342)
   [junit4]   2> 	at org.apache.solr.common.cloud.ZkCmdExecutor.retryOperation(ZkCmdExecutor.java:60)
   [junit4]   2> 	at org.apache.solr.common.cloud.SolrZkClient.getData(SolrZkClient.java:342)
   [junit4]   2> 	at org.apache.solr.common.cloud.ZkStateReader.fetchCollectionState(ZkStateReader.java:972)
   [junit4]   2> 	at org.apache.solr.common.cloud.ZkStateReader.access$700(ZkStateReader.java:56)
   [junit4]   2> 	at org.apache.solr.common.cloud.ZkStateReader$StateWatcher.refreshAndWatch(ZkStateReader.java:837)
   [junit4]   2> 	at org.apache.solr.common.cloud.ZkStateReader.addCollectionWatch(ZkStateReader.java:989)
   [junit4]   2> 	at org.apache.solr.cloud.ZkController.preRegister(ZkController.java:1508)
   [junit4]   2> 	at org.apache.solr.core.CoreContainer.create(CoreContainer.java:809)
   [junit4]   2> 	at org.apache.solr.core.CoreContainer.access$000(CoreContainer.java:87)
   [junit4]   2> 	at org.apache.solr.core.CoreContainer$1.call(CoreContainer.java:467)
   [junit4]   2> 	at org.apache.solr.core.CoreContainer$1.call(CoreContainer.java:458)
   [junit4]   2> 	at java.util.concurrent.FutureTask.run(FutureTask.java:262)
   [junit4]   2> 	at org.apache.solr.common.util.ExecutorUtil$MDCAwareThreadPoolExecutor$1.run(ExecutorUtil.java:231)
   [junit4]   2> 	at java.util.concurrent.ThreadPoolExecutor.runWorker(ThreadPoolExecutor.java:1145)
   [junit4]   2> 	at java.util.concurrent.ThreadPoolExecutor$Worker.run(ThreadPoolExecutor.java:615)
   [junit4]   2> 	at java.lang.Thread.run(Thread.java:745)
   [junit4]   2> 1128074 INFO  (OverseerStateUpdate-95363665457250307-127.0.0.1:1661_solr-n_0000000000) [n:127.0.0.1:1661_solr    ] o.a.s.c.Overseer processMessage: queueSize: 1, message = {
   [junit4]   2>   "core_node_name":"127.0.0.1:1662_solr_.",
   [junit4]   2>   "core":".",
   [junit4]   2>   "node_name":"127.0.0.1:1662_solr",
   [junit4]   2>   "roles":null,
   [junit4]   2>   "collection":".",
   [junit4]   2>   "operation":"state",
   [junit4]   2>   "shard":null,
   [junit4]   2>   "base_url":"http://127.0.0.1:1662/solr",
   [junit4]   2>   "state":"down"} current state version: 1
   [junit4]   2> 1128074 INFO  (OverseerStateUpdate-95363665457250307-127.0.0.1:1661_solr-n_0000000000) [n:127.0.0.1:1661_solr    ] o.a.s.c.o.ReplicaMutator Update state numShards=null message={
   [junit4]   2>   "core_node_name":"127.0.0.1:1662_solr_.",
   [junit4]   2>   "core":".",
   [junit4]   2>   "node_name":"127.0.0.1:1662_solr",
   [junit4]   2>   "roles":null,
   [junit4]   2>   "collection":".",
   [junit4]   2>   "operation":"state",
   [junit4]   2>   "shard":null,
   [junit4]   2>   "base_url":"http://127.0.0.1:1662/solr",
   [junit4]   2>   "state":"down"}
   [junit4]   2> 1128074 INFO  (TEST-ClusterStateUpdateTest.testCoreRegistration-seed#[68B83D687D84F5F]) [n:127.0.0.1:1662_solr    ] o.a.s.c.SolrResourceLoader new SolrResourceLoader for directory: '/home/jenkins/workspace/Lucene-Solr-5.x-Linux/solr/build/solr-core/test/J0/temp/solr.cloud.ClusterStateUpdateTest_68B83D687D84F5F-001/tempDir-001'
   [junit4]   2> 1128074 INFO  (OverseerStateUpdate-95363665457250307-127.0.0.1:1661_solr-n_0000000000) [n:127.0.0.1:1661_solr    ] o.a.s.c.o.ReplicaMutator Collection already exists with numShards=1
   [junit4]   2> 1128074 INFO  (OverseerStateUpdate-95363665457250307-127.0.0.1:1661_solr-n_0000000000) [n:127.0.0.1:1661_solr    ] o.a.s.c.o.ReplicaMutator Assigning new node to shard shard=shard1
   [junit4]   2> 1128074 INFO  (TEST-ClusterStateUpdateTest.testCoreRegistration-seed#[68B83D687D84F5F]) [n:127.0.0.1:1662_solr    ] o.a.s.c.SolrResourceLoader JNDI not configured for solr (NoInitialContextEx)
   [junit4]   2> 1128074 INFO  (TEST-ClusterStateUpdateTest.testCoreRegistration-seed#[68B83D687D84F5F]) [n:127.0.0.1:1662_solr    ] o.a.s.c.SolrResourceLoader using system property solr.solr.home: /home/jenkins/workspace/Lucene-Solr-5.x-Linux/solr/core/src/test-files/solr
   [junit4]   2> 1128074 INFO  (TEST-ClusterStateUpdateTest.testCoreRegistration-seed#[68B83D687D84F5F]) [n:127.0.0.1:1662_solr    ] o.a.s.c.SolrXmlConfig Loading container configuration from /home/jenkins/workspace/Lucene-Solr-5.x-Linux/solr/build/solr-core/test/J0/temp/solr.cloud.ClusterStateUpdateTest_68B83D687D84F5F-001/tempDir-001/solr.xml
   [junit4]   2> 1128075 INFO  (zkCallback-1019-thread-1-processing-n:127.0.0.1:1661_solr) [n:127.0.0.1:1661_solr    ] o.a.s.c.c.ZkStateReader A cluster state change: [WatchedEvent state:SyncConnected type:NodeDataChanged path:/clusterstate.json], has occurred - updating... (live nodes size: [2])
   [junit4]   2> 1128075 INFO  (zkCallback-1023-thread-1-processing-n:127.0.0.1:1662_solr) [n:127.0.0.1:1662_solr    ] o.a.s.c.c.ZkStateReader A cluster state change: [WatchedEvent state:SyncConnected type:NodeDataChanged path:/clusterstate.json], has occurred - updating... (live nodes size: [2])
   [junit4]   2> 1128082 INFO  (TEST-ClusterStateUpdateTest.testCoreRegistration-seed#[68B83D687D84F5F]) [n:127.0.0.1:1662_solr    ] o.a.s.c.CorePropertiesLocator Config-defined core root directory: /home/jenkins/workspace/Lucene-Solr-5.x-Linux/solr/build/solr-core/test/J0/temp/solr.cloud.ClusterStateUpdateTest_68B83D687D84F5F-001/tempDir-001/.
   [junit4]   2> 1128082 INFO  (TEST-ClusterStateUpdateTest.testCoreRegistration-seed#[68B83D687D84F5F]) [n:127.0.0.1:1662_solr    ] o.a.s.c.CoreContainer New CoreContainer 1663289
   [junit4]   2> 1128082 INFO  (TEST-ClusterStateUpdateTest.testCoreRegistration-seed#[68B83D687D84F5F]) [n:127.0.0.1:1662_solr    ] o.a.s.c.CoreContainer Loading cores into CoreContainer [instanceDir=/home/jenkins/workspace/Lucene-Solr-5.x-Linux/solr/build/solr-core/test/J0/temp/solr.cloud.ClusterStateUpdateTest_68B83D687D84F5F-001/tempDir-001]
   [junit4]   2> 1128082 WARN  (TEST-ClusterStateUpdateTest.testCoreRegistration-seed#[68B83D687D84F5F]) [n:127.0.0.1:1662_solr    ] o.a.s.c.CoreContainer Couldn't add files from /home/jenkins/workspace/Lucene-Solr-5.x-Linux/solr/build/solr-core/test/J0/temp/solr.cloud.ClusterStateUpdateTest_68B83D687D84F5F-001/tempDir-001/lib to classpath: /home/jenkins/workspace/Lucene-Solr-5.x-Linux/solr/build/solr-core/test/J0/temp/solr.cloud.ClusterStateUpdateTest_68B83D687D84F5F-001/tempDir-001/lib
   [junit4]   2> 1128083 INFO  (TEST-ClusterStateUpdateTest.testCoreRegistration-seed#[68B83D687D84F5F]) [n:127.0.0.1:1662_solr    ] o.a.s.h.c.HttpShardHandlerFactory created with socketTimeout : 90000,urlScheme : ,connTimeout : 15000,maxConnectionsPerHost : 20,maxConnections : 10000,corePoolSize : 0,maximumPoolSize : 2147483647,maxThreadIdleTime : 5,sizeOfQueue : -1,fairnessPolicy : false,useRetries : false,
   [junit4]   2> 1128084 INFO  (TEST-ClusterStateUpdateTest.testCoreRegistration-seed#[68B83D687D84F5F]) [n:127.0.0.1:1662_solr    ] o.a.s.u.UpdateShardHandler Creating UpdateShardHandler HTTP client with params: socketTimeout=340000&connTimeout=45000&retry=true
   [junit4]   2> 1128084 INFO  (TEST-ClusterStateUpdateTest.testCoreRegistration-seed#[68B83D687D84F5F]) [n:127.0.0.1:1662_solr    ] o.a.s.l.LogWatcher SLF4J impl is org.slf4j.impl.Log4jLoggerFactory
   [junit4]   2> 1128084 INFO  (TEST-ClusterStateUpdateTest.testCoreRegistration-seed#[68B83D687D84F5F]) [n:127.0.0.1:1662_solr    ] o.a.s.l.LogWatcher Registering Log Listener [Log4j (org.slf4j.impl.Log4jLoggerFactory)]
   [junit4]   2> 1128084 INFO  (TEST-ClusterStateUpdateTest.testCoreRegistration-seed#[68B83D687D84F5F]) [n:127.0.0.1:1662_solr    ] o.a.s.c.ZkContainer Zookeeper client=127.0.0.1:60804/solr
   [junit4]   2> 1128084 INFO  (TEST-ClusterStateUpdateTest.testCoreRegistration-seed#[68B83D687D84F5F]) [n:127.0.0.1:1662_solr    ] o.a.s.c.ZkController zkHost includes chroot
   [junit4]   2> 1128084 INFO  (TEST-ClusterStateUpdateTest.testCoreRegistration-seed#[68B83D687D84F5F]) [n:127.0.0.1:1662_solr    ] o.a.s.c.c.SolrZkClient Using default ZkCredentialsProvider
   [junit4]   2> 1128085 INFO  (TEST-ClusterStateUpdateTest.testCoreRegistration-seed#[68B83D687D84F5F]) [n:127.0.0.1:1662_solr    ] o.a.s.c.c.ConnectionManager Waiting for client to connect to ZooKeeper
   [junit4]   2> 1128086 INFO  (zkCallback-1026-thread-1-processing-n:127.0.0.1:1662_solr) [n:127.0.0.1:1662_solr    ] o.a.s.c.c.ConnectionManager Watcher org.apache.solr.common.cloud.ConnectionManager@1f2332a name:ZooKeeperConnection Watcher:127.0.0.1:60804 got event WatchedEvent state:SyncConnected type:None path:null path:null type:None
   [junit4]   2> 1128086 INFO  (TEST-ClusterStateUpdateTest.testCoreRegistration-seed#[68B83D687D84F5F]) [n:127.0.0.1:1662_solr    ] o.a.s.c.c.ConnectionManager Client is connected to ZooKeeper
   [junit4]   2> 1128086 INFO  (TEST-ClusterStateUpdateTest.testCoreRegistration-seed#[68B83D687D84F5F]) [n:127.0.0.1:1662_solr    ] o.a.s.c.c.SolrZkClient Using default ZkACLProvider
   [junit4]   2> 1128087 INFO  (TEST-ClusterStateUpdateTest.testCoreRegistration-seed#[68B83D687D84F5F]) [n:127.0.0.1:1663_solr    ] o.a.s.c.c.ConnectionManager Waiting for client to connect to ZooKeeper
   [junit4]   2> 1128088 INFO  (zkCallback-1027-thread-1-processing-n:127.0.0.1:1663_solr) [n:127.0.0.1:1663_solr    ] o.a.s.c.c.ConnectionManager Watcher org.apache.solr.common.cloud.ConnectionManager@6c020 name:ZooKeeperConnection Watcher:127.0.0.1:60804/solr got event WatchedEvent state:SyncConnected type:None path:null path:null type:None
   [junit4]   2> 1128088 INFO  (TEST-ClusterStateUpdateTest.testCoreRegistration-seed#[68B83D687D84F5F]) [n:127.0.0.1:1663_solr    ] o.a.s.c.c.ConnectionManager Client is connected to ZooKeeper
   [junit4]   2> 1128090 INFO  (TEST-ClusterStateUpdateTest.testCoreRegistration-seed#[68B83D687D84F5F]) [n:127.0.0.1:1663_solr    ] o.a.s.c.c.ZkStateReader Updating cluster state from ZooKeeper... 
   [junit4]   2> 1129092 INFO  (TEST-ClusterStateUpdateTest.testCoreRegistration-seed#[68B83D687D84F5F]) [n:127.0.0.1:1663_solr    ] o.a.s.c.ZkController Register node as live in ZooKeeper:/live_nodes/127.0.0.1:1663_solr
   [junit4]   2> 1129092 INFO  (TEST-ClusterStateUpdateTest.testCoreRegistration-seed#[68B83D687D84F5F]) [n:127.0.0.1:1663_solr    ] o.a.s.c.c.SolrZkClient makePath: /live_nodes/127.0.0.1:1663_solr
   [junit4]   2> 1129093 INFO  (zkCallback-1027-thread-1-processing-n:127.0.0.1:1663_solr) [n:127.0.0.1:1663_solr    ] o.a.s.c.c.ZkStateReader A live node change: [WatchedEvent state:SyncConnected type:NodeChildrenChanged path:/live_nodes], has occurred - updating... (live nodes size: [2])
   [junit4]   2> 1129093 INFO  (zkCallback-1019-thread-1-processing-n:127.0.0.1:1661_solr) [n:127.0.0.1:1661_solr    ] o.a.s.c.c.ZkStateReader A live node change: [WatchedEvent state:SyncConnected type:NodeChildrenChanged path:/live_nodes], has occurred - updating... (live nodes size: [2])
   [junit4]   2> 1129093 INFO  (zkCallback-1023-thread-1-processing-n:127.0.0.1:1662_solr) [n:127.0.0.1:1662_solr    ] o.a.s.c.c.ZkStateReader A live node change: [WatchedEvent state:SyncConnected type:NodeChildrenChanged path:/live_nodes], has occurred - updating... (live nodes size: [2])
   [junit4]   2> 1129094 INFO  (TEST-ClusterStateUpdateTest.testCoreRegistration-seed#[68B83D687D84F5F]) [n:127.0.0.1:1663_solr    ] o.a.s.c.Overseer Overseer (id=null) closing
   [junit4]   2> 1129094 INFO  (TEST-ClusterStateUpdateTest.testCoreRegistration-seed#[68B83D687D84F5F]) [n:127.0.0.1:1663_solr    ] o.a.s.c.LeaderElector Joined leadership election with path: /overseer_elect/election/95363665457250311-127.0.0.1:1663_solr-n_0000000002
   [junit4]   2> 1129095 INFO  (TEST-ClusterStateUpdateTest.testCoreRegistration-seed#[68B83D687D84F5F]) [n:127.0.0.1:1663_solr    ] o.a.s.c.LeaderElector Watching path /overseer_elect/election/95363665457250309-127.0.0.1:1662_solr-n_0000000001 to know if I could be the leader
   [junit4]   2> 1129110 INFO  (TEST-ClusterStateUpdateTest.testCoreRegistration-seed#[68B83D687D84F5F]) [n:127.0.0.1:1663_solr    ] o.a.s.c.CoreContainer Security conf doesn't exist. Skipping setup for authorization module.
   [junit4]   2> 1129110 INFO  (TEST-ClusterStateUpdateTest.testCoreRegistration-seed#[68B83D687D84F5F]) [n:127.0.0.1:1663_solr    ] o.a.s.c.CoreContainer No authentication plugin used.
   [junit4]   2> 1129110 INFO  (TEST-ClusterStateUpdateTest.testCoreRegistration-seed#[68B83D687D84F5F]) [n:127.0.0.1:1663_solr    ] o.a.s.c.CorePropertiesLocator Looking for core definitions underneath /home/jenkins/workspace/Lucene-Solr-5.x-Linux/solr/build/solr-core/test/J0/temp/solr.cloud.ClusterStateUpdateTest_68B83D687D84F5F-001/tempDir-001/.
   [junit4]   2> 1129111 INFO  (TEST-ClusterStateUpdateTest.testCoreRegistration-seed#[68B83D687D84F5F]) [n:127.0.0.1:1663_solr    ] o.a.s.c.CoreDescriptor Created CoreDescriptor: {configSetProperties=configsetprops.json, config=solrconfig.xml, dataDir=data/, schema=schema.xml, name=., loadOnStartup=true, transient=false}
   [junit4]   2> 1129111 INFO  (TEST-ClusterStateUpdateTest.testCoreRegistration-seed#[68B83D687D84F5F]) [n:127.0.0.1:1663_solr    ] o.a.s.c.CorePropertiesLocator Found core . in /home/jenkins/workspace/Lucene-Solr-5.x-Linux/solr/build/solr-core/test/J0/temp/solr.cloud.ClusterStateUpdateTest_68B83D687D84F5F-001/tempDir-001/.
   [junit4]   2> 1129111 INFO  (TEST-ClusterStateUpdateTest.testCoreRegistration-seed#[68B83D687D84F5F]) [n:127.0.0.1:1663_solr    ] o.a.s.c.CorePropertiesLocator Found 1 core definitions
   [junit4]   2> 1129111 INFO  (coreLoadExecutor-3405-thread-1-processing-n:127.0.0.1:1663_solr) [n:127.0.0.1:1663_solr c:.  r:127.0.0.1:1663_solr_. x:.] o.a.s.c.ZkController publishing state=down
   [junit4]   2> 1129111 INFO  (coreLoadExecutor-3405-thread-1-processing-n:127.0.0.1:1663_solr) [n:127.0.0.1:1663_solr c:.  r:127.0.0.1:1663_solr_. x:.] o.a.s.c.ZkController numShards not found on descriptor - reading it from system property
   [junit4]   2> 1129112 INFO  (coreLoadExecutor-3405-thread-1-processing-n:127.0.0.1:1663_solr) [n:127.0.0.1:1663_solr c:.  r:127.0.0.1:1663_solr_. x:.] o.a.s.c.ZkController Registering watch for collection .
   [junit4]   2> 1129112 INFO  (coreLoadExecutor-3405-thread-1-processing-n:127.0.0.1:1663_solr) [n:127.0.0.1:1663_solr c:.  r:127.0.0.1:1663_solr_. x:.] o.a.s.c.c.ZkStateReader addZkWatch [.]
   [junit4]   2> 1129112 ERROR (coreLoadExecutor-3405-thread-1-processing-n:127.0.0.1:1663_solr) [n:127.0.0.1:1663_solr c:.  r:127.0.0.1:1663_solr_. x:.] o.a.s.c.CoreContainer Error creating core [.]: Invalid path string "/collections/./state.json" caused by relative paths not allowed @13
   [junit4]   2> java.lang.IllegalArgumentException: Invalid path string "/collections/./state.json" caused by relative paths not allowed @13
   [junit4]   2> 	at org.apache.zookeeper.common.PathUtils.validatePath(PathUtils.java:99)
   [junit4]   2> 	at org.apache.zookeeper.ZooKeeper.getData(ZooKeeper.java:1137)
   [junit4]   2> 	at org.apache.solr.common.cloud.SolrZkClient$7.execute(SolrZkClient.java:345)
   [junit4]   2> 	at org.apache.solr.common.cloud.SolrZkClient$7.execute(SolrZkClient.java:342)
   [junit4]   2> 	at org.apache.solr.common.cloud.ZkCmdExecutor.retryOperation(ZkCmdExecutor.java:60)
   [junit4]   2> 	at org.apache.solr.common.cloud.SolrZkClient.getData(SolrZkClient.java:342)
   [junit4]   2> 	at org.apache.solr.common.cloud.ZkStateReader.fetchCollectionState(ZkStateReader.java:972)
   [junit4]   2> 	at org.apache.solr.common.cloud.ZkStateReader.access$700(ZkStateReader.java:56)
   [junit4]   2> 	at org.apache.solr.common.cloud.ZkStateReader$StateWatcher.refreshAndWatch(ZkStateReader.java:837)
   [junit4]   2> 	at org.apache.solr.common.cloud.ZkStateReader.addCollectionWatch(ZkStateReader.java:989)
   [junit4]   2> 	at org.apache.solr.cloud.ZkController.preRegister(ZkController.java:1508)
   [junit4]   2> 	at org.apache.solr.core.CoreContainer.create(CoreContainer.java:809)
   [junit4]   2> 	at org.apache.solr.core.CoreContainer.access$000(CoreContainer.java:87)
   [junit4]   2> 	at org.apache.solr.core.CoreContainer$1.call(CoreContainer.java:467)
   [junit4]   2> 	at org.apache.solr.core.CoreContainer$1.call(CoreContainer.java:458)
   [junit4]   2> 	at java.util.concurrent.FutureTask.run(FutureTask.java:262)
   [junit4]   2> 	at org.apache.solr.common.util.ExecutorUtil$MDCAwareThreadPoolExecutor$1.run(ExecutorUtil.java:231)
   [junit4]   2> 	at java.util.concurrent.ThreadPoolExecutor.runWorker(ThreadPoolExecutor.java:1145)
   [junit4]   2> 	at java.util.concurrent.ThreadPoolExecutor$Worker.run(ThreadPoolExecutor.java:615)
   [junit4]   2> 	at java.lang.Thread.run(Thread.java:745)
   [junit4]   2> 1129112 INFO  (OverseerStateUpdate-95363665457250307-127.0.0.1:1661_solr-n_0000000000) [n:127.0.0.1:1661_solr    ] o.a.s.c.Overseer processMessage: queueSize: 1, message = {
   [junit4]   2>   "core_node_name":"127.0.0.1:1663_solr_.",
   [junit4]   2>   "core":".",
   [junit4]   2>   "node_name":"127.0.0.1:1663_solr",
   [junit4]   2>   "roles":null,
   [junit4]   2>   "collection":".",
   [junit4]   2>   "operation":"state",
   [junit4]   2>   "shard":null,
   [junit4]   2>   "base_url":"http://127.0.0.1:1663/solr",
   [junit4]   2>   "state":"down"} current state version: 2
   [junit4]   2> 1129112 INFO  (TEST-ClusterStateUpdateTest.testCoreRegistration-seed#[68B83D687D84F5F]) [n:127.0.0.1:1663_solr    ] o.a.s.c.ClusterStateUpdateTest ####SETUP_END testCoreRegistration
   [junit4]   2> 1129112 INFO  (OverseerStateUpdate-95363665457250307-127.0.0.1:1661_solr-n_0000000000) [n:127.0.0.1:1661_solr    ] o.a.s.c.o.ReplicaMutator Update state numShards=null message={
   [junit4]   2>   "core_node_name":"127.0.0.1:1663_solr_.",
   [junit4]   2>   "core":".",
   [junit4]   2>   "node_name":"127.0.0.1:1663_solr",
   [junit4]   2>   "roles":null,
   [junit4]   2>   "collection":".",
   [junit4]   2>   "operation":"state",
   [junit4]   2>   "shard":null,
   [junit4]   2>   "base_url":"http://127.0.0.1:1663/solr",
   [junit4]   2>   "state":"down"}
   [junit4]   2> 1129113 INFO  (OverseerStateUpdate-95363665457250307-127.0.0.1:1661_solr-n_0000000000) [n:127.0.0.1:1661_solr    ] o.a.s.c.o.ReplicaMutator Collection already exists with numShards=1
   [junit4]   2> 1129113 INFO  (TEST-ClusterStateUpdateTest.testCoreRegistration-seed#[68B83D687D84F5F]) [n:127.0.0.1:1663_solr    ] o.a.s.c.c.SolrZkClient Using default ZkCredentialsProvider
   [junit4]   2> 1129113 INFO  (OverseerStateUpdate-95363665457250307-127.0.0.1:1661_solr-n_0000000000) [n:127.0.0.1:1661_solr    ] o.a.s.c.o.ReplicaMutator Assigning new node to shard shard=shard1
   [junit4]   2> 1129113 INFO  (TEST-ClusterStateUpdateTest.testCoreRegistration-seed#[68B83D687D84F5F]) [n:127.0.0.1:1663_solr    ] o.a.s.c.c.ConnectionManager Waiting for client to connect to ZooKeeper
   [junit4]   2> 1129114 INFO  (zkCallback-1028-thread-1-processing-n:127.0.0.1:1663_solr) [n:127.0.0.1:1663_solr    ] o.a.s.c.c.ConnectionManager Watcher org.apache.solr.common.cloud.ConnectionManager@184166c name:ZooKeeperConnection Watcher:127.0.0.1:60804/solr got event WatchedEvent state:SyncConnected type:None path:null path:null type:None
   [junit4]   2> 1129114 INFO  (TEST-ClusterStateUpdateTest.testCoreRegistration-seed#[68B83D687D84F5F]) [n:127.0.0.1:1663_solr    ] o.a.s.c.c.ConnectionManager Client is connected to ZooKeeper
   [junit4]   2> 1129114 INFO  (TEST-ClusterStateUpdateTest.testCoreRegistration-seed#[68B83D687D84F5F]) [n:127.0.0.1:1663_solr    ] o.a.s.c.c.SolrZkClient Using default ZkACLProvider
   [junit4]   2> 1129114 INFO  (TEST-ClusterStateUpdateTest.testCoreRegistration-seed#[68B83D687D84F5F]) [n:127.0.0.1:1663_solr    ] o.a.s.c.c.SolrZkClient makePath: /collections/testcore
   [junit4]   2> 1129115 INFO  (zkCallback-1023-thread-1-processing-n:127.0.0.1:1662_solr) [n:127.0.0.1:1662_solr    ] o.a.s.c.c.ZkStateReader A collections change: [WatchedEvent state:SyncConnected type:NodeChildrenChanged path:/collections], has occurred - updating...
   [junit4]   2> 1129115 INFO  (zkCallback-1019-thread-1-processing-n:127.0.0.1:1661_solr) [n:127.0.0.1:1661_solr    ] o.a.s.c.c.ZkStateReader A collections change: [WatchedEvent state:SyncConnected type:NodeChildrenChanged path:/collections], has occurred - updating...
   [junit4]   2> 1129115 INFO  (zkCallback-1027-thread-1-processing-n:127.0.0.1:1663_solr) [n:127.0.0.1:1663_solr    ] o.a.s.c.c.ZkStateReader A collections change: [WatchedEvent state:SyncConnected type:NodeChildrenChanged path:/collections], has occurred - updating...
   [junit4]   2> 1129116 INFO  (TEST-ClusterStateUpdateTest.testCoreRegistration-seed#[68B83D687D84F5F]) [n:127.0.0.1:1663_solr    ] o.a.s.c.c.SolrZkClient makePath: /collections/testcore/shards
   [junit4]   2> 1129117 INFO  (TEST-ClusterStateUpdateTest.testCoreRegistration-seed#[68B83D687D84F5F]) [n:127.0.0.1:1663_solr    ] o.a.s.c.CoreDescriptor Created CoreDescriptor: {dataDir=/home/jenkins/workspace/Lucene-Solr-5.x-Linux/solr/build/solr-core/test/J0/temp/solr.cloud.ClusterStateUpdateTest_68B83D687D84F5F-001/zkData-001/data4, configSetProperties=configsetprops.json, loadOnStartup=true, schema=schema.xml, name=testcore, transient=false, config=solrconfig.xml}
   [junit4]   2> 1129118 INFO  (TEST-ClusterStateUpdateTest.testCoreRegistration-seed#[68B83D687D84F5F]) [n:127.0.0.1:1661_solr c:testcore  r:127.0.0.1:1661_solr_testcore x:testcore] o.a.s.c.ZkController publishing state=down
   [junit4]   2> 1129118 INFO  (TEST-ClusterStateUpdateTest.testCoreRegistration-seed#[68B83D687D84F5F]) [n:127.0.0.1:1661_solr c:testcore  r:127.0.0.1:1661_solr_testcore x:testcore] o.a.s.c.ZkController numShards not found on descriptor - reading it from system property
   [junit4]   2> 1129119 INFO  (OverseerStateUpdate-95363665457250307-127.0.0.1:1661_solr-n_0000000000) [n:127.0.0.1:1661_solr    ] o.a.s.c.Overseer processMessage: queueSize: 1, message = {
   [junit4]   2>   "core_node_name":"127.0.0.1:1661_solr_testcore",
   [junit4]   2>   "core":"testcore",
   [junit4]   2>   "node_name":"127.0.0.1:1661_solr",
   [junit4]   2>   "roles":null,
   [junit4]   2>   "collection":"testcore",
   [junit4]   2>   "operation":"state",
   [junit4]   2>   "shard":null,
   [junit4]   2>   "base_url":"http://127.0.0.1:1661/solr",
   [junit4]   2>   "state":"down"} current state version: 2
   [junit4]   2> 1129119 INFO  (OverseerStateUpdate-95363665457250307-127.0.0.1:1661_solr-n_0000000000) [n:127.0.0.1:1661_solr    ] o.a.s.c.o.ReplicaMutator Update state numShards=null message={
   [junit4]   2>   "core_node_name":"127.0.0.1:1661_solr_testcore",
   [junit4]   2>   "core":"testcore",
   [junit4]   2>   "node_name":"127.0.0.1:1661_solr",
   [junit4]   2>   "roles":null,
   [junit4]   2>   "collection":"testcore",
   [junit4]   2>   "operation":"state",
   [junit4]   2>   "shard":null,
   [junit4]   2>   "base_url":"http://127.0.0.1:1661/solr",
   [junit4]   2>   "state":"down"}
   [junit4]   2> 1129119 INFO  (TEST-ClusterStateUpdateTest.testCoreRegistration-seed#[68B83D687D84F5F]) [n:127.0.0.1:1661_solr c:testcore  r:127.0.0.1:1661_solr_testcore x:testcore] o.a.s.c.ZkController waiting to find shard id in clusterstate for testcore
   [junit4]   2> 1129119 INFO  (OverseerStateUpdate-95363665457250307-127.0.0.1:1661_solr-n_0000000000) [n:127.0.0.1:1661_solr    ] o.a.s.c.o.ReplicaMutator Assigning new node to shard shard=shard1
   [junit4]   2> 1129221 INFO  (zkCallback-1023-thread-1-processing-n:127.0.0.1:1662_solr) [n:127.0.0.1:1662_solr    ] o.a.s.c.c.ZkStateReader A cluster state change: [WatchedEvent state:SyncConnected type:NodeDataChanged path:/clusterstate.json], has occurred - updating... (live nodes size: [3])
   [junit4]   2> 1129221 INFO  (zkCallback-1027-thread-1-processing-n:127.0.0.1:1663_solr) [n:127.0.0.1:1663_solr    ] o.a.s.c.c.ZkStateReader A cluster state change: [WatchedEvent state:SyncConnected type:NodeDataChanged path:/clusterstate.json], has occurred - updating... (live nodes size: [3])
   [junit4]   2> 1129221 INFO  (zkCallback-1019-thread-1-processing-n:127.0.0.1:1661_solr) [n:127.0.0.1:1661_solr    ] o.a.s.c.c.ZkStateReader A cluster state change: [WatchedEvent state:SyncConnected type:NodeDataChanged path:/clusterstate.json], has occurred - updating... (live nodes size: [3])
   [junit4]   2> 1130120 INFO  (TEST-ClusterStateUpdateTest.testCoreRegistration-seed#[68B83D687D84F5F]) [n:127.0.0.1:1661_solr c:testcore  r:127.0.0.1:1661_solr_testcore x:testcore] o.a.s.c.ZkController Check for collection zkNode:testcore
   [junit4]   2> 1130120 INFO  (TEST-ClusterStateUpdateTest.testCoreRegistration-seed#[68B83D687D84F5F]) [n:127.0.0.1:1661_solr c:testcore  r:127.0.0.1:1661_solr_testcore x:testcore] o.a.s.c.ZkController Collection zkNode exists
   [junit4]   2> 1130120 INFO  (TEST-ClusterStateUpdateTest.testCoreRegistration-seed#[68B83D687D84F5F]) [n:127.0.0.1:1661_solr c:testcore  r:127.0.0.1:1661_solr_testcore x:testcore] o.a.s.c.c.ZkStateReader Load collection config from: [/collections/testcore]
   [junit4]   2> 1130120 INFO  (TEST-ClusterStateUpdateTest.testCoreRegistration-seed#[68B83D687D84F5F]) [n:127.0.0.1:1661_solr c:testcore  r:127.0.0.1:1661_solr_testcore x:testcore] o.a.s.c.c.ZkStateReader path=[/collections/testcore] [configName]=[conf1] specified config exists in ZooKeeper
   [junit4]   2> 1130120 INFO  (TEST-ClusterStateUpdateTest.testCoreRegistration-seed#[68B83D687D84F5F]) [n:127.0.0.1:1661_solr c:testcore  r:127.0.0.1:1661_solr_testcore x:testcore] o.a.s.c.SolrResourceLoader new SolrResourceLoader for directory: '/home/jenkins/workspace/Lucene-Solr-5.x-Linux/solr/build/solr-core/test/J0/temp/solr.cloud.ClusterStateUpdateTest_68B83D687D84F5F-001/tempDir-001/testcore'
   [junit4]   2> 1130121 INFO  (TEST-ClusterStateUpdateTest.testCoreRegistration-seed#[68B83D687D84F5F]) [n:127.0.0.1:1661_solr c:testcore  r:127.0.0.1:1661_solr_testcore x:testcore] o.a.s.c.SolrResourceLoader JNDI not configured for solr (NoInitialContextEx)
   [junit4]   2> 1130121 INFO  (TEST-ClusterStateUpdateTest.testCoreRegistration-seed#[68B83D687D84F5F]) [n:127.0.0.1:1661_solr c:testcore  r:127.0.0.1:1661_solr_testcore x:testcore] o.a.s.c.SolrResourceLoader solr home defaulted to 'solr/' (could not find system property or JNDI)
   [junit4]   2> 1130122 INFO  (TEST-ClusterStateUpdateTest.testCoreRegistration-seed#[68B83D687D84F5F]) [n:127.0.0.1:1661_solr c:testcore  r:127.0.0.1:1661_solr_testcore x:testcore] o.a.s.c.Config loaded config solrconfig.xml with version 0 
   [junit4]   2> 1130130 INFO  (TEST-ClusterStateUpdateTest.testCoreRegistration-seed#[68B83D687D84F5F]) [n:127.0.0.1:1661_solr c:testcore  r:127.0.0.1:1661_solr_testcore x:testcore] o.a.s.c.SolrConfig current version of requestparams : -1
   [junit4]   2> 1130154 INFO  (TEST-ClusterStateUpdateTest.testCoreRegistration-seed#[68B83D687D84F5F]) [n:127.0.0.1:1661_solr c:testcore  r:127.0.0.1:1661_solr_testcore x:testcore] o.a.s.c.SolrConfig Using Lucene MatchVersion: 5.5.0
   [junit4]   2> 1130223 INFO  (TEST-ClusterStateUpdateTest.testCoreRegistration-seed#[68B83D687D84F5F]) [n:127.0.0.1:1661_solr c:testcore  r:127.0.0.1:1661_solr_testcore x:testcore] o.a.s.c.SolrConfig Loaded SolrConfig: solrconfig.xml
   [junit4]   2> 1130228 INFO  (TEST-ClusterStateUpdateTest.testCoreRegistration-seed#[68B83D687D84F5F]) [n:127.0.0.1:1661_solr c:testcore  r:127.0.0.1:1661_solr_testcore x:testcore] o.a.s.s.IndexSchema [testcore] Schema name=test
   [junit4]   2> 1130393 INFO  (TEST-ClusterStateUpdateTest.testCoreRegistration-seed#[68B83D687D84F5F]) [n:127.0.0.1:1661_solr c:testcore  r:127.0.0.1:1661_solr_testcore x:testcore] o.a.s.s.OpenExchangeRatesOrgProvider Initialized with rates=open-exchange-rates.json, refreshInterval=1440.
   [junit4]   2> 1130399 INFO  (TEST-ClusterStateUpdateTest.testCoreRegistration-seed#[68B83D687D84F5F]) [n:127.0.0.1:1661_solr c:testcore  r:127.0.0.1:1661_solr_testcore x:testcore] o.a.s.s.IndexSchema default search field in schema is text
   [junit4]   2> 1130400 INFO  (TEST-ClusterStateUpdateTest.testCoreRegistration-seed#[68B83D687D84F5F]) [n:127.0.0.1:1661_solr c:testcore  r:127.0.0.1:1661_solr_testcore x:testcore] o.a.s.s.IndexSchema unique key field: id
   [junit4]   2> 1130405 INFO  (TEST-ClusterStateUpdateTest.testCoreRegistration-seed#[68B83D687D84F5F]) [n:127.0.0.1:1661_solr c:testcore  r:127.0.0.1:1661_solr_testcore x:testcore] o.a.s.s.FileExchangeRateProvider Reloading exchange rates from file currency.xml
   [junit4]   2> 1130407 INFO  (TEST-ClusterStateUpdateTest.testCoreRegistration-seed#[68B83D687D84F5F]) [n:127.0.0.1:1661_solr c:testcore  r:127.0.0.1:1661_solr_testcore x:testcore] o.a.s.s.FileExchangeRateProvider Reloading exchange rates from file currency.xml
   [junit4]   2> 1130409 INFO  (TEST-ClusterStateUpdateTest.testCoreRegistration-seed#[68B83D687D84F5F]) [n:127.0.0.1:1661_solr c:testcore  r:127.0.0.1:1661_solr_testcore x:testcore] o.a.s.s.OpenExchangeRatesOrgProvider Reloading exchange rates from open-exchange-rates.json
   [junit4]   2> 1130409 INFO  (TEST-ClusterStateUpdateTest.testCoreRegistration-seed#[68B83D687D84F5F]) [n:127.0.0.1:1661_solr c:testcore  r:127.0.0.1:1661_solr_testcore x:testcore] o.a.s.s.OpenExchangeRatesOrgProvider Reloading exchange rates from open-exchange-rates.json
   [junit4]   2> 1130410 INFO  (TEST-ClusterStateUpdateTest.testCoreRegistration-seed#[68B83D687D84F5F]) [n:127.0.0.1:1661_solr c:testcore  r:127.0.0.1:1661_solr_testcore x:testcore] o.a.s.c.ConfigSetProperties Did not find ConfigSet properties, assuming default properties: Can't find resource 'configsetprops.json' in classpath or '/configs/conf1', cwd=/home/jenkins/workspace/Lucene-Solr-5.x-Linux/solr/build/solr-core/test/J0
   [junit4]   2> 1130410 INFO  (TEST-ClusterStateUpdateTest.testCoreRegistration-seed#[68B83D687D84F5F]) [n:127.0.0.1:1661_solr c:testcore  r:127.0.0.1:1661_solr_testcore x:testcore] o.a.s.c.CoreContainer Creating SolrCore 'testcore' using configuration from collection testcore
   [junit4]   2> 1130410 INFO  (TEST-ClusterStateUpdateTest.testCoreRegistration-seed#[68B83D687D84F5F]) [n:127.0.0.1:1661_solr c:testcore s:shard1 r:127.0.0.1:1661_solr_testcore x:testcore] o.a.s.c.SolrCore org.apache.solr.core.MockDirectoryFactory
   [junit4]   2> 1130410 INFO  (TEST-ClusterStateUpdateTest.testCoreRegistration-seed#[68B83D687D84F5F]) [n:127.0.0.1:1661_solr c:testcore s:shard1 r:127.0.0.1:1661_solr_testcore x:testcore] o.a.s.c.SolrCore [[testcore] ] Opening new SolrCore at [/home/jenkins/workspace/Lucene-Solr-5.x-Linux/solr/build/solr-core/test/J0/temp/solr.cloud.ClusterStateUpdateTest_68B83D687D84F5F-001/tempDir-001/testcore], dataDir=[/home/jenkins/workspace/Lucene-Solr-5.x-Linux/solr/build/solr-core/test/J0/temp/solr.cloud.ClusterStateUpdateTest_68B83D687D84F5F-001/zkData-001/data4/]
   [junit4]   2> 1130411 INFO  (TEST-ClusterStateUpdateTest.testCoreRegistration-seed#[68B83D687D84F5F]) [n:127.0.0.1:1661_solr c:testcore s:shard1 r:127.0.0.1:1661_solr_testcore x:testcore] o.a.s.c.JmxMonitoredMap JMX monitoring is enabled. Adding Solr mbeans to JMX Server: com.sun.jmx.mbeanserver.JmxMBeanServer@6964e6
   [junit4]   2> 1130411 INFO  (TEST-ClusterStateUpdateTest.testCoreRegistration-seed#[68B83D687D84F5F]) [n:127.0.0.1:1661_solr c:testcore s:shard1 r:127.0.0.1:1661_solr_testcore x:testcore] o.a.s.c.CachingDirectoryFactory return new directory for /home/jenkins/workspace/Lucene-Solr-5.x-Linux/solr/build/solr-core/test/J0/temp/solr.cloud.ClusterStateUpdateTest_68B83D687D84F5F-001/zkData-001/data4
   [junit4]   2> 1130412 INFO  (TEST-ClusterStateUpdateTest.testCoreRegistration-seed#[68B83D687D84F5F]) [n:127.0.0.1:1661_solr c:testcore s:shard1 r:127.0.0.1:1661_solr_testcore x:testcore] o.a.s.c.SolrCore New index directory detected: old=null new=/home/jenkins/workspace/Lucene-Solr-5.x-Linux/solr/build/solr-core/test/J0/temp/solr.cloud.ClusterStateUpdateTest_68B83D687D84F5F-001/zkData-001/data4/index/
   [junit4]   2> 1130412 WARN  (TEST-ClusterStateUpdateTest.testCoreRegistration-seed#[68B83D687D84F5F]) [n:127.0.0.1:1661_solr c:testcore s:shard1 r:127.0.0.1:1661_solr_testcore x:testcore] o.a.s.c.SolrCore [testcore] Solr index directory '/home/jenkins/workspace/Lucene-Solr-5.x-Linux/solr/build/solr-core/test/J0/temp/solr.cloud.ClusterStateUpdateTest_68B83D687D84F5F-001/zkData-001/data4/index' doesn't exist. Creating new index...
   [junit4]   2> 1130413 INFO  (TEST-ClusterStateUpdateTest.testCoreRegistration-seed#[68B83D687D84F5F]) [n:127.0.0.1:1661_solr c:testcore s:shard1 r:127.0.0.1:1661_solr_testcore x:testcore] o.a.s.c.CachingDirectoryFactory return new directory for /home/jenkins/workspace/Lucene-Solr-5.x-Linux/solr/build/solr-core/test/J0/temp/solr.cloud.ClusterStateUpdateTest_68B83D687D84F5F-001/zkData-001/data4/index
   [junit4]   2> 1130413 INFO  (TEST-ClusterStateUpdateTest.testCoreRegistration-seed#[68B83D687D84F5F]) [n:127.0.0.1:1661_solr c:testcore s:shard1 r:127.0.0.1:1661_solr_testcore x:testcore] o.a.s.u.RandomMergePolicy RandomMergePolicy wrapping class org.apache.lucene.index.LogByteSizeMergePolicy: [LogByteSizeMergePolicy: minMergeSize=1677721, mergeFactor=27, maxMergeSize=2147483648, maxMergeSizeForForcedMerge=9223372036854775807, calibrateSizeByDeletes=true, maxMergeDocs=2147483647, maxCFSSegmentSizeMB=8.796093022207999E12, noCFSRatio=0.41523666037152784]
   [junit4]   2> 1130413 INFO  (TEST-ClusterStateUpdateTest.testCoreRegistration-seed#[68B83D687D84F5F]) [n:127.0.0.1:1661_solr c:testcore s:shard1 r:127.0.0.1:1661_solr_testcore x:testcore] o.a.s.c.SolrDeletionPolicy SolrDeletionPolicy.onCommit: commits: num=1
   [junit4]   2> 	commit{dir=MockDirectoryWrapper(RAMDirectory@a9aa5 lockFactory=org.apache.lucene.store.SingleInstanceLockFactory@2ec7af),segFN=segments_1,generation=1}
   [junit4]   2> 1130413 INFO  (TEST-ClusterStateUpdateTest.testCoreRegistration-seed#[68B83D687D84F5F]) [n:127.0.0.1:1661_solr c:testcore s:shard1 r:127.0.0.1:1661_solr_testcore x:testcore] o.a.s.c.SolrDeletionPolicy newest commit generation = 1
   [junit4]   2> 1130413 INFO  (OldIndexDirectoryCleanupThreadForCore-testcore) [n:127.0.0.1:1661_solr c:testcore s:shard1 r:127.0.0.1:1661_solr_testcore x:testcore] o.a.s.c.SolrCore Looking for old index directories to cleanup for core testcore in /home/jenkins/workspace/Lucene-Solr-5.x-Linux/solr/build/solr-core/test/J0/temp/solr.cloud.ClusterStateUpdateTest_68B83D687D84F5F-001/zkData-001/data4/
   [junit4]   2> 1130416 INFO  (TEST-ClusterStateUpdateTest.testCoreRegistration-seed#[68B83D687D84F5F]) [n:127.0.0.1:1661_solr c:testcore s:shard1 r:127.0.0.1:1661_solr_testcore x:testcore] o.a.s.u.p.UpdateRequestProcessorChain creating updateRequestProcessorChain "dedupe"
   [junit4]   2> 1130416 INFO  (TEST-ClusterStateUpdateTest.testCoreRegistration-seed#[68B83D687D84F5F]) [n:127.0.0.1:1661_solr c:testcore s:shard1 r:127.0.0.1:1661_solr_testcore x:testcore] o.a.s.u.p.UpdateRequestProcessorChain inserting DistributedUpdateProcessorFactory into updateRequestProcessorChain "dedupe"
   [junit4]   2> 1130416 INFO  (TEST-ClusterStateUpdateTest.testCoreRegistration-seed#[68B83D687D84F5F]) [n:127.0.0.1:1661_solr c:testcore s:shard1 r:127.0.0.1:1661_solr_testcore x:testcore] o.a.s.u.p.UpdateRequestProcessorChain creating updateRequestProcessorChain "dedupe-allfields"
   [junit4]   2> 1130416 INFO  (TEST-ClusterStateUpdateTest.testCoreRegistration-seed#[68B83D687D84F5F]) [n:127.0.0.1:1661_solr c:testcore s:shard1 r:127.0.0.1:1661_solr_testcore x:testcore] o.a.s.u.p.UpdateRequestProcessorChain inserting DistributedUpdateProcessorFactory into updateRequestProcessorChain "dedupe-allfields"
   [junit4]   2> 1130416 INFO  (TEST-ClusterStateUpdateTest.testCoreRegistration-seed#[68B83D687D84F5F]) [n:127.0.0.1:1661_solr c:testcore s:shard1 r:127.0.0.1:1661_solr_testcore x:testcore] o.a.s.u.p.UpdateRequestProcessorChain creating updateRequestProcessorChain "stored_sig"
   [junit4]   2> 1130416 INFO  (TEST-ClusterStateUpdateTest.testCoreRegistration-seed#[68B83D687D84F5F]) [n:127.0.0.1:1661_solr c:testcore s:shard1 r:127.0.0.1:1661_solr_testcore x:testcore] o.a.s.u.p.UpdateRequestProcessorChain inserting DistributedUpdateProcessorFactory into updateRequestProcessorChain "stored_sig"
   [junit4]   2> 1130416 INFO  (TEST-ClusterStateUpdateTest.testCoreRegistration-seed#[68B83D687D84F5F]) [n:127.0.0.1:1661_solr c:testcore s:shard1 r:127.0.0.1:1661_solr_testcore x:testcore] o.a.s.u.p.UpdateRequestProcessorChain creating updateRequestProcessorChain "uniq-fields"
   [junit4]   2> 1130416 INFO  (TEST-ClusterStateUpdateTest.testCoreRegistration-seed#[68B83D687D84F5F]) [n:127.0.0.1:1661_solr c:testcore s:shard1 r:127.0.0.1:1661_solr_testcore x:testcore] o.a.s.u.p.UpdateRequestProcessorChain inserting DistributedUpdateProcessorFactory into updateRequestProcessorChain "uniq-fields"
   [junit4]   2> 1130416 INFO  (TEST-ClusterStateUpdateTest.testCoreRegistration-seed#[68B83D687D84F5F]) [n:127.0.0.1:1661_solr c:testcore s:shard1 r:127.0.0.1:1661_solr_testcore x:testcore] o.a.s.u.p.UpdateRequestProcessorChain creating updateRequestProcessorChain "distrib-dup-test-chain-explicit"
   [junit4]   2> 1130416 INFO  (TEST-ClusterStateUpdateTest.testCoreRegistration-seed#[68B83D687D84F5F]) [n:127.0.0.1:1661_solr c:testcore s:shard1 r:127.0.0.1:1661_solr_testcore x:testcore] o.a.s.u.p.UpdateRequestProcessorChain creating updateRequestProcessorChain "distrib-dup-test-chain-implicit"
   [junit4]   2> 1130416 INFO  (TEST-ClusterStateUpdateTest.testCoreRegistration-seed#[68B83D687D84F5F]) [n:127.0.0.1:1661_solr c:testcore s:shard1 r:127.0.0.1:1661_solr_testcore x:testcore] o.a.s.u.p.UpdateRequestProcessorChain inserting DistributedUpdateProcessorFactory into updateRequestProcessorChain "distrib-dup-test-chain-implicit"
   [junit4]   2> 1130416 INFO  (TEST-ClusterStateUpdateTest.testCoreRegistration-seed#[68B83D687D84F5F]) [n:127.0.0.1:1661_solr c:testcore s:shard1 r:127.0.0.1:1661_solr_testcore x:testcore] o.a.s.c.SolrCore no updateRequestProcessorChain defined as default, creating implicit default
   [junit4]   2> 1130418 INFO  (TEST-ClusterStateUpdateTest.testCoreRegistration-seed#[68B83D687D84F5F]) [n:127.0.0.1:1661_solr c:testcore s:shard1 r:127.0.0.1:1661_solr_testcore x:testcore] o.a.s.h.l.XMLLoader xsltCacheLifetimeSeconds=60
   [junit4]   2> 1130419 INFO  (TEST-ClusterStateUpdateTest.testCoreRegistration-seed#[68B83D687D84F5F]) [n:127.0.0.1:1661_solr c:testcore s:shard1 r:127.0.0.1:1661_solr_testcore x:testcore] o.a.s.h.l.XMLLoader xsltCacheLifetimeSeconds=60
   [junit4]   2> 1130420 INFO  (TEST-ClusterStateUpdateTest.testCoreRegistration-seed#[68B83D687D84F5F]) [n:127.0.0.1:1661_solr c:testcore s:shard1 r:127.0.0.1:1661_solr_testcore x:testcore] o.a.s.h.l.XMLLoader xsltCacheLifetimeSeconds=60
   [junit4]   2> 1130421 INFO  (TEST-ClusterStateUpdateTest.testCoreRegistration-seed#[68B83D687D84F5F]) [n:127.0.0.1:1661_solr c:testcore s:shard1 r:127.0.0.1:1661_solr_testcore x:testcore] o.a.s.h.l.XMLLoader xsltCacheLifetimeSeconds=60
   [junit4]   2> 1130423 INFO  (TEST-ClusterStateUpdateTest.testCoreRegistration-seed#[68B83D687D84F5F]) [n:127.0.0.1:1661_solr c:testcore s:shard1 r:127.0.0.1:1661_solr_testcore x:testcore] o.a.s.c.PluginBag requestHandler : 'lazy' created with startup=lazy 
   [junit4]   2> 1130425 INFO  (TEST-ClusterStateUpdateTest.testCoreRegistration-seed#[68B83D687D84F5F]) [n:127.0.0.1:1661_solr c:testcore s:shard1 r:127.0.0.1:1661_solr_testcore x:testcore] o.a.s.c.RequestHandlers Registered paths: /debug/dump,spellCheckWithWordbreak_Direct,/admin/segments,/update/json/docs,dismax,/admin/plugins,/replication,/update/csv,spellCheckWithWordbreak,/mlt,/admin/ping,spellCheckCompRH_Direct,/search-facet-invariants,/admin/logging,defaults,tvrh,spellCheckCompRH1,/admin/threads,/admin/luke,/admin/system,mock,standard,/update/json,/admin/properties,/get,mltrh,/admin/mbeans,spellCheckCompRH,/update,/admin/file,/schema,/terms,lazy,/config,/search-facet-def
   [junit4]   2> 1130425 WARN  (TEST-ClusterStateUpdateTest.testCoreRegistration-seed#[68B83D687D84F5F]) [n:127.0.0.1:1661_solr c:testcore s:shard1 r:127.0.0.1:1661_solr_testcore x:testcore] o.a.s.c.SolrCore solrconfig.xml uses deprecated <admin/gettableFiles>, Please update your config to use the ShowFileRequestHandler.
   [junit4]   2> 1130426 INFO  (TEST-ClusterStateUpdateTest.testCoreRegistration-seed#[68B83D687D84F5F]) [n:127.0.0.1:1661_solr c:testcore s:shard1 r:127.0.0.1:1661_solr_testcore x:testcore] o.a.s.c.SolrCore Using default statsCache cache: org.apache.solr.search.stats.LocalStatsCache
   [junit4]   2> 1130426 INFO  (TEST-ClusterStateUpdateTest.testCoreRegistration-seed#[68B83D687D84F5F]) [n:127.0.0.1:1661_solr c:testcore s:shard1 r:127.0.0.1:1661_solr_testcore x:testcore] o.a.s.u.UpdateHandler Using UpdateLog implementation: org.apache.solr.update.UpdateLog
   [junit4]   2> 1130426 INFO  (TEST-ClusterStateUpdateTest.testCoreRegistration-seed#[68B83D687D84F5F]) [n:127.0.0.1:1661_solr c:testcore s:shard1 r:127.0.0.1:1661_solr_testcore x:testcore] o.a.s.u.UpdateLog Initializing UpdateLog: dataDir= defaultSyncLevel=FLUSH numRecordsToKeep=100 maxNumLogsToKeep=10 numVersionBuckets=65536
   [junit4]   2> 1130427 INFO  (TEST-ClusterStateUpdateTest.testCoreRegistration-seed#[68B83D687D84F5F]) [n:127.0.0.1:1661_solr c:testcore s:shard1 r:127.0.0.1:1661_solr_testcore x:testcore] o.a.s.u.CommitTracker Hard AutoCommit: disabled
   [junit4]   2> 1130427 INFO  (TEST-ClusterStateUpdateTest.testCoreRegistration-seed#[68B83D687D84F5F]) [n:127.0.0.1:1661_solr c:testcore s:shard1 r:127.0.0.1:1661_solr_testcore x:testcore] o.a.s.u.CommitTracker Soft AutoCommit: disabled
   [junit4]   2> 1130427 INFO  (TEST-ClusterStateUpdateTest.testCoreRegistration-seed#[68B83D687D84F5F]) [n:127.0.0.1:1661_solr c:testcore s:shard1 r:127.0.0.1:1661_solr_testcore x:testcore] o.a.s.u.RandomMergePolicy RandomMergePolicy wrapping class org.apache.lucene.index.LogByteSizeMergePolicy: [LogByteSizeMergePolicy: minMergeSize=1677721, mergeFactor=36, maxMergeSize=2147483648, maxMergeSizeForForcedMerge=9223372036854775807, calibrateSizeByDeletes=true, maxMergeDocs=2147483647, maxCFSSegmentSizeMB=8.796093022207999E12, noCFSRatio=0.3930845599043209]
   [junit4]   2> 1130428 INFO  (TEST-ClusterStateUpdateTest.testCoreRegistration-seed#[68B83D687D84F5F]) [n:127.0.0.1:1661_solr c:testcore s:shard1 r:127.0.0.1:1661_solr_testcore x:testcore] o.a.s.c.SolrDeletionPolicy SolrDeletionPolicy.onInit: commits: num=1
   [junit4]   2> 	commit{dir=MockDirectoryWrapper(RAMDirectory@a9aa5 lockFactory=org.apache.lucene.store.SingleInstanceLockFactory@2ec7af),segFN=segments_1,generation=1}
   [junit4]   2> 1130428 INFO  (TEST-ClusterStateUpdateTest.testCoreRegistration-seed#[68B83D687D84F5F]) [n:127.0.0.1:1661_solr c:testcore s:shard1 r:127.0.0.1:1661_solr_testcore x:testcore] o.a.s.c.SolrDeletionPolicy newest commit generation = 1
   [junit4]   2> 1130428 INFO  (TEST-ClusterStateUpdateTest.testCoreRegistration-seed#[68B83D687D84F5F]) [n:127.0.0.1:1661_solr c:testcore s:shard1 r:127.0.0.1:1661_solr_testcore x:testcore] o.a.s.s.SolrIndexSearcher Opening Searcher@1c63857[testcore] main
   [junit4]   2> 1130428 INFO  (TEST-ClusterStateUpdateTest.testCoreRegistration-seed#[68B83D687D84F5F]) [n:127.0.0.1:1661_solr c:testcore s:shard1 r:127.0.0.1:1661_solr_testcore x:testcore] o.a.s.c.c.ZkStateReader Load collection config from: [/collections/testcore]
   [junit4]   2> 1130428 INFO  (TEST-ClusterStateUpdateTest.testCoreRegistration-seed#[68B83D687D84F5F]) [n:127.0.0.1:1661_solr c:testcore s:shard1 r:127.0.0.1:1661_solr_testcore x:testcore] o.a.s.c.c.ZkStateReader path=[/collections/testcore] [configName]=[conf1] specified config exists in ZooKeeper
   [junit4]   2> 1130428 INFO  (TEST-ClusterStateUpdateTest.testCoreRegistration-seed#[68B83D687D84F5F]) [n:127.0.0.1:1661_solr c:testcore s:shard1 r:127.0.0.1:1661_solr_testcore x:testcore] o.a.s.r.RestManager Initializing RestManager with initArgs: {storageIO=org.apache.solr.rest.ManagedResourceStorage$InMemoryStorageIO}
   [junit4]   2> 1130428 INFO  (TEST-ClusterStateUpdateTest.testCoreRegistration-seed#[68B83D687D84F5F]) [n:127.0.0.1:1661_solr c:testcore s:shard1 r:127.0.0.1:1661_solr_testcore x:testcore] o.a.s.r.ManagedResourceStorage Reading _rest_managed.json using InMemoryStorage
   [junit4]   2> 1130428 INFO  (TEST-ClusterStateUpdateTest.testCoreRegistration-seed#[68B83D687D84F5F]) [n:127.0.0.1:1661_solr c:testcore s:shard1 r:127.0.0.1:1661_solr_testcore x:testcore] o.a.s.r.RestManager Initializing 0 registered ManagedResources
   [junit4]   2> 1130429 INFO  (TEST-ClusterStateUpdateTest.testCoreRegistration-seed#[68B83D687D84F5F]) [n:127.0.0.1:1661_solr c:testcore s:shard1 r:127.0.0.1:1661_solr_testcore x:testcore] o.a.s.h.c.SpellCheckComponent Initializing spell checkers
   [junit4]   2> 1130466 INFO  (TEST-ClusterStateUpdateTest.testCoreRegistration-seed#[68B83D687D84F5F]) [n:127.0.0.1:1661_solr c:testcore s:shard1 r:127.0.0.1:1661_solr_testcore x:testcore] o.a.s.s.DirectSolrSpellChecker init: {name=direct,classname=DirectSolrSpellChecker,field=lowerfilt,minQueryLength=3}
   [junit4]   2> 1130577 INFO  (TEST-ClusterStateUpdateTest.testCoreRegistration-seed#[68B83D687D84F5F]) [n:127.0.0.1:1661_solr c:testcore s:shard1 r:127.0.0.1:1661_solr_testcore x:testcore] o.a.s.h.ReplicationHandler Commits will be reserved for  10000
   [junit4]   2> 1130577 INFO  (searcherExecutor-3406-thread-1-processing-x:testcore r:127.0.0.1:1661_solr_testcore n:127.0.0.1:1661_solr c:testcore s:shard1) [n:127.0.0.1:1661_solr c:testcore s:shard1 r:127.0.0.1:1661_solr_testcore x:testcore] o.a.s.h.c.SpellCheckComponent Loading spell index for spellchecker: default
   [junit4]   2> 1130578 INFO  (searcherExecutor-3406-thread-1-processing-x:testcore r:127.0.0.1:1661_solr_testcore n:127.0.0.1:1661_solr c:testcore s:shard1) [n:127.0.0.1:1661_solr c:testcore s:shard1 r:127.0.0.1:1661_solr_testcore x:testcore] o.a.s.h.c.SpellCheckComponent Loading spell index for spellchecker: direct
   [junit4]   2> 1130578 INFO  (searcherExecutor-3406-thread-1-processing-x:testcore r:127.0.0.1:1661_solr_testcore n:127.0.0.1:1661_solr c:testcore s:shard1) [n:127.0.0.1:1661_solr c:testcore s:shard1 r:127.0.0.1:1661_solr_testcore x:testcore] o.a.s.h.c.SpellCheckComponent Loading spell index for spellchecker: wordbreak
   [junit4]   2> 1130578 INFO  (searcherExecutor-3406-thread-1-processing-x:testcore r:127.0.0.1:1661_solr_testcore n:127.0.0.1:1661_solr c:testcore s:shard1) [n:127.0.0.1:1661_solr c:testcore s:shard1 r:127.0.0.1:1661_solr_testcore x:testcore] o.a.s.h.c.SpellCheckComponent Loading spell index for spellchecker: multipleFields
   [junit4]   2> 1130578 INFO  (searcherExecutor-3406-thread-1-processing-x:testcore r:127.0.0.1:1661_solr_testcore n:127.0.0.1:1661_solr c:testcore s:shard1) [n:127.0.0.1:1661_solr c:testcore s:shard1 r:127.0.0.1:1661_solr_testcore x:testcore] o.a.s.h.c.SpellCheckComponent Loading spell index for spellchecker: jarowinkler
   [junit4]   2> 1130578 INFO  (TEST-ClusterStateUpdateTest.testCoreRegistration-seed#[68B83D687D84F5F]) [n:127.0.0.1:1661_solr c:testcore s:shard1 r:127.0.0.1:1661_solr_testcore x:testcore] o.a.s.u.UpdateLog Looking up max value of version field to seed version buckets
   [junit4]   2> 1130578 INFO  (TEST-ClusterStateUpdateTest.testCoreRegistration-seed#[68B83D687D84F5F]) [n:127.0.0.1:1661_solr c:testcore s:shard1 r:127.0.0.1:1661_solr_testcore x:testcore] o.a.s.u.VersionInfo Refreshing highest value of _version_ for 65536 version buckets from index
   [junit4]   2> 1130578 INFO  (TEST-ClusterStateUpdateTest.testCoreRegistration-seed#[68B83D687D84F5F]) [n:127.0.0.1:1661_solr c:testcore s:shard1 r:127.0.0.1:1661_solr_testcore x:testcore] o.a.s.u.VersionInfo No terms found for _version_, cannot seed version bucket highest value from index
   [junit4]   2> 1130578 INFO  (searcherExecutor-3406-thread-1-processing-x:testcore r:127.0.0.1:1661_solr_testcore n:127.0.0.1:1661_solr c:testcore s:shard1) [n:127.0.0.1:1661_solr c:testcore s:shard1 r:127.0.0.1:1661_solr_testcore x:testcore] o.a.s.h.c.SpellCheckComponent Loading spell index for spellchecker: external
   [junit4]   2> 1130578 INFO  (TEST-ClusterStateUpdateTest.testCoreRegistration-seed#[68B83D687D84F5F]) [n:127.0.0.1:1661_solr c:testcore s:shard1 r:127.0.0.1:1661_solr_testcore x:testcore] o.a.s.u.UpdateLog Could not find max version in index or recent updates, using new clock 1525818652289400832
   [junit4]   2> 1130578 INFO  (searcherExecutor-3406-thread-1-processing-x:testcore r:127.0.0.1:1661_solr_testcore n:127.0.0.1:1661_solr c:testcore s:shard1) [n:127.0.0.1:1661_solr c:testcore s:shard1 r:127.0.0.1:1661_solr_testcore x:testcore] o.a.s.h.c.SpellCheckComponent Loading spell index for spellchecker: freq
   [junit4]   2> 1130578 INFO  (searcherExecutor-3406-thread-1-processing-x:testcore r:127.0.0.1:1661_solr_testcore n:127.0.0.1:1661_solr c:testcore s:shard1) [n:127.0.0.1:1661_solr c:testcore s:shard1 r:127.0.0.1:1661_solr_testcore x:testcore] o.

[...truncated too long message...]

47)
   [junit4]   2> 	at com.carrotsearch.randomizedtesting.rules.StatementAdapter.evaluate(StatementAdapter.java:36)
   [junit4]   2> 	at com.carrotsearch.randomizedtesting.ThreadLeakControl$StatementRunner.run(ThreadLeakControl.java:367)
   [junit4]   2> 	at com.carrotsearch.randomizedtesting.ThreadLeakControl.forkTimeoutingTask(ThreadLeakControl.java:809)
   [junit4]   2> 	at com.carrotsearch.randomizedtesting.ThreadLeakControl$3.evaluate(ThreadLeakControl.java:460)
   [junit4]   2> 	at com.carrotsearch.randomizedtesting.RandomizedRunner.runSingleTest(RandomizedRunner.java:880)
   [junit4]   2> 	at com.carrotsearch.randomizedtesting.RandomizedRunner$5.evaluate(RandomizedRunner.java:781)
   [junit4]   2> 	at com.carrotsearch.randomizedtesting.RandomizedRunner$6.evaluate(RandomizedRunner.java:816)
   [junit4]   2> 	at com.carrotsearch.randomizedtesting.RandomizedRunner$7.evaluate(RandomizedRunner.java:827)
   [junit4]   2> 	at com.carrotsearch.randomizedtesting.rules.StatementAdapter.evaluate(StatementAdapter.java:36)
   [junit4]   2> 	at com.carrotsearch.randomizedtesting.rules.SystemPropertiesRestoreRule$1.evaluate(SystemPropertiesRestoreRule.java:57)
   [junit4]   2> 	at org.apache.lucene.util.AbstractBeforeAfterRule$1.evaluate(AbstractBeforeAfterRule.java:45)
   [junit4]   2> 	at com.carrotsearch.randomizedtesting.rules.StatementAdapter.evaluate(StatementAdapter.java:36)
   [junit4]   2> 	at org.apache.lucene.util.TestRuleStoreClassName$1.evaluate(TestRuleStoreClassName.java:41)
   [junit4]   2> 	at com.carrotsearch.randomizedtesting.rules.NoShadowingOrOverridesOnMethodsRule$1.evaluate(NoShadowingOrOverridesOnMethodsRule.java:40)
   [junit4]   2> 	at com.carrotsearch.randomizedtesting.rules.NoShadowingOrOverridesOnMethodsRule$1.evaluate(NoShadowingOrOverridesOnMethodsRule.java:40)
   [junit4]   2> 	at com.carrotsearch.randomizedtesting.rules.StatementAdapter.evaluate(StatementAdapter.java:36)
   [junit4]   2> 	at com.carrotsearch.randomizedtesting.rules.StatementAdapter.evaluate(StatementAdapter.java:36)
   [junit4]   2> 	at com.carrotsearch.randomizedtesting.rules.StatementAdapter.evaluate(StatementAdapter.java:36)
   [junit4]   2> 	at org.apache.lucene.util.TestRuleAssertionsRequired$1.evaluate(TestRuleAssertionsRequired.java:53)
   [junit4]   2> 	at org.apache.lucene.util.TestRuleMarkFailure$1.evaluate(TestRuleMarkFailure.java:47)
   [junit4]   2> 	at org.apache.lucene.util.TestRuleIgnoreAfterMaxFailures$1.evaluate(TestRuleIgnoreAfterMaxFailures.java:64)
   [junit4]   2> 	at org.apache.lucene.util.TestRuleIgnoreTestSuites$1.evaluate(TestRuleIgnoreTestSuites.java:54)
   [junit4]   2> 	at com.carrotsearch.randomizedtesting.rules.StatementAdapter.evaluate(StatementAdapter.java:36)
   [junit4]   2> 	at com.carrotsearch.randomizedtesting.ThreadLeakControl$StatementRunner.run(ThreadLeakControl.java:367)
   [junit4]   2> 	at java.lang.Thread.run(Thread.java:745)
   [junit4]   2> 1155114 INFO  (TEST-ClusterStateUpdateTest.testCoreRegistration-seed#[68B83D687D84F5F]) [n:127.0.0.1:1662_solr c:testcore s:shard1 r:127.0.0.1:1661_solr_testcore x:testcore] o.a.s.c.ZkController Could not publish node as down: org.apache.zookeeper.KeeperException$SessionExpiredException: KeeperErrorCode = Session expired for /overseer
   [junit4]   2> 1155115 INFO  (TEST-ClusterStateUpdateTest.testCoreRegistration-seed#[68B83D687D84F5F]) [n:127.0.0.1:1662_solr c:testcore s:shard1 r:127.0.0.1:1661_solr_testcore x:testcore] o.a.s.c.ZkTestServer connecting to 127.0.0.1:60804 60804
   [junit4]   2> 1155213 INFO  (Thread-3042) [    ] o.a.s.c.ZkTestServer connecting to 127.0.0.1:60804 60804
   [junit4]   2> 1155214 WARN  (Thread-3042) [    ] o.a.s.c.ZkTestServer Watch limit violations: 
   [junit4]   2> Maximum concurrent create/delete watches above limit:
   [junit4]   2> 
   [junit4]   2> 	4	/solr/aliases.json
   [junit4]   2> 	4	/solr/security.json
   [junit4]   2> 	2	/solr/configs/conf1
   [junit4]   2> 
   [junit4]   2> Maximum concurrent data watches above limit:
   [junit4]   2> 
   [junit4]   2> 	4	/solr/clusterstate.json
   [junit4]   2> 	2	/solr/overseer_elect/election/95363665457250307-127.0.0.1:1661_solr-n_0000000000
   [junit4]   2> 
   [junit4]   2> Maximum concurrent children watches above limit:
   [junit4]   2> 
   [junit4]   2> 	4	/solr/collections
   [junit4]   2> 	3	/solr/live_nodes
   [junit4]   2> 	2	/solr/overseer/queue
   [junit4]   2> 	2	/solr/overseer/collection-queue-work
   [junit4]   2> 
   [junit4]   2> 1155214 INFO  (TEST-ClusterStateUpdateTest.testCoreRegistration-seed#[68B83D687D84F5F]) [n:127.0.0.1:1662_solr c:testcore s:shard1 r:127.0.0.1:1661_solr_testcore x:testcore] o.a.s.SolrTestCaseJ4 ###Ending testCoreRegistration
   [junit4]   2> NOTE: reproduce with: ant test  -Dtestcase=ClusterStateUpdateTest -Dtests.method=testCoreRegistration -Dtests.seed=68B83D687D84F5F -Dtests.multiplier=3 -Dtests.slow=true -Dtests.locale=es-BO -Dtests.timezone=Pacific/Guam -Dtests.asserts=true -Dtests.file.encoding=US-ASCII
   [junit4] FAILURE 29.4s J0 | ClusterStateUpdateTest.testCoreRegistration <<<
   [junit4]    > Throwable #1: java.lang.AssertionError
   [junit4]    > 	at __randomizedtesting.SeedInfo.seed([68B83D687D84F5F:B800E579FEA2416A]:0)
   [junit4]    > 	at org.apache.solr.cloud.ClusterStateUpdateTest.testCoreRegistration(ClusterStateUpdateTest.java:234)
   [junit4]    > 	at java.lang.Thread.run(Thread.java:745)
   [junit4]   2> 1155216 INFO  (SUITE-ClusterStateUpdateTest-seed#[68B83D687D84F5F]-worker) [n:127.0.0.1:1662_solr c:testcore s:shard1 r:127.0.0.1:1661_solr_testcore x:testcore] o.a.s.SolrTestCaseJ4 ###deleteCore
   [junit4]   2> NOTE: leaving temporary files on disk at: /home/jenkins/workspace/Lucene-Solr-5.x-Linux/solr/build/solr-core/test/J0/temp/solr.cloud.ClusterStateUpdateTest_68B83D687D84F5F-001
   [junit4]   2> Feb 10, 2016 7:54:44 PM com.carrotsearch.randomizedtesting.ThreadLeakControl checkThreadLeaks
   [junit4]   2> WARNING: Will linger awaiting termination of 1 leaked thread(s).
   [junit4]   2> NOTE: test params are: codec=Asserting(Lucene54): {}, docValues:{}, sim=RandomSimilarity(queryNorm=true,coord=no): {}, locale=es-BO, timezone=Pacific/Guam
   [junit4]   2> NOTE: Linux 3.19.0-47-generic i386/Oracle Corporation 1.7.0_80 (32-bit)/cpus=12,threads=1,free=104118856,total=529530880
   [junit4]   2> NOTE: All tests run in this JVM: [TestDocSet, TestJoin, TestCrossCoreJoin, TestFastOutputStream, SuggestComponentContextFilterQueryTest, TestDynamicFieldCollectionResource, PolyFieldTest, TestRandomRequestDistribution, TestCollationFieldDocValues, TestSolr4Spatial, TestNonDefinedSimilarityFactory, TestRealTimeGet, RAMDirectoryFactoryTest, TestIntervalFaceting, TestFieldResource, TestSolrXml, ActionThrottleTest, DistributedSpellCheckComponentTest, JsonLoaderTest, TestArbitraryIndexDir, TestDynamicLoading, UUIDFieldTest, DistribCursorPagingTest, TestValueSourceCache, QueryEqualityTest, TestManagedSchemaDynamicFieldResource, AnalyticsQueryTest, TestJsonFacets, RequiredFieldsTest, TestExceedMaxTermLength, JavabinLoaderTest, TestClassNameShortening, SignatureUpdateProcessorFactoryTest, HdfsDirectoryTest, EchoParamsTest, SyncSliceTest, ZkNodePropsTest, DistributedQueryElevationComponentTest, TestCloudPivotFacet, PKIAuthenticationIntegrationTest, BasicZkTest, AnalysisAfterCoreReloadTest, DistributedSuggestComponentTest, CollectionStateFormat2Test, TestAnalyzedSuggestions, TestDistribDocBasedVersion, TestLeaderElectionZkExpiry, CheckHdfsIndexTest, TestInitQParser, IndexSchemaTest, CustomCollectionTest, BasicDistributedZkTest, ResponseLogComponentTest, OutputWriterTest, TestLMDirichletSimilarityFactory, TestOmitPositions, AnalysisErrorHandlingTest, TestFaceting, TestExpandComponent, BlockCacheTest, TestRangeQuery, DistributedFacetPivotWhiteBoxTest, ChangedSchemaMergeTest, TestComponentsName, BlockJoinFacetRandomTest, HdfsDirectoryFactoryTest, DisMaxRequestHandlerTest, TestRTGBase, PreAnalyzedFieldTest, JSONWriterTest, TestHighlightDedupGrouping, TestFoldingMultitermQuery, HttpPartitionTest, BigEndianAscendingWordSerializerTest, DocExpirationUpdateProcessorFactoryTest, TestRemoteStreaming, TestNoOpRegenerator, FileBasedSpellCheckerTest, ReturnFieldsTest, TestRandomDVFaceting, TestFileDictionaryLookup, ConnectionReuseTest, DistributedDebugComponentTest, RankQueryTest, TestUseDocValuesAsStored, TestBinaryField, HdfsTlogReplayBufferedWhileIndexingTest, CacheHeaderTest, AlternateDirectoryTest, TestCloudManagedSchema, TestRandomFaceting, TestConfig, DateFieldTest, TestPseudoReturnFields, ChaosMonkeySafeLeaderTest, BasicDistributedZk2Test, ShardRoutingTest, FullSolrCloudDistribCmdsTest, ClusterStateUpdateTest]
   [junit4] Completed [289/568 (1!)] on J0 in 29.65s, 1 test, 1 failure <<< FAILURES!

[...truncated 882 lines...]
BUILD FAILED
/home/jenkins/workspace/Lucene-Solr-5.x-Linux/build.xml:750: The following error occurred while executing this line:
/home/jenkins/workspace/Lucene-Solr-5.x-Linux/build.xml:694: The following error occurred while executing this line:
/home/jenkins/workspace/Lucene-Solr-5.x-Linux/build.xml:59: The following error occurred while executing this line:
/home/jenkins/workspace/Lucene-Solr-5.x-Linux/solr/build.xml:233: The following error occurred while executing this line:
/home/jenkins/workspace/Lucene-Solr-5.x-Linux/solr/common-build.xml:534: The following error occurred while executing this line:
/home/jenkins/workspace/Lucene-Solr-5.x-Linux/lucene/common-build.xml:1477: The following error occurred while executing this line:
/home/jenkins/workspace/Lucene-Solr-5.x-Linux/lucene/common-build.xml:1033: There were test failures: 568 suites (7 ignored), 2276 tests, 1 failure, 86 ignored (41 assumptions) [seed: 68B83D687D84F5F]

Total time: 54 minutes 26 seconds
Build step 'Invoke Ant' marked build as failure
Archiving artifacts
[WARNINGS] Skipping publisher since build result is FAILURE
Recording test results
Email was triggered for: Failure - Any
Sending email for trigger: Failure - Any



Mime
View raw message