lucene-dev mailing list archives

Site index · List index
Message view « Date » · « Thread »
Top « Date » · « Thread »
From Policeman Jenkins Server <jenk...@thetaphi.de>
Subject [JENKINS] Lucene-Solr-trunk-Linux (32bit/jdk1.8.0_72) - Build # 15846 - Failure!
Date Thu, 11 Feb 2016 03:18:53 GMT
Build: http://jenkins.thetaphi.de/job/Lucene-Solr-trunk-Linux/15846/
Java: 32bit/jdk1.8.0_72 -client -XX:+UseG1GC

1 tests failed.
FAILED:  org.apache.solr.handler.TestReplicationHandler.doTestIndexAndConfigAliasReplication

Error Message:
Index: 0, Size: 0

Stack Trace:
java.lang.IndexOutOfBoundsException: Index: 0, Size: 0
	at __randomizedtesting.SeedInfo.seed([A0C1A60753A8D026:57B2485F95407FC0]:0)
	at java.util.ArrayList.rangeCheck(ArrayList.java:653)
	at java.util.ArrayList.get(ArrayList.java:429)
	at org.apache.solr.handler.TestReplicationHandler.doTestIndexAndConfigAliasReplication(TestReplicationHandler.java:1241)
	at sun.reflect.NativeMethodAccessorImpl.invoke0(Native Method)
	at sun.reflect.NativeMethodAccessorImpl.invoke(NativeMethodAccessorImpl.java:62)
	at sun.reflect.DelegatingMethodAccessorImpl.invoke(DelegatingMethodAccessorImpl.java:43)
	at java.lang.reflect.Method.invoke(Method.java:498)
	at com.carrotsearch.randomizedtesting.RandomizedRunner.invoke(RandomizedRunner.java:1764)
	at com.carrotsearch.randomizedtesting.RandomizedRunner$8.evaluate(RandomizedRunner.java:871)
	at com.carrotsearch.randomizedtesting.RandomizedRunner$9.evaluate(RandomizedRunner.java:907)
	at com.carrotsearch.randomizedtesting.RandomizedRunner$10.evaluate(RandomizedRunner.java:921)
	at com.carrotsearch.randomizedtesting.rules.SystemPropertiesRestoreRule$1.evaluate(SystemPropertiesRestoreRule.java:57)
	at org.apache.lucene.util.TestRuleSetupTeardownChained$1.evaluate(TestRuleSetupTeardownChained.java:49)
	at org.apache.lucene.util.AbstractBeforeAfterRule$1.evaluate(AbstractBeforeAfterRule.java:45)
	at org.apache.lucene.util.TestRuleThreadAndTestName$1.evaluate(TestRuleThreadAndTestName.java:48)
	at org.apache.lucene.util.TestRuleIgnoreAfterMaxFailures$1.evaluate(TestRuleIgnoreAfterMaxFailures.java:64)
	at org.apache.lucene.util.TestRuleMarkFailure$1.evaluate(TestRuleMarkFailure.java:47)
	at com.carrotsearch.randomizedtesting.rules.StatementAdapter.evaluate(StatementAdapter.java:36)
	at com.carrotsearch.randomizedtesting.ThreadLeakControl$StatementRunner.run(ThreadLeakControl.java:367)
	at com.carrotsearch.randomizedtesting.ThreadLeakControl.forkTimeoutingTask(ThreadLeakControl.java:809)
	at com.carrotsearch.randomizedtesting.ThreadLeakControl$3.evaluate(ThreadLeakControl.java:460)
	at com.carrotsearch.randomizedtesting.RandomizedRunner.runSingleTest(RandomizedRunner.java:880)
	at com.carrotsearch.randomizedtesting.RandomizedRunner$5.evaluate(RandomizedRunner.java:781)
	at com.carrotsearch.randomizedtesting.RandomizedRunner$6.evaluate(RandomizedRunner.java:816)
	at com.carrotsearch.randomizedtesting.RandomizedRunner$7.evaluate(RandomizedRunner.java:827)
	at com.carrotsearch.randomizedtesting.rules.StatementAdapter.evaluate(StatementAdapter.java:36)
	at com.carrotsearch.randomizedtesting.rules.SystemPropertiesRestoreRule$1.evaluate(SystemPropertiesRestoreRule.java:57)
	at org.apache.lucene.util.AbstractBeforeAfterRule$1.evaluate(AbstractBeforeAfterRule.java:45)
	at com.carrotsearch.randomizedtesting.rules.StatementAdapter.evaluate(StatementAdapter.java:36)
	at org.apache.lucene.util.TestRuleStoreClassName$1.evaluate(TestRuleStoreClassName.java:41)
	at com.carrotsearch.randomizedtesting.rules.NoShadowingOrOverridesOnMethodsRule$1.evaluate(NoShadowingOrOverridesOnMethodsRule.java:40)
	at com.carrotsearch.randomizedtesting.rules.NoShadowingOrOverridesOnMethodsRule$1.evaluate(NoShadowingOrOverridesOnMethodsRule.java:40)
	at com.carrotsearch.randomizedtesting.rules.StatementAdapter.evaluate(StatementAdapter.java:36)
	at com.carrotsearch.randomizedtesting.rules.StatementAdapter.evaluate(StatementAdapter.java:36)
	at com.carrotsearch.randomizedtesting.rules.StatementAdapter.evaluate(StatementAdapter.java:36)
	at org.apache.lucene.util.TestRuleAssertionsRequired$1.evaluate(TestRuleAssertionsRequired.java:53)
	at org.apache.lucene.util.TestRuleMarkFailure$1.evaluate(TestRuleMarkFailure.java:47)
	at org.apache.lucene.util.TestRuleIgnoreAfterMaxFailures$1.evaluate(TestRuleIgnoreAfterMaxFailures.java:64)
	at org.apache.lucene.util.TestRuleIgnoreTestSuites$1.evaluate(TestRuleIgnoreTestSuites.java:54)
	at com.carrotsearch.randomizedtesting.rules.StatementAdapter.evaluate(StatementAdapter.java:36)
	at com.carrotsearch.randomizedtesting.ThreadLeakControl$StatementRunner.run(ThreadLeakControl.java:367)
	at java.lang.Thread.run(Thread.java:745)




Build Log:
[...truncated 11323 lines...]
   [junit4] Suite: org.apache.solr.handler.TestReplicationHandler
   [junit4]   2> Creating dataDir: /home/jenkins/workspace/Lucene-Solr-trunk-Linux/solr/build/solr-core/test/J0/temp/solr.handler.TestReplicationHandler_A0C1A60753A8D026-001/init-core-data-001
   [junit4]   2> 987719 INFO  (TEST-TestReplicationHandler.doTestDetails-seed#[A0C1A60753A8D026]) [    ] o.a.s.SolrTestCaseJ4 ###Starting doTestDetails
   [junit4]   2> 987719 INFO  (TEST-TestReplicationHandler.doTestDetails-seed#[A0C1A60753A8D026]) [    ] o.a.s.SolrTestCaseJ4 Writing core.properties file to /home/jenkins/workspace/Lucene-Solr-trunk-Linux/solr/build/solr-core/test/J0/temp/solr.handler.TestReplicationHandler_A0C1A60753A8D026-001/solr-instance-001/collection1
   [junit4]   2> 987732 INFO  (TEST-TestReplicationHandler.doTestDetails-seed#[A0C1A60753A8D026]) [    ] o.e.j.s.Server jetty-9.2.13.v20150730
   [junit4]   2> 987733 INFO  (TEST-TestReplicationHandler.doTestDetails-seed#[A0C1A60753A8D026]) [    ] o.e.j.s.h.ContextHandler Started o.e.j.s.ServletContextHandler@d509c3{/solr,null,AVAILABLE}
   [junit4]   2> 987734 INFO  (TEST-TestReplicationHandler.doTestDetails-seed#[A0C1A60753A8D026]) [    ] o.e.j.s.ServerConnector Started ServerConnector@1dee1cd{HTTP/1.1}{127.0.0.1:45475}
   [junit4]   2> 987734 INFO  (TEST-TestReplicationHandler.doTestDetails-seed#[A0C1A60753A8D026]) [    ] o.e.j.s.Server Started @988977ms
   [junit4]   2> 987734 INFO  (TEST-TestReplicationHandler.doTestDetails-seed#[A0C1A60753A8D026]) [    ] o.a.s.c.s.e.JettySolrRunner Jetty properties: {solr.data.dir=/home/jenkins/workspace/Lucene-Solr-trunk-Linux/solr/build/solr-core/test/J0/temp/solr.handler.TestReplicationHandler_A0C1A60753A8D026-001/solr-instance-001/collection1/data, hostContext=/solr, hostPort=45475}
   [junit4]   2> 987734 INFO  (TEST-TestReplicationHandler.doTestDetails-seed#[A0C1A60753A8D026]) [    ] o.a.s.s.SolrDispatchFilter SolrDispatchFilter.init(): sun.misc.Launcher$AppClassLoader@1d16e93
   [junit4]   2> 987734 INFO  (TEST-TestReplicationHandler.doTestDetails-seed#[A0C1A60753A8D026]) [    ] o.a.s.c.SolrResourceLoader new SolrResourceLoader for directory: '/home/jenkins/workspace/Lucene-Solr-trunk-Linux/solr/build/solr-core/test/J0/temp/solr.handler.TestReplicationHandler_A0C1A60753A8D026-001/solr-instance-001'
   [junit4]   2> 987734 INFO  (TEST-TestReplicationHandler.doTestDetails-seed#[A0C1A60753A8D026]) [    ] o.a.s.c.SolrResourceLoader JNDI not configured for solr (NoInitialContextEx)
   [junit4]   2> 987735 INFO  (TEST-TestReplicationHandler.doTestDetails-seed#[A0C1A60753A8D026]) [    ] o.a.s.c.SolrResourceLoader solr home defaulted to 'solr/' (could not find system property or JNDI)
   [junit4]   2> 987735 INFO  (TEST-TestReplicationHandler.doTestDetails-seed#[A0C1A60753A8D026]) [    ] o.a.s.c.SolrXmlConfig Loading container configuration from /home/jenkins/workspace/Lucene-Solr-trunk-Linux/solr/build/solr-core/test/J0/temp/solr.handler.TestReplicationHandler_A0C1A60753A8D026-001/solr-instance-001/solr.xml
   [junit4]   2> 987743 INFO  (TEST-TestReplicationHandler.doTestDetails-seed#[A0C1A60753A8D026]) [    ] o.a.s.c.CorePropertiesLocator Config-defined core root directory: /home/jenkins/workspace/Lucene-Solr-trunk-Linux/solr/build/solr-core/test/J0/temp/solr.handler.TestReplicationHandler_A0C1A60753A8D026-001/solr-instance-001/.
   [junit4]   2> 987743 INFO  (TEST-TestReplicationHandler.doTestDetails-seed#[A0C1A60753A8D026]) [    ] o.a.s.c.CoreContainer New CoreContainer 7952077
   [junit4]   2> 987743 INFO  (TEST-TestReplicationHandler.doTestDetails-seed#[A0C1A60753A8D026]) [    ] o.a.s.c.CoreContainer Loading cores into CoreContainer [instanceDir=/home/jenkins/workspace/Lucene-Solr-trunk-Linux/solr/build/solr-core/test/J0/temp/solr.handler.TestReplicationHandler_A0C1A60753A8D026-001/solr-instance-001]
   [junit4]   2> 987743 WARN  (TEST-TestReplicationHandler.doTestDetails-seed#[A0C1A60753A8D026]) [    ] o.a.s.c.CoreContainer Couldn't add files from /home/jenkins/workspace/Lucene-Solr-trunk-Linux/solr/build/solr-core/test/J0/temp/solr.handler.TestReplicationHandler_A0C1A60753A8D026-001/solr-instance-001/lib to classpath: /home/jenkins/workspace/Lucene-Solr-trunk-Linux/solr/build/solr-core/test/J0/temp/solr.handler.TestReplicationHandler_A0C1A60753A8D026-001/solr-instance-001/lib
   [junit4]   2> 987743 INFO  (TEST-TestReplicationHandler.doTestDetails-seed#[A0C1A60753A8D026]) [    ] o.a.s.h.c.HttpShardHandlerFactory created with socketTimeout : 90000,urlScheme : ,connTimeout : 15000,maxConnectionsPerHost : 20,maxConnections : 10000,corePoolSize : 0,maximumPoolSize : 2147483647,maxThreadIdleTime : 5,sizeOfQueue : -1,fairnessPolicy : false,useRetries : false,
   [junit4]   2> 987744 INFO  (TEST-TestReplicationHandler.doTestDetails-seed#[A0C1A60753A8D026]) [    ] o.a.s.u.UpdateShardHandler Creating UpdateShardHandler HTTP client with params: socketTimeout=340000&connTimeout=45000&retry=true
   [junit4]   2> 987744 INFO  (TEST-TestReplicationHandler.doTestDetails-seed#[A0C1A60753A8D026]) [    ] o.a.s.l.LogWatcher SLF4J impl is org.slf4j.impl.Log4jLoggerFactory
   [junit4]   2> 987744 INFO  (TEST-TestReplicationHandler.doTestDetails-seed#[A0C1A60753A8D026]) [    ] o.a.s.l.LogWatcher Registering Log Listener [Log4j (org.slf4j.impl.Log4jLoggerFactory)]
   [junit4]   2> 987745 INFO  (TEST-TestReplicationHandler.doTestDetails-seed#[A0C1A60753A8D026]) [    ] o.a.s.c.CoreContainer Security conf doesn't exist. Skipping setup for authorization module.
   [junit4]   2> 987745 INFO  (TEST-TestReplicationHandler.doTestDetails-seed#[A0C1A60753A8D026]) [    ] o.a.s.c.CoreContainer No authentication plugin used.
   [junit4]   2> 987745 INFO  (TEST-TestReplicationHandler.doTestDetails-seed#[A0C1A60753A8D026]) [    ] o.a.s.c.CorePropertiesLocator Looking for core definitions underneath /home/jenkins/workspace/Lucene-Solr-trunk-Linux/solr/build/solr-core/test/J0/temp/solr.handler.TestReplicationHandler_A0C1A60753A8D026-001/solr-instance-001/.
   [junit4]   2> 987746 INFO  (TEST-TestReplicationHandler.doTestDetails-seed#[A0C1A60753A8D026]) [    ] o.a.s.c.CoreDescriptor Created CoreDescriptor: {name=collection1, config=solrconfig.xml, loadOnStartup=true, schema=schema.xml, configSetProperties=configsetprops.json, transient=false, dataDir=data/}
   [junit4]   2> 987746 INFO  (TEST-TestReplicationHandler.doTestDetails-seed#[A0C1A60753A8D026]) [    ] o.a.s.c.CorePropertiesLocator Found core collection1 in /home/jenkins/workspace/Lucene-Solr-trunk-Linux/solr/build/solr-core/test/J0/temp/solr.handler.TestReplicationHandler_A0C1A60753A8D026-001/solr-instance-001/./collection1
   [junit4]   2> 987747 INFO  (TEST-TestReplicationHandler.doTestDetails-seed#[A0C1A60753A8D026]) [    ] o.a.s.c.CorePropertiesLocator Found 1 core definitions
   [junit4]   2> 987747 INFO  (coreLoadExecutor-3342-thread-1) [    ] o.a.s.c.SolrResourceLoader new SolrResourceLoader for directory: '/home/jenkins/workspace/Lucene-Solr-trunk-Linux/solr/build/solr-core/test/J0/temp/solr.handler.TestReplicationHandler_A0C1A60753A8D026-001/solr-instance-001/collection1'
   [junit4]   2> 987747 INFO  (TEST-TestReplicationHandler.doTestDetails-seed#[A0C1A60753A8D026]) [    ] o.a.s.s.SolrDispatchFilter user.dir=/home/jenkins/workspace/Lucene-Solr-trunk-Linux/solr/build/solr-core/test/J0
   [junit4]   2> 987747 INFO  (TEST-TestReplicationHandler.doTestDetails-seed#[A0C1A60753A8D026]) [    ] o.a.s.s.SolrDispatchFilter SolrDispatchFilter.init() done
   [junit4]   2> 987747 INFO  (coreLoadExecutor-3342-thread-1) [    ] o.a.s.c.SolrResourceLoader JNDI not configured for solr (NoInitialContextEx)
   [junit4]   2> 987747 INFO  (coreLoadExecutor-3342-thread-1) [    ] o.a.s.c.SolrResourceLoader solr home defaulted to 'solr/' (could not find system property or JNDI)
   [junit4]   2> 987767 INFO  (coreLoadExecutor-3342-thread-1) [    ] o.a.s.c.SolrConfig current version of requestparams : -1
   [junit4]   2> 987773 INFO  (coreLoadExecutor-3342-thread-1) [    ] o.a.s.c.SolrConfig Using Lucene MatchVersion: 6.0.0
   [junit4]   2> 987782 INFO  (coreLoadExecutor-3342-thread-1) [    ] o.a.s.c.SolrConfig Loaded SolrConfig: solrconfig.xml
   [junit4]   2> 987786 INFO  (coreLoadExecutor-3342-thread-1) [    ] o.a.s.s.IndexSchema [collection1] Schema name=test
   [junit4]   2> 987789 INFO  (coreLoadExecutor-3342-thread-1) [    ] o.a.s.s.IndexSchema unique key field: id
   [junit4]   2> 987790 INFO  (coreLoadExecutor-3342-thread-1) [    ] o.a.s.c.ConfigSetProperties Did not find ConfigSet properties, assuming default properties: Can't find resource 'configsetprops.json' in classpath or '/home/jenkins/workspace/Lucene-Solr-trunk-Linux/solr/build/solr-core/test/J0/temp/solr.handler.TestReplicationHandler_A0C1A60753A8D026-001/solr-instance-001/collection1'
   [junit4]   2> 987790 INFO  (coreLoadExecutor-3342-thread-1) [    ] o.a.s.c.CoreContainer Creating SolrCore 'collection1' using configuration from instancedir /home/jenkins/workspace/Lucene-Solr-trunk-Linux/solr/build/solr-core/test/J0/temp/solr.handler.TestReplicationHandler_A0C1A60753A8D026-001/solr-instance-001/./collection1
   [junit4]   2> 987790 INFO  (coreLoadExecutor-3342-thread-1) [    x:collection1] o.a.s.c.SolrCore org.apache.solr.core.MockDirectoryFactory
   [junit4]   2> 987790 INFO  (coreLoadExecutor-3342-thread-1) [    x:collection1] o.a.s.c.SolrCore [[collection1] ] Opening new SolrCore at [/home/jenkins/workspace/Lucene-Solr-trunk-Linux/solr/build/solr-core/test/J0/temp/solr.handler.TestReplicationHandler_A0C1A60753A8D026-001/solr-instance-001/collection1], dataDir=[/home/jenkins/workspace/Lucene-Solr-trunk-Linux/solr/build/solr-core/test/J0/temp/solr.handler.TestReplicationHandler_A0C1A60753A8D026-001/solr-instance-001/./collection1/data/]
   [junit4]   2> 987790 INFO  (coreLoadExecutor-3342-thread-1) [    x:collection1] o.a.s.c.SolrCore JMX monitoring not detected for core: collection1
   [junit4]   2> 987791 INFO  (coreLoadExecutor-3342-thread-1) [    x:collection1] o.a.s.c.CachingDirectoryFactory return new directory for /home/jenkins/workspace/Lucene-Solr-trunk-Linux/solr/build/solr-core/test/J0/temp/solr.handler.TestReplicationHandler_A0C1A60753A8D026-001/solr-instance-001/./collection1/data
   [junit4]   2> 987791 INFO  (coreLoadExecutor-3342-thread-1) [    x:collection1] o.a.s.c.SolrCore New index directory detected: old=null new=/home/jenkins/workspace/Lucene-Solr-trunk-Linux/solr/build/solr-core/test/J0/temp/solr.handler.TestReplicationHandler_A0C1A60753A8D026-001/solr-instance-001/./collection1/data/index/
   [junit4]   2> 987791 WARN  (coreLoadExecutor-3342-thread-1) [    x:collection1] o.a.s.c.SolrCore [collection1] Solr index directory '/home/jenkins/workspace/Lucene-Solr-trunk-Linux/solr/build/solr-core/test/J0/temp/solr.handler.TestReplicationHandler_A0C1A60753A8D026-001/solr-instance-001/./collection1/data/index' doesn't exist. Creating new index...
   [junit4]   2> 987791 INFO  (coreLoadExecutor-3342-thread-1) [    x:collection1] o.a.s.c.CachingDirectoryFactory return new directory for /home/jenkins/workspace/Lucene-Solr-trunk-Linux/solr/build/solr-core/test/J0/temp/solr.handler.TestReplicationHandler_A0C1A60753A8D026-001/solr-instance-001/./collection1/data/index
   [junit4]   2> 987792 INFO  (coreLoadExecutor-3342-thread-1) [    x:collection1] o.a.s.u.RandomMergePolicy RandomMergePolicy wrapping class org.apache.lucene.index.TieredMergePolicy: [TieredMergePolicy: maxMergeAtOnce=48, maxMergeAtOnceExplicit=19, maxMergedSegmentMB=17.3310546875, floorSegmentMB=1.2431640625, forceMergeDeletesPctAllowed=26.71590485750143, segmentsPerTier=32.0, maxCFSSegmentSizeMB=8.796093022207999E12, noCFSRatio=0.0
   [junit4]   2> 987792 INFO  (coreLoadExecutor-3342-thread-1) [    x:collection1] o.a.s.c.SolrDeletionPolicy SolrDeletionPolicy.onCommit: commits: num=1
   [junit4]   2> 	commit{dir=MockDirectoryWrapper(RAMDirectory@b923fe lockFactory=org.apache.lucene.store.SingleInstanceLockFactory@c3055c),segFN=segments_1,generation=1}
   [junit4]   2> 987792 INFO  (coreLoadExecutor-3342-thread-1) [    x:collection1] o.a.s.c.SolrDeletionPolicy newest commit generation = 1
   [junit4]   2> 987793 INFO  (OldIndexDirectoryCleanupThreadForCore-collection1) [    x:collection1] o.a.s.c.SolrCore Looking for old index directories to cleanup for core collection1 in /home/jenkins/workspace/Lucene-Solr-trunk-Linux/solr/build/solr-core/test/J0/temp/solr.handler.TestReplicationHandler_A0C1A60753A8D026-001/solr-instance-001/./collection1/data/
   [junit4]   2> 987794 INFO  (coreLoadExecutor-3342-thread-1) [    x:collection1] o.a.s.c.SolrCore no updateRequestProcessorChain defined as default, creating implicit default
   [junit4]   2> 987796 INFO  (coreLoadExecutor-3342-thread-1) [    x:collection1] o.a.s.h.l.XMLLoader xsltCacheLifetimeSeconds=60
   [junit4]   2> 987796 INFO  (coreLoadExecutor-3342-thread-1) [    x:collection1] o.a.s.h.l.XMLLoader xsltCacheLifetimeSeconds=60
   [junit4]   2> 987797 INFO  (coreLoadExecutor-3342-thread-1) [    x:collection1] o.a.s.h.l.XMLLoader xsltCacheLifetimeSeconds=60
   [junit4]   2> 987798 INFO  (coreLoadExecutor-3342-thread-1) [    x:collection1] o.a.s.h.l.XMLLoader xsltCacheLifetimeSeconds=60
   [junit4]   2> 987801 INFO  (coreLoadExecutor-3342-thread-1) [    x:collection1] o.a.s.c.PluginBag requestHandler : 'lazy' created with startup=lazy 
   [junit4]   2> 987801 INFO  (coreLoadExecutor-3342-thread-1) [    x:collection1] o.a.s.c.RequestHandlers Registered paths: /admin/mbeans,standard,lazy,/update/json/docs,/admin/luke,/export,/get,/admin/properties,/update/json,/admin/threads,/update/csv,/sql,/admin/segments,/admin/system,/replication,defaults,/config,/stream,/schema,/admin/plugins,/admin/logging,/admin/ping,/update,/admin/file
   [junit4]   2> 987802 INFO  (coreLoadExecutor-3342-thread-1) [    x:collection1] o.a.s.c.SolrCore Using default statsCache cache: org.apache.solr.search.stats.LocalStatsCache
   [junit4]   2> 987802 INFO  (coreLoadExecutor-3342-thread-1) [    x:collection1] o.a.s.u.CommitTracker Hard AutoCommit: disabled
   [junit4]   2> 987802 INFO  (coreLoadExecutor-3342-thread-1) [    x:collection1] o.a.s.u.CommitTracker Soft AutoCommit: disabled
   [junit4]   2> 987802 INFO  (coreLoadExecutor-3342-thread-1) [    x:collection1] o.a.s.u.RandomMergePolicy RandomMergePolicy wrapping class org.apache.lucene.index.TieredMergePolicy: [TieredMergePolicy: maxMergeAtOnce=16, maxMergeAtOnceExplicit=45, maxMergedSegmentMB=65.3876953125, floorSegmentMB=1.1572265625, forceMergeDeletesPctAllowed=14.083846989239952, segmentsPerTier=13.0, maxCFSSegmentSizeMB=8.796093022207999E12, noCFSRatio=0.11039822682950975
   [junit4]   2> 987802 INFO  (coreLoadExecutor-3342-thread-1) [    x:collection1] o.a.s.c.SolrDeletionPolicy SolrDeletionPolicy.onInit: commits: num=1
   [junit4]   2> 	commit{dir=MockDirectoryWrapper(RAMDirectory@b923fe lockFactory=org.apache.lucene.store.SingleInstanceLockFactory@c3055c),segFN=segments_1,generation=1}
   [junit4]   2> 987813 INFO  (coreLoadExecutor-3342-thread-1) [    x:collection1] o.a.s.c.SolrDeletionPolicy newest commit generation = 1
   [junit4]   2> 987814 INFO  (coreLoadExecutor-3342-thread-1) [    x:collection1] o.a.s.s.SolrIndexSearcher Opening [Searcher@12cc28e[collection1] main]
   [junit4]   2> 987814 INFO  (coreLoadExecutor-3342-thread-1) [    x:collection1] o.a.s.r.ManagedResourceStorage File-based storage initialized to use dir: /home/jenkins/workspace/Lucene-Solr-trunk-Linux/solr/build/solr-core/test/J0/temp/solr.handler.TestReplicationHandler_A0C1A60753A8D026-001/solr-instance-001/collection1/conf
   [junit4]   2> 987814 INFO  (coreLoadExecutor-3342-thread-1) [    x:collection1] o.a.s.r.RestManager Initializing RestManager with initArgs: {storageDir=/home/jenkins/workspace/Lucene-Solr-trunk-Linux/solr/build/solr-core/test/J0/temp/solr.handler.TestReplicationHandler_A0C1A60753A8D026-001/solr-instance-001/collection1/conf}
   [junit4]   2> 987814 INFO  (coreLoadExecutor-3342-thread-1) [    x:collection1] o.a.s.r.ManagedResourceStorage Reading _rest_managed.json using file:dir=/home/jenkins/workspace/Lucene-Solr-trunk-Linux/solr/build/solr-core/test/J0/temp/solr.handler.TestReplicationHandler_A0C1A60753A8D026-001/solr-instance-001/collection1/conf
   [junit4]   2> 987814 INFO  (coreLoadExecutor-3342-thread-1) [    x:collection1] o.a.s.r.RestManager Initializing 0 registered ManagedResources
   [junit4]   2> 987814 INFO  (coreLoadExecutor-3342-thread-1) [    x:collection1] o.a.s.h.ReplicationHandler Replication enabled for following config files: schema.xml,xslt/dummy.xsl
   [junit4]   2> 987814 INFO  (coreLoadExecutor-3342-thread-1) [    x:collection1] o.a.s.h.ReplicationHandler Commits will be reserved for  10000
   [junit4]   2> 987815 INFO  (searcherExecutor-3343-thread-1-processing-x:collection1) [    x:collection1] o.a.s.c.SolrCore [collection1] Registered new searcher Searcher@12cc28e[collection1] main{ExitableDirectoryReader(UninvertingDirectoryReader())}
   [junit4]   2> 987815 INFO  (coreLoadExecutor-3342-thread-1) [    x:collection1] o.a.s.c.CoreContainer registering core: collection1
   [junit4]   2> 988251 INFO  (TEST-TestReplicationHandler.doTestDetails-seed#[A0C1A60753A8D026]) [    ] o.a.s.SolrTestCaseJ4 Writing core.properties file to /home/jenkins/workspace/Lucene-Solr-trunk-Linux/solr/build/solr-core/test/J0/temp/solr.handler.TestReplicationHandler_A0C1A60753A8D026-001/solr-instance-002/collection1
   [junit4]   2> 988254 INFO  (TEST-TestReplicationHandler.doTestDetails-seed#[A0C1A60753A8D026]) [    ] o.e.j.s.Server jetty-9.2.13.v20150730
   [junit4]   2> 988255 INFO  (TEST-TestReplicationHandler.doTestDetails-seed#[A0C1A60753A8D026]) [    ] o.e.j.s.h.ContextHandler Started o.e.j.s.ServletContextHandler@1cf6131{/solr,null,AVAILABLE}
   [junit4]   2> 988255 INFO  (TEST-TestReplicationHandler.doTestDetails-seed#[A0C1A60753A8D026]) [    ] o.e.j.s.ServerConnector Started ServerConnector@145f144{HTTP/1.1}{127.0.0.1:47945}
   [junit4]   2> 988255 INFO  (TEST-TestReplicationHandler.doTestDetails-seed#[A0C1A60753A8D026]) [    ] o.e.j.s.Server Started @989499ms
   [junit4]   2> 988255 INFO  (TEST-TestReplicationHandler.doTestDetails-seed#[A0C1A60753A8D026]) [    ] o.a.s.c.s.e.JettySolrRunner Jetty properties: {solr.data.dir=/home/jenkins/workspace/Lucene-Solr-trunk-Linux/solr/build/solr-core/test/J0/temp/solr.handler.TestReplicationHandler_A0C1A60753A8D026-001/solr-instance-002/collection1/data, hostContext=/solr, hostPort=47945}
   [junit4]   2> 988256 INFO  (TEST-TestReplicationHandler.doTestDetails-seed#[A0C1A60753A8D026]) [    ] o.a.s.s.SolrDispatchFilter SolrDispatchFilter.init(): sun.misc.Launcher$AppClassLoader@1d16e93
   [junit4]   2> 988256 INFO  (TEST-TestReplicationHandler.doTestDetails-seed#[A0C1A60753A8D026]) [    ] o.a.s.c.SolrResourceLoader new SolrResourceLoader for directory: '/home/jenkins/workspace/Lucene-Solr-trunk-Linux/solr/build/solr-core/test/J0/temp/solr.handler.TestReplicationHandler_A0C1A60753A8D026-001/solr-instance-002'
   [junit4]   2> 988256 INFO  (TEST-TestReplicationHandler.doTestDetails-seed#[A0C1A60753A8D026]) [    ] o.a.s.c.SolrResourceLoader JNDI not configured for solr (NoInitialContextEx)
   [junit4]   2> 988256 INFO  (TEST-TestReplicationHandler.doTestDetails-seed#[A0C1A60753A8D026]) [    ] o.a.s.c.SolrResourceLoader solr home defaulted to 'solr/' (could not find system property or JNDI)
   [junit4]   2> 988256 INFO  (TEST-TestReplicationHandler.doTestDetails-seed#[A0C1A60753A8D026]) [    ] o.a.s.c.SolrXmlConfig Loading container configuration from /home/jenkins/workspace/Lucene-Solr-trunk-Linux/solr/build/solr-core/test/J0/temp/solr.handler.TestReplicationHandler_A0C1A60753A8D026-001/solr-instance-002/solr.xml
   [junit4]   2> 988261 INFO  (TEST-TestReplicationHandler.doTestDetails-seed#[A0C1A60753A8D026]) [    ] o.a.s.c.CorePropertiesLocator Config-defined core root directory: /home/jenkins/workspace/Lucene-Solr-trunk-Linux/solr/build/solr-core/test/J0/temp/solr.handler.TestReplicationHandler_A0C1A60753A8D026-001/solr-instance-002/.
   [junit4]   2> 988261 INFO  (TEST-TestReplicationHandler.doTestDetails-seed#[A0C1A60753A8D026]) [    ] o.a.s.c.CoreContainer New CoreContainer 10857425
   [junit4]   2> 988261 INFO  (TEST-TestReplicationHandler.doTestDetails-seed#[A0C1A60753A8D026]) [    ] o.a.s.c.CoreContainer Loading cores into CoreContainer [instanceDir=/home/jenkins/workspace/Lucene-Solr-trunk-Linux/solr/build/solr-core/test/J0/temp/solr.handler.TestReplicationHandler_A0C1A60753A8D026-001/solr-instance-002]
   [junit4]   2> 988261 WARN  (TEST-TestReplicationHandler.doTestDetails-seed#[A0C1A60753A8D026]) [    ] o.a.s.c.CoreContainer Couldn't add files from /home/jenkins/workspace/Lucene-Solr-trunk-Linux/solr/build/solr-core/test/J0/temp/solr.handler.TestReplicationHandler_A0C1A60753A8D026-001/solr-instance-002/lib to classpath: /home/jenkins/workspace/Lucene-Solr-trunk-Linux/solr/build/solr-core/test/J0/temp/solr.handler.TestReplicationHandler_A0C1A60753A8D026-001/solr-instance-002/lib
   [junit4]   2> 988262 INFO  (TEST-TestReplicationHandler.doTestDetails-seed#[A0C1A60753A8D026]) [    ] o.a.s.h.c.HttpShardHandlerFactory created with socketTimeout : 90000,urlScheme : ,connTimeout : 15000,maxConnectionsPerHost : 20,maxConnections : 10000,corePoolSize : 0,maximumPoolSize : 2147483647,maxThreadIdleTime : 5,sizeOfQueue : -1,fairnessPolicy : false,useRetries : false,
   [junit4]   2> 988263 INFO  (TEST-TestReplicationHandler.doTestDetails-seed#[A0C1A60753A8D026]) [    ] o.a.s.u.UpdateShardHandler Creating UpdateShardHandler HTTP client with params: socketTimeout=340000&connTimeout=45000&retry=true
   [junit4]   2> 988264 INFO  (TEST-TestReplicationHandler.doTestDetails-seed#[A0C1A60753A8D026]) [    ] o.a.s.l.LogWatcher SLF4J impl is org.slf4j.impl.Log4jLoggerFactory
   [junit4]   2> 988264 INFO  (TEST-TestReplicationHandler.doTestDetails-seed#[A0C1A60753A8D026]) [    ] o.a.s.l.LogWatcher Registering Log Listener [Log4j (org.slf4j.impl.Log4jLoggerFactory)]
   [junit4]   2> 988264 INFO  (TEST-TestReplicationHandler.doTestDetails-seed#[A0C1A60753A8D026]) [    ] o.a.s.c.CoreContainer Security conf doesn't exist. Skipping setup for authorization module.
   [junit4]   2> 988264 INFO  (TEST-TestReplicationHandler.doTestDetails-seed#[A0C1A60753A8D026]) [    ] o.a.s.c.CoreContainer No authentication plugin used.
   [junit4]   2> 988264 INFO  (TEST-TestReplicationHandler.doTestDetails-seed#[A0C1A60753A8D026]) [    ] o.a.s.c.CorePropertiesLocator Looking for core definitions underneath /home/jenkins/workspace/Lucene-Solr-trunk-Linux/solr/build/solr-core/test/J0/temp/solr.handler.TestReplicationHandler_A0C1A60753A8D026-001/solr-instance-002/.
   [junit4]   2> 988276 INFO  (TEST-TestReplicationHandler.doTestDetails-seed#[A0C1A60753A8D026]) [    ] o.a.s.c.CoreDescriptor Created CoreDescriptor: {name=collection1, config=solrconfig.xml, loadOnStartup=true, schema=schema.xml, configSetProperties=configsetprops.json, transient=false, dataDir=data/}
   [junit4]   2> 988276 INFO  (TEST-TestReplicationHandler.doTestDetails-seed#[A0C1A60753A8D026]) [    ] o.a.s.c.CorePropertiesLocator Found core collection1 in /home/jenkins/workspace/Lucene-Solr-trunk-Linux/solr/build/solr-core/test/J0/temp/solr.handler.TestReplicationHandler_A0C1A60753A8D026-001/solr-instance-002/./collection1
   [junit4]   2> 988276 INFO  (TEST-TestReplicationHandler.doTestDetails-seed#[A0C1A60753A8D026]) [    ] o.a.s.c.CorePropertiesLocator Found 1 core definitions
   [junit4]   2> 988277 INFO  (coreLoadExecutor-3352-thread-1) [    ] o.a.s.c.SolrResourceLoader new SolrResourceLoader for directory: '/home/jenkins/workspace/Lucene-Solr-trunk-Linux/solr/build/solr-core/test/J0/temp/solr.handler.TestReplicationHandler_A0C1A60753A8D026-001/solr-instance-002/collection1'
   [junit4]   2> 988277 INFO  (coreLoadExecutor-3352-thread-1) [    ] o.a.s.c.SolrResourceLoader JNDI not configured for solr (NoInitialContextEx)
   [junit4]   2> 988277 INFO  (TEST-TestReplicationHandler.doTestDetails-seed#[A0C1A60753A8D026]) [    ] o.a.s.s.SolrDispatchFilter user.dir=/home/jenkins/workspace/Lucene-Solr-trunk-Linux/solr/build/solr-core/test/J0
   [junit4]   2> 988278 INFO  (TEST-TestReplicationHandler.doTestDetails-seed#[A0C1A60753A8D026]) [    ] o.a.s.s.SolrDispatchFilter SolrDispatchFilter.init() done
   [junit4]   2> 988277 INFO  (coreLoadExecutor-3352-thread-1) [    ] o.a.s.c.SolrResourceLoader solr home defaulted to 'solr/' (could not find system property or JNDI)
   [junit4]   2> 988284 INFO  (coreLoadExecutor-3352-thread-1) [    ] o.a.s.c.SolrConfig current version of requestparams : -1
   [junit4]   2> 988287 INFO  (coreLoadExecutor-3352-thread-1) [    ] o.a.s.c.SolrConfig Using Lucene MatchVersion: 6.0.0
   [junit4]   2> 988294 INFO  (coreLoadExecutor-3352-thread-1) [    ] o.a.s.c.SolrConfig Loaded SolrConfig: solrconfig.xml
   [junit4]   2> 988297 INFO  (coreLoadExecutor-3352-thread-1) [    ] o.a.s.s.IndexSchema [collection1] Schema name=test
   [junit4]   2> 988300 INFO  (coreLoadExecutor-3352-thread-1) [    ] o.a.s.s.IndexSchema unique key field: id
   [junit4]   2> 988300 INFO  (coreLoadExecutor-3352-thread-1) [    ] o.a.s.c.ConfigSetProperties Did not find ConfigSet properties, assuming default properties: Can't find resource 'configsetprops.json' in classpath or '/home/jenkins/workspace/Lucene-Solr-trunk-Linux/solr/build/solr-core/test/J0/temp/solr.handler.TestReplicationHandler_A0C1A60753A8D026-001/solr-instance-002/collection1'
   [junit4]   2> 988301 INFO  (coreLoadExecutor-3352-thread-1) [    ] o.a.s.c.CoreContainer Creating SolrCore 'collection1' using configuration from instancedir /home/jenkins/workspace/Lucene-Solr-trunk-Linux/solr/build/solr-core/test/J0/temp/solr.handler.TestReplicationHandler_A0C1A60753A8D026-001/solr-instance-002/./collection1
   [junit4]   2> 988301 INFO  (coreLoadExecutor-3352-thread-1) [    x:collection1] o.a.s.c.SolrCore org.apache.solr.core.MockDirectoryFactory
   [junit4]   2> 988301 INFO  (coreLoadExecutor-3352-thread-1) [    x:collection1] o.a.s.c.SolrCore [[collection1] ] Opening new SolrCore at [/home/jenkins/workspace/Lucene-Solr-trunk-Linux/solr/build/solr-core/test/J0/temp/solr.handler.TestReplicationHandler_A0C1A60753A8D026-001/solr-instance-002/collection1], dataDir=[/home/jenkins/workspace/Lucene-Solr-trunk-Linux/solr/build/solr-core/test/J0/temp/solr.handler.TestReplicationHandler_A0C1A60753A8D026-001/solr-instance-002/./collection1/data/]
   [junit4]   2> 988302 INFO  (coreLoadExecutor-3352-thread-1) [    x:collection1] o.a.s.c.SolrCore JMX monitoring not detected for core: collection1
   [junit4]   2> 988311 INFO  (coreLoadExecutor-3352-thread-1) [    x:collection1] o.a.s.c.CachingDirectoryFactory return new directory for /home/jenkins/workspace/Lucene-Solr-trunk-Linux/solr/build/solr-core/test/J0/temp/solr.handler.TestReplicationHandler_A0C1A60753A8D026-001/solr-instance-002/./collection1/data
   [junit4]   2> 988311 INFO  (coreLoadExecutor-3352-thread-1) [    x:collection1] o.a.s.c.SolrCore New index directory detected: old=null new=/home/jenkins/workspace/Lucene-Solr-trunk-Linux/solr/build/solr-core/test/J0/temp/solr.handler.TestReplicationHandler_A0C1A60753A8D026-001/solr-instance-002/./collection1/data/index/
   [junit4]   2> 988311 WARN  (coreLoadExecutor-3352-thread-1) [    x:collection1] o.a.s.c.SolrCore [collection1] Solr index directory '/home/jenkins/workspace/Lucene-Solr-trunk-Linux/solr/build/solr-core/test/J0/temp/solr.handler.TestReplicationHandler_A0C1A60753A8D026-001/solr-instance-002/./collection1/data/index' doesn't exist. Creating new index...
   [junit4]   2> 988312 INFO  (coreLoadExecutor-3352-thread-1) [    x:collection1] o.a.s.c.CachingDirectoryFactory return new directory for /home/jenkins/workspace/Lucene-Solr-trunk-Linux/solr/build/solr-core/test/J0/temp/solr.handler.TestReplicationHandler_A0C1A60753A8D026-001/solr-instance-002/./collection1/data/index
   [junit4]   2> 988312 INFO  (coreLoadExecutor-3352-thread-1) [    x:collection1] o.a.s.u.RandomMergePolicy RandomMergePolicy wrapping class org.apache.lucene.index.TieredMergePolicy: [TieredMergePolicy: maxMergeAtOnce=48, maxMergeAtOnceExplicit=19, maxMergedSegmentMB=17.3310546875, floorSegmentMB=1.2431640625, forceMergeDeletesPctAllowed=26.71590485750143, segmentsPerTier=32.0, maxCFSSegmentSizeMB=8.796093022207999E12, noCFSRatio=0.0
   [junit4]   2> 988313 INFO  (coreLoadExecutor-3352-thread-1) [    x:collection1] o.a.s.c.SolrDeletionPolicy SolrDeletionPolicy.onCommit: commits: num=1
   [junit4]   2> 	commit{dir=MockDirectoryWrapper(RAMDirectory@e42ef2 lockFactory=org.apache.lucene.store.SingleInstanceLockFactory@2bb202),segFN=segments_1,generation=1}
   [junit4]   2> 988313 INFO  (coreLoadExecutor-3352-thread-1) [    x:collection1] o.a.s.c.SolrDeletionPolicy newest commit generation = 1
   [junit4]   2> 988313 INFO  (OldIndexDirectoryCleanupThreadForCore-collection1) [    x:collection1] o.a.s.c.SolrCore Looking for old index directories to cleanup for core collection1 in /home/jenkins/workspace/Lucene-Solr-trunk-Linux/solr/build/solr-core/test/J0/temp/solr.handler.TestReplicationHandler_A0C1A60753A8D026-001/solr-instance-002/./collection1/data/
   [junit4]   2> 988315 INFO  (coreLoadExecutor-3352-thread-1) [    x:collection1] o.a.s.c.SolrCore no updateRequestProcessorChain defined as default, creating implicit default
   [junit4]   2> 988316 INFO  (coreLoadExecutor-3352-thread-1) [    x:collection1] o.a.s.h.l.XMLLoader xsltCacheLifetimeSeconds=60
   [junit4]   2> 988316 INFO  (coreLoadExecutor-3352-thread-1) [    x:collection1] o.a.s.h.l.XMLLoader xsltCacheLifetimeSeconds=60
   [junit4]   2> 988317 INFO  (coreLoadExecutor-3352-thread-1) [    x:collection1] o.a.s.h.l.XMLLoader xsltCacheLifetimeSeconds=60
   [junit4]   2> 988318 INFO  (coreLoadExecutor-3352-thread-1) [    x:collection1] o.a.s.h.l.XMLLoader xsltCacheLifetimeSeconds=60
   [junit4]   2> 988319 INFO  (coreLoadExecutor-3352-thread-1) [    x:collection1] o.a.s.c.PluginBag requestHandler : 'lazy' created with startup=lazy 
   [junit4]   2> 988319 INFO  (coreLoadExecutor-3352-thread-1) [    x:collection1] o.a.s.c.RequestHandlers Registered paths: /admin/mbeans,standard,lazy,/update/json/docs,/admin/luke,/export,/get,/admin/properties,/update/json,/admin/threads,/update/csv,/sql,/admin/segments,/admin/system,/replication,defaults,/config,/stream,/schema,/admin/plugins,/admin/logging,/admin/ping,/update,/admin/file
   [junit4]   2> 988319 INFO  (coreLoadExecutor-3352-thread-1) [    x:collection1] o.a.s.c.SolrCore Using default statsCache cache: org.apache.solr.search.stats.LocalStatsCache
   [junit4]   2> 988319 INFO  (coreLoadExecutor-3352-thread-1) [    x:collection1] o.a.s.u.CommitTracker Hard AutoCommit: disabled
   [junit4]   2> 988319 INFO  (coreLoadExecutor-3352-thread-1) [    x:collection1] o.a.s.u.CommitTracker Soft AutoCommit: disabled
   [junit4]   2> 988320 INFO  (coreLoadExecutor-3352-thread-1) [    x:collection1] o.a.s.u.RandomMergePolicy RandomMergePolicy wrapping class org.apache.lucene.index.TieredMergePolicy: [TieredMergePolicy: maxMergeAtOnce=16, maxMergeAtOnceExplicit=45, maxMergedSegmentMB=65.3876953125, floorSegmentMB=1.1572265625, forceMergeDeletesPctAllowed=14.083846989239952, segmentsPerTier=13.0, maxCFSSegmentSizeMB=8.796093022207999E12, noCFSRatio=0.11039822682950975
   [junit4]   2> 988320 INFO  (coreLoadExecutor-3352-thread-1) [    x:collection1] o.a.s.c.SolrDeletionPolicy SolrDeletionPolicy.onInit: commits: num=1
   [junit4]   2> 	commit{dir=MockDirectoryWrapper(RAMDirectory@e42ef2 lockFactory=org.apache.lucene.store.SingleInstanceLockFactory@2bb202),segFN=segments_1,generation=1}
   [junit4]   2> 988320 INFO  (coreLoadExecutor-3352-thread-1) [    x:collection1] o.a.s.c.SolrDeletionPolicy newest commit generation = 1
   [junit4]   2> 988320 INFO  (coreLoadExecutor-3352-thread-1) [    x:collection1] o.a.s.s.SolrIndexSearcher Opening [Searcher@c5c45a[collection1] main]
   [junit4]   2> 988320 INFO  (coreLoadExecutor-3352-thread-1) [    x:collection1] o.a.s.r.ManagedResourceStorage File-based storage initialized to use dir: /home/jenkins/workspace/Lucene-Solr-trunk-Linux/solr/build/solr-core/test/J0/temp/solr.handler.TestReplicationHandler_A0C1A60753A8D026-001/solr-instance-002/collection1/conf
   [junit4]   2> 988321 INFO  (coreLoadExecutor-3352-thread-1) [    x:collection1] o.a.s.r.RestManager Initializing RestManager with initArgs: {storageDir=/home/jenkins/workspace/Lucene-Solr-trunk-Linux/solr/build/solr-core/test/J0/temp/solr.handler.TestReplicationHandler_A0C1A60753A8D026-001/solr-instance-002/collection1/conf}
   [junit4]   2> 988321 INFO  (coreLoadExecutor-3352-thread-1) [    x:collection1] o.a.s.r.ManagedResourceStorage Reading _rest_managed.json using file:dir=/home/jenkins/workspace/Lucene-Solr-trunk-Linux/solr/build/solr-core/test/J0/temp/solr.handler.TestReplicationHandler_A0C1A60753A8D026-001/solr-instance-002/collection1/conf
   [junit4]   2> 988321 INFO  (coreLoadExecutor-3352-thread-1) [    x:collection1] o.a.s.r.RestManager Initializing 0 registered ManagedResources
   [junit4]   2> 988323 INFO  (coreLoadExecutor-3352-thread-1) [    x:collection1] o.a.s.h.ReplicationHandler Poll scheduled at an interval of 1000ms
   [junit4]   2> 988324 INFO  (searcherExecutor-3353-thread-1-processing-x:collection1) [    x:collection1] o.a.s.c.SolrCore [collection1] Registered new searcher Searcher@c5c45a[collection1] main{ExitableDirectoryReader(UninvertingDirectoryReader())}
   [junit4]   2> 988324 INFO  (coreLoadExecutor-3352-thread-1) [    x:collection1] o.a.s.c.CoreContainer registering core: collection1
   [junit4]   2> 988326 INFO  (qtp13206868-8323) [    x:collection1] o.a.s.c.S.Request [collection1]  webapp=/solr path=/replication params={qt=/replication&wt=javabin&version=2&command=indexversion} status=0 QTime=0
   [junit4]   2> 988780 INFO  (qtp13206868-8324) [    x:collection1] o.a.s.c.S.Request [collection1]  webapp=/solr path=/select params={q=*:*&sort=id+desc&wt=javabin&version=2} hits=0 status=0 QTime=0
   [junit4]   2> 988783 INFO  (qtp13206868-8325) [    x:collection1] o.a.s.c.S.Request [collection1]  webapp=/solr path=/replication params={_trace=getDetails&qt=/replication&wt=javabin&version=2&command=details} status=0 QTime=0
   [junit4]   2> 988789 INFO  (qtp13206868-8323) [    x:collection1] o.a.s.c.S.Request [collection1]  webapp=/solr path=/replication params={slave=false&qt=/replication&wt=javabin&version=2&command=details} status=0 QTime=0
   [junit4]   2> 988789 INFO  (qtp26137925-8341) [    x:collection1] o.a.s.c.S.Request [collection1]  webapp=/solr path=/replication params={_trace=getDetails&qt=/replication&wt=javabin&version=2&command=details} status=0 QTime=3
   [junit4]   2> 988793 INFO  (qtp13206868-8324) [    x:collection1] o.a.s.u.p.LogUpdateProcessorFactory [collection1]  webapp=/solr path=/update params={wt=javabin&version=2}{add=[0]} 0 1
   [junit4]   2> 988796 INFO  (qtp13206868-8325) [    x:collection1] o.a.s.u.DirectUpdateHandler2 start commit{,optimize=false,openSearcher=true,waitSearcher=true,expungeDeletes=false,softCommit=false,prepareCommit=false}
   [junit4]   2> 988798 INFO  (qtp13206868-8325) [    x:collection1] o.a.s.c.SolrDeletionPolicy SolrDeletionPolicy.onCommit: commits: num=2
   [junit4]   2> 	commit{dir=MockDirectoryWrapper(RAMDirectory@b923fe lockFactory=org.apache.lucene.store.SingleInstanceLockFactory@c3055c),segFN=segments_1,generation=1}
   [junit4]   2> 	commit{dir=MockDirectoryWrapper(RAMDirectory@b923fe lockFactory=org.apache.lucene.store.SingleInstanceLockFactory@c3055c),segFN=segments_2,generation=2}
   [junit4]   2> 988798 INFO  (qtp13206868-8325) [    x:collection1] o.a.s.c.SolrDeletionPolicy newest commit generation = 2
   [junit4]   2> 988800 INFO  (qtp13206868-8325) [    x:collection1] o.a.s.s.SolrIndexSearcher Opening [Searcher@145ec36[collection1] main]
   [junit4]   2> 988800 INFO  (qtp13206868-8325) [    x:collection1] o.a.s.u.DirectUpdateHandler2 end_commit_flush
   [junit4]   2> 988800 INFO  (searcherExecutor-3343-thread-1-processing-x:collection1) [    x:collection1] o.a.s.c.SolrCore [collection1] Registered new searcher Searcher@145ec36[collection1] main{ExitableDirectoryReader(UninvertingDirectoryReader(Uninverting(_0(6.0.0):C1)))}
   [junit4]   2> 988800 INFO  (qtp13206868-8325) [    x:collection1] o.a.s.u.p.LogUpdateProcessorFactory [collection1]  webapp=/solr path=/update params={waitSearcher=true&commit=true&softCommit=false&wt=javabin&version=2}{commit=} 0 4
   [junit4]   2> 988802 WARN  (explicit-fetchindex-cmd) [    x:collection1] o.a.s.h.IndexFetcher 'masterUrl' must be specified without the /replication suffix
   [junit4]   2> 988805 INFO  (qtp13206868-8323) [    x:collection1] o.a.s.c.S.Request [collection1]  webapp=/solr path=/replication params={qt=/replication&wt=javabin&version=2&command=indexversion} status=0 QTime=0
   [junit4]   2> 988806 INFO  (explicit-fetchindex-cmd) [    x:collection1] o.a.s.h.IndexFetcher Master's generation: 2
   [junit4]   2> 988806 INFO  (explicit-fetchindex-cmd) [    x:collection1] o.a.s.h.IndexFetcher Slave's generation: 1
   [junit4]   2> 988806 INFO  (explicit-fetchindex-cmd) [    x:collection1] o.a.s.h.IndexFetcher Starting replication process
   [junit4]   2> 988810 INFO  (qtp13206868-8324) [    x:collection1] o.a.s.c.S.Request [collection1]  webapp=/solr path=/replication params={generation=2&qt=/replication&wt=javabin&version=2&command=filelist} status=0 QTime=2
   [junit4]   2> 988810 INFO  (explicit-fetchindex-cmd) [    x:collection1] o.a.s.h.IndexFetcher Number of files in latest index in master: 10
   [junit4]   2> 988811 INFO  (explicit-fetchindex-cmd) [    x:collection1] o.a.s.c.CachingDirectoryFactory return new directory for /home/jenkins/workspace/Lucene-Solr-trunk-Linux/solr/build/solr-core/test/J0/temp/solr.handler.TestReplicationHandler_A0C1A60753A8D026-001/solr-instance-002/./collection1/data/index.20160211000509352
   [junit4]   2> 988811 INFO  (explicit-fetchindex-cmd) [    x:collection1] o.a.s.u.DefaultSolrCoreState Rollback old IndexWriter... core=collection1
   [junit4]   2> 988812 INFO  (explicit-fetchindex-cmd) [    x:collection1] o.a.s.u.RandomMergePolicy RandomMergePolicy wrapping class org.apache.lucene.index.TieredMergePolicy: [TieredMergePolicy: maxMergeAtOnce=28, maxMergeAtOnceExplicit=25, maxMergedSegmentMB=10.9892578125, floorSegmentMB=1.548828125, forceMergeDeletesPctAllowed=5.19947274020769, segmentsPerTier=32.0, maxCFSSegmentSizeMB=8.796093022207999E12, noCFSRatio=0.5191734116337807
   [junit4]   2> 988813 INFO  (explicit-fetchindex-cmd) [    x:collection1] o.a.s.c.SolrDeletionPolicy SolrDeletionPolicy.onInit: commits: num=1
   [junit4]   2> 	commit{dir=MockDirectoryWrapper(RAMDirectory@e42ef2 lockFactory=org.apache.lucene.store.SingleInstanceLockFactory@2bb202),segFN=segments_1,generation=1}
   [junit4]   2> 988813 INFO  (explicit-fetchindex-cmd) [    x:collection1] o.a.s.c.SolrDeletionPolicy newest commit generation = 1
   [junit4]   2> 988813 INFO  (explicit-fetchindex-cmd) [    x:collection1] o.a.s.u.DefaultSolrCoreState New IndexWriter is ready to be used.
   [junit4]   2> 988813 INFO  (explicit-fetchindex-cmd) [    x:collection1] o.a.s.c.SolrDeletionPolicy SolrDeletionPolicy.onCommit: commits: num=1
   [junit4]   2> 	commit{dir=MockDirectoryWrapper(RAMDirectory@e42ef2 lockFactory=org.apache.lucene.store.SingleInstanceLockFactory@2bb202),segFN=segments_1,generation=1}
   [junit4]   2> 988813 INFO  (explicit-fetchindex-cmd) [    x:collection1] o.a.s.c.SolrDeletionPolicy newest commit generation = 1
   [junit4]   2> 988813 INFO  (explicit-fetchindex-cmd) [    x:collection1] o.a.s.u.DefaultSolrCoreState Rollback old IndexWriter... core=collection1
   [junit4]   2> 988814 INFO  (explicit-fetchindex-cmd) [    x:collection1] o.a.s.h.IndexFetcher Starting download (fullCopy=false) to MockDirectoryWrapper(MMapDirectory@/home/jenkins/workspace/Lucene-Solr-trunk-Linux/solr/build/solr-core/test/J0/temp/solr.handler.TestReplicationHandler_A0C1A60753A8D026-001/index-MMapDirectory-003 lockFactory=org.apache.lucene.store.NativeFSLockFactory@16cc75f)
   [junit4]   2> 988816 INFO  (qtp13206868-8325) [    x:collection1] o.a.s.c.S.Request [collection1]  webapp=/solr path=/replication params={generation=2&qt=/replication&file=_0.si&checksum=true&wt=filestream&command=filecontent} status=0 QTime=0
   [junit4]   2> 988819 INFO  (qtp13206868-8323) [    x:collection1] o.a.s.c.S.Request [collection1]  webapp=/solr path=/replication params={generation=2&qt=/replication&file=_0.nvd&checksum=true&wt=filestream&command=filecontent} status=0 QTime=0
   [junit4]   2> 988823 INFO  (qtp13206868-8324) [    x:collection1] o.a.s.c.S.Request [collection1]  webapp=/solr path=/replication params={generation=2&qt=/replication&file=_0.fdx&checksum=true&wt=filestream&command=filecontent} status=0 QTime=0
   [junit4]   2> 988832 INFO  (qtp13206868-8325) [    x:collection1] o.a.s.c.S.Request [collection1]  webapp=/solr path=/replication params={generation=2&qt=/replication&file=_0_Asserting_0.doc&checksum=true&wt=filestream&command=filecontent} status=0 QTime=0
   [junit4]   2> 988839 INFO  (qtp13206868-8323) [    x:collection1] o.a.s.c.S.Request [collection1]  webapp=/solr path=/replication params={generation=2&qt=/replication&file=_0_Asserting_0.tim&checksum=true&wt=filestream&command=filecontent} status=0 QTime=0
   [junit4]   2> 988842 INFO  (qtp13206868-8324) [    x:collection1] o.a.s.c.S.Request [collection1]  webapp=/solr path=/replication params={generation=2&qt=/replication&file=_0.fdt&checksum=true&wt=filestream&command=filecontent} status=0 QTime=0
   [junit4]   2> 988983 INFO  (qtp13206868-8325) [    x:collection1] o.a.s.c.S.Request [collection1]  webapp=/solr path=/replication params={generation=2&qt=/replication&file=_0_Asserting_0.tip&checksum=true&wt=filestream&command=filecontent} status=0 QTime=0
   [junit4]   2> 988987 INFO  (qtp13206868-8323) [    x:collection1] o.a.s.c.S.Request [collection1]  webapp=/solr path=/replication params={generation=2&qt=/replication&file=_0.fnm&checksum=true&wt=filestream&command=filecontent} status=0 QTime=0
   [junit4]   2> 988991 INFO  (qtp13206868-8324) [    x:collection1] o.a.s.c.S.Request [collection1]  webapp=/solr path=/replication params={generation=2&qt=/replication&file=_0.nvm&checksum=true&wt=filestream&command=filecontent} status=0 QTime=0
   [junit4]   2> 988995 INFO  (qtp13206868-8325) [    x:collection1] o.a.s.c.S.Request [collection1]  webapp=/solr path=/replication params={generation=2&qt=/replication&file=segments_2&checksum=true&wt=filestream&command=filecontent} status=0 QTime=0
   [junit4]   2> 988998 INFO  (explicit-fetchindex-cmd) [    x:collection1] o.a.s.h.IndexFetcher Total time taken for download (fullCopy=false,bytesDownloaded=1636) : 0 secs (null bytes/sec) to MockDirectoryWrapper(MMapDirectory@/home/jenkins/workspace/Lucene-Solr-trunk-Linux/solr/build/solr-core/test/J0/temp/solr.handler.TestReplicationHandler_A0C1A60753A8D026-001/index-MMapDirectory-003 lockFactory=org.apache.lucene.store.NativeFSLockFactory@16cc75f)
   [junit4]   2> 989013 INFO  (explicit-fetchindex-cmd) [    x:collection1] o.a.s.u.RandomMergePolicy RandomMergePolicy wrapping class org.apache.lucene.index.TieredMergePolicy: [TieredMergePolicy: maxMergeAtOnce=16, maxMergeAtOnceExplicit=28, maxMergedSegmentMB=3.6376953125, floorSegmentMB=1.2470703125, forceMergeDeletesPctAllowed=13.405923610420734, segmentsPerTier=28.0, maxCFSSegmentSizeMB=8.796093022207999E12, noCFSRatio=0.0
   [junit4]   2> 989014 INFO  (explicit-fetchindex-cmd) [    x:collection1] o.a.s.c.SolrDeletionPolicy SolrDeletionPolicy.onInit: commits: num=2
   [junit4]   2> 	commit{dir=MockDirectoryWrapper(RAMDirectory@e42ef2 lockFactory=org.apache.lucene.store.SingleInstanceLockFactory@2bb202),segFN=segments_1,generation=1}
   [junit4]   2> 	commit{dir=MockDirectoryWrapper(RAMDirectory@e42ef2 lockFactory=org.apache.lucene.store.SingleInstanceLockFactory@2bb202),segFN=segments_2,generation=2}
   [junit4]   2> 989014 INFO  (explicit-fetchindex-cmd) [    x:collection1] o.a.s.c.SolrDeletionPolicy newest commit generation = 2
   [junit4]   2> 989015 INFO  (explicit-fetchindex-cmd) [    x:collection1] o.a.s.u.DefaultSolrCoreState New IndexWriter is ready to be used.
   [junit4]   2> 989016 INFO  (explicit-fetchindex-cmd) [    x:collection1] o.a.s.s.SolrIndexSearcher Opening [Searcher@d67180[collection1] main]
   [junit4]   2> 989016 INFO  (searcherExecutor-3353-thread-1-processing-x:collection1) [    x:collection1] o.a.s.c.SolrCore [collection1] Registered new searcher Searcher@d67180[collection1] main{ExitableDirectoryReader(UninvertingDirectoryReader(Uninverting(_0(6.0.0):C1)))}
   [junit4]   2> 989017 INFO  (explicit-fetchindex-cmd) [    x:collection1] o.a.s.c.CachingDirectoryFactory looking to close /home/jenkins/workspace/Lucene-Solr-trunk-Linux/solr/build/solr-core/test/J0/temp/solr.handler.TestReplicationHandler_A0C1A60753A8D026-001/solr-instance-002/./collection1/data/index.20160211000509352 [CachedDir<<refCount=0;path=/home/jenkins/workspace/Lucene-Solr-trunk-Linux/solr/build/solr-core/test/J0/temp/solr.handler.TestReplicationHandler_A0C1A60753A8D026-001/solr-instance-002/./collection1/data/index.20160211000509352;done=true>>]
   [junit4]   2> 989017 INFO  (explicit-fetchindex-cmd) [    x:collection1] o.a.s.c.CachingDirectoryFactory Closing directory: /home/jenkins/workspace/Lucene-Solr-trunk-Linux/solr/build/solr-core/test/J0/temp/solr.handler.TestReplicationHandler_A0C1A60753A8D026-001/solr-instance-002/./collection1/data/index.20160211000509352
   [junit4]   2> 989017 INFO  (qtp26137925-8342) [    x:collection1] o.a.s.c.S.Request [collection1]  webapp=/solr path=/replication params={wait=true&masterUrl=http://127.0.0.1:45475/solr/collection1/replication&command=fetchindex} status=0 QTime=215
   [junit4]   2> 989023 INFO  (qtp13206868-8323) [    x:collection1] o.a.s.c.S.Request [collection1]  webapp=/solr path=/replication params={slave=false&qt=/replication&wt=javabin&version=2&command=details} status=0 QTime=0
   [junit4]   2> 989024 INFO  (qtp26137925-8343) [    x:collection1] o.a.s.c.S.Request [collection1]  webapp=/solr path=/replication params={_trace=getDetails&qt=/replication&wt=javabin&version=2&command=details} status=0 QTime=4
   [junit4]   2> 989028 INFO  (qtp13206868-8324) [    x:collection1] o.a.s.u.p.LogUpdateProcessorFactory [collection1]  webapp=/solr path=/update params={wt=javabin&version=2}{add=[1]} 0 1
   [junit4]   2> 989030 INFO  (qtp13206868-8325) [    x:collection1] o.a.s.u.DirectUpdateHandler2 start commit{,optimize=false,openSearcher=true,waitSearcher=true,expungeDeletes=false,softCommit=false,prepareCommit=false}
   [junit4]   2> 989034 INFO  (qtp13206868-8325) [    x:collection1] o.a.s.c.SolrDeletionPolicy SolrDeletionPolicy.onCommit: commits: num=3
   [junit4]   2> 	commit{dir=MockDirectoryWrapper(RAMDirectory@b923fe lockFactory=org.apache.lucene.store.SingleInstanceLockFactory@c3055c),segFN=segments_1,generation=1}
   [junit4]   2> 	commit{dir=MockDirectoryWrapper(RAMDirectory@b923fe lockFactory=org.apache.lucene.store.SingleInstanceLockFactory@c3055c),segFN=segments_2,generation=2}
   [junit4]   2> 	commit{dir=MockDirectoryWrapper(RAMDirectory@b923fe lockFactory=org.apache.lucene.store.SingleInstanceLockFactory@c3055c),segFN=segments_3,generation=3}
   [junit4]   2> 989034 INFO  (qtp13206868-8325) [    x:collection1] o.a.s.c.SolrDeletionPolicy newest commit generation = 3
   [junit4]   2> 989035 INFO  (qtp13206868-8325) [    x:collection1] o.a.s.s.SolrIndexSearcher Opening [Searcher@1e31840[collection1] main]
   [junit4]   2> 989035 INFO  (qtp13206868-8325) [    x:collection1] o.a.s.u.DirectUpdateHandler2 end_commit_flush
   [junit4]   2> 989035 INFO  (searcherExecutor-3343-thread-1-processing-x:collection1) [    x:collection1] o.a.s.c.SolrCore [collection1] Registered new searcher Searcher@1e31840[collection1] main{ExitableDirectoryReader(UninvertingDirectoryReader(Uninverting(_0(6.0.0):C1) Uninverting(_1(6.0.0):C1)))}
   [junit4]   2> 989035 INFO  (qtp13206868-8325) [    x:collection1] o.a.s.u.p.LogUpdateProcessorFactory [collection1]  webapp=/solr path=/update params={waitSearcher=true&commit=true&softCommit=false&wt=javabin&version=2}{commit=} 0 5
   [junit4]   2> 989036 WARN  (explicit-fetchindex-cmd) [    x:collection1] o.a.s.h.IndexFetcher 'masterUrl' must be specified without the /replication suffix
   [junit4]   2> 989040 INFO  (qtp13206868-8323) [    x:collection1] o.a.s.c.S.Request [collection1]  webapp=/solr path=/replication params={qt=/replication&wt=javabin&version=2&command=indexversion} status=0 QTime=0
   [junit4]   2> 989040 INFO  (explicit-fetchindex-cmd) [    x:collection1] o.a.s.h.IndexFetcher Master's generation: 3
   [junit4]   2> 989040 INFO  (explicit-fetchindex-cmd) [    x:collection1] o.a.s.h.IndexFetcher Slave's generation: 2
   [junit4]   2> 989040 INFO  (explicit-fetchindex-cmd) [    x:collection1] o.a.s.h.IndexFetcher Starting replication process
   [junit4]   2> 989043 INFO  (qtp13206868-8324) [    x:collection1] o.a.s.c.S.Request [collection1]  webapp=/solr path=/replication params={generation=3&qt=/replication&wt=javabin&version=2&command=filelist} status=0 QTime=1
   [junit4]   2> 989044 INFO  (explicit-fetchindex-cmd) [    x:collection1] o.a.s.h.IndexFetcher Number of files in latest index in master: 19
   [junit4]   2> 989045 INFO  (explicit-fetchindex-cmd) [    x:collection1] o.a.s.c.CachingDirectoryFactory return new directory for /home/jenkins/workspace/Lucene-Solr-trunk-Linux/solr/build/solr-core/test/J0/temp/solr.handler.TestReplicationHandler_A0C1A60753A8D026-001/solr-instance-002/./collection1/data/index.20160211000509586
   [junit4]   2> 989046 INFO  (explicit-fetchindex-cmd) [    x:collection1] o.a.s.u.DefaultSolrCoreState Rollback old IndexWriter... core=collection1
   [junit4]   2> 989047 INFO  (explicit-fetchindex-cmd) [    x:collection1] o.a.s.u.RandomMergePolicy RandomMergePolicy wrapping class org.apache.lucene.index.TieredMergePolicy: [TieredMergePolicy: maxMergeAtOnce=28, maxMergeAtOnceExplicit=25, maxMergedSegmentMB=10.9892578125, floorSegmentMB=1.548828125, forceMergeDeletesPctAllowed=5.19947274020769, segmentsPerTier=32.0, maxCFSSegmentSizeMB=8.796093022207999E12, noCFSRatio=0.5191734116337807
   [junit4]   2> 989048 INFO  (explicit-fetchindex-cmd) [    x:collection1] o.a.s.c.SolrDeletionPolicy SolrDeletionPolicy.onInit: commits: num=1
   [junit4]   2> 	commit{dir=MockDirectoryWrapper(RAMDirectory@e42ef2 lockFactory=org.apache.lucene.store.SingleInstanceLockFactory@2bb202),segFN=segments_2,generation=2}
   [junit4]   2> 989048 INFO  (explicit-fetchindex-cmd) [    x:collection1] o.a.s.c.SolrDeletionPolicy newest commit generation = 2
   [junit4]   2> 989049 INFO  (explicit-fetchindex-cmd) [    x:collection1] o.a.s.u.DefaultSolrCoreState New IndexWriter is ready to be used.
   [junit4]   2> 989049 INFO  (explicit-fetchindex-cmd) [    x:collection1] o.a.s.c.SolrDeletionPolicy SolrDeletionPolicy.onCommit: commits: num=1
   [junit4]   2> 	commit{dir=MockDirectoryWrapper(RAMDirectory@e42ef2 lockFactory=org.apache.lucene.store.SingleInstanceLockFactory@2bb202),segFN=segments_2,generation=2}
   [junit4]   2> 989049 INFO  (explicit-fetchindex-cmd) [    x:collection1] o.a.s.c.SolrDeletionPolicy newest commit generation = 2
   [junit4]   2> 989049 INFO  (explicit-fetchindex-cmd) [    x:collection1] o.a.s.u.DefaultSolrCoreState Rollback old IndexWriter... core=collection1
   [junit4]   2> 989049 INFO  (explicit-fetchindex-cmd) [    x:collection1] o.a.s.h.IndexFetcher Starting download (fullCopy=false) to MockDirectoryWrapper(MMapDirectory@/home/jenkins/workspace/Lucene-Solr-trunk-Linux/solr/build/solr-core/test/J0/temp/solr.handler.TestReplicationHandler_A0C1A60753A8D026-001/index-MMapDirectory-004 lockFactory=org.apache.lucene.store.NativeFSLockFactory@16cc75f)
   [junit4]   2> 989050 INFO  (explicit-fetchindex-cmd) [    x:collection1] o.a.s.h.IndexFetcher Skipping download for _0.si because it already exists
   [junit4]   2> 989050 INFO  (explicit-fetchindex-cmd) [    x:collection1] o.a.s.h.IndexFetcher Skipping download for _0.nvd because it already exists
   [junit4]   2> 989050 INFO  (explicit-fetchindex-cmd) [    x:collection1] o.a.s.h.IndexFetcher Skipping download for _0.fdx because it already exists
   [junit4]   2> 989050 INFO  (explicit-fetchindex-cmd) [    x:collection1] o.a.s.h.IndexFetcher Skipping download for _0_Asserting_0.doc because it already exists
   [junit4]   2> 989050 INFO  (explicit-fetchindex-cmd) [    x:collection1] o.a.s.h.IndexFetcher Skipping download for _0_Asserting_0.tim because it already exists
   [junit4]   2> 989050 INFO  (explicit-fetchindex-cmd) [    x:collection1] o.a.s.h.IndexFetcher Skipping download for _0.fdt because it already exists
   [junit4]   2> 989050 INFO  (explicit-fetchindex-cmd) [    x:collection1] o.a.s.h.IndexFetcher Skipping download for _0_Asserting_0.tip because it already exists
   [junit4]   2> 989050 INFO  (explicit-fetchindex-cmd) [    x:collection1] o.a.s.h.IndexFetcher Skipping download for _0.fnm because it already exists
   [junit4]   2> 989050 INFO  (explicit-fetchindex-cmd) [    x:collection1] o.a.s.h.IndexFetcher Skipping download for _0.nvm because it already exists
   [junit4]   2> 989054 INFO  (qtp13206868-8325) [    x:collection1] o.a.s.c.S.Request [collection1]  webapp=/solr path=/replication params={generation=3&qt=/replication&file=_1_Asserting_0.tip&checksum=true&wt=filestream&command=filecontent} status=0 QTime=0
   [junit4]   2> 989058 INFO  (qtp13206868-8323) [    x:collection1] o.a.s.c.S.Request [collection1]  webapp=/solr path=/replication params={generation=3&qt=/replication&file=_1.si&checksum=true&wt=filestream&command=filecontent} status=0 QTime=0
   [junit4]   2> 989066 INFO  (qtp13206868-8324) [    x:collection1] o.a.s.c.S.Request [collection1]  webapp=/solr path=/replication params={generation=3&qt=/replication&file=_1.nvd&checksum=true&wt=filestream&command=filecontent} status=0 QTime=0
   [junit4]   2> 989070 INFO  (qtp13206868-8325) [    x:collection1] o.a.s.c.S.Request [collection1]  webapp=/solr path=/replication params={generation=3&qt=/replication&file=_1_Asserting_0.doc&checksum=true&wt=filestream&command=filecontent} status=0 QTime=0
   [junit4]   2> 989073 INFO  (qtp13206868-8323) [    x:collection1] o.a.s.c.S.Request [collection1]  webapp=/solr path=/replication params={generation=3&qt=/replication&file=_1_Asserting_0.tim&checksum=true&wt=filestream&command=filecontent} status=0 QTime=0
   [junit4]   2> 989076 INFO  (qtp13206868-8324) [    x:collection1] o.a.s.c.S.Request [collection1]  webapp=/solr path=/replication params={generation=3&qt=/replication&file=_1.fdx&checksum=true&wt=filestream&command=filecontent} status=0 QTime=0
   [junit4]   2> 989079 INFO  (qtp13206868-8325) [    x:collection1] o.a.s.c.S.Request [collection1]  webapp=/solr path=/replication params={generation=3&qt=/replication&file=_1.fnm&checksum=true&wt=filestream&command=filecontent} status=0 QTime=0
   [junit4]   2> 989081 INFO  (qtp13206868-8323) [    x:collection1] o.a.s.c.S.Request [collection1]  webapp=/solr path=/replication params={generation=3&qt=/replication&file=_1.nvm&checksum=true&wt=filestream&command=filecontent} status=0 QTime=0
   [junit4]   2> 989084 INFO  (qtp13206868-8324) [    x:collection1] o.a.s.c.S.Request [collection1]  webapp=/solr path=/replication params={generation=3&qt=/replication&file=_1.fdt&checksum=true&wt=filestream&command=filecontent} status=0 QTime=0
   [junit4]   2> 989088 INFO  (qtp13206868-8325) [    x:collection1] o.a.s.c.S.Request [collection1]  webapp=/solr path=/replication params={generation=3&qt=/replication&file=segments_3&checksum=true&wt=filestream&command=filecontent} status=0 QTime=0
   [junit4]   2> 989089 INFO  (explicit-fetchindex-cmd) [    x:collection1] o.a.s.h.IndexFetcher Total time taken for download (fullCopy=false,bytesDownloaded=1699) : 0 secs (null bytes/sec) to MockDirectoryWrapper(MMapDirectory@/home/jenkins/workspace/Lucene-Solr-trunk-Linux/solr/build/solr-core/test/J0/temp/solr.handler.TestReplicationHandler_A0C1A60753A8D026-001/index-MMapDirectory-004 lockFactory=org.apache.lucene.store.NativeFSLockFactory@16cc75f)
   [junit4]   2> 989108 INFO  (explicit-fetchindex-cmd) [    x:collection1] o.a.s.u.RandomMergePolicy RandomMergePolicy wrapping class org.apache.lucene.index.TieredMergePolicy: [TieredMergePolicy: maxMergeAtOnce=16, maxMergeAtOnceExplicit=28, maxMergedSegmentMB=3.6376953125, floorSegmentMB=1.2470703125, forceMergeDeletesPctAllowed=13.405923610420734, segmentsPerTier=28.0, maxCFSSegmentSizeMB=8.796093022207999E12, noCFSRatio=0.0
   [junit4]   2> 989109 INFO  (explicit-fetchindex-cmd) [    x:collection1] o.a.s.c.SolrDeletionPolicy SolrDeletionPolicy.onInit: commits: num=2
   [junit4]   2> 	commit{dir=MockDirectoryWrapper(RAMDirectory@e42ef2 lockFactory=org.apache.lucene.store.SingleInstanceLockFactory@2bb202),segFN=segments_2,generation=2}
   [junit4]   2> 	commit{dir=MockDirectoryWrapper(RAMDirectory@e42ef2 lockFactory=org.apache.lucene.store.SingleInstanceLockFactory@2bb202),segFN=segments_3,generation=3}
   [junit4]   2> 989109 INFO  (explicit-fetchindex-cmd) [    x:collection1] o.a.s.c.SolrDeletionPolicy newest commit generation = 3
   [junit4]   2> 989110 INFO  (explicit-fetchindex-cmd) [    x:collection1] o.a.s.u.DefaultSolrCoreState New IndexWriter is ready to be used.
   [junit4]   2> 989111 INFO  (explicit-fetchindex-cmd) [    x:collection1] o.a.s.s.SolrIndexSearcher Opening [Searcher@15600e0[collection1] main]
   [junit4]   2> 989111 INFO  (searcherExecutor-3353-thread-1-processing-x:collection1) [    x:collection1] o.a.s.c.SolrCore [collection1] Registered new searcher Searcher@15600e0[collection1] main{ExitableDirectoryReader(UninvertingDirectoryReader(Uninverting(_0(6.0.0):C1) Uninverting(_1(6.0.0):C1)))}
   [junit4]   2> 989112 INFO  (explicit-fetchindex-cmd) [    x:collection1] o.a.s.c.CachingDirectoryFactory looking to close /home/jenkins/workspace/Lucene-Solr-trunk-Linux/solr/build/solr-core/test/J0/temp/solr.handler.TestReplicationHandler_A0C1A60753A8D026-001/solr-instance-002/./collection1/data/index.20160211000509586 [CachedDir<<refCount=0;path=/home/jenkins/workspace/Lucene-Solr-trunk-Linux/solr/build/solr-core/test/J0/temp/solr.handler.TestReplicationHandler_A0C1A60753A8D026-001/solr-instance-002/./collection1/data/index.20160211000509586;done=true>>]
   [junit4]   2> 989112 INFO  (explicit-fetchindex-cmd) [    x:collection1] o.a.s.c.CachingDirectoryFactory Closing directory: /home/jenkins/workspace/Lucene-Solr-trunk-Linux/solr/build/solr-core/test/J0/temp/solr.handler.TestReplicationHandler_A0C1A60753A8D026-001/solr-instance-002/./collection1/data/index.20160211000509586
   [junit4]   2> 989112 INFO  (qtp26137925-8341) [    x:collection1] o.a.s.c.S.Request [collection1]  webapp=/solr path=/replication params={wait=true&masterUrl=http://127.0.0.1:45475/solr/collection1/replication&command=fetchindex} status=0 QTime=75
   [junit4]   2> 989117 INFO  (qtp13206868-8323) [    x:collection1] o.a.s.c.S.Request [collection1]  webapp=/solr path=/replication params={slave=false&qt=/replication&wt=javabin&version=2&command=details} status=0 QTime=0
   [junit4]   2> 989118 INFO  (qtp26137925-8342) [    x:collection1] o.a.s.c.S.Request [collection1]  webapp=/solr path=/replication params={_trace=getDetails&qt=/replication&wt=javabin&version=2&command=details} status=0 QTime=4
   [junit4]   2> 989122 INFO  (qtp13206868-8324) [    x:collection1] o.a.s.u.p.LogUpdateProcessorFactory [collection1]  webapp=/solr path=/update params={wt=javabin&version=2}{add=[2]} 0 0
   [junit4]   2> 989124 INFO  (qtp13206868-8325) [    x:collection1] o.a.s.u.DirectUpdateHandler2 start commit{,optimize=false,openSearcher=true,waitSearcher=true,expungeDeletes=false,softCommit=false,prepareCommit=false}
   [junit4]   2> 989127 INFO  (qtp13206868-8325) [    x:collection1] o.a.s.c.SolrDeletionPolicy SolrDeletionPolicy.onCommit: commits: num=4
   [junit4]   2> 	commit{dir=MockDirectoryWrapper(RAMDirectory@b923fe lockFactory=org.apache.lucene.store.SingleInstanceLockFactory@c3055c),segFN=segments_1,generation=1}
   [junit4]   2> 	commit{dir=MockDirectoryWrapper(RAMDirectory@b923fe lockFactory=org.apache.lucene.store.SingleInstanceLockFactory@c3055c),segFN=segments_2,generation=2}
   [junit4]   2> 	commit{dir=MockDirectoryWrapper(RAMDirectory@b923fe lockFactory=org.apache.lucene.store.SingleInstanceLockFactory@c3055c),segFN=segments_3,generation=3}
   [junit4]   2> 	commit{dir=MockDirectoryWrapper(RAMDirectory@b923fe lockFactory=org.apache.lucene.store.SingleInstanceLockFactory@c3055c),segFN=segments_4,generation=4}
   [junit4]   2> 989127 INFO  (qtp13206868-8325) [    x:collection1] o.a.s.c.SolrDeletionPolicy newest commit generation = 4
   [junit4]   2> 989127 INFO  (qtp13206868-8325) [    x:collection1] o.a.s.s.SolrIndexSearcher Opening [Searcher@1ef8e8f[collection1] main]
   [junit4]   2> 989127 INFO  (qtp13206868-8325) [    x:collection1] o.a.s.u.DirectUpdateHandler2 end_commit_flush
   [junit4]   2> 989127 INFO  (searcherExecutor-3343-thread-1-processing-x:collection1) [    x:collection1] o.a.s.c.SolrCore [collection1] Registered new searcher Searcher@1ef8e8f[collection1] main{ExitableDirectoryReader(UninvertingDirectoryReader(Uninverting(_0(6.0.0):C1) Uninverting(_1(6.0.0):C1) Uninverting(_2(6.0.0):C1)))}
   [junit4]   2> 989128 INFO  (qtp13206868-8325) [    x:collection1] o.a.s.u.p.LogUpdateProcessorFactory [collection1]  webapp=/solr path=/update params={waitSearcher=true&commit=true&softCommit=false&wt=javabin&version=2}{commit=} 0 3
   [junit4]   2> 989129 WARN  (explicit-fetchindex-cmd) [    x:collection1] o.a.s.h.IndexFetcher 'masterUrl' must be specified without the /replication suffix
   [junit4]   2> 989132 INFO  (qtp13206868-8323) [    x:collection1] o.a.s.c.S.Request [collection1]  webapp=/solr path=/replication params={qt=/replication&wt=javabin&version=2&command=indexversion} status=0 QTime=0
   [junit4]   2> 989132 INFO  (explicit-fetchindex-cmd) [    x:collection1] o.a.s.h.IndexFetcher Master's generation: 4
   [junit4]   2> 989132 INFO  (explicit-fetchindex-cmd) [    x:collection1] o.a.s.h.IndexFetcher Slave's generation: 3
   [junit4]   2> 989132 INFO  (explicit-fetchindex-cmd) [    x:collection1] o.a.s.h.IndexFetcher Starting replication process
   [junit4]   2> 989136 INFO  (qtp13206868-8324) [    x:collection1] o.a.s.c.S.Request [collection1]  webapp=/solr path=/replication params={generation=4&qt=/replication&wt=javabin&version=2&command=filelist} status=0 QTime=1
   [junit4]   2> 989136 INFO  (explicit-fetchindex-cmd) [    x:collection1] o.a.s.h.IndexFetcher Number of files in latest index in master: 28
   [junit4]   2> 989137 INFO  (explicit-fetchindex-cmd) [    x:collection1] o.a.s.c.CachingDirectoryFactory return new directory for /home/jenkins/workspace/Lucene-Solr-trunk-Linux/solr/build/solr-core/test/J0/temp/solr.handler.TestReplicationHandler_A0C1A60753A8D026-001/solr-instance-002/./collection1/data/index.20160211000509678
   [junit4]   2> 989138 INFO  (explicit-fetchindex-cmd) [    x:collection1] o.a.s.u.DefaultSolrCoreState Rollback old IndexWriter... core=collection1
   [junit4]   2> 989138 INFO  (explicit-fetchindex-cmd) [    x:collection1] o.a.s.u.RandomMergePolicy RandomMergePolicy wrapping class org.apache.lucene.index.TieredMergePolicy: [TieredMergePolicy: maxMergeAtOnce=28, maxMergeAtOnceExplicit=25, maxMergedSegmentMB=10.9892578125, floorSegmentMB=1.548828125, forceMergeDeletesPctAllowed=5.19947274020769, segmentsPerTier=32.0, maxCFSSegmentSizeMB=8.796093022207999E12, noCFSRatio=0.5191734116337807
   [junit4]   2> 989139 INFO  (explicit-fetchindex-cmd) [    x:collection1] o.a.s.c.SolrDeletionPolicy SolrDeletionPolicy.onInit: commits: num=1
   [junit4]   2> 	commit{dir=MockDirectoryWrapper(RAMDirectory@e42ef2 lockFactory=org.apache.lucene.store.SingleInstanceLockFactory@2bb202),segFN=segments_3,generation=3}
   [junit4]   2> 989139 INFO  (explicit-fetchindex-cmd) [    x:collection1] o.a.s.c.SolrDeletionPolicy newest commit generation = 3
   [junit4]   2> 989139 INFO  (explicit-fetchindex-cmd) [    x:collection1] o.a.s.u.DefaultSolrCoreState New IndexWriter is ready to be used.
   [junit4]   2> 989139 INFO  (explicit-fetchindex-cmd) [    x:collection1] o.a.s.c.SolrDeletionPolicy SolrDeletionPolicy.onCommit: commits: num=1
   [junit4]   2> 	commit{dir=MockDirectoryWrapper(RAMDirectory@e42ef2 lockFactory=org.apache.lucene.store.SingleInstanceLockFactory@2bb202),segFN=segments_3,generation=3}
   [junit4]   2> 989139 INFO  (explicit-fetchindex-cmd) [    x:collection1] o.a.s.c.SolrDeletionPolicy newest commit generation = 3
   [junit4]   2> 989140 INFO  (explicit-fetchindex-cmd) [    x:collection1] o.a.s.u.DefaultSolrCoreState Rollback old IndexWriter... core=collection1
   [junit4]   2> 989140 INFO  (explicit-fetchindex-cmd) [    x:collection1] o.a.s.h.IndexFetcher Starting download (fullCopy=false) to MockDirectoryWrapper(MMapDirectory@/home/jenkins/workspace/Lucene-Solr-trunk-Linux/solr/build/solr-core/test/J0/temp/solr.handler.TestReplicationHandler_A0C1A60753A8D026-001/index-MMapDirectory-005 lockFactory=org.apache.lucene.store.NativeFSLockFactory@16cc75f)
   [junit4]   2> 989140 INFO  (explicit-fetchindex-cmd) [    x:collection1] o.a.s.h.IndexFetcher Skipping download for _0.si because it already exists
   [junit4]   2> 989140 INFO  (explicit-fetchindex-cmd) [    x:collection1] o.a.s.h.IndexFetcher Skipping download for _0.nvd because it already exists
   [junit4]   2> 989140 INFO  (explicit-fetchindex-cmd) [    x:collection1] o.a.s.h.IndexFetcher Skipping download for _0.fdx because it already exists
   [junit4]   2> 989140 INFO  (explicit-fetchindex-cmd) [    x:collection1] o.a.s.h.IndexFetcher Skipping download for _0_Asserting_0.doc because it already exists
   [junit4]   2> 989140 INFO  (explicit-fetchindex-cmd) [    x:collection1] o.a.s.h.IndexFetcher Skipping download for _0_Asserting_0.tim because it already exists
   [junit4]   2> 989140 INFO  (explicit-fetchindex-cmd) [    x:collection1] o.a.s.h.IndexFetcher Skipping download for _0.fdt because it already exists
   [junit4]   2> 989140 INFO  (explicit-fetchindex-cmd) [    x:collection1] o.a.s.h.IndexFetcher Skipping download for _0_Asserting_0.tip because it already exists
   [junit4]   2> 989140 INFO  (explicit-fetchindex-cmd) [    x:collection1] o.a.s.h.IndexFetcher Skipping download for _0.fnm because it already exists
   [junit4]   2> 989140 INFO  (explicit-fetchindex-cmd) [    x:collection1] o.a.s.h.IndexFetcher Skipping download for _0.nvm because it already exists
   [junit4]   2> 989140 INFO  (explicit-fetchindex-cmd) [    x:collection1] o.a.s.h.IndexFetcher Skipping download for _1_Asserting_0.tip because it already exists
   [junit4]   2> 989140 INFO  (explicit-fetchindex-cmd) [    x:collection1] o.a.s.h.IndexFetcher Skipping download for _1.si because it already exists
   [junit4]   2> 989141 INFO  (explicit-fetchindex-cmd) [    x:collection1] o.a.s.h.IndexFetcher Skipping download for _1.nvd because it already exists
   [junit4]   2> 989141 INFO  (explicit-fetchindex-cmd) [    x:collection1] o.a.s.h.IndexFetcher Skipping download for _1_Asserting_0.doc because it already exists
   [junit4]   2> 989141 INFO  (explicit-fetchindex-cmd) [    x:collection1] o.a.s.h.IndexFetcher Skipping download for _1_Asserting_0.tim because it already exists
   [junit4]   2> 989141 INFO  (explicit-fetchindex-cmd) [    x:collection1] o.a.s.h.IndexFetcher Skipping download for _1.fdx because it already exists
   [junit4]   2> 989141 INFO  (explicit-fetchindex-cmd) [    x:collection1] o.a.s.h.IndexFetcher Skipping download for _1.fnm because it already exists
   [junit4]   2> 989141 INFO  (explicit-fetchindex-cmd) [    x:collection1] o.a.s.h.IndexFetcher Skipping download for _1.nvm because it already exists
   [junit4]   2> 989141 INFO  (explicit-fetchindex-cmd) [    x:collection1] o.a.s.h.IndexFetcher Skipping download for _1.fdt because it already exists
   [junit4]   2> 989143 INFO  (qtp13206868-8325) [    x:collection1] o.a.s.c.S.Request [collection1]  webapp=/solr path=/replication params={generation=4&qt=/replication&file=_2.nvd&checksum=true&wt=filestream&command=filecontent} status=0 QTime=0
   [junit4]   2> 989146 INFO  (qtp13206868-8323) [    x:collection1] o.a.s.c.S.Request [collection1]  webapp=/solr path=/replication params={generation=4&qt=/replication&file=_2.si&checksum=true&wt=filestream&command=filecontent} status=0 QTime=0
   [junit4]   2> 989149 INFO  (qtp13206868-8324) [    x:collection1] o.a.s.c.S.Request [collection1]  webapp=/solr path=/replication params={generation=4&qt=/replication&file=_2.fdt&checksum=true&wt=filestream&command=filecontent} status=0 QTime=0
   [junit4]   2> 989159 INFO  (qtp13206868-8325) [    x:collection1] o.a.s.c.S.Request [collection1]  webapp=/solr path=/replication params={generation=4&qt=/replication&file=_2_Asserting_0.tip&checksum=true&wt=filestream&command=filecontent} status=0 QTime=0
   [junit4]   2> 989161 INFO  (qtp13206868-8323) [    x:collection1] o.a.s.c.S.Request [collection1]  webapp=/solr path=/replication params={generation=4&qt=/replication&file=_2.fnm&checksum=true&wt=filestream&command=filecontent} status=0 QTime=0
   [junit4]   2> 989174 INFO  (qtp13206868-8324) [    x:collection1] o.a.s.c.S.Request [collection1]  webapp=/solr path=/replication params={generation=4&qt=/replication&file=_2.nvm&checksum=true&wt=filestream&command=filecontent} status=0 QTime=0
   [junit4]   2> 989177 INFO  (qtp13206868-8325) [    x:collection1] o.a.s.c.S.Request [collection1]  webapp=/solr path=/replication params={generation=4&qt=/replication&file=_2.fdx&checksum=true&wt=filestream&command=filecontent} status=0 QTime=0
   [junit4]   2> 989180 INFO  (qtp13206868-8323) [    x:collection1] o.a.s.c.S.Request [collection1]  webapp=/solr path=/replication params={generation=4&qt=/replication&file=_2_Asserting_0.doc&checksum=true&wt=filestream&command=filecontent} status=0 QTime=0
   [junit4]   2> 989182 INFO  (qtp13206868-8324) [    x:collection1] o.a.s.c.S.Request [collection1]  webapp=/solr path=/replication params={generation=4&qt=/replication&file=_2_Asserting_0.tim&checksum=true&wt=filestream&command=filecontent} status=0 QTime=0
   [junit4]   2> 989193 INFO  (qtp13206868-8325) [    x:collection1] o.a.s.c.S.Request [collection1]  webapp=/solr path=/replication params={generation=4&qt=/replication&file=segments_4&checksum=true&wt=filestream&command=filecontent} status=0 QTime=0
   [junit4]   2> 989194 INFO  (explicit-fetchindex-cmd) [    x:collection1] o.a.s.h.IndexFetcher Total time taken for download (fullCopy=false,bytesDownloaded=1762) : 0 secs (null bytes/sec) to MockDirectoryWrapper(MMapDirectory@/home/jenkins/workspace/Lucene-Solr-trunk-Linux/solr/build/solr-core/test/J0/temp/solr.handler.TestReplicationHandler_A0C1A60753A8D026-001/index-MMapDirectory-005 lockFactory=org.apache.lucene.store.NativeFSLockFactory@16cc75f)
   [junit4]   2> 989198 INFO  (explicit-fetchindex-cmd) [    x:collection1] o.a.s.u.RandomMergePolicy RandomMergePolicy wrapping class org.apache.lucene.index.TieredMergePolicy: [TieredMergePolicy: maxMergeAtOnce=16, maxMergeAtOnceExplicit=28, maxMergedSegmentMB=3.6376953125, floorSegmentMB=1.2470703125, forceMergeDeletesPctAllowed=13.405923610420734, segmentsPerTier=28.0, maxCFSSegmentSizeMB=8.796093022207999E12, noCFSRatio=0.0
   [junit4]   2> 989199 INFO  (explicit-fetchindex-cmd) [    x:collection1] o.a.s.c.SolrDeletionPolicy SolrDeletionPolicy.onInit: commits: num=2
   [junit4]   2> 	commit{dir=MockDirectoryWrapper(RAMDirectory@e42ef2 lockFactory=org.apache.lucene.store.SingleInstanceLockFactory@2bb202),segFN=segments_3,generation=3}
   [junit4]   2> 	commit{dir=MockDirectoryWrapper(RAMDirectory@e42ef2 lockFactory=org.apache.lucene.store.SingleInstanceLockFactory@2bb202),segFN=segments_4,generation=4}
   [junit4]   2> 989199 INFO  (explicit-fetchindex-cmd) [    x:collection1] o.a.s.c.SolrDeletionPolicy newest commit generation = 4
   [junit4]   2> 989200 INFO  (explicit-fetchindex-cmd) [    x:collection1] o.a.s.u.DefaultSolrCoreState New IndexWriter is ready to be used.
   [junit4]   2> 989202 INFO  (explicit-fetchindex-cmd) [    x:collection1] o.a.s.s.SolrIndexSearcher Opening [Searcher@1fc1e9d[collection1] main]
   [junit4]   2> 989203 INFO  (searcherExecutor-3353-thread-1-processing-x:collection1) [    x:collection1] o.a.s.c.SolrCore [collection1] Registered new searcher Searcher@1fc1e9d[collection1] main{ExitableDirectoryReader(UninvertingDirectoryReader(Uninverting(_0(6.0.0):C1) Uninverting(_1(6.0.0):C1) Uninverting(_2(6.0.0):C1)))}
   [junit4]   2> 989203 INFO  (explicit-fetchindex-cmd) [    x:collection1] o.a.s.c.CachingDirectoryFactory looking to close /home/jenkins/workspace/Lucene-Solr-trunk-Linux/solr/build/solr-core/test/J0/temp/solr.handler.TestReplicationHandler_A0C1A60753A8D026-001/solr-instance-002/./collection1/data/index.20160211000509678 [CachedDir<<refCount=0;path=/home/jenkins/workspace/Lucene-Solr-trunk-Linux/solr/build/solr-core/test/J0/temp/solr.handler.TestReplicationHandler_A0C1A60753A8D026-001/solr-instance-002/./collection1/data/index.20160211000509678;done=true>>]
   [junit4]   2> 989203 INFO  (explicit-fetchindex-cmd) [    x:collection1] o.a.s.c.CachingDirectoryFactory Closing directory: /home/jenkins/workspace/Lucene-Solr-trunk-Linux/solr/build/solr-core/test/J0/temp/solr.handler.TestReplicationHandler_A0C1A60753A8D026-001/solr-instance-002/./collection1/data/index.20160211000509678
   [junit4]   2> 989203 INFO  (qtp26137925-8343) [    x:collection1] o.a.s.c.S.Request [collection1]  webapp=/solr path=/replication params={wait=true&masterUrl=http://127.0.0.1:45475/solr/collection1/replication&command=fetchindex} status=0 QTime=74
   [junit4]   2> 989217 INFO  (TEST-TestReplicationHandler.doTestDetails-seed#[A0C1A60753A8D026]) [    ] o.a.s.SolrTestCaseJ4 Writing core.properties file to /home/jenkins/workspace/Lucene-Solr-trunk-Linux/solr/build/solr-core/test/J0/temp/solr.handler.TestReplicationHandler_A0C1A60753A8D026-001/solr-instance-003/collection1
   [junit4]   2> 989219 INFO  (TEST-TestReplicationHandler.doTestDetails-seed#[A0C1A60753A8D026]) [    ] o.e.j.s.Server jetty-9.2.13.v20150730
   [junit4]   2> 989221 INFO  (TEST-TestReplicationHandler.doTestDetails-seed#[A0C1A60753A8D026]) [    ] o.e.j.s.h.ContextHandler Started o.e.j.s.ServletContextHandler@99c9d3{/solr,null,AVAILABLE}
   [junit4]   2> 989221 INFO  (TEST-TestReplicationHandler.doTestDetails-seed#[A0C1A60753A8D026]) [    ] o.e.j.s.ServerConnector Started ServerConnector@115ed86{HTTP/1.1}{127.0.0.1:33107}
   [junit4]   2> 989221 INFO  (TEST-TestReplicationHandler.doTestDetails-seed#[A0C1A60753A8D026]) [    ] o.e.j.s.Server Started @990464ms
   [junit4]   2> 989221 INFO  (TEST-TestReplicationHandler.doTestDetails-seed#[A0C1A60753A8D026]) [    ] o.a.s.c.s.e.JettySolrRunner Jetty properties: {solr.data.dir=/home/jenkins/workspace/Lucene-Solr-trunk-Linux/solr/build/solr-core/test/J0/temp/solr.handler.TestReplicationHandler_A0C1A60753A8D026-001/solr-instance-003/collection1/data, hostContext=/solr, hostPort=33107}
   [junit4]   2> 989221 INFO  (TEST-TestReplicationHandler.doTestDetails-seed#[A0C1A60753A8D026]) [    ] o.a.s.s.SolrDispatchFilter SolrDispatchFilter.init(): sun.misc.Launcher$AppClassLoader@1d16e93
   [junit4]   2> 989221 INFO  (TEST-TestReplicationHandler.doTestDetails-seed#[A0C1A60753A8D026]) [    ] o.a.s.c.SolrResourceLoader new SolrResourceLoader for directory: '/home/jenkins/workspace/Lucene-Solr-trunk-Linux/solr/build/solr-core/test/J0/temp/solr.handler.TestReplicationHandler_A0C1A60753A8D026-001/solr-instance-003'
   [junit4]   2> 989222 INFO  (TEST-TestReplicationHandler.doTestDetails-seed#[A0C1A60753A8D026]) [    ] o.a.s.c.SolrResourceLoader JNDI not configured for solr (NoInitialContextEx)
   [junit4]   2> 989222 INFO  (TEST-TestReplicationHandler.doTestDetails-seed#[A0C1A60753A8D026]) [    ] o.a.s.c.SolrResourceLoader solr home defaulted to 'solr/' (could not find system property or JNDI)
   [junit4]   2> 989222 INFO  (TEST-TestReplicationHandler.doTestDetails-seed#[A0C1A60753A8D026]) [    ] o.a.s.c.SolrXmlConfig Loading container configuration from /home/jenkins/workspace/Lucene-Solr-trunk-Linux/solr/build/solr-core/test/J0/temp/solr.handler.TestReplicationHandler_A0C1A60753A8D026-001/solr-instance-003/solr.xml
   [junit4]   2> 989227 INFO  (TEST-TestReplicationHandler.doTestDetails-seed#[A0C1A60753A8D026]) [    ] o.a.s.c.CorePropertiesLocator Config-defined core root directory: /home/jenkins/workspace/Lucene-Solr-trunk-Linux/solr/build/solr-core/test/J0/temp/solr.handler.TestReplicationHandler_A0C1A60753A8D026-001/solr-instance-003/.
   [junit4]   2> 989228 INFO  (TEST-TestReplicationHandler.doTestDetails-seed#[A0C1A60753A8D026]) [    ] o.a.s.c.CoreContainer New CoreContainer 7538445
   [junit4]   2> 989228 INFO  (TEST-TestReplicationHandler.doTestDetails-seed#[A0C1A60753A8D026]) [    ] o.a.s.c.CoreContainer Loading cores into CoreContainer [instanceDir=/home/jenkins/workspace/Lucene-Solr-trunk-Linux/solr/build/solr-core/test/J0/temp/solr.handler.TestReplicationHandler_A0C1A60753A8D026-001/solr-instance-003]
   [junit4]   2> 989228 WARN  (TEST-TestReplicationHandler.doTestDetails-seed#[A0C1A60753A8D026]) [    ] o.a.s.c.CoreContainer Couldn't add files from /home/jenkins/workspace/Lucene-Solr-trunk-Linux/solr/build/solr-core/test/J0/temp/solr.handler.TestReplicationHandler_A0C1A60753A8D026-001/solr-instance-003/lib to classpath: /home/jenkins/workspace/Lucene-Solr-trunk-Linux/solr/build/solr-core/test/J0/temp/solr.handler.TestReplicationHandler_A0C1A60753A8D026-001/solr-instance-003/lib
   [junit4]   2> 989228 INFO  (TEST-TestReplicationHandler.doTestDetails-seed#[A0C1A60753A8D026]) [    ] o.a.s.h.c.HttpShardHandlerFactory created with socketTimeout : 90000,urlScheme : ,connTimeout : 15000,maxConnectionsPerHost : 20,maxConnections : 10000,corePoolSize : 0,maximumPoolSize : 2147483647,maxThreadIdleTime : 5,sizeOfQueue : -1,fairnessPolicy : false,useRetries : false,
   [junit4]   2> 989229 INFO  (TEST-TestReplicationHandler.doTestDetails-seed#[A0C1A60753A8D026]) [    ] o.a.s.u.UpdateShardHandler Creating UpdateShardHandler HTTP client with params: socketTimeout=340000&connTimeout=45000&retry=true
   [junit4]   2> 989229 INFO  (TEST-TestReplicationHandler.doTestDetails-seed#[A0C1A60753A8D026]) [    ] o.a.s.l.LogWatcher SLF4J impl is org.slf4j.impl.Log4jLoggerFactory
   [junit4]   2> 989229 INFO  (TEST-TestReplicationHandler.doTestDetails-seed#[A0C1A60753A8D026]) [    ] o.a.s.l.LogWatcher Registering Log Listener [Log4j (org.slf4j.impl.Log4jLoggerFactory)]
   [junit4]   2> 989229 INFO  (TEST-TestReplicationHandler.doTestDetails-seed#[A0C1A60753A8D026]) [    ] o.a.s.c.CoreContainer Security conf doesn't exist. Skipping setup for authorization module.
   [junit4]   2> 989229 INFO  (TEST-TestReplicationHandler.doTestDetails-seed#[A0C1A60753A8D026]) [    ] o.a.s.c.CoreContainer No authentication plugin used.
   [junit4]   2> 989229 INFO  (TEST-TestReplicationHandler.doTestDetails-seed#[A0C1A60753A8D026]) [    ] o.a.s.c.CorePropertiesLocator Looking for core definitions underneath /home/jenkins/workspace/Lucene-Solr-trunk-Linux/solr/build/solr-core/test/J0/temp/solr.handler.TestReplicationHandler_A0C1A60753A8D026-001/solr-instance-003/.
   [junit4]   2> 989240 INFO  (TEST-TestReplicationHandler.doTestDetails-seed#[A0C1A60753A8D026]) [    ] o.a.s.c.CoreDescriptor Created CoreDescriptor: {name=collection1, config=solrconfig.xml, loadOnStartup=true, schema=schema.xml, configSetProperties=configsetprops.json, transient=false, dataDir=data/}
   [junit4]   2> 989240 INFO  (TEST-TestReplicationHandler.doTestDetails-seed#[A0C1A60753A8D026]) [    ] o.a.s.c.CorePropertiesLocator Found core collection1 in /home/jenkins/workspace/Lucene-Solr-trunk-Linux/solr/build/solr-core/test/J0/temp/solr.handler.TestReplicationHandler_A0C1A60753A8D026-001/solr-instance-003/./collection1
   [junit4]   2> 989240 INFO  (TEST-TestReplicationHandler.doTestDetails-seed#[A0C1A60753A8D026]) [    ] o.a.s.c.CorePropertiesLocator Found 1 core definitions
   [junit4]   2> 989240 INFO  (coreLoadExecutor-3366-thread-1) [    ] o.a.s.c.SolrResourceLoader new SolrResourceLoader for directory: '/home/jenkins/workspace/Lucene-Solr-trunk-Linux/solr/build/solr-core/test/J0/temp/solr.handler.TestReplicationHandler_A0C1A60753A8D026-001/solr-instance-003/collection1'
   [junit4]   2> 989241 INFO  (TEST-TestReplicationHandler.doTestDetails-seed#[A0C1A60753A8D026]) [    ] o.a.s.s.SolrDispatchFilter user.dir=/home/jenkins/workspace/Lucene-Solr-trunk-Linux/solr/build/solr-core/test/J0
   [junit4]   2> 989241 INFO  (coreLoadExecutor-3366-thread-1) [    ] o.a.s.c.SolrResourceLoader JNDI not configured for solr (NoInitialContextEx)
   [junit4]   2> 989241 INFO  (TEST-TestReplicationHandler.doTestDetails-seed#[A0C1A60753A8D026]) [    ] o.a.s.s.SolrDispatchFilter SolrDispatchFilter.init() done
   [junit4]   2> 989241 INFO  (coreLoadExecutor-3366-thread-1) [    ] o.a.s.c.SolrResourceLoader solr home defaulted to 'solr/' (could not find system property or JNDI)
   [junit4]   2> 989248 INFO  (coreLoadExecutor-3366-thread-1) [    ] o.a.s.c.SolrConfig current version of requestparams : -1
   [junit4]   2> 989252 INFO  (coreLoadExecutor-3366-thread-1) [    ] o.a.s.c.SolrConfig Using Lucene MatchVersion: 6.0.0
   [junit4]   2> 989259 INFO  (coreLoadExecutor-3366-thread-1) [    ] o.a.s.c.SolrConfig Loaded SolrConfig: solrconfig.xml
   [junit4]   2> 989262 INFO  (coreLoadExecutor-3366-thread-1) [    ] o.a.s.s.IndexSchema [collection1] Schema name=test
   [junit4]   2> 989264 INFO  (coreLoadExecutor-3366-thread-1) [    ] o.a.s.s.IndexSchema unique key field: id
   [junit4]   2> 989266 INFO  (coreLoadExecutor-3366-thread-1) [    ] o.a.s.c.ConfigSetProperties Did not find ConfigSet properties, assuming default properties: Can't find resource 'configsetprops.json' in classpath or '/home/jenkins/workspace/Lucene-Solr-trunk-Linux/solr/build/solr-core/test/J0/temp/solr.handler.TestReplicationHandler_A0C1A60753A8D026-001/solr-instance-003/collection1'
   [junit4]   2> 989266 INFO  (coreLoadExecutor-3366-thread-1) [    ] o.a.s.c.CoreContainer Creating SolrCore 'collection1' using configuration from instancedir /home/jenkins/workspace/Lucene-Solr-trunk-Linux/solr/build/solr-core/test/J0/temp/solr.handler.TestReplicationHandler_A0C1A60753A8D026-001/solr-instance-003/./collection1
   [junit4]   2> 989266 INFO  (coreLoadExecutor-3366-thread-1) [    x:collection1] o.a.s.c.SolrCore org.apache.solr.core.MockDirectoryFactory
   [junit4]   2> 989266 INFO  (coreLoadExecutor-3366-thread-1) [    x:collection1] o.a.s.c.SolrCore [[collection1] ] Opening new SolrCore at [/home/jenkins/workspace/Lucene-Solr-trunk-Linux/solr/build/solr-core/test/J0/temp/solr.handler.TestReplicationHandler_A0C1A60753A8D026-001/solr-instance-003/collection1], dataDir=[/home/jenkins/workspace/Lucene-Solr-trunk-Linux/solr/build/solr-core/test/J0/temp/solr.handler.TestReplicationHandler_A0C1A60753A8D026-001/solr-instance-003/./collection1/data/]
   [junit4]   2> 989266 INFO  (coreLoadExecutor-3366-thread-1) [    x:collection1] o.a.s.c.SolrCore JMX monitoring not detected for core: collection1
   [junit4]   2> 989285 INFO  (coreLoadExecutor-3366-thread-1) [    x:collection1] o.a.s.c.CachingDirectoryFactory return new directory for /home/jenkins/workspace/Lucene-Solr-trunk-Linux/solr/build/solr-core/test/J0/temp/solr.handler.TestReplicationHandler_A0C1A60753A8D026-001/solr-instance-003/./collection1/data
   [junit4]   2> 989286 INFO  (coreLoadExecutor-3366-thread-1) [    x:collection1] o.a.s.c.SolrCore New index directory detected: old=null new=/home/jenkins/workspace/Lucene-Solr-trunk-Linux/solr/build/solr-core/test/J0/temp/solr.handler.TestReplicationHandler_A0C1A60753A8D026-001/solr-instance-003/./collection1/data/index/
   [junit4]   2> 989286 WARN  (coreLoadExecutor-3366-thread-1) [    x:collection1] o.a.s.c.SolrCore [collection1] Solr index directory '/home/jenkins/workspace/Lucene-Solr-trunk-Linux/solr/build/solr-core/test/J0/temp/solr.handler.TestReplicationHandler_A0C1A60753A8D026-001/solr-instance-003/./collection1/data/index' doesn't exist. Creating new index...
   [junit4]   2> 989286 INFO  (coreLoadExecutor-3366-thread-1) [    x:collection1] o.a.s.c.CachingDirectoryFactory return new directory for /home/jenkins/workspace/Lucene-Solr-trunk-Linux/solr/build/solr-core/test/J0/temp/solr.handler.TestReplicationHandler_A0C1A60753A8D026-001/solr-instance-003/./collection1/data/index
   [junit4]   2> 989286 INFO  (coreLoadExecutor-3366-thread-1) [    x:collection1] o.a.s.u.RandomMergePolicy RandomMergePolicy wrapping class org.apache.lucene.index.TieredMergePolicy: [TieredMergePolicy: maxMergeAtOnce=48, maxMergeAtOnceExplicit=19, maxMergedSegmentMB=17.3310546875, floorSegmentMB=1.2431640625, forceMergeDeletesPctAllowed=26.71590485750143, segmentsPerTier=32.0, maxCFSSegmentSizeMB=8.796093022207999E12, noCFSRatio=0.0
   [junit4]   2> 989286 INFO  (coreLoadExecutor-3366-thread-1) [    x:collection1] o.a.s.c.SolrDeletionPolicy SolrDeletionPolicy.onCommit: commits: num=1
   [junit4]   2> 	commit{dir=MockDirectoryWrapper(RAMDirectory@1536e43 lockFactory=org.apache.lucene.store.SingleInstanceLoc

[...truncated too long message...]

irectoryFactory - 2 directories currently being tracked
   [junit4]   2> 1093627 INFO  (coreCloseExecutor-3928-thread-1) [    x:collection1] o.a.s.c.CachingDirectoryFactory looking to close /home/jenkins/workspace/Lucene-Solr-trunk-Linux/solr/build/solr-core/test/J0/temp/solr.handler.TestReplicationHandler_A0C1A60753A8D026-001/solr-instance-027/collection1/data [CachedDir<<refCount=0;path=/home/jenkins/workspace/Lucene-Solr-trunk-Linux/solr/build/solr-core/test/J0/temp/solr.handler.TestReplicationHandler_A0C1A60753A8D026-001/solr-instance-027/collection1/data;done=false>>]
   [junit4]   2> 1093627 INFO  (coreCloseExecutor-3928-thread-1) [    x:collection1] o.a.s.c.CachingDirectoryFactory Closing directory: /home/jenkins/workspace/Lucene-Solr-trunk-Linux/solr/build/solr-core/test/J0/temp/solr.handler.TestReplicationHandler_A0C1A60753A8D026-001/solr-instance-027/collection1/data
   [junit4]   2> 1093627 INFO  (coreCloseExecutor-3928-thread-1) [    x:collection1] o.a.s.c.CachingDirectoryFactory looking to close /home/jenkins/workspace/Lucene-Solr-trunk-Linux/solr/build/solr-core/test/J0/temp/solr.handler.TestReplicationHandler_A0C1A60753A8D026-001/solr-instance-027/collection1/data/index [CachedDir<<refCount=0;path=/home/jenkins/workspace/Lucene-Solr-trunk-Linux/solr/build/solr-core/test/J0/temp/solr.handler.TestReplicationHandler_A0C1A60753A8D026-001/solr-instance-027/collection1/data/index;done=false>>]
   [junit4]   2> 1093627 INFO  (coreCloseExecutor-3928-thread-1) [    x:collection1] o.a.s.c.CachingDirectoryFactory Closing directory: /home/jenkins/workspace/Lucene-Solr-trunk-Linux/solr/build/solr-core/test/J0/temp/solr.handler.TestReplicationHandler_A0C1A60753A8D026-001/solr-instance-027/collection1/data/index
   [junit4]   2> 1093627 INFO  (TEST-TestReplicationHandler.testRateLimitedReplication-seed#[A0C1A60753A8D026]) [    ] o.e.j.s.h.ContextHandler Stopped o.e.j.s.ServletContextHandler@18ab914{/solr,null,UNAVAILABLE}
   [junit4]   2> 1093629 INFO  (TEST-TestReplicationHandler.testRateLimitedReplication-seed#[A0C1A60753A8D026]) [    ] o.e.j.s.ServerConnector Stopped ServerConnector@8f0a0e{HTTP/1.1}{127.0.0.1:0}
   [junit4]   2> 1093629 INFO  (TEST-TestReplicationHandler.testRateLimitedReplication-seed#[A0C1A60753A8D026]) [    ] o.a.s.c.CoreContainer Shutting down CoreContainer instance=13527970
   [junit4]   2> 1093629 INFO  (coreCloseExecutor-3929-thread-1) [    x:collection1] o.a.s.c.SolrCore [collection1]  CLOSING SolrCore org.apache.solr.core.SolrCore@edf13c
   [junit4]   2> 1093629 INFO  (coreCloseExecutor-3929-thread-1) [    x:collection1] o.a.s.u.DirectUpdateHandler2 closing DirectUpdateHandler2{commits=0,autocommits=0,soft autocommits=0,optimizes=0,rollbacks=0,expungeDeletes=0,docsPending=0,adds=0,deletesById=0,deletesByQuery=0,errors=0,cumulative_adds=0,cumulative_deletesById=0,cumulative_deletesByQuery=0,cumulative_errors=0}
   [junit4]   2> 1093629 INFO  (coreCloseExecutor-3929-thread-1) [    x:collection1] o.a.s.u.SolrCoreState Closing SolrCoreState
   [junit4]   2> 1093629 INFO  (coreCloseExecutor-3929-thread-1) [    x:collection1] o.a.s.u.DefaultSolrCoreState SolrCoreState ref count has reached 0 - closing IndexWriter
   [junit4]   2> 1093629 INFO  (coreCloseExecutor-3929-thread-1) [    x:collection1] o.a.s.u.DefaultSolrCoreState closing IndexWriter with IndexWriterCloser
   [junit4]   2> 1093631 INFO  (coreCloseExecutor-3929-thread-1) [    x:collection1] o.a.s.c.SolrCore [collection1] Closing main searcher on request.
   [junit4]   2> 1093631 INFO  (coreCloseExecutor-3929-thread-1) [    x:collection1] o.a.s.c.CachingDirectoryFactory Closing NRTCachingDirectoryFactory - 2 directories currently being tracked
   [junit4]   2> 1093631 INFO  (coreCloseExecutor-3929-thread-1) [    x:collection1] o.a.s.c.CachingDirectoryFactory looking to close /home/jenkins/workspace/Lucene-Solr-trunk-Linux/solr/build/solr-core/test/J0/temp/solr.handler.TestReplicationHandler_A0C1A60753A8D026-001/solr-instance-028/collection1/data/index [CachedDir<<refCount=0;path=/home/jenkins/workspace/Lucene-Solr-trunk-Linux/solr/build/solr-core/test/J0/temp/solr.handler.TestReplicationHandler_A0C1A60753A8D026-001/solr-instance-028/collection1/data/index;done=false>>]
   [junit4]   2> 1093631 INFO  (coreCloseExecutor-3929-thread-1) [    x:collection1] o.a.s.c.CachingDirectoryFactory Closing directory: /home/jenkins/workspace/Lucene-Solr-trunk-Linux/solr/build/solr-core/test/J0/temp/solr.handler.TestReplicationHandler_A0C1A60753A8D026-001/solr-instance-028/collection1/data/index
   [junit4]   2> 1093631 INFO  (coreCloseExecutor-3929-thread-1) [    x:collection1] o.a.s.c.CachingDirectoryFactory looking to close /home/jenkins/workspace/Lucene-Solr-trunk-Linux/solr/build/solr-core/test/J0/temp/solr.handler.TestReplicationHandler_A0C1A60753A8D026-001/solr-instance-028/collection1/data [CachedDir<<refCount=0;path=/home/jenkins/workspace/Lucene-Solr-trunk-Linux/solr/build/solr-core/test/J0/temp/solr.handler.TestReplicationHandler_A0C1A60753A8D026-001/solr-instance-028/collection1/data;done=false>>]
   [junit4]   2> 1093631 INFO  (coreCloseExecutor-3929-thread-1) [    x:collection1] o.a.s.c.CachingDirectoryFactory Closing directory: /home/jenkins/workspace/Lucene-Solr-trunk-Linux/solr/build/solr-core/test/J0/temp/solr.handler.TestReplicationHandler_A0C1A60753A8D026-001/solr-instance-028/collection1/data
   [junit4]   2> 1093632 INFO  (TEST-TestReplicationHandler.testRateLimitedReplication-seed#[A0C1A60753A8D026]) [    ] o.e.j.s.h.ContextHandler Stopped o.e.j.s.ServletContextHandler@1a60bb9{/solr,null,UNAVAILABLE}
   [junit4]   2> 1093634 INFO  (SUITE-TestReplicationHandler-seed#[A0C1A60753A8D026]-worker) [    ] o.a.s.SolrTestCaseJ4 ###deleteCore
   [junit4]   2> NOTE: leaving temporary files on disk at: /home/jenkins/workspace/Lucene-Solr-trunk-Linux/solr/build/solr-core/test/J0/temp/solr.handler.TestReplicationHandler_A0C1A60753A8D026-001
   [junit4]   2> NOTE: test params are: codec=Asserting(Lucene60): {name=PostingsFormat(name=Asserting), id=PostingsFormat(name=Asserting), newname=PostingsFormat(name=Asserting)}, docValues:{}, sim=ClassicSimilarity, locale=el-GR, timezone=America/Argentina/Jujuy
   [junit4]   2> NOTE: Linux 3.19.0-47-generic i386/Oracle Corporation 1.8.0_72 (32-bit)/cpus=12,threads=1,free=321511808,total=427819008
   [junit4]   2> NOTE: All tests run in this JVM: [UUIDFieldTest, OutputWriterTest, DirectoryFactoryTest, FileBasedSpellCheckerTest, AnalyticsQueryTest, TestLRUCache, RuleEngineTest, CurrencyFieldOpenExchangeTest, AtomicUpdatesTest, TestAuthenticationFramework, SignatureUpdateProcessorFactoryTest, TestConfigSetProperties, TestMinMaxOnMultiValuedField, DeleteInactiveReplicaTest, TestHashQParserPlugin, TestAtomicUpdateErrorCases, HdfsBasicDistributedZk2Test, SyncSliceTest, DistributedSuggestComponentTest, TestDynamicFieldCollectionResource, PeerSyncTest, JSONWriterTest, DeleteShardTest, DataDrivenBlockJoinTest, TestIBSimilarityFactory, TestNamedUpdateProcessors, SystemInfoHandlerTest, PolyFieldTest, InfoHandlerTest, BasicAuthIntegrationTest, RAMDirectoryFactoryTest, TestSchemaSimilarityResource, DistributedVersionInfoTest, CloudExitableDirectoryReaderTest, TestRemoteStreaming, OverriddenZkACLAndCredentialsProvidersTest, HdfsRecoverLeaseTest, BasicDistributedZkTest, TestUseDocValuesAsStored, AddBlockUpdateTest, PingRequestHandlerTest, DisMaxRequestHandlerTest, TestSolrQueryResponse, CheckHdfsIndexTest, RemoteQueryErrorTest, DistributedFacetPivotWhiteBoxTest, TestTestInjection, TestScoreJoinQPScore, SuggestComponentContextFilterQueryTest, TestArbitraryIndexDir, TestFaceting, AnalysisAfterCoreReloadTest, TestHdfsUpdateLog, BlockJoinFacetSimpleTest, ResourceLoaderTest, TestStressLucene, TestManagedSchemaDynamicFieldResource, TestCustomSort, TestRangeQuery, TestBinaryField, TestFieldResource, CdcrVersionReplicationTest, TestSolrQueryParserDefaultOperatorResource, TestReRankQParserPlugin, TestSolr4Spatial2, RequiredFieldsTest, EchoParamsTest, TestLMDirichletSimilarityFactory, PreAnalyzedFieldTest, QueryElevationComponentTest, TestRequestStatusCollectionAPI, TestTrieFacet, TestManagedStopFilterFactory, ZkNodePropsTest, TestJoin, CollectionTooManyReplicasTest, TestRealTimeGet, StandardRequestHandlerTest, TestCollectionAPI, TestSolr4Spatial, TestRandomFaceting, TestCustomDocTransformer, HdfsUnloadDistributedZkTest, BasicZkTest, TestCloudManagedSchema, CacheHeaderTest, TestDocSet, TestPKIAuthenticationPlugin, TestRebalanceLeaders, RollingRestartTest, ResponseLogComponentTest, TestClusterStateMutator, BufferStoreTest, TestPhraseSuggestions, TestLeaderInitiatedRecoveryThread, TestReplicationHandler]
   [junit4] Completed [306/579 (1!)] on J0 in 105.94s, 13 tests, 1 error <<< FAILURES!

[...truncated 886 lines...]
BUILD FAILED
/home/jenkins/workspace/Lucene-Solr-trunk-Linux/build.xml:740: The following error occurred while executing this line:
/home/jenkins/workspace/Lucene-Solr-trunk-Linux/build.xml:684: The following error occurred while executing this line:
/home/jenkins/workspace/Lucene-Solr-trunk-Linux/build.xml:59: The following error occurred while executing this line:
/home/jenkins/workspace/Lucene-Solr-trunk-Linux/solr/build.xml:233: The following error occurred while executing this line:
/home/jenkins/workspace/Lucene-Solr-trunk-Linux/solr/common-build.xml:524: The following error occurred while executing this line:
/home/jenkins/workspace/Lucene-Solr-trunk-Linux/lucene/common-build.xml:1457: The following error occurred while executing this line:
/home/jenkins/workspace/Lucene-Solr-trunk-Linux/lucene/common-build.xml:1014: There were test failures: 579 suites (8 ignored), 2327 tests, 1 error, 117 ignored (72 assumptions) [seed: A0C1A60753A8D026]

Total time: 52 minutes 11 seconds
Build step 'Invoke Ant' marked build as failure
Archiving artifacts
[WARNINGS] Skipping publisher since build result is FAILURE
Recording test results
Email was triggered for: Failure - Any
Sending email for trigger: Failure - Any



Mime
View raw message