lucene-dev mailing list archives

Site index · List index
Message view « Date » · « Thread »
Top « Date » · « Thread »
From Policeman Jenkins Server <jenk...@thetaphi.de>
Subject [JENKINS] Lucene-Solr-trunk-Windows (64bit/jdk1.8.0_72) - Build # 5631 - Failure!
Date Sat, 20 Feb 2016 10:19:22 GMT
Build: http://jenkins.thetaphi.de/job/Lucene-Solr-trunk-Windows/5631/
Java: 64bit/jdk1.8.0_72 -XX:-UseCompressedOops -XX:+UseG1GC

3 tests failed.
FAILED:  junit.framework.TestSuite.org.apache.solr.core.TestLazyCores

Error Message:
ObjectTracker found 4 object(s) that were not released!!! [MockDirectoryWrapper, MDCAwareThreadPoolExecutor, MockDirectoryWrapper, SolrCore]

Stack Trace:
java.lang.AssertionError: ObjectTracker found 4 object(s) that were not released!!! [MockDirectoryWrapper, MDCAwareThreadPoolExecutor, MockDirectoryWrapper, SolrCore]
	at __randomizedtesting.SeedInfo.seed([2C68A00828D76E6E]:0)
	at org.junit.Assert.fail(Assert.java:93)
	at org.junit.Assert.assertTrue(Assert.java:43)
	at org.junit.Assert.assertNull(Assert.java:551)
	at org.apache.solr.SolrTestCaseJ4.afterClass(SolrTestCaseJ4.java:228)
	at sun.reflect.NativeMethodAccessorImpl.invoke0(Native Method)
	at sun.reflect.NativeMethodAccessorImpl.invoke(NativeMethodAccessorImpl.java:62)
	at sun.reflect.DelegatingMethodAccessorImpl.invoke(DelegatingMethodAccessorImpl.java:43)
	at java.lang.reflect.Method.invoke(Method.java:498)
	at com.carrotsearch.randomizedtesting.RandomizedRunner.invoke(RandomizedRunner.java:1764)
	at com.carrotsearch.randomizedtesting.RandomizedRunner$7.evaluate(RandomizedRunner.java:834)
	at com.carrotsearch.randomizedtesting.rules.StatementAdapter.evaluate(StatementAdapter.java:36)
	at com.carrotsearch.randomizedtesting.rules.SystemPropertiesRestoreRule$1.evaluate(SystemPropertiesRestoreRule.java:57)
	at org.apache.lucene.util.AbstractBeforeAfterRule$1.evaluate(AbstractBeforeAfterRule.java:45)
	at com.carrotsearch.randomizedtesting.rules.StatementAdapter.evaluate(StatementAdapter.java:36)
	at org.apache.lucene.util.TestRuleStoreClassName$1.evaluate(TestRuleStoreClassName.java:41)
	at com.carrotsearch.randomizedtesting.rules.NoShadowingOrOverridesOnMethodsRule$1.evaluate(NoShadowingOrOverridesOnMethodsRule.java:40)
	at com.carrotsearch.randomizedtesting.rules.NoShadowingOrOverridesOnMethodsRule$1.evaluate(NoShadowingOrOverridesOnMethodsRule.java:40)
	at com.carrotsearch.randomizedtesting.rules.StatementAdapter.evaluate(StatementAdapter.java:36)
	at com.carrotsearch.randomizedtesting.rules.StatementAdapter.evaluate(StatementAdapter.java:36)
	at com.carrotsearch.randomizedtesting.rules.StatementAdapter.evaluate(StatementAdapter.java:36)
	at org.apache.lucene.util.TestRuleAssertionsRequired$1.evaluate(TestRuleAssertionsRequired.java:53)
	at org.apache.lucene.util.TestRuleMarkFailure$1.evaluate(TestRuleMarkFailure.java:47)
	at org.apache.lucene.util.TestRuleIgnoreAfterMaxFailures$1.evaluate(TestRuleIgnoreAfterMaxFailures.java:64)
	at org.apache.lucene.util.TestRuleIgnoreTestSuites$1.evaluate(TestRuleIgnoreTestSuites.java:54)
	at com.carrotsearch.randomizedtesting.rules.StatementAdapter.evaluate(StatementAdapter.java:36)
	at com.carrotsearch.randomizedtesting.ThreadLeakControl$StatementRunner.run(ThreadLeakControl.java:367)
	at java.lang.Thread.run(Thread.java:745)


FAILED:  junit.framework.TestSuite.org.apache.solr.core.TestLazyCores

Error Message:
1 thread leaked from SUITE scope at org.apache.solr.core.TestLazyCores:     1) Thread[id=106, name=searcherExecutor-129-thread-1, state=WAITING, group=TGRP-TestLazyCores]         at sun.misc.Unsafe.park(Native Method)         at java.util.concurrent.locks.LockSupport.park(LockSupport.java:175)         at java.util.concurrent.locks.AbstractQueuedSynchronizer$ConditionObject.await(AbstractQueuedSynchronizer.java:2039)         at java.util.concurrent.LinkedBlockingQueue.take(LinkedBlockingQueue.java:442)         at java.util.concurrent.ThreadPoolExecutor.getTask(ThreadPoolExecutor.java:1067)         at java.util.concurrent.ThreadPoolExecutor.runWorker(ThreadPoolExecutor.java:1127)         at java.util.concurrent.ThreadPoolExecutor$Worker.run(ThreadPoolExecutor.java:617)         at java.lang.Thread.run(Thread.java:745)

Stack Trace:
com.carrotsearch.randomizedtesting.ThreadLeakError: 1 thread leaked from SUITE scope at org.apache.solr.core.TestLazyCores: 
   1) Thread[id=106, name=searcherExecutor-129-thread-1, state=WAITING, group=TGRP-TestLazyCores]
        at sun.misc.Unsafe.park(Native Method)
        at java.util.concurrent.locks.LockSupport.park(LockSupport.java:175)
        at java.util.concurrent.locks.AbstractQueuedSynchronizer$ConditionObject.await(AbstractQueuedSynchronizer.java:2039)
        at java.util.concurrent.LinkedBlockingQueue.take(LinkedBlockingQueue.java:442)
        at java.util.concurrent.ThreadPoolExecutor.getTask(ThreadPoolExecutor.java:1067)
        at java.util.concurrent.ThreadPoolExecutor.runWorker(ThreadPoolExecutor.java:1127)
        at java.util.concurrent.ThreadPoolExecutor$Worker.run(ThreadPoolExecutor.java:617)
        at java.lang.Thread.run(Thread.java:745)
	at __randomizedtesting.SeedInfo.seed([2C68A00828D76E6E]:0)


FAILED:  junit.framework.TestSuite.org.apache.solr.core.TestLazyCores

Error Message:
There are still zombie threads that couldn't be terminated:    1) Thread[id=106, name=searcherExecutor-129-thread-1, state=WAITING, group=TGRP-TestLazyCores]         at sun.misc.Unsafe.park(Native Method)         at java.util.concurrent.locks.LockSupport.park(LockSupport.java:175)         at java.util.concurrent.locks.AbstractQueuedSynchronizer$ConditionObject.await(AbstractQueuedSynchronizer.java:2039)         at java.util.concurrent.LinkedBlockingQueue.take(LinkedBlockingQueue.java:442)         at java.util.concurrent.ThreadPoolExecutor.getTask(ThreadPoolExecutor.java:1067)         at java.util.concurrent.ThreadPoolExecutor.runWorker(ThreadPoolExecutor.java:1127)         at java.util.concurrent.ThreadPoolExecutor$Worker.run(ThreadPoolExecutor.java:617)         at java.lang.Thread.run(Thread.java:745)

Stack Trace:
com.carrotsearch.randomizedtesting.ThreadLeakError: There are still zombie threads that couldn't be terminated:
   1) Thread[id=106, name=searcherExecutor-129-thread-1, state=WAITING, group=TGRP-TestLazyCores]
        at sun.misc.Unsafe.park(Native Method)
        at java.util.concurrent.locks.LockSupport.park(LockSupport.java:175)
        at java.util.concurrent.locks.AbstractQueuedSynchronizer$ConditionObject.await(AbstractQueuedSynchronizer.java:2039)
        at java.util.concurrent.LinkedBlockingQueue.take(LinkedBlockingQueue.java:442)
        at java.util.concurrent.ThreadPoolExecutor.getTask(ThreadPoolExecutor.java:1067)
        at java.util.concurrent.ThreadPoolExecutor.runWorker(ThreadPoolExecutor.java:1127)
        at java.util.concurrent.ThreadPoolExecutor$Worker.run(ThreadPoolExecutor.java:617)
        at java.lang.Thread.run(Thread.java:745)
	at __randomizedtesting.SeedInfo.seed([2C68A00828D76E6E]:0)




Build Log:
[...truncated 10410 lines...]
   [junit4] Suite: org.apache.solr.core.TestLazyCores
   [junit4]   2> Creating dataDir: C:\Users\JenkinsSlave\workspace\Lucene-Solr-trunk-Windows\solr\build\solr-core\test\J0\temp\solr.core.TestLazyCores_2C68A00828D76E6E-001\init-core-data-001
   [junit4]   2> 0    INFO  (SUITE-TestLazyCores-seed#[2C68A00828D76E6E]-worker) [    ] o.a.s.SolrTestCaseJ4 Randomized ssl (false) and clientAuth (false)
   [junit4]   2> 107  INFO  (TEST-TestLazyCores.testLazyLoad-seed#[2C68A00828D76E6E]) [    ] o.a.s.SolrTestCaseJ4 ###Starting testLazyLoad
   [junit4]   2> 397  INFO  (TEST-TestLazyCores.testLazyLoad-seed#[2C68A00828D76E6E]) [    ] o.a.s.c.SolrResourceLoader new SolrResourceLoader for directory: 'C:\Users\JenkinsSlave\workspace\Lucene-Solr-trunk-Windows\solr\build\solr-core\test\J0\temp\solr.core.TestLazyCores_2C68A00828D76E6E-001\tempDir-001'
   [junit4]   2> 582  INFO  (TEST-TestLazyCores.testLazyLoad-seed#[2C68A00828D76E6E]) [    ] o.a.s.c.SolrResourceLoader JNDI not configured for solr (NoInitialContextEx)
   [junit4]   2> 583  INFO  (TEST-TestLazyCores.testLazyLoad-seed#[2C68A00828D76E6E]) [    ] o.a.s.c.SolrResourceLoader solr home defaulted to 'solr/' (could not find system property or JNDI)
   [junit4]   2> 796  INFO  (TEST-TestLazyCores.testLazyLoad-seed#[2C68A00828D76E6E]) [    ] o.a.s.c.CoreContainer New CoreContainer 1637856044
   [junit4]   2> 796  INFO  (TEST-TestLazyCores.testLazyLoad-seed#[2C68A00828D76E6E]) [    ] o.a.s.c.CoreContainer Loading cores into CoreContainer [instanceDir=C:\Users\JenkinsSlave\workspace\Lucene-Solr-trunk-Windows\solr\build\solr-core\test\J0\temp\solr.core.TestLazyCores_2C68A00828D76E6E-001\tempDir-001]
   [junit4]   2> 803  WARN  (TEST-TestLazyCores.testLazyLoad-seed#[2C68A00828D76E6E]) [    ] o.a.s.c.CoreContainer Couldn't add files from C:\Users\JenkinsSlave\workspace\Lucene-Solr-trunk-Windows\solr\build\solr-core\test\J0\temp\solr.core.TestLazyCores_2C68A00828D76E6E-001\tempDir-001\lib to classpath: C:\Users\JenkinsSlave\workspace\Lucene-Solr-trunk-Windows\solr\build\solr-core\test\J0\temp\solr.core.TestLazyCores_2C68A00828D76E6E-001\tempDir-001\lib
   [junit4]   2> 920  INFO  (TEST-TestLazyCores.testLazyLoad-seed#[2C68A00828D76E6E]) [    ] o.a.s.h.c.HttpShardHandlerFactory created with socketTimeout : 600000,connTimeout : 60000,maxConnectionsPerHost : 20,maxConnections : 10000,corePoolSize : 0,maximumPoolSize : 2147483647,maxThreadIdleTime : 5,sizeOfQueue : -1,fairnessPolicy : false,useRetries : false,
   [junit4]   2> 1541 INFO  (TEST-TestLazyCores.testLazyLoad-seed#[2C68A00828D76E6E]) [    ] o.a.s.u.UpdateShardHandler Creating UpdateShardHandler HTTP client with params: socketTimeout=600000&connTimeout=60000&retry=true
   [junit4]   2> 1545 INFO  (TEST-TestLazyCores.testLazyLoad-seed#[2C68A00828D76E6E]) [    ] o.a.s.c.SolrCores Allocating transient cache for 4 transient cores
   [junit4]   2> 1560 INFO  (TEST-TestLazyCores.testLazyLoad-seed#[2C68A00828D76E6E]) [    ] o.a.s.l.LogWatcher SLF4J impl is org.slf4j.impl.Log4jLoggerFactory
   [junit4]   2> 1563 INFO  (TEST-TestLazyCores.testLazyLoad-seed#[2C68A00828D76E6E]) [    ] o.a.s.l.LogWatcher Registering Log Listener [Log4j (org.slf4j.impl.Log4jLoggerFactory)]
   [junit4]   2> 1572 INFO  (TEST-TestLazyCores.testLazyLoad-seed#[2C68A00828D76E6E]) [    ] o.a.s.c.CoreContainer Security conf doesn't exist. Skipping setup for authorization module.
   [junit4]   2> 1573 INFO  (TEST-TestLazyCores.testLazyLoad-seed#[2C68A00828D76E6E]) [    ] o.a.s.c.CoreContainer No authentication plugin used.
   [junit4]   2> 1801 INFO  (TEST-TestLazyCores.testLazyLoad-seed#[2C68A00828D76E6E]) [    ] o.a.s.c.CoreDescriptor Created CoreDescriptor: {name=collection1, config=solrconfig.xml, loadOnStartup=true, schema=schema.xml, configSetProperties=configsetprops.json, transient=false, dataDir=data\}
   [junit4]   2> 1802 INFO  (TEST-TestLazyCores.testLazyLoad-seed#[2C68A00828D76E6E]) [    ] o.a.s.c.CoreDescriptor Created CoreDescriptor: {name=collection2, config=solrconfig.xml, loadOnStartup=true, schema=schema.xml, configSetProperties=configsetprops.json, transient=true, dataDir=data\}
   [junit4]   2> 1803 INFO  (TEST-TestLazyCores.testLazyLoad-seed#[2C68A00828D76E6E]) [    ] o.a.s.c.CoreDescriptor Created CoreDescriptor: {name=collection3, config=solrconfig.xml, loadOnStartup=false, schema=schema.xml, configSetProperties=configsetprops.json, transient=on, dataDir=data\}
   [junit4]   2> 1804 INFO  (TEST-TestLazyCores.testLazyLoad-seed#[2C68A00828D76E6E]) [    ] o.a.s.c.CoreDescriptor Created CoreDescriptor: {name=collection4, config=solrconfig.xml, loadOnStartup=false, schema=schema.xml, configSetProperties=configsetprops.json, transient=false, dataDir=data\}
   [junit4]   2> 1804 INFO  (TEST-TestLazyCores.testLazyLoad-seed#[2C68A00828D76E6E]) [    ] o.a.s.c.CoreDescriptor Created CoreDescriptor: {name=collection5, config=solrconfig.xml, loadOnStartup=true, schema=schema.xml, configSetProperties=configsetprops.json, transient=false, dataDir=data\}
   [junit4]   2> 1805 INFO  (TEST-TestLazyCores.testLazyLoad-seed#[2C68A00828D76E6E]) [    ] o.a.s.c.CoreDescriptor Created CoreDescriptor: {name=collection6, config=solrconfig.xml, loadOnStartup=false, schema=schema.xml, configSetProperties=configsetprops.json, transient=true, dataDir=data\}
   [junit4]   2> 1805 INFO  (TEST-TestLazyCores.testLazyLoad-seed#[2C68A00828D76E6E]) [    ] o.a.s.c.CoreDescriptor Created CoreDescriptor: {name=collection7, config=solrconfig.xml, loadOnStartup=false, schema=schema.xml, configSetProperties=configsetprops.json, transient=true, dataDir=data\}
   [junit4]   2> 1806 INFO  (TEST-TestLazyCores.testLazyLoad-seed#[2C68A00828D76E6E]) [    ] o.a.s.c.CoreDescriptor Created CoreDescriptor: {name=collection8, config=solrconfig.xml, loadOnStartup=false, schema=schema.xml, configSetProperties=configsetprops.json, transient=true, dataDir=data\}
   [junit4]   2> 1807 INFO  (TEST-TestLazyCores.testLazyLoad-seed#[2C68A00828D76E6E]) [    ] o.a.s.c.CoreDescriptor Created CoreDescriptor: {name=collection9, config=solrconfig.xml, loadOnStartup=false, schema=schema.xml, configSetProperties=configsetprops.json, transient=true, dataDir=data\}
   [junit4]   2> 1832 INFO  (coreLoadExecutor-6-thread-2) [    ] o.a.s.c.SolrResourceLoader new SolrResourceLoader for directory: 'C:\Users\JenkinsSlave\workspace\Lucene-Solr-trunk-Windows\solr\build\solr-core\test\J0\temp\solr.core.TestLazyCores_2C68A00828D76E6E-001\tempDir-001\collection2'
   [junit4]   2> 1831 INFO  (coreLoadExecutor-6-thread-1) [    ] o.a.s.c.SolrResourceLoader new SolrResourceLoader for directory: 'C:\Users\JenkinsSlave\workspace\Lucene-Solr-trunk-Windows\solr\build\solr-core\test\J0\temp\solr.core.TestLazyCores_2C68A00828D76E6E-001\tempDir-001\collection1'
   [junit4]   2> 1831 INFO  (coreLoadExecutor-6-thread-3) [    ] o.a.s.c.SolrResourceLoader new SolrResourceLoader for directory: 'C:\Users\JenkinsSlave\workspace\Lucene-Solr-trunk-Windows\solr\build\solr-core\test\J0\temp\solr.core.TestLazyCores_2C68A00828D76E6E-001\tempDir-001\collection5'
   [junit4]   2> 1835 INFO  (coreLoadExecutor-6-thread-3) [    ] o.a.s.c.SolrResourceLoader JNDI not configured for solr (NoInitialContextEx)
   [junit4]   2> 1835 INFO  (coreLoadExecutor-6-thread-1) [    ] o.a.s.c.SolrResourceLoader JNDI not configured for solr (NoInitialContextEx)
   [junit4]   2> 1835 INFO  (coreLoadExecutor-6-thread-2) [    ] o.a.s.c.SolrResourceLoader JNDI not configured for solr (NoInitialContextEx)
   [junit4]   2> 1836 INFO  (coreLoadExecutor-6-thread-3) [    ] o.a.s.c.SolrResourceLoader solr home defaulted to 'solr/' (could not find system property or JNDI)
   [junit4]   2> 1836 INFO  (coreLoadExecutor-6-thread-1) [    ] o.a.s.c.SolrResourceLoader solr home defaulted to 'solr/' (could not find system property or JNDI)
   [junit4]   2> 1837 INFO  (coreLoadExecutor-6-thread-2) [    ] o.a.s.c.SolrResourceLoader solr home defaulted to 'solr/' (could not find system property or JNDI)
   [junit4]   2> 1978 INFO  (coreLoadExecutor-6-thread-3) [    ] o.a.s.c.SolrConfig current version of requestparams : -1
   [junit4]   2> 1984 INFO  (coreLoadExecutor-6-thread-2) [    ] o.a.s.c.SolrConfig current version of requestparams : -1
   [junit4]   2> 1985 INFO  (coreLoadExecutor-6-thread-1) [    ] o.a.s.c.SolrConfig current version of requestparams : -1
   [junit4]   2> 3004 INFO  (coreLoadExecutor-6-thread-3) [    ] o.a.s.c.SolrConfig Using Lucene MatchVersion: 6.0.0
   [junit4]   2> 3004 INFO  (coreLoadExecutor-6-thread-1) [    ] o.a.s.c.SolrConfig Using Lucene MatchVersion: 6.0.0
   [junit4]   2> 3061 INFO  (coreLoadExecutor-6-thread-2) [    ] o.a.s.c.SolrConfig Using Lucene MatchVersion: 6.0.0
   [junit4]   2> 3187 INFO  (coreLoadExecutor-6-thread-1) [    ] o.a.s.c.SolrConfig Loaded SolrConfig: solrconfig.xml
   [junit4]   2> 3187 INFO  (coreLoadExecutor-6-thread-2) [    ] o.a.s.c.SolrConfig Loaded SolrConfig: solrconfig.xml
   [junit4]   2> 3217 INFO  (coreLoadExecutor-6-thread-3) [    ] o.a.s.c.SolrConfig Loaded SolrConfig: solrconfig.xml
   [junit4]   2> 3279 INFO  (coreLoadExecutor-6-thread-2) [    ] o.a.s.s.IndexSchema [collection2] Schema name=tiny
   [junit4]   2> 3279 INFO  (coreLoadExecutor-6-thread-3) [    ] o.a.s.s.IndexSchema [collection5] Schema name=tiny
   [junit4]   2> 3281 INFO  (coreLoadExecutor-6-thread-1) [    ] o.a.s.s.IndexSchema [collection1] Schema name=tiny
   [junit4]   2> 4050 INFO  (coreLoadExecutor-6-thread-1) [    ] o.a.s.s.IndexSchema unique key field: id
   [junit4]   2> 4052 INFO  (coreLoadExecutor-6-thread-2) [    ] o.a.s.s.IndexSchema unique key field: id
   [junit4]   2> 4053 INFO  (coreLoadExecutor-6-thread-3) [    ] o.a.s.s.IndexSchema unique key field: id
   [junit4]   2> 4066 INFO  (coreLoadExecutor-6-thread-1) [    ] o.a.s.c.ConfigSetProperties Did not find ConfigSet properties, assuming default properties: Can't find resource 'configsetprops.json' in classpath or 'C:\Users\JenkinsSlave\workspace\Lucene-Solr-trunk-Windows\solr\build\solr-core\test\J0\temp\solr.core.TestLazyCores_2C68A00828D76E6E-001\tempDir-001\collection1'
   [junit4]   2> 4067 INFO  (coreLoadExecutor-6-thread-2) [    ] o.a.s.c.ConfigSetProperties Did not find ConfigSet properties, assuming default properties: Can't find resource 'configsetprops.json' in classpath or 'C:\Users\JenkinsSlave\workspace\Lucene-Solr-trunk-Windows\solr\build\solr-core\test\J0\temp\solr.core.TestLazyCores_2C68A00828D76E6E-001\tempDir-001\collection2'
   [junit4]   2> 4066 INFO  (coreLoadExecutor-6-thread-3) [    ] o.a.s.c.ConfigSetProperties Did not find ConfigSet properties, assuming default properties: Can't find resource 'configsetprops.json' in classpath or 'C:\Users\JenkinsSlave\workspace\Lucene-Solr-trunk-Windows\solr\build\solr-core\test\J0\temp\solr.core.TestLazyCores_2C68A00828D76E6E-001\tempDir-001\collection5'
   [junit4]   2> 4069 INFO  (coreLoadExecutor-6-thread-1) [    ] o.a.s.c.CoreContainer Creating SolrCore 'collection1' using configuration from instancedir C:\Users\JenkinsSlave\workspace\Lucene-Solr-trunk-Windows\solr\build\solr-core\test\J0\temp\solr.core.TestLazyCores_2C68A00828D76E6E-001\tempDir-001\collection1
   [junit4]   2> 4069 INFO  (coreLoadExecutor-6-thread-3) [    ] o.a.s.c.CoreContainer Creating SolrCore 'collection5' using configuration from instancedir C:\Users\JenkinsSlave\workspace\Lucene-Solr-trunk-Windows\solr\build\solr-core\test\J0\temp\solr.core.TestLazyCores_2C68A00828D76E6E-001\tempDir-001\collection5
   [junit4]   2> 4069 INFO  (coreLoadExecutor-6-thread-2) [    ] o.a.s.c.CoreContainer Creating SolrCore 'collection2' using configuration from instancedir C:\Users\JenkinsSlave\workspace\Lucene-Solr-trunk-Windows\solr\build\solr-core\test\J0\temp\solr.core.TestLazyCores_2C68A00828D76E6E-001\tempDir-001\collection2
   [junit4]   2> 4192 INFO  (coreLoadExecutor-6-thread-1) [    x:collection1] o.a.s.c.SolrCore org.apache.solr.core.MockDirectoryFactory
   [junit4]   2> 4199 INFO  (coreLoadExecutor-6-thread-2) [    x:collection2] o.a.s.c.SolrCore org.apache.solr.core.MockDirectoryFactory
   [junit4]   2> 4200 INFO  (coreLoadExecutor-6-thread-3) [    x:collection5] o.a.s.c.SolrCore org.apache.solr.core.MockDirectoryFactory
   [junit4]   2> 4225 INFO  (coreLoadExecutor-6-thread-3) [    x:collection5] o.a.s.c.SolrCore [[collection5] ] Opening new SolrCore at [C:\Users\JenkinsSlave\workspace\Lucene-Solr-trunk-Windows\solr\build\solr-core\test\J0\temp\solr.core.TestLazyCores_2C68A00828D76E6E-001\tempDir-001\collection5], dataDir=[C:\Users\JenkinsSlave\workspace\Lucene-Solr-trunk-Windows\solr\build\solr-core\test\J0\temp\solr.core.TestLazyCores_2C68A00828D76E6E-001\tempDir-001\collection5\data\]
   [junit4]   2> 4226 INFO  (coreLoadExecutor-6-thread-3) [    x:collection5] o.a.s.c.SolrCore JMX monitoring not detected for core: collection5
   [junit4]   2> 4238 INFO  (coreLoadExecutor-6-thread-1) [    x:collection1] o.a.s.c.SolrCore [[collection1] ] Opening new SolrCore at [C:\Users\JenkinsSlave\workspace\Lucene-Solr-trunk-Windows\solr\build\solr-core\test\J0\temp\solr.core.TestLazyCores_2C68A00828D76E6E-001\tempDir-001\collection1], dataDir=[C:\Users\JenkinsSlave\workspace\Lucene-Solr-trunk-Windows\solr\build\solr-core\test\J0\temp\solr.core.TestLazyCores_2C68A00828D76E6E-001\tempDir-001\collection1\data\]
   [junit4]   2> 4238 INFO  (coreLoadExecutor-6-thread-1) [    x:collection1] o.a.s.c.SolrCore JMX monitoring not detected for core: collection1
   [junit4]   2> 4256 INFO  (coreLoadExecutor-6-thread-2) [    x:collection2] o.a.s.c.SolrCore [[collection2] ] Opening new SolrCore at [C:\Users\JenkinsSlave\workspace\Lucene-Solr-trunk-Windows\solr\build\solr-core\test\J0\temp\solr.core.TestLazyCores_2C68A00828D76E6E-001\tempDir-001\collection2], dataDir=[C:\Users\JenkinsSlave\workspace\Lucene-Solr-trunk-Windows\solr\build\solr-core\test\J0\temp\solr.core.TestLazyCores_2C68A00828D76E6E-001\tempDir-001\collection2\data\]
   [junit4]   2> 4256 INFO  (coreLoadExecutor-6-thread-2) [    x:collection2] o.a.s.c.SolrCore JMX monitoring not detected for core: collection2
   [junit4]   2> 4304 INFO  (coreLoadExecutor-6-thread-3) [    x:collection5] o.a.s.c.CachingDirectoryFactory return new directory for C:\Users\JenkinsSlave\workspace\Lucene-Solr-trunk-Windows\solr\build\solr-core\test\J0\temp\solr.core.TestLazyCores_2C68A00828D76E6E-001\tempDir-001\collection5\data\
   [junit4]   2> 4304 INFO  (coreLoadExecutor-6-thread-3) [    x:collection5] o.a.s.c.SolrCore New index directory detected: old=null new=C:\Users\JenkinsSlave\workspace\Lucene-Solr-trunk-Windows\solr\build\solr-core\test\J0\temp\solr.core.TestLazyCores_2C68A00828D76E6E-001\tempDir-001\collection5\data\index/
   [junit4]   2> 4304 WARN  (coreLoadExecutor-6-thread-3) [    x:collection5] o.a.s.c.SolrCore [collection5] Solr index directory 'C:\Users\JenkinsSlave\workspace\Lucene-Solr-trunk-Windows\solr\build\solr-core\test\J0\temp\solr.core.TestLazyCores_2C68A00828D76E6E-001\tempDir-001\collection5\data\index' doesn't exist. Creating new index...
   [junit4]   2> 4305 INFO  (coreLoadExecutor-6-thread-2) [    x:collection2] o.a.s.c.CachingDirectoryFactory return new directory for C:\Users\JenkinsSlave\workspace\Lucene-Solr-trunk-Windows\solr\build\solr-core\test\J0\temp\solr.core.TestLazyCores_2C68A00828D76E6E-001\tempDir-001\collection2\data\
   [junit4]   2> 4306 INFO  (coreLoadExecutor-6-thread-2) [    x:collection2] o.a.s.c.SolrCore New index directory detected: old=null new=C:\Users\JenkinsSlave\workspace\Lucene-Solr-trunk-Windows\solr\build\solr-core\test\J0\temp\solr.core.TestLazyCores_2C68A00828D76E6E-001\tempDir-001\collection2\data\index/
   [junit4]   2> 4306 WARN  (coreLoadExecutor-6-thread-2) [    x:collection2] o.a.s.c.SolrCore [collection2] Solr index directory 'C:\Users\JenkinsSlave\workspace\Lucene-Solr-trunk-Windows\solr\build\solr-core\test\J0\temp\solr.core.TestLazyCores_2C68A00828D76E6E-001\tempDir-001\collection2\data\index' doesn't exist. Creating new index...
   [junit4]   2> 4305 INFO  (coreLoadExecutor-6-thread-1) [    x:collection1] o.a.s.c.CachingDirectoryFactory return new directory for C:\Users\JenkinsSlave\workspace\Lucene-Solr-trunk-Windows\solr\build\solr-core\test\J0\temp\solr.core.TestLazyCores_2C68A00828D76E6E-001\tempDir-001\collection1\data\
   [junit4]   2> 4308 INFO  (coreLoadExecutor-6-thread-1) [    x:collection1] o.a.s.c.SolrCore New index directory detected: old=null new=C:\Users\JenkinsSlave\workspace\Lucene-Solr-trunk-Windows\solr\build\solr-core\test\J0\temp\solr.core.TestLazyCores_2C68A00828D76E6E-001\tempDir-001\collection1\data\index/
   [junit4]   2> 4308 WARN  (coreLoadExecutor-6-thread-1) [    x:collection1] o.a.s.c.SolrCore [collection1] Solr index directory 'C:\Users\JenkinsSlave\workspace\Lucene-Solr-trunk-Windows\solr\build\solr-core\test\J0\temp\solr.core.TestLazyCores_2C68A00828D76E6E-001\tempDir-001\collection1\data\index' doesn't exist. Creating new index...
   [junit4]   2> 4328 INFO  (coreLoadExecutor-6-thread-3) [    x:collection5] o.a.s.c.CachingDirectoryFactory return new directory for C:\Users\JenkinsSlave\workspace\Lucene-Solr-trunk-Windows\solr\build\solr-core\test\J0\temp\solr.core.TestLazyCores_2C68A00828D76E6E-001\tempDir-001\collection5\data\index
   [junit4]   2> 4329 INFO  (coreLoadExecutor-6-thread-2) [    x:collection2] o.a.s.c.CachingDirectoryFactory return new directory for C:\Users\JenkinsSlave\workspace\Lucene-Solr-trunk-Windows\solr\build\solr-core\test\J0\temp\solr.core.TestLazyCores_2C68A00828D76E6E-001\tempDir-001\collection2\data\index
   [junit4]   2> 4331 INFO  (coreLoadExecutor-6-thread-1) [    x:collection1] o.a.s.c.CachingDirectoryFactory return new directory for C:\Users\JenkinsSlave\workspace\Lucene-Solr-trunk-Windows\solr\build\solr-core\test\J0\temp\solr.core.TestLazyCores_2C68A00828D76E6E-001\tempDir-001\collection1\data\index
   [junit4]   2> 4343 INFO  (coreLoadExecutor-6-thread-2) [    x:collection2] o.a.s.u.RandomMergePolicy RandomMergePolicy wrapping class org.apache.lucene.index.AlcoholicMergePolicy: [AlcoholicMergePolicy: minMergeSize=0, mergeFactor=10, maxMergeSize=758295146, maxMergeSizeForForcedMerge=9223372036854775807, calibrateSizeByDeletes=true, maxMergeDocs=2147483647, maxCFSSegmentSizeMB=8.796093022207999E12, noCFSRatio=0.1]
   [junit4]   2> 4345 INFO  (coreLoadExecutor-6-thread-3) [    x:collection5] o.a.s.u.RandomMergePolicy RandomMergePolicy wrapping class org.apache.lucene.index.AlcoholicMergePolicy: [AlcoholicMergePolicy: minMergeSize=0, mergeFactor=10, maxMergeSize=758295146, maxMergeSizeForForcedMerge=9223372036854775807, calibrateSizeByDeletes=true, maxMergeDocs=2147483647, maxCFSSegmentSizeMB=8.796093022207999E12, noCFSRatio=0.1]
   [junit4]   2> 4348 INFO  (coreLoadExecutor-6-thread-1) [    x:collection1] o.a.s.u.RandomMergePolicy RandomMergePolicy wrapping class org.apache.lucene.index.AlcoholicMergePolicy: [AlcoholicMergePolicy: minMergeSize=0, mergeFactor=10, maxMergeSize=758295146, maxMergeSizeForForcedMerge=9223372036854775807, calibrateSizeByDeletes=true, maxMergeDocs=2147483647, maxCFSSegmentSizeMB=8.796093022207999E12, noCFSRatio=0.1]
   [junit4]   2> 4512 INFO  (coreLoadExecutor-6-thread-2) [    x:collection2] o.a.s.c.SolrDeletionPolicy SolrDeletionPolicy.onCommit: commits: num=1
   [junit4]   2> 	commit{dir=MockDirectoryWrapper(RAMDirectory@7e96b3f4 lockFactory=org.apache.lucene.store.SingleInstanceLockFactory@2fcddd66),segFN=segments_1,generation=1}
   [junit4]   2> 4514 INFO  (coreLoadExecutor-6-thread-2) [    x:collection2] o.a.s.c.SolrDeletionPolicy newest commit generation = 1
   [junit4]   2> 4514 INFO  (coreLoadExecutor-6-thread-1) [    x:collection1] o.a.s.c.SolrDeletionPolicy SolrDeletionPolicy.onCommit: commits: num=1
   [junit4]   2> 	commit{dir=MockDirectoryWrapper(RAMDirectory@ab91ceb lockFactory=org.apache.lucene.store.SingleInstanceLockFactory@20afc38d),segFN=segments_1,generation=1}
   [junit4]   2> 4515 INFO  (coreLoadExecutor-6-thread-1) [    x:collection1] o.a.s.c.SolrDeletionPolicy newest commit generation = 1
   [junit4]   2> 4516 INFO  (coreLoadExecutor-6-thread-3) [    x:collection5] o.a.s.c.SolrDeletionPolicy SolrDeletionPolicy.onCommit: commits: num=1
   [junit4]   2> 	commit{dir=MockDirectoryWrapper(RAMDirectory@c24d719 lockFactory=org.apache.lucene.store.SingleInstanceLockFactory@7c4ed45b),segFN=segments_1,generation=1}
   [junit4]   2> 4516 INFO  (coreLoadExecutor-6-thread-3) [    x:collection5] o.a.s.c.SolrDeletionPolicy newest commit generation = 1
   [junit4]   2> 4517 INFO  (OldIndexDirectoryCleanupThreadForCore-collection2) [    x:collection2] o.a.s.c.SolrCore Looking for old index directories to cleanup for core collection2 in C:\Users\JenkinsSlave\workspace\Lucene-Solr-trunk-Windows\solr\build\solr-core\test\J0\temp\solr.core.TestLazyCores_2C68A00828D76E6E-001\tempDir-001\collection2\data\
   [junit4]   2> 4529 WARN  (OldIndexDirectoryCleanupThreadForCore-collection2) [    x:collection2] o.a.s.c.DirectoryFactory C:\Users\JenkinsSlave\workspace\Lucene-Solr-trunk-Windows\solr\build\solr-core\test\J0\temp\solr.core.TestLazyCores_2C68A00828D76E6E-001\tempDir-001\collection2\data\ does not point to a valid data directory; skipping clean-up of old index directories.
   [junit4]   2> 4547 INFO  (OldIndexDirectoryCleanupThreadForCore-collection1) [    x:collection1] o.a.s.c.SolrCore Looking for old index directories to cleanup for core collection1 in C:\Users\JenkinsSlave\workspace\Lucene-Solr-trunk-Windows\solr\build\solr-core\test\J0\temp\solr.core.TestLazyCores_2C68A00828D76E6E-001\tempDir-001\collection1\data\
   [junit4]   2> 4547 INFO  (OldIndexDirectoryCleanupThreadForCore-collection5) [    x:collection5] o.a.s.c.SolrCore Looking for old index directories to cleanup for core collection5 in C:\Users\JenkinsSlave\workspace\Lucene-Solr-trunk-Windows\solr\build\solr-core\test\J0\temp\solr.core.TestLazyCores_2C68A00828D76E6E-001\tempDir-001\collection5\data\
   [junit4]   2> 4547 WARN  (OldIndexDirectoryCleanupThreadForCore-collection1) [    x:collection1] o.a.s.c.DirectoryFactory C:\Users\JenkinsSlave\workspace\Lucene-Solr-trunk-Windows\solr\build\solr-core\test\J0\temp\solr.core.TestLazyCores_2C68A00828D76E6E-001\tempDir-001\collection1\data\ does not point to a valid data directory; skipping clean-up of old index directories.
   [junit4]   2> 4548 WARN  (OldIndexDirectoryCleanupThreadForCore-collection5) [    x:collection5] o.a.s.c.DirectoryFactory C:\Users\JenkinsSlave\workspace\Lucene-Solr-trunk-Windows\solr\build\solr-core\test\J0\temp\solr.core.TestLazyCores_2C68A00828D76E6E-001\tempDir-001\collection5\data\ does not point to a valid data directory; skipping clean-up of old index directories.
   [junit4]   2> 5216 INFO  (coreLoadExecutor-6-thread-2) [    x:collection2] o.a.s.c.SolrCore no updateRequestProcessorChain defined as default, creating implicit default
   [junit4]   2> 5216 INFO  (coreLoadExecutor-6-thread-3) [    x:collection5] o.a.s.c.SolrCore no updateRequestProcessorChain defined as default, creating implicit default
   [junit4]   2> 5217 INFO  (coreLoadExecutor-6-thread-1) [    x:collection1] o.a.s.c.SolrCore no updateRequestProcessorChain defined as default, creating implicit default
   [junit4]   2> 5395 INFO  (coreLoadExecutor-6-thread-1) [    x:collection1] o.a.s.h.l.XMLLoader xsltCacheLifetimeSeconds=60
   [junit4]   2> 5395 INFO  (coreLoadExecutor-6-thread-3) [    x:collection5] o.a.s.h.l.XMLLoader xsltCacheLifetimeSeconds=60
   [junit4]   2> 5396 INFO  (coreLoadExecutor-6-thread-2) [    x:collection2] o.a.s.h.l.XMLLoader xsltCacheLifetimeSeconds=60
   [junit4]   2> 5411 INFO  (coreLoadExecutor-6-thread-1) [    x:collection1] o.a.s.h.l.XMLLoader xsltCacheLifetimeSeconds=60
   [junit4]   2> 5412 INFO  (coreLoadExecutor-6-thread-1) [    x:collection1] o.a.s.h.l.XMLLoader xsltCacheLifetimeSeconds=60
   [junit4]   2> 5413 INFO  (coreLoadExecutor-6-thread-1) [    x:collection1] o.a.s.h.l.XMLLoader xsltCacheLifetimeSeconds=60
   [junit4]   2> 5416 INFO  (coreLoadExecutor-6-thread-2) [    x:collection2] o.a.s.h.l.XMLLoader xsltCacheLifetimeSeconds=60
   [junit4]   2> 5418 INFO  (coreLoadExecutor-6-thread-2) [    x:collection2] o.a.s.h.l.XMLLoader xsltCacheLifetimeSeconds=60
   [junit4]   2> 5420 INFO  (coreLoadExecutor-6-thread-3) [    x:collection5] o.a.s.h.l.XMLLoader xsltCacheLifetimeSeconds=60
   [junit4]   2> 5420 INFO  (coreLoadExecutor-6-thread-2) [    x:collection2] o.a.s.h.l.XMLLoader xsltCacheLifetimeSeconds=60
   [junit4]   2> 5426 INFO  (coreLoadExecutor-6-thread-3) [    x:collection5] o.a.s.h.l.XMLLoader xsltCacheLifetimeSeconds=60
   [junit4]   2> 5434 INFO  (coreLoadExecutor-6-thread-3) [    x:collection5] o.a.s.h.l.XMLLoader xsltCacheLifetimeSeconds=60
   [junit4]   2> 5550 INFO  (coreLoadExecutor-6-thread-3) [    x:collection5] o.a.s.c.RequestHandlers Registered paths: /admin/mbeans,/update/csv,/sql,/update/json/docs,/admin/luke,/export,/select,/admin/segments,/get,/admin/system,/replication,/admin/properties,/config,/stream,/schema,/admin/plugins,/admin/logging,/update/json,/admin/threads,/admin/ping,/update,/admin/file
   [junit4]   2> 5550 INFO  (coreLoadExecutor-6-thread-2) [    x:collection2] o.a.s.c.RequestHandlers Registered paths: /admin/mbeans,/update/csv,/sql,/update/json/docs,/admin/luke,/export,/select,/admin/segments,/get,/admin/system,/replication,/admin/properties,/config,/stream,/schema,/admin/plugins,/admin/logging,/update/json,/admin/threads,/admin/ping,/update,/admin/file
   [junit4]   2> 5551 INFO  (coreLoadExecutor-6-thread-1) [    x:collection1] o.a.s.c.RequestHandlers Registered paths: /admin/mbeans,/update/csv,/sql,/update/json/docs,/admin/luke,/export,/select,/admin/segments,/get,/admin/system,/replication,/admin/properties,/config,/stream,/schema,/admin/plugins,/admin/logging,/update/json,/admin/threads,/admin/ping,/update,/admin/file
   [junit4]   2> 5552 INFO  (coreLoadExecutor-6-thread-3) [    x:collection5] o.a.s.c.SolrCore Using default statsCache cache: org.apache.solr.search.stats.LocalStatsCache
   [junit4]   2> 5552 INFO  (coreLoadExecutor-6-thread-2) [    x:collection2] o.a.s.c.SolrCore Using default statsCache cache: org.apache.solr.search.stats.LocalStatsCache
   [junit4]   2> 5558 INFO  (coreLoadExecutor-6-thread-1) [    x:collection1] o.a.s.c.SolrCore Using default statsCache cache: org.apache.solr.search.stats.LocalStatsCache
   [junit4]   2> 5618 INFO  (coreLoadExecutor-6-thread-3) [    x:collection5] o.a.s.u.CommitTracker Hard AutoCommit: disabled
   [junit4]   2> 5618 INFO  (coreLoadExecutor-6-thread-2) [    x:collection2] o.a.s.u.CommitTracker Hard AutoCommit: disabled
   [junit4]   2> 5620 INFO  (coreLoadExecutor-6-thread-2) [    x:collection2] o.a.s.u.CommitTracker Soft AutoCommit: disabled
   [junit4]   2> 5618 INFO  (coreLoadExecutor-6-thread-1) [    x:collection1] o.a.s.u.CommitTracker Hard AutoCommit: disabled
   [junit4]   2> 5621 INFO  (coreLoadExecutor-6-thread-1) [    x:collection1] o.a.s.u.CommitTracker Soft AutoCommit: disabled
   [junit4]   2> 5620 INFO  (coreLoadExecutor-6-thread-3) [    x:collection5] o.a.s.u.CommitTracker Soft AutoCommit: disabled
   [junit4]   2> 5621 INFO  (coreLoadExecutor-6-thread-2) [    x:collection2] o.a.s.u.RandomMergePolicy RandomMergePolicy wrapping class org.apache.lucene.index.LogDocMergePolicy: [LogDocMergePolicy: minMergeSize=1000, mergeFactor=47, maxMergeSize=9223372036854775807, maxMergeSizeForForcedMerge=9223372036854775807, calibrateSizeByDeletes=false, maxMergeDocs=2147483647, maxCFSSegmentSizeMB=8.796093022207999E12, noCFSRatio=0.19337577699883823]
   [junit4]   2> 5626 INFO  (coreLoadExecutor-6-thread-3) [    x:collection5] o.a.s.u.RandomMergePolicy RandomMergePolicy wrapping class org.apache.lucene.index.LogDocMergePolicy: [LogDocMergePolicy: minMergeSize=1000, mergeFactor=47, maxMergeSize=9223372036854775807, maxMergeSizeForForcedMerge=9223372036854775807, calibrateSizeByDeletes=false, maxMergeDocs=2147483647, maxCFSSegmentSizeMB=8.796093022207999E12, noCFSRatio=0.19337577699883823]
   [junit4]   2> 5630 INFO  (coreLoadExecutor-6-thread-2) [    x:collection2] o.a.s.c.SolrDeletionPolicy SolrDeletionPolicy.onInit: commits: num=1
   [junit4]   2> 	commit{dir=MockDirectoryWrapper(RAMDirectory@7e96b3f4 lockFactory=org.apache.lucene.store.SingleInstanceLockFactory@2fcddd66),segFN=segments_1,generation=1}
   [junit4]   2> 5630 INFO  (coreLoadExecutor-6-thread-2) [    x:collection2] o.a.s.c.SolrDeletionPolicy newest commit generation = 1
   [junit4]   2> 5621 INFO  (coreLoadExecutor-6-thread-1) [    x:collection1] o.a.s.u.RandomMergePolicy RandomMergePolicy wrapping class org.apache.lucene.index.LogDocMergePolicy: [LogDocMergePolicy: minMergeSize=1000, mergeFactor=47, maxMergeSize=9223372036854775807, maxMergeSizeForForcedMerge=9223372036854775807, calibrateSizeByDeletes=false, maxMergeDocs=2147483647, maxCFSSegmentSizeMB=8.796093022207999E12, noCFSRatio=0.19337577699883823]
   [junit4]   2> 5641 INFO  (coreLoadExecutor-6-thread-1) [    x:collection1] o.a.s.c.SolrDeletionPolicy SolrDeletionPolicy.onInit: commits: num=1
   [junit4]   2> 	commit{dir=MockDirectoryWrapper(RAMDirectory@ab91ceb lockFactory=org.apache.lucene.store.SingleInstanceLockFactory@20afc38d),segFN=segments_1,generation=1}
   [junit4]   2> 5642 INFO  (coreLoadExecutor-6-thread-1) [    x:collection1] o.a.s.c.SolrDeletionPolicy newest commit generation = 1
   [junit4]   2> 5642 INFO  (coreLoadExecutor-6-thread-3) [    x:collection5] o.a.s.c.SolrDeletionPolicy SolrDeletionPolicy.onInit: commits: num=1
   [junit4]   2> 	commit{dir=MockDirectoryWrapper(RAMDirectory@c24d719 lockFactory=org.apache.lucene.store.SingleInstanceLockFactory@7c4ed45b),segFN=segments_1,generation=1}
   [junit4]   2> 5642 INFO  (coreLoadExecutor-6-thread-3) [    x:collection5] o.a.s.c.SolrDeletionPolicy newest commit generation = 1
   [junit4]   2> 5705 INFO  (coreLoadExecutor-6-thread-3) [    x:collection5] o.a.s.s.SolrIndexSearcher Opening [Searcher@5731efd9[collection5] main]
   [junit4]   2> 5705 INFO  (coreLoadExecutor-6-thread-2) [    x:collection2] o.a.s.s.SolrIndexSearcher Opening [Searcher@4b6c1009[collection2] main]
   [junit4]   2> 5705 INFO  (coreLoadExecutor-6-thread-1) [    x:collection1] o.a.s.s.SolrIndexSearcher Opening [Searcher@5df48b60[collection1] main]
   [junit4]   2> 5734 INFO  (coreLoadExecutor-6-thread-3) [    x:collection5] o.a.s.r.ManagedResourceStorage File-based storage initialized to use dir: C:\Users\JenkinsSlave\workspace\Lucene-Solr-trunk-Windows\solr\build\solr-core\test\J0\temp\solr.core.TestLazyCores_2C68A00828D76E6E-001\tempDir-001\collection5\conf
   [junit4]   2> 5734 INFO  (coreLoadExecutor-6-thread-1) [    x:collection1] o.a.s.r.ManagedResourceStorage File-based storage initialized to use dir: C:\Users\JenkinsSlave\workspace\Lucene-Solr-trunk-Windows\solr\build\solr-core\test\J0\temp\solr.core.TestLazyCores_2C68A00828D76E6E-001\tempDir-001\collection1\conf
   [junit4]   2> 5736 INFO  (coreLoadExecutor-6-thread-3) [    x:collection5] o.a.s.r.RestManager Initializing RestManager with initArgs: {storageDir=C:\Users\JenkinsSlave\workspace\Lucene-Solr-trunk-Windows\solr\build\solr-core\test\J0\temp\solr.core.TestLazyCores_2C68A00828D76E6E-001\tempDir-001\collection5\conf}
   [junit4]   2> 5734 INFO  (coreLoadExecutor-6-thread-2) [    x:collection2] o.a.s.r.ManagedResourceStorage File-based storage initialized to use dir: C:\Users\JenkinsSlave\workspace\Lucene-Solr-trunk-Windows\solr\build\solr-core\test\J0\temp\solr.core.TestLazyCores_2C68A00828D76E6E-001\tempDir-001\collection2\conf
   [junit4]   2> 5736 INFO  (coreLoadExecutor-6-thread-2) [    x:collection2] o.a.s.r.RestManager Initializing RestManager with initArgs: {storageDir=C:\Users\JenkinsSlave\workspace\Lucene-Solr-trunk-Windows\solr\build\solr-core\test\J0\temp\solr.core.TestLazyCores_2C68A00828D76E6E-001\tempDir-001\collection2\conf}
   [junit4]   2> 5736 INFO  (coreLoadExecutor-6-thread-1) [    x:collection1] o.a.s.r.RestManager Initializing RestManager with initArgs: {storageDir=C:\Users\JenkinsSlave\workspace\Lucene-Solr-trunk-Windows\solr\build\solr-core\test\J0\temp\solr.core.TestLazyCores_2C68A00828D76E6E-001\tempDir-001\collection1\conf}
   [junit4]   2> 5796 INFO  (coreLoadExecutor-6-thread-1) [    x:collection1] o.a.s.r.ManagedResourceStorage Reading _rest_managed.json using file:dir=C:\Users\JenkinsSlave\workspace\Lucene-Solr-trunk-Windows\solr\build\solr-core\test\J0\temp\solr.core.TestLazyCores_2C68A00828D76E6E-001\tempDir-001\collection1\conf
   [junit4]   2> 5796 INFO  (coreLoadExecutor-6-thread-3) [    x:collection5] o.a.s.r.ManagedResourceStorage Reading _rest_managed.json using file:dir=C:\Users\JenkinsSlave\workspace\Lucene-Solr-trunk-Windows\solr\build\solr-core\test\J0\temp\solr.core.TestLazyCores_2C68A00828D76E6E-001\tempDir-001\collection5\conf
   [junit4]   2> 5797 INFO  (coreLoadExecutor-6-thread-1) [    x:collection1] o.a.s.r.RestManager Initializing 0 registered ManagedResources
   [junit4]   2> 5796 INFO  (coreLoadExecutor-6-thread-2) [    x:collection2] o.a.s.r.ManagedResourceStorage Reading _rest_managed.json using file:dir=C:\Users\JenkinsSlave\workspace\Lucene-Solr-trunk-Windows\solr\build\solr-core\test\J0\temp\solr.core.TestLazyCores_2C68A00828D76E6E-001\tempDir-001\collection2\conf
   [junit4]   2> 5797 INFO  (coreLoadExecutor-6-thread-2) [    x:collection2] o.a.s.r.RestManager Initializing 0 registered ManagedResources
   [junit4]   2> 5797 INFO  (coreLoadExecutor-6-thread-3) [    x:collection5] o.a.s.r.RestManager Initializing 0 registered ManagedResources
   [junit4]   2> 5870 INFO  (coreLoadExecutor-6-thread-1) [    x:collection1] o.a.s.h.ReplicationHandler Commits will be reserved for  10000
   [junit4]   2> 5870 INFO  (coreLoadExecutor-6-thread-3) [    x:collection5] o.a.s.h.ReplicationHandler Commits will be reserved for  10000
   [junit4]   2> 5870 INFO  (coreLoadExecutor-6-thread-2) [    x:collection2] o.a.s.h.ReplicationHandler Commits will be reserved for  10000
   [junit4]   2> 5931 INFO  (searcherExecutor-7-thread-1-processing-x:collection1) [    x:collection1] o.a.s.c.SolrCore [collection1] Registered new searcher Searcher@5df48b60[collection1] main{ExitableDirectoryReader(UninvertingDirectoryReader())}
   [junit4]   2> 5932 INFO  (searcherExecutor-8-thread-1-processing-x:collection2) [    x:collection2] o.a.s.c.SolrCore [collection2] Registered new searcher Searcher@4b6c1009[collection2] main{ExitableDirectoryReader(UninvertingDirectoryReader())}
   [junit4]   2> 5932 INFO  (coreLoadExecutor-6-thread-2) [    x:collection2] o.a.s.c.SolrCores Opening transient core collection2
   [junit4]   2> 5932 INFO  (searcherExecutor-9-thread-1-processing-x:collection5) [    x:collection5] o.a.s.c.SolrCore [collection5] Registered new searcher Searcher@5731efd9[collection5] main{ExitableDirectoryReader(UninvertingDirectoryReader())}
   [junit4]   2> 5932 INFO  (coreLoadExecutor-6-thread-1) [    x:collection1] o.a.s.c.CoreContainer registering core: collection1
   [junit4]   2> 5932 INFO  (coreLoadExecutor-6-thread-2) [    x:collection2] o.a.s.c.CoreContainer registering core: collection2
   [junit4]   2> 5933 INFO  (coreLoadExecutor-6-thread-3) [    x:collection5] o.a.s.c.CoreContainer registering core: collection5
   [junit4]   2> 5940 INFO  (TEST-TestLazyCores.testLazyLoad-seed#[2C68A00828D76E6E]) [    ] o.a.s.c.SolrResourceLoader new SolrResourceLoader for directory: 'C:\Users\JenkinsSlave\workspace\Lucene-Solr-trunk-Windows\solr\build\solr-core\test\J0\temp\solr.core.TestLazyCores_2C68A00828D76E6E-001\tempDir-001\collection3'
   [junit4]   2> 5940 INFO  (TEST-TestLazyCores.testLazyLoad-seed#[2C68A00828D76E6E]) [    ] o.a.s.c.SolrResourceLoader JNDI not configured for solr (NoInitialContextEx)
   [junit4]   2> 5940 INFO  (TEST-TestLazyCores.testLazyLoad-seed#[2C68A00828D76E6E]) [    ] o.a.s.c.SolrResourceLoader solr home defaulted to 'solr/' (could not find system property or JNDI)
   [junit4]   2> 5966 INFO  (TEST-TestLazyCores.testLazyLoad-seed#[2C68A00828D76E6E]) [    ] o.a.s.c.SolrConfig current version of requestparams : -1
   [junit4]   2> 5973 INFO  (TEST-TestLazyCores.testLazyLoad-seed#[2C68A00828D76E6E]) [    ] o.a.s.c.SolrConfig Using Lucene MatchVersion: 6.0.0
   [junit4]   2> 5990 INFO  (TEST-TestLazyCores.testLazyLoad-seed#[2C68A00828D76E6E]) [    ] o.a.s.c.SolrConfig Loaded SolrConfig: solrconfig.xml
   [junit4]   2> 5998 INFO  (TEST-TestLazyCores.testLazyLoad-seed#[2C68A00828D76E6E]) [    ] o.a.s.s.IndexSchema [collection3] Schema name=tiny
   [junit4]   2> 6005 INFO  (TEST-TestLazyCores.testLazyLoad-seed#[2C68A00828D76E6E]) [    ] o.a.s.s.IndexSchema unique key field: id
   [junit4]   2> 6012 INFO  (TEST-TestLazyCores.testLazyLoad-seed#[2C68A00828D76E6E]) [    ] o.a.s.c.ConfigSetProperties Did not find ConfigSet properties, assuming default properties: Can't find resource 'configsetprops.json' in classpath or 'C:\Users\JenkinsSlave\workspace\Lucene-Solr-trunk-Windows\solr\build\solr-core\test\J0\temp\solr.core.TestLazyCores_2C68A00828D76E6E-001\tempDir-001\collection3'
   [junit4]   2> 6012 INFO  (TEST-TestLazyCores.testLazyLoad-seed#[2C68A00828D76E6E]) [    ] o.a.s.c.CoreContainer Creating SolrCore 'collection3' using configuration from instancedir C:\Users\JenkinsSlave\workspace\Lucene-Solr-trunk-Windows\solr\build\solr-core\test\J0\temp\solr.core.TestLazyCores_2C68A00828D76E6E-001\tempDir-001\collection3
   [junit4]   2> 6013 INFO  (TEST-TestLazyCores.testLazyLoad-seed#[2C68A00828D76E6E]) [    x:collection3] o.a.s.c.SolrCore org.apache.solr.core.MockDirectoryFactory
   [junit4]   2> 6013 INFO  (TEST-TestLazyCores.testLazyLoad-seed#[2C68A00828D76E6E]) [    x:collection3] o.a.s.c.SolrCore [[collection3] ] Opening new SolrCore at [C:\Users\JenkinsSlave\workspace\Lucene-Solr-trunk-Windows\solr\build\solr-core\test\J0\temp\solr.core.TestLazyCores_2C68A00828D76E6E-001\tempDir-001\collection3], dataDir=[C:\Users\JenkinsSlave\workspace\Lucene-Solr-trunk-Windows\solr\build\solr-core\test\J0\temp\solr.core.TestLazyCores_2C68A00828D76E6E-001\tempDir-001\collection3\data\]
   [junit4]   2> 6013 INFO  (TEST-TestLazyCores.testLazyLoad-seed#[2C68A00828D76E6E]) [    x:collection3] o.a.s.c.SolrCore JMX monitoring not detected for core: collection3
   [junit4]   2> 6014 INFO  (TEST-TestLazyCores.testLazyLoad-seed#[2C68A00828D76E6E]) [    x:collection3] o.a.s.c.CachingDirectoryFactory return new directory for C:\Users\JenkinsSlave\workspace\Lucene-Solr-trunk-Windows\solr\build\solr-core\test\J0\temp\solr.core.TestLazyCores_2C68A00828D76E6E-001\tempDir-001\collection3\data\
   [junit4]   2> 6014 INFO  (TEST-TestLazyCores.testLazyLoad-seed#[2C68A00828D76E6E]) [    x:collection3] o.a.s.c.SolrCore New index directory detected: old=null new=C:\Users\JenkinsSlave\workspace\Lucene-Solr-trunk-Windows\solr\build\solr-core\test\J0\temp\solr.core.TestLazyCores_2C68A00828D76E6E-001\tempDir-001\collection3\data\index/
   [junit4]   2> 6014 WARN  (TEST-TestLazyCores.testLazyLoad-seed#[2C68A00828D76E6E]) [    x:collection3] o.a.s.c.SolrCore [collection3] Solr index directory 'C:\Users\JenkinsSlave\workspace\Lucene-Solr-trunk-Windows\solr\build\solr-core\test\J0\temp\solr.core.TestLazyCores_2C68A00828D76E6E-001\tempDir-001\collection3\data\index' doesn't exist. Creating new index...
   [junit4]   2> 6015 INFO  (TEST-TestLazyCores.testLazyLoad-seed#[2C68A00828D76E6E]) [    x:collection3] o.a.s.c.CachingDirectoryFactory return new directory for C:\Users\JenkinsSlave\workspace\Lucene-Solr-trunk-Windows\solr\build\solr-core\test\J0\temp\solr.core.TestLazyCores_2C68A00828D76E6E-001\tempDir-001\collection3\data\index
   [junit4]   2> 6015 INFO  (TEST-TestLazyCores.testLazyLoad-seed#[2C68A00828D76E6E]) [    x:collection3] o.a.s.u.RandomMergePolicy RandomMergePolicy wrapping class org.apache.lucene.index.TieredMergePolicy: [TieredMergePolicy: maxMergeAtOnce=15, maxMergeAtOnceExplicit=39, maxMergedSegmentMB=2.43359375, floorSegmentMB=1.3388671875, forceMergeDeletesPctAllowed=20.100846529431024, segmentsPerTier=46.0, maxCFSSegmentSizeMB=8.796093022207999E12, noCFSRatio=0.0
   [junit4]   2> 6016 INFO  (TEST-TestLazyCores.testLazyLoad-seed#[2C68A00828D76E6E]) [    x:collection3] o.a.s.c.SolrDeletionPolicy SolrDeletionPolicy.onCommit: commits: num=1
   [junit4]   2> 	commit{dir=MockDirectoryWrapper(RAMDirectory@bd6c2e9 lockFactory=org.apache.lucene.store.SingleInstanceLockFactory@63c55354),segFN=segments_1,generation=1}
   [junit4]   2> 6016 INFO  (TEST-TestLazyCores.testLazyLoad-seed#[2C68A00828D76E6E]) [    x:collection3] o.a.s.c.SolrDeletionPolicy newest commit generation = 1
   [junit4]   2> 6017 INFO  (TEST-TestLazyCores.testLazyLoad-seed#[2C68A00828D76E6E]) [    x:collection3] o.a.s.c.SolrCore no updateRequestProcessorChain defined as default, creating implicit default
   [junit4]   2> 6019 INFO  (TEST-TestLazyCores.testLazyLoad-seed#[2C68A00828D76E6E]) [    x:collection3] o.a.s.h.l.XMLLoader xsltCacheLifetimeSeconds=60
   [junit4]   2> 6020 INFO  (TEST-TestLazyCores.testLazyLoad-seed#[2C68A00828D76E6E]) [    x:collection3] o.a.s.h.l.XMLLoader xsltCacheLifetimeSeconds=60
   [junit4]   2> 6021 INFO  (OldIndexDirectoryCleanupThreadForCore-collection3) [    x:collection3] o.a.s.c.SolrCore Looking for old index directories to cleanup for core collection3 in C:\Users\JenkinsSlave\workspace\Lucene-Solr-trunk-Windows\solr\build\solr-core\test\J0\temp\solr.core.TestLazyCores_2C68A00828D76E6E-001\tempDir-001\collection3\data\
   [junit4]   2> 6021 WARN  (OldIndexDirectoryCleanupThreadForCore-collection3) [    x:collection3] o.a.s.c.DirectoryFactory C:\Users\JenkinsSlave\workspace\Lucene-Solr-trunk-Windows\solr\build\solr-core\test\J0\temp\solr.core.TestLazyCores_2C68A00828D76E6E-001\tempDir-001\collection3\data\ does not point to a valid data directory; skipping clean-up of old index directories.
   [junit4]   2> 6023 INFO  (TEST-TestLazyCores.testLazyLoad-seed#[2C68A00828D76E6E]) [    x:collection3] o.a.s.h.l.XMLLoader xsltCacheLifetimeSeconds=60
   [junit4]   2> 6027 INFO  (TEST-TestLazyCores.testLazyLoad-seed#[2C68A00828D76E6E]) [    x:collection3] o.a.s.h.l.XMLLoader xsltCacheLifetimeSeconds=60
   [junit4]   2> 6030 INFO  (TEST-TestLazyCores.testLazyLoad-seed#[2C68A00828D76E6E]) [    x:collection3] o.a.s.c.RequestHandlers Registered paths: /admin/mbeans,/update/csv,/sql,/update/json/docs,/admin/luke,/export,/select,/admin/segments,/get,/admin/system,/replication,/admin/properties,/config,/stream,/schema,/admin/plugins,/admin/logging,/update/json,/admin/threads,/admin/ping,/update,/admin/file
   [junit4]   2> 6031 INFO  (TEST-TestLazyCores.testLazyLoad-seed#[2C68A00828D76E6E]) [    x:collection3] o.a.s.c.SolrCore Using default statsCache cache: org.apache.solr.search.stats.LocalStatsCache
   [junit4]   2> 6032 INFO  (TEST-TestLazyCores.testLazyLoad-seed#[2C68A00828D76E6E]) [    x:collection3] o.a.s.u.CommitTracker Hard AutoCommit: disabled
   [junit4]   2> 6032 INFO  (TEST-TestLazyCores.testLazyLoad-seed#[2C68A00828D76E6E]) [    x:collection3] o.a.s.u.CommitTracker Soft AutoCommit: disabled
   [junit4]   2> 6032 INFO  (TEST-TestLazyCores.testLazyLoad-seed#[2C68A00828D76E6E]) [    x:collection3] o.a.s.u.RandomMergePolicy RandomMergePolicy wrapping class org.apache.lucene.index.TieredMergePolicy: [TieredMergePolicy: maxMergeAtOnce=45, maxMergeAtOnceExplicit=12, maxMergedSegmentMB=91.6513671875, floorSegmentMB=0.984375, forceMergeDeletesPctAllowed=3.037971666230365, segmentsPerTier=28.0, maxCFSSegmentSizeMB=8.796093022207999E12, noCFSRatio=1.0
   [junit4]   2> 6033 INFO  (TEST-TestLazyCores.testLazyLoad-seed#[2C68A00828D76E6E]) [    x:collection3] o.a.s.c.SolrDeletionPolicy SolrDeletionPolicy.onInit: commits: num=1
   [junit4]   2> 	commit{dir=MockDirectoryWrapper(RAMDirectory@bd6c2e9 lockFactory=org.apache.lucene.store.SingleInstanceLockFactory@63c55354),segFN=segments_1,generation=1}
   [junit4]   2> 6033 INFO  (TEST-TestLazyCores.testLazyLoad-seed#[2C68A00828D76E6E]) [    x:collection3] o.a.s.c.SolrDeletionPolicy newest commit generation = 1
   [junit4]   2> 6034 INFO  (TEST-TestLazyCores.testLazyLoad-seed#[2C68A00828D76E6E]) [    x:collection3] o.a.s.s.SolrIndexSearcher Opening [Searcher@394f810d[collection3] main]
   [junit4]   2> 6035 INFO  (TEST-TestLazyCores.testLazyLoad-seed#[2C68A00828D76E6E]) [    x:collection3] o.a.s.r.ManagedResourceStorage File-based storage initialized to use dir: C:\Users\JenkinsSlave\workspace\Lucene-Solr-trunk-Windows\solr\build\solr-core\test\J0\temp\solr.core.TestLazyCores_2C68A00828D76E6E-001\tempDir-001\collection3\conf
   [junit4]   2> 6035 INFO  (TEST-TestLazyCores.testLazyLoad-seed#[2C68A00828D76E6E]) [    x:collection3] o.a.s.r.RestManager Initializing RestManager with initArgs: {storageDir=C:\Users\JenkinsSlave\workspace\Lucene-Solr-trunk-Windows\solr\build\solr-core\test\J0\temp\solr.core.TestLazyCores_2C68A00828D76E6E-001\tempDir-001\collection3\conf}
   [junit4]   2> 6035 INFO  (TEST-TestLazyCores.testLazyLoad-seed#[2C68A00828D76E6E]) [    x:collection3] o.a.s.r.ManagedResourceStorage Reading _rest_managed.json using file:dir=C:\Users\JenkinsSlave\workspace\Lucene-Solr-trunk-Windows\solr\build\solr-core\test\J0\temp\solr.core.TestLazyCores_2C68A00828D76E6E-001\tempDir-001\collection3\conf
   [junit4]   2> 6036 INFO  (TEST-TestLazyCores.testLazyLoad-seed#[2C68A00828D76E6E]) [    x:collection3] o.a.s.r.RestManager Initializing 0 registered ManagedResources
   [junit4]   2> 6036 INFO  (TEST-TestLazyCores.testLazyLoad-seed#[2C68A00828D76E6E]) [    x:collection3] o.a.s.h.ReplicationHandler Commits will be reserved for  10000
   [junit4]   2> 6037 INFO  (TEST-TestLazyCores.testLazyLoad-seed#[2C68A00828D76E6E]) [    x:collection3] o.a.s.c.SolrCores Opening transient core collection3
   [junit4]   2> 6041 INFO  (TEST-TestLazyCores.testLazyLoad-seed#[2C68A00828D76E6E]) [    x:collection3] o.a.s.c.CoreContainer registering core: collection3
   [junit4]   2> 6041 INFO  (TEST-TestLazyCores.testLazyLoad-seed#[2C68A00828D76E6E]) [    x:collection3] o.a.s.c.SolrResourceLoader new SolrResourceLoader for directory: 'C:\Users\JenkinsSlave\workspace\Lucene-Solr-trunk-Windows\solr\build\solr-core\test\J0\temp\solr.core.TestLazyCores_2C68A00828D76E6E-001\tempDir-001\collection4'
   [junit4]   2> 6042 INFO  (TEST-TestLazyCores.testLazyLoad-seed#[2C68A00828D76E6E]) [    x:collection3] o.a.s.c.SolrResourceLoader JNDI not configured for solr (NoInitialContextEx)
   [junit4]   2> 6042 INFO  (TEST-TestLazyCores.testLazyLoad-seed#[2C68A00828D76E6E]) [    x:collection3] o.a.s.c.SolrResourceLoader solr home defaulted to 'solr/' (could not find system property or JNDI)
   [junit4]   2> 6043 INFO  (searcherExecutor-19-thread-1-processing-x:collection3) [    x:collection3] o.a.s.c.SolrCore [collection3] Registered new searcher Searcher@394f810d[collection3] main{ExitableDirectoryReader(UninvertingDirectoryReader())}
   [junit4]   2> 6062 INFO  (TEST-TestLazyCores.testLazyLoad-seed#[2C68A00828D76E6E]) [    x:collection3] o.a.s.c.SolrConfig current version of requestparams : -1
   [junit4]   2> 6075 INFO  (TEST-TestLazyCores.testLazyLoad-seed#[2C68A00828D76E6E]) [    x:collection3] o.a.s.c.SolrConfig Using Lucene MatchVersion: 6.0.0
   [junit4]   2> 6116 INFO  (TEST-TestLazyCores.testLazyLoad-seed#[2C68A00828D76E6E]) [    x:collection3] o.a.s.c.SolrConfig Loaded SolrConfig: solrconfig.xml
   [junit4]   2> 6124 INFO  (TEST-TestLazyCores.testLazyLoad-seed#[2C68A00828D76E6E]) [    x:collection3] o.a.s.s.IndexSchema [collection4] Schema name=tiny
   [junit4]   2> 6130 INFO  (TEST-TestLazyCores.testLazyLoad-seed#[2C68A00828D76E6E]) [    x:collection3] o.a.s.s.IndexSchema unique key field: id
   [junit4]   2> 6132 INFO  (TEST-TestLazyCores.testLazyLoad-seed#[2C68A00828D76E6E]) [    x:collection3] o.a.s.c.ConfigSetProperties Did not find ConfigSet properties, assuming default properties: Can't find resource 'configsetprops.json' in classpath or 'C:\Users\JenkinsSlave\workspace\Lucene-Solr-trunk-Windows\solr\build\solr-core\test\J0\temp\solr.core.TestLazyCores_2C68A00828D76E6E-001\tempDir-001\collection4'
   [junit4]   2> 6132 INFO  (TEST-TestLazyCores.testLazyLoad-seed#[2C68A00828D76E6E]) [    x:collection3] o.a.s.c.CoreContainer Creating SolrCore 'collection4' using configuration from instancedir C:\Users\JenkinsSlave\workspace\Lucene-Solr-trunk-Windows\solr\build\solr-core\test\J0\temp\solr.core.TestLazyCores_2C68A00828D76E6E-001\tempDir-001\collection4
   [junit4]   2> 6132 INFO  (TEST-TestLazyCores.testLazyLoad-seed#[2C68A00828D76E6E]) [    x:collection4] o.a.s.c.SolrCore org.apache.solr.core.MockDirectoryFactory
   [junit4]   2> 6132 INFO  (TEST-TestLazyCores.testLazyLoad-seed#[2C68A00828D76E6E]) [    x:collection4] o.a.s.c.SolrCore [[collection4] ] Opening new SolrCore at [C:\Users\JenkinsSlave\workspace\Lucene-Solr-trunk-Windows\solr\build\solr-core\test\J0\temp\solr.core.TestLazyCores_2C68A00828D76E6E-001\tempDir-001\collection4], dataDir=[C:\Users\JenkinsSlave\workspace\Lucene-Solr-trunk-Windows\solr\build\solr-core\test\J0\temp\solr.core.TestLazyCores_2C68A00828D76E6E-001\tempDir-001\collection4\data\]
   [junit4]   2> 6133 INFO  (TEST-TestLazyCores.testLazyLoad-seed#[2C68A00828D76E6E]) [    x:collection4] o.a.s.c.SolrCore JMX monitoring not detected for core: collection4
   [junit4]   2> 6133 INFO  (TEST-TestLazyCores.testLazyLoad-seed#[2C68A00828D76E6E]) [    x:collection4] o.a.s.c.CachingDirectoryFactory return new directory for C:\Users\JenkinsSlave\workspace\Lucene-Solr-trunk-Windows\solr\build\solr-core\test\J0\temp\solr.core.TestLazyCores_2C68A00828D76E6E-001\tempDir-001\collection4\data\
   [junit4]   2> 6133 INFO  (TEST-TestLazyCores.testLazyLoad-seed#[2C68A00828D76E6E]) [    x:collection4] o.a.s.c.SolrCore New index directory detected: old=null new=C:\Users\JenkinsSlave\workspace\Lucene-Solr-trunk-Windows\solr\build\solr-core\test\J0\temp\solr.core.TestLazyCores_2C68A00828D76E6E-001\tempDir-001\collection4\data\index/
   [junit4]   2> 6133 WARN  (TEST-TestLazyCores.testLazyLoad-seed#[2C68A00828D76E6E]) [    x:collection4] o.a.s.c.SolrCore [collection4] Solr index directory 'C:\Users\JenkinsSlave\workspace\Lucene-Solr-trunk-Windows\solr\build\solr-core\test\J0\temp\solr.core.TestLazyCores_2C68A00828D76E6E-001\tempDir-001\collection4\data\index' doesn't exist. Creating new index...
   [junit4]   2> 6134 INFO  (TEST-TestLazyCores.testLazyLoad-seed#[2C68A00828D76E6E]) [    x:collection4] o.a.s.c.CachingDirectoryFactory return new directory for C:\Users\JenkinsSlave\workspace\Lucene-Solr-trunk-Windows\solr\build\solr-core\test\J0\temp\solr.core.TestLazyCores_2C68A00828D76E6E-001\tempDir-001\collection4\data\index
   [junit4]   2> 6134 INFO  (TEST-TestLazyCores.testLazyLoad-seed#[2C68A00828D76E6E]) [    x:collection4] o.a.s.u.RandomMergePolicy RandomMergePolicy wrapping class org.apache.lucene.index.TieredMergePolicy: [TieredMergePolicy: maxMergeAtOnce=36, maxMergeAtOnceExplicit=45, maxMergedSegmentMB=35.3974609375, floorSegmentMB=2.16796875, forceMergeDeletesPctAllowed=27.119007753968944, segmentsPerTier=50.0, maxCFSSegmentSizeMB=8.796093022207999E12, noCFSRatio=0.7572747866159023
   [junit4]   2> 6135 INFO  (TEST-TestLazyCores.testLazyLoad-seed#[2C68A00828D76E6E]) [    x:collection4] o.a.s.c.SolrDeletionPolicy SolrDeletionPolicy.onCommit: commits: num=1
   [junit4]   2> 	commit{dir=MockDirectoryWrapper(RAMDirectory@3abaf4fb lockFactory=org.apache.lucene.store.SingleInstanceLockFactory@61008d4d),segFN=segments_1,generation=1}
   [junit4]   2> 6135 INFO  (TEST-TestLazyCores.testLazyLoad-seed#[2C68A00828D76E6E]) [    x:collection4] o.a.s.c.SolrDeletionPolicy newest commit generation = 1
   [junit4]   2> 6137 INFO  (TEST-TestLazyCores.testLazyLoad-seed#[2C68A00828D76E6E]) [    x:collection4] o.a.s.c.SolrCore no updateRequestProcessorChain defined as default, creating implicit default
   [junit4]   2> 6139 INFO  (TEST-TestLazyCores.testLazyLoad-seed#[2C68A00828D76E6E]) [    x:collection4] o.a.s.h.l.XMLLoader xsltCacheLifetimeSeconds=60
   [junit4]   2> 6142 INFO  (TEST-TestLazyCores.testLazyLoad-seed#[2C68A00828D76E6E]) [    x:collection4] o.a.s.h.l.XMLLoader xsltCacheLifetimeSeconds=60
   [junit4]   2> 6143 INFO  (TEST-TestLazyCores.testLazyLoad-seed#[2C68A00828D76E6E]) [    x:collection4] o.a.s.h.l.XMLLoader xsltCacheLifetimeSeconds=60
   [junit4]   2> 6144 INFO  (TEST-TestLazyCores.testLazyLoad-seed#[2C68A00828D76E6E]) [    x:collection4] o.a.s.h.l.XMLLoader xsltCacheLifetimeSeconds=60
   [junit4]   2> 6145 INFO  (OldIndexDirectoryCleanupThreadForCore-collection4) [    x:collection4] o.a.s.c.SolrCore Looking for old index directories to cleanup for core collection4 in C:\Users\JenkinsSlave\workspace\Lucene-Solr-trunk-Windows\solr\build\solr-core\test\J0\temp\solr.core.TestLazyCores_2C68A00828D76E6E-001\tempDir-001\collection4\data\
   [junit4]   2> 6146 WARN  (OldIndexDirectoryCleanupThreadForCore-collection4) [    x:collection4] o.a.s.c.DirectoryFactory C:\Users\JenkinsSlave\workspace\Lucene-Solr-trunk-Windows\solr\build\solr-core\test\J0\temp\solr.core.TestLazyCores_2C68A00828D76E6E-001\tempDir-001\collection4\data\ does not point to a valid data directory; skipping clean-up of old index directories.
   [junit4]   2> 6147 INFO  (TEST-TestLazyCores.testLazyLoad-seed#[2C68A00828D76E6E]) [    x:collection4] o.a.s.c.RequestHandlers Registered paths: /admin/mbeans,/update/csv,/sql,/update/json/docs,/admin/luke,/export,/select,/admin/segments,/get,/admin/system,/replication,/admin/properties,/config,/stream,/schema,/admin/plugins,/admin/logging,/update/json,/admin/threads,/admin/ping,/update,/admin/file
   [junit4]   2> 6147 INFO  (TEST-TestLazyCores.testLazyLoad-seed#[2C68A00828D76E6E]) [    x:collection4] o.a.s.c.SolrCore Using default statsCache cache: org.apache.solr.search.stats.LocalStatsCache
   [junit4]   2> 6148 INFO  (TEST-TestLazyCores.testLazyLoad-seed#[2C68A00828D76E6E]) [    x:collection4] o.a.s.u.CommitTracker Hard AutoCommit: disabled
   [junit4]   2> 6148 INFO  (TEST-TestLazyCores.testLazyLoad-seed#[2C68A00828D76E6E]) [    x:collection4] o.a.s.u.CommitTracker Soft AutoCommit: disabled
   [junit4]   2> 6148 INFO  (TEST-TestLazyCores.testLazyLoad-seed#[2C68A00828D76E6E]) [    x:collection4] o.a.s.u.RandomMergePolicy RandomMergePolicy wrapping class org.apache.lucene.index.LogDocMergePolicy: [LogDocMergePolicy: minMergeSize=1000, mergeFactor=16, maxMergeSize=9223372036854775807, maxMergeSizeForForcedMerge=9223372036854775807, calibrateSizeByDeletes=false, maxMergeDocs=2147483647, maxCFSSegmentSizeMB=8.796093022207999E12, noCFSRatio=1.0]
   [junit4]   2> 6149 INFO  (TEST-TestLazyCores.testLazyLoad-seed#[2C68A00828D76E6E]) [    x:collection4] o.a.s.c.SolrDeletionPolicy SolrDeletionPolicy.onInit: commits: num=1
   [junit4]   2> 	commit{dir=MockDirectoryWrapper(RAMDirectory@3abaf4fb lockFactory=org.apache.lucene.store.SingleInstanceLockFactory@61008d4d),segFN=segments_1,generation=1}
   [junit4]   2> 6149 INFO  (TEST-TestLazyCores.testLazyLoad-seed#[2C68A00828D76E6E]) [    x:collection4] o.a.s.c.SolrDeletionPolicy newest commit generation = 1
   [junit4]   2> 6149 INFO  (TEST-TestLazyCores.testLazyLoad-seed#[2C68A00828D76E6E]) [    x:collection4] o.a.s.s.SolrIndexSearcher Opening [Searcher@44cdb590[collection4] main]
   [junit4]   2> 6150 INFO  (TEST-TestLazyCores.testLazyLoad-seed#[2C68A00828D76E6E]) [    x:collection4] o.a.s.r.ManagedResourceStorage File-based storage initialized to use dir: C:\Users\JenkinsSlave\workspace\Lucene-Solr-trunk-Windows\solr\build\solr-core\test\J0\temp\solr.core.TestLazyCores_2C68A00828D76E6E-001\tempDir-001\collection4\conf
   [junit4]   2> 6150 INFO  (TEST-TestLazyCores.testLazyLoad-seed#[2C68A00828D76E6E]) [    x:collection4] o.a.s.r.RestManager Initializing RestManager with initArgs: {storageDir=C:\Users\JenkinsSlave\workspace\Lucene-Solr-trunk-Windows\solr\build\solr-core\test\J0\temp\solr.core.TestLazyCores_2C68A00828D76E6E-001\tempDir-001\collection4\conf}
   [junit4]   2> 6150 INFO  (TEST-TestLazyCores.testLazyLoad-seed#[2C68A00828D76E6E]) [    x:collection4] o.a.s.r.ManagedResourceStorage Reading _rest_managed.json using file:dir=C:\Users\JenkinsSlave\workspace\Lucene-Solr-trunk-Windows\solr\build\solr-core\test\J0\temp\solr.core.TestLazyCores_2C68A00828D76E6E-001\tempDir-001\collection4\conf
   [junit4]   2> 6150 INFO  (TEST-TestLazyCores.testLazyLoad-seed#[2C68A00828D76E6E]) [    x:collection4] o.a.s.r.RestManager Initializing 0 registered ManagedResources
   [junit4]   2> 6150 INFO  (TEST-TestLazyCores.testLazyLoad-seed#[2C68A00828D76E6E]) [    x:collection4] o.a.s.h.ReplicationHandler Commits will be reserved for  10000
   [junit4]   2> 6152 INFO  (TEST-TestLazyCores.testLazyLoad-seed#[2C68A00828D76E6E]) [    x:collection4] o.a.s.c.CoreContainer registering core: collection4
   [junit4]   2> 6153 INFO  (TEST-TestLazyCores.testLazyLoad-seed#[2C68A00828D76E6E]) [    x:collection4] o.a.s.c.CoreContainer Shutting down CoreContainer instance=1637856044
   [junit4]   2> 6153 INFO  (searcherExecutor-23-thread-1-processing-x:collection4) [    x:collection4] o.a.s.c.SolrCore [collection4] Registered new searcher Searcher@44cdb590[collection4] main{ExitableDirectoryReader(UninvertingDirectoryReader())}
   [junit4]   2> 6157 INFO  (coreCloseExecutor-27-thread-1-processing-x:collection4) [    x:collection1] o.a.s.c.SolrCore [collection1]  CLOSING SolrCore org.apache.solr.core.SolrCore@7c657d96
   [junit4]   2> 6158 INFO  (coreCloseExecutor-27-thread-1-processing-x:collection4) [    x:collection1] o.a.s.u.DirectUpdateHandler2 closing DirectUpdateHandler2{commits=0,autocommits=0,soft autocommits=0,optimizes=0,rollbacks=0,expungeDeletes=0,docsPending=0,adds=0,deletesById=0,deletesByQuery=0,errors=0,cumulative_adds=0,cumulative_deletesById=0,cumulative_deletesByQuery=0,cumulative_errors=0}
   [junit4]   2> 6159 INFO  (coreCloseExecutor-27-thread-1-processing-x:collection4) [    x:collection1] o.a.s.u.SolrCoreState Closing SolrCoreState
   [junit4]   2> 6159 INFO  (coreCloseExecutor-27-thread-1-processing-x:collection4) [    x:collection1] o.a.s.u.DefaultSolrCoreState SolrCoreState ref count has reached 0 - closing IndexWriter
   [junit4]   2> 6159 INFO  (coreCloseExecutor-27-thread-1-processing-x:collection4) [    x:collection1] o.a.s.u.DefaultSolrCoreState closing IndexWriter with IndexWriterCloser
   [junit4]   2> 6182 INFO  (coreCloseExecutor-27-thread-1-processing-x:collection4) [    x:collection1] o.a.s.c.SolrCore [collection1] Closing main searcher on request.
   [junit4]   2> 6183 INFO  (coreCloseExecutor-27-thread-1-processing-x:collection4) [    x:collection1] o.a.s.c.CachingDirectoryFactory Closing MockDirectoryFactory - 2 directories currently being tracked
   [junit4]   2> 6185 INFO  (coreCloseExecutor-27-thread-1-processing-x:collection4) [    x:collection1] o.a.s.c.CachingDirectoryFactory looking to close C:\Users\JenkinsSlave\workspace\Lucene-Solr-trunk-Windows\solr\build\solr-core\test\J0\temp\solr.core.TestLazyCores_2C68A00828D76E6E-001\tempDir-001\collection1\data\index [CachedDir<<refCount=0;path=C:\Users\JenkinsSlave\workspace\Lucene-Solr-trunk-Windows\solr\build\solr-core\test\J0\temp\solr.core.TestLazyCores_2C68A00828D76E6E-001\tempDir-001\collection1\data\index;done=false>>]
   [junit4]   2> 6185 INFO  (coreCloseExecutor-27-thread-1-processing-x:collection4) [    x:collection1] o.a.s.c.CachingDirectoryFactory Closing directory: C:\Users\JenkinsSlave\workspace\Lucene-Solr-trunk-Windows\solr\build\solr-core\test\J0\temp\solr.core.TestLazyCores_2C68A00828D76E6E-001\tempDir-001\collection1\data\index
   [junit4]   2> 6185 INFO  (coreCloseExecutor-27-thread-1-processing-x:collection4) [    x:collection1] o.a.s.c.CachingDirectoryFactory looking to close C:\Users\JenkinsSlave\workspace\Lucene-Solr-trunk-Windows\solr\build\solr-core\test\J0\temp\solr.core.TestLazyCores_2C68A00828D76E6E-001\tempDir-001\collection1\data\ [CachedDir<<refCount=0;path=C:\Users\JenkinsSlave\workspace\Lucene-Solr-trunk-Windows\solr\build\solr-core\test\J0\temp\solr.core.TestLazyCores_2C68A00828D76E6E-001\tempDir-001\collection1\data\;done=false>>]
   [junit4]   2> 6185 INFO  (coreCloseExecutor-27-thread-1-processing-x:collection4) [    x:collection1] o.a.s.c.CachingDirectoryFactory Closing directory: C:\Users\JenkinsSlave\workspace\Lucene-Solr-trunk-Windows\solr\build\solr-core\test\J0\temp\solr.core.TestLazyCores_2C68A00828D76E6E-001\tempDir-001\collection1\data\
   [junit4]   2> 6186 INFO  (coreCloseExecutor-28-thread-1-processing-x:collection4) [    x:collection5] o.a.s.c.SolrCore [collection5]  CLOSING SolrCore org.apache.solr.core.SolrCore@43593e78
   [junit4]   2> 6187 INFO  (coreCloseExecutor-28-thread-1-processing-x:collection4) [    x:collection5] o.a.s.u.DirectUpdateHandler2 closing DirectUpdateHandler2{commits=0,autocommits=0,soft autocommits=0,optimizes=0,rollbacks=0,expungeDeletes=0,docsPending=0,adds=0,deletesById=0,deletesByQuery=0,errors=0,cumulative_adds=0,cumulative_deletesById=0,cumulative_deletesByQuery=0,cumulative_errors=0}
   [junit4]   2> 6189 INFO  (coreCloseExecutor-28-thread-1-processing-x:collection4) [    x:collection5] o.a.s.u.SolrCoreState Closing SolrCoreState
   [junit4]   2> 6190 INFO  (coreCloseExecutor-28-thread-1-processing-x:collection4) [    x:collection5] o.a.s.u.DefaultSolrCoreState SolrCoreState ref count has reached 0 - closing IndexWriter
   [junit4]   2> 6190 INFO  (coreCloseExecutor-28-thread-1-processing-x:collection4) [    x:collection5] o.a.s.u.DefaultSolrCoreState closing IndexWriter with IndexWriterCloser
   [junit4]   2> 6193 INFO  (coreCloseExecutor-28-thread-1-processing-x:collection4) [    x:collection5] o.a.s.c.SolrCore [collection5] Closing main searcher on request.
   [junit4]   2> 6193 INFO  (coreCloseExecutor-28-thread-1-processing-x:collection4) [    x:collection5] o.a.s.c.CachingDirectoryFactory Closing MockDirectoryFactory - 2 directories currently being tracked
   [junit4]   2> 6193 INFO  (coreCloseExecutor-28-thread-1-processing-x:collection4) [    x:collection5] o.a.s.c.CachingDirectoryFactory looking to close C:\Users\JenkinsSlave\workspace\Lucene-Solr-trunk-Windows\solr\build\solr-core\test\J0\temp\solr.core.TestLazyCores_2C68A00828D76E6E-001\tempDir-001\collection5\data\ [CachedDir<<refCount=0;path=C:\Users\JenkinsSlave\workspace\Lucene-Solr-trunk-Windows\solr\build\solr-core\test\J0\temp\solr.core.TestLazyCores_2C68A00828D76E6E-001\tempDir-001\collection5\data\;done=false>>]
   [junit4]   2> 6193 INFO  (coreCloseExecutor-28-thread-1-processing-x:collection4) [    x:collection5] o.a.s.c.CachingDirectoryFactory Closing directory: C:\Users\JenkinsSlave\workspace\Lucene-Solr-trunk-Windows\solr\build\solr-core\test\J0\temp\solr.core.TestLazyCores_2C68A00828D76E6E-001\tempDir-001\collection5\data\
   [junit4]   2> 6193 INFO  (coreCloseExecutor-28-thread-1-processing-x:collection4) [    x:collection5] o.a.s.c.CachingDirectoryFactory looking to close C:\Users\JenkinsSlave\workspace\Lucene-Solr-trunk-Windows\solr\build\solr-core\test\J0\temp\solr.core.TestLazyCores_2C68A00828D76E6E-001\tempDir-001\collection5\data\index [CachedDir<<refCount=0;path=C:\Users\JenkinsSlave\workspace\Lucene-Solr-trunk-Windows\solr\build\solr-core\test\J0\temp\solr.core.TestLazyCores_2C68A00828D76E6E-001\tempDir-001\collection5\data\index;done=false>>]
   [junit4]   2> 6193 INFO  (coreCloseExecutor-28-thread-1-processing-x:collection4) [    x:collection5] o.a.s.c.CachingDirectoryFactory Closing directory: C:\Users\JenkinsSlave\workspace\Lucene-Solr-trunk-Windows\solr\build\solr-core\test\J0\temp\solr.core.TestLazyCores_2C68A00828D76E6E-001\tempDir-001\collection5\data\index
   [junit4]   2> 6194 INFO  (coreCloseExecutor-29-thread-1-processing-x:collection4) [    x:collection4] o.a.s.c.SolrCore [collection4]  CLOSING SolrCore org.apache.solr.core.SolrCore@6d960307
   [junit4]   2> 6195 INFO  (coreCloseExecutor-29-thread-1-processing-x:collection4) [    x:collection4] o.a.s.u.DirectUpdateHandler2 closing DirectUpdateHandler2{commits=0,autocommits=0,soft autocommits=0,optimizes=0,rollbacks=0,expungeDeletes=0,docsPending=0,adds=0,deletesById=0,deletesByQuery=0,errors=0,cumulative_adds=0,cumulative_deletesById=0,cumulative_deletesByQuery=0,cumulative_errors=0}
   [junit4]   2> 6195 INFO  (coreCloseExecutor-29-thread-1-processing-x:collection4) [    x:collection4] o.a.s.u.SolrCoreState Closing SolrCoreState
   [junit4]   2> 6195 INFO  (coreCloseExecutor-29-thread-1-processing-x:collection4) [    x:collection4] o.a.s.u.DefaultSolrCoreState SolrCoreState ref count has reached 0 - closing IndexWriter
   [junit4]   2> 6195 INFO  (coreCloseExecutor-29-thread-1-processing-x:collection4) [    x:collection4] o.a.s.u.DefaultSolrCoreState closing IndexWriter with IndexWriterCloser
   [junit4]   2> 6197 INFO  (coreCloseExecutor-29-thread-1-processing-x:collection4) [    x:collection4] o.a.s.c.SolrCore [collection4] Closing main searcher on request.
   [junit4]   2> 6197 INFO  (coreCloseExecutor-29-thread-1-processing-x:collection4) [    x:collection4] o.a.s.c.CachingDirectoryFactory Closing MockDirectoryFactory - 2 directories currently being tracked
   [junit4]   2> 6199 INFO  (coreCloseExecutor-29-thread-1-processing-x:collection4) [    x:collection4] o.a.s.c.CachingDirectoryFactory looking to close C:\Users\JenkinsSlave\workspace\Lucene-Solr-trunk-Windows\solr\build\solr-core\test\J0\temp\solr.core.TestLazyCores_2C68A00828D76E6E-001\tempDir-001\collection4\data\index [CachedDir<<refCount=0;path=C:\Users\JenkinsSlave\workspace\Lucene-Solr-trunk-Windows\solr\build\solr-core\test\J0\temp\solr.core.TestLazyCores_2C68A00828D76E6E-001\tempDir-001\collection4\data\index;done=false>>]
   [junit4]   2> 6199 INFO  (coreCloseExecutor-29-thread-1-processing-x:collection4) [    x:collection4] o.a.s.c.CachingDirectoryFactory Closing directory: C:\Users\JenkinsSlave\workspace\Lucene-Solr-trunk-Windows\solr\build\solr-core\test\J0\temp\solr.core.TestLazyCores_2C68A00828D76E6E-001\tempDir-001\collection4\data\index
   [junit4]   2> 6199 INFO  (coreCloseExecutor-29-thread-1-processing-x:collection4) [    x:collection4] o.a.s.c.CachingDirectoryFactory looking to close C:\Users\JenkinsSlave\workspace\Lucene-Solr-trunk-Windows\solr\build\solr-core\test\J0\temp\solr.core.TestLazyCores_2C68A00828D76E6E-001\tempDir-001\collection4\data\ [CachedDir<<refCount=0;path=C:\Users\JenkinsSlave\workspace\Lucene-Solr-trunk-Windows\solr\build\solr-core\test\J0\temp\solr.core.TestLazyCores_2C68A00828D76E6E-001\tempDir-001\collection4\data\;done=false>>]
   [junit4]   2> 6199 INFO  (coreCloseExecutor-29-thread-1-processing-x:collection4) [    x:collection4] o.a.s.c.CachingDirectoryFactory Closing directory: C:\Users\JenkinsSlave\workspace\Lucene-Solr-trunk-Windows\solr\build\solr-core\test\J0\temp\solr.core.TestLazyCores_2C68A00828D76E6E-001\tempDir-001\collection4\data\
   [junit4]   2> 6201 INFO  (coreCloseExecutor-30-thread-1-processing-x:collection4) [    x:collection2] o.a.s.c.SolrCore [collection2]  CLOSING SolrCore org.apache.solr.core.SolrCore@1db87a14
   [junit4]   2> 6201 INFO  (coreCloseExecutor-30-thread-1-processing-x:collection4) [    x:collection2] o.a.s.u.DirectUpdateHandler2 closing DirectUpdateHandler2{commits=0,autocommits=0,soft autocommits=0,optimizes=0,rollbacks=0,expungeDeletes=0,docsPending=0,adds=0,deletesById=0,deletesByQuery=0,errors=0,cumulative_adds=0,cumulative_deletesById=0,cumulative_deletesByQuery=0,cumulative_errors=0}
   [junit4]   2> 6201 INFO  (coreCloseExecutor-30-thread-1-processing-x:collection4) [    x:collection2] o.a.s.u.SolrCoreState Closing SolrCoreState
   [junit4]   2> 6201 INFO  (coreCloseExecutor-30-thread-1-processing-x:collection4) [    x:collection2] o.a.s.u.DefaultSolrCoreState SolrCoreState ref count has reached 0 - closing IndexWriter
   [junit4]   2> 6201 INFO  (coreCloseExecutor-30-thread-1-processing-x:collection4) [    x:collection2] o.a.s.u.DefaultSolrCoreState closing IndexWriter with IndexWriterCloser
   [junit4]   2> 6203 INFO  (coreCloseExecutor-30-thread-1-processing-x:collection4) [    x:collection2] o.a.s.c.SolrCore [collection2] Closing main searcher on request.
   [junit4]   2> 6203 INFO  (coreCloseExecutor-30-thread-1-processing-x:collection4) [    x:collection2] o.a.s.c.CachingDirectoryFactory Closing MockDirectoryFactory - 2 directories currently being tracked
   [junit4]   2> 6203 INFO  (coreCloseExecutor-30-thread-1-processing-x:collection4) [    x:collection2] o.a.s.c.CachingDirectoryFactory looking to close C:\Users\JenkinsSlave\workspace\Lucene-Solr-trunk-Windows\solr\build\solr-core\test\J0\temp\solr.core.TestLazyCores_2C68A00828D76E6E-001\tempDir-001\collection2\data\ [CachedDir<<refCount=0;path=C:\Users\JenkinsSlave\workspace\Lucene-Solr-trunk-Windows\solr\build\solr-core\test\J0\temp\solr.core.TestLazyCores_2C68A00828D76E6E-001\tempDir-001\collection2\data\;done=false>>]
   [junit4]   2> 6203 INFO  (coreCloseExecutor-30-thread-1-processing-x:collection4) [    x:collection2] o.a.s.c.CachingDirectoryFactory Closing directory: C:\Users\JenkinsSlave\workspace\Lucene-Solr-trunk-Windows\solr\build\solr-core\test\J0\temp\solr.core.TestLazyCores_2C68A00828D76E6E-001\tempDir-001\collection2\data\
   [junit4]   2> 6203 INFO  (coreCloseExecutor-30-thread-1-processing-x:collection4) [    x:collection2] o.a.s.c.CachingDirectoryFactory looking to close C:\Users\JenkinsSlave\workspace\Lucene-Solr-trunk-Windows\solr\build\solr-core\test\J0\temp\solr.core.TestLazyCores_2C68A00828D76E6E-001\tempDir-001\collection2\data\index [CachedDir<<refCount=0;path=C:\Users\JenkinsSlave\workspace\Lucene-Solr-trunk-Windows\solr\build\solr-core\test\J0\temp\solr.core.TestLazyCores_2C68A00828D76E6E-001\tempDir-001\collection2\data\index;done=false>>]
   [junit4]   2> 6203 INFO  (coreCloseExecutor-30-thread-1-processing-x:collection4) [    x:collection2] o.a.s.c.CachingDirectoryFactory Closing directory: C:\Users\JenkinsSlave\workspace\Lucene-Solr-trunk-Windows\solr\build\solr-core\test\J0\temp\solr.core.TestLazyCores_2C68A00828D76E6E-001\tempDir-001\collection2\data\index
   [junit4]   2> 6206 INFO  (coreCloseExecutor-31-thread-1-processing-x:collection4) [    x:collection3] o.a.s.c.SolrCore [collection3]  CLOSING SolrCore org.apache.solr.core.SolrCore@35985f6f
   [junit4]   2> 6206 INFO  (coreCloseExecutor-31-thread-1-processing-x:collection4) [    x:collection3] o.a.s.u.DirectUpdateHandler2 closing DirectUpdateHandler2{commits=0,autocommits=0,soft autocommits=0,optimizes=0,rollbacks=0,expungeDeletes=0,docsPending=0,adds=0,deletesById=0,deletesByQuery=0,errors=0,cumulative_adds=0,cumulative_deletesById=0,cumulative_deletesByQuery=0,cumulative_errors=0}
   [junit4]   2> 6206 INFO  (coreCloseExecutor-31-thread-1-processing-x:collection4) [    x:collection3] o.a.s.u.SolrCoreState Closing SolrCoreState
   [junit4]   2> 6206 INFO  (coreCloseExecutor-31-thread-1-processing-x:collection4) [    x:collection3] o.a.s.u.DefaultSolrCoreState SolrCoreState ref count has reached 0 - closing IndexWriter
   [junit4]   2> 6206 INFO  (coreCloseExecutor-31-thread-1-processing-x:collection4) [    x:collection3] o.a.s.u.DefaultSolrCoreState closing IndexWriter with IndexWriterCloser
   [junit4]   2> 6212 INFO  (coreCloseExecutor-31-thread-1-processing-x:collection4) [    x:collection3] o.a.s.c.SolrCore [collection3] Closing main searcher on request.
   [junit4]   2> 6212 INFO  (coreCloseExecutor-31-thread-1-processing-x:collection4) [    x:collection3] o.a.s.c.CachingDirectoryFactory Closing MockDirectoryFactory - 2 directories currently being tracked
   [junit4]   2> 6212 INFO  (coreCloseExecutor-31-thread-1-processing-x:collection4) [    x:collection3] o.a.s.c.CachingDirectoryFactory looking to close C:\Users\JenkinsSlave\workspace\Lucene-Solr-trunk-Windows\solr\build\solr-core\test\J0\temp\solr.core.TestLazyCores_2C68A00828D76E6E-001\tempDir-001\collection3\data\index [CachedDir<<refCount=0;path=C:\Users\JenkinsSlave\workspace\Lucene-Solr-trunk-Windows\solr\build\solr-core\test\J0\temp\solr.core.TestLazyCores_2C68A00828D76E6E-001\tempDir-001\collection3\data\index;done=false>>]
   [junit4]   2> 6214 INFO  (coreCloseExecutor-31-thread-1-processing-x:collection4) [    x:collection3] o.a.s.c.CachingDirectoryFactory Closing directory: C:\Users\JenkinsSlave\workspace\Lucene-Solr-trunk-Windows\solr\build\solr-core\test\J0\temp\solr.core.TestLazyCores_2C68A00828D76E6E-001\tempDir-001\collection3\data\index
   [junit4]   2> 6214 INFO  (coreCloseExecutor-31-thread-1-processing-x:collection4) [    x:collection3] o.a.s.c.CachingDirectoryFactory looking to close C:\Users\JenkinsSlave\workspace\Lucene-Solr-trunk-Windows\solr\build\solr-core\test\J0\temp\solr.core.TestLazyCores_2C68A00828D76E6E-001\tempDir-001\collection3\data\ [CachedDir<<refCount=0;path=C:\Users\JenkinsSlave\workspace\Lucene-Solr-trunk-Windows\solr\build\solr-core\test\J0\temp\solr.core.TestLazyCores_2C68A00828D76E6E-001\tempDir-001\collection3\data\;done=false>>]
   [junit4]   2> 6214 INFO  (coreCloseExecutor-31-thread-1-processing-x:collection4) [    x:collection3] o.a.s.c.CachingDirectoryFactory Closing directory: C:\Users\JenkinsSlave\workspace\Lucene-Solr-trunk-Windows\solr\build\solr-core\test\J0\temp\solr.core.TestLazyCores_2C68A00828D76E6E-001\tempDir-001\collection3\data\
   [junit4]   2> 6215 INFO  (TEST-TestLazyCores.testLazyLoad-seed#[2C68A00828D76E6E]) [    x:collection4] o.a.s.SolrTestCaseJ4 ###Ending testLazyLoad
   [junit4]   2> 6224 INFO  (TEST-TestLazyCores.testMidUseUnload-seed#[2C68A00828D76E6E]) [    x:collection4] o.a.s.SolrTestCaseJ4 ###Starting testMidUseUnload
   [junit4]   2> 6664 INFO  (TEST-TestLazyCores.testMidUseUnload-seed#[2C68A00828D76E6E]) [    x:collection4] o.a.s.c.SolrResourceLoader new SolrResourceLoader for directory: 'C:\Users\JenkinsSlave\workspace\Lucene-Solr-trunk-Windows\solr\build\solr-core\test\J0\temp\solr.core.TestLazyCores_2C68A00828D76E6E-001\tempDir-002'
   [junit4]   2> 6664 INFO  (TEST-TestLazyCores.testMidUseUnload-seed#[2C68A00828D76E6E]) [    x:collection4] o.a.s.c.SolrResourceLoader JNDI not configured for solr (NoInitialContextEx)
   [junit4]   2> 6664 INFO  (TEST-TestLazyCores.testMidUseUnload-seed#[2C68A00828D76E6E]) [    x:collection4] o.a.s.c.SolrResourceLoader solr home defaulted to 'solr/' (could not find system property or JNDI)
   [junit4]   2> 6665 INFO  (TEST-TestLazyCores.testMidUseUnload-seed#[2C68A00828D76E6E]) [    x:collection4] o.a.s.c.CoreContainer New CoreContainer 1076646692
   [junit4]   2> 6665 INFO  (TEST-TestLazyCores.testMidUseUnload-seed#[2C68A00828D76E6E]) [    x:collection4] o.a.s.c.CoreContainer Loading cores into CoreContainer [instanceDir=C:\Users\JenkinsSlave\workspace\Lucene-Solr-trunk-Windows\solr\build\solr-core\test\J0\temp\solr.core.TestLazyCores_2C68A00828D76E6E-001\tempDir-002]
   [junit4]   2> 6665 WARN  (TEST-TestLazyCores.testMidUseUnload-seed#[2C68A00828D76E6E]) [    x:collection4] o.a.s.c.CoreContainer Couldn't add files from C:\Users\JenkinsSlave\workspace\Lucene-Solr-trunk-Windows\solr\build\solr-core\test\J0\temp\solr.core.TestLazyCores_2C68A00828D76E6E-001\tempDir-002\lib to classpath: C:\Users\JenkinsSlave\workspace\Lucene-Solr-trunk-Windows\solr\build\solr-core\test\J0\temp\solr.core.TestLazyCores_2C68A00828D76E6E-001\tempDir-002\lib
   [junit4]   2> 6665 INFO  (TEST-TestLazyCores.testMidUseUnload-seed#[2C68A00828D76E6E]) [    x:collection4] o.a.s.h.c.HttpShardHandlerFactory created with socketTimeout : 600000,connTimeout : 60000,maxConnectionsPerHost : 20,maxConnections : 10000,corePoolSize : 0,maximumPoolSize : 2147483647,maxThreadIdleTime : 5,sizeOfQueue : -1,fairnessPolicy : false,useRetries : false,
   [junit4]   2> 6668 INFO  (TEST-TestLazyCores.testMidUseUnload-seed#[2C68A00828D76E6E]) [    x:collection4] o.a.s.u.UpdateShardHandler Creating UpdateShardHandler HTTP client with params: socketTimeout=600000&connTimeout=60000&retry=true
   [junit4]   2> 6669 INFO  (TEST-TestLazyCores.testMidUseUnload-seed#[2C68A00828D76E6E]) [    x:collection4] o.a.s.c.SolrCores Allocating transient cache for 4 transient cores
   [junit4]   2> 6669 INFO  (TEST-TestLazyCores.testMidUseUnload-seed#[2C68A00828D76E6E]) [    x:collection4] o.a.s.l.LogWatcher SLF4J impl is org.slf4j.impl.Log4jLoggerFactory
   [junit4]   2> 6669 INFO  (TEST-TestLazyCores.testMidUseUnload-seed#[2C68A00828D76E6E]) [    x:collection4] o.a.s.l.LogWatcher Registering Log Listener [Log4j (org.slf4j.impl.Log4jLoggerFactory)]
   [junit4]   2> 6669 INFO  (TEST-TestLazyCores.testMidUseUnload-seed#[2C68A00828D76E6E]) [    x:collection4] o.a.s.c.CoreContainer Security conf doesn't exist. Skipping setup for authorization module.
   [junit4]   2> 6669 INFO  (TEST-TestLazyCores.testMidUseUnload-seed#[2C68A00828D76E6E]) [    x:collection4] o.a.s.c.CoreContainer No authentication plugin used.
   [junit4]   2> 6694 INFO  (TEST-TestLazyCores.testMidUseUnload-seed#[2C68A00828D76E6E]) [    x:collection4] o.a.s.c.CoreDescriptor Created CoreDescriptor: {name=collection1, config=solrconfig.xml, loadOnStartup=true, schema=schema.xml, configSetProperties=configsetprops.json, transient=false, dataDir=data\}
   [junit4]   2> 6695 INFO  (TEST-TestLazyCores.testMidUseUnload-seed#[2C68A00828D76E6E]) [    x:collection4] o.a.s.c.CoreDescriptor Created CoreDescriptor: {name=collection2, config=solrconfig.xml, loadOnStartup=true, schema=schema.xml, configSetProperties=configsetprops.json, transient=true, dataDir=data\}
   [junit4]   2> 6695 INFO  (TEST-TestLazyCores.testMidUseUnload-seed#[2C68A00828D76E6E]) [    x:collection4] o.a.s.c.CoreDescriptor Created CoreDescriptor: {name=collection3, config=solrconfig.xml, loadOnStartup=false, schema=schema.xml, configSetProperties=configsetprops.json, transient=on, dataDir=data\}
   [junit4]   2> 6696 INFO  (TEST-TestLazyCores.testMidUseUnload-seed#[2C68A00828D76E6E]) [    x:collection4] o.a.s.c.CoreDescriptor Created CoreDescriptor: {name=collection4, config=solrconfig.xml, loadOnStartup=false, schema=schema.xml, configSetProperties=configsetprops.json, transient=false, dataDir=data\}
   [junit4]   2> 6696 INFO  (TEST-TestLazyCores.testMidUseUnload-seed#[2C68A00828D76E6E]) [    x:collection4] o.a.s.c.CoreDescriptor Created CoreDescriptor: {name=collection5, config=solrconfig.xml, loadOnStartup=true, schema=schema.xml, configSetProperties=configsetprops.json, transient=false, dataDir=data\}
   [junit4]   2> 6697 INFO  (TEST-TestLazyCores.testMidUseUnload-seed#[2C68A00828D76E6E]) [    x:collection4] o.a.s.c.CoreDescriptor Created CoreDescriptor: {name=collection6, config=solrconfig.xml, loadOnStartup=false, schema=schema.xml, configSetProperties=configsetprops.json, transient=true, dataDir=data\}
   [junit4]   2> 6698 INFO  (TEST-TestLazyCores.testMidUseUnload-seed#[2C68A00828D76E6E]) [    x:collection4] o.a.s.c.CoreDescriptor Created CoreDescriptor: {name=collection7, config=solrconfig.xml, loadOnStartup=false, schema=schema.xml, configSetProperties=configsetprops.json, transient=true, dataDir=data\}
   [junit4]   2> 6698 INFO  (TEST-TestLazyCores.testMidUseUnload-seed#[2C68A00828D76E6E]) [    x:collection4] o.a.s.c.CoreDescriptor Created CoreDescriptor: {name=collection8, config=solrconfig.xml, loadOnStartup=false, schema=schema.xml, configSetProperties=configsetprops.json, transient=true, dataDir=data\}
   [junit4]   2> 6699 INFO  (TEST-TestLazyCores.testMidUseUnload-seed#[2C68A00828D76E6E]) [    x:collection4] o.a.s.c.CoreDescriptor Created CoreDescriptor: {name=collection9, config=solrconfig.xml, loadOnStartup=false, schema=schema.xml, configSetProperties=configsetprops.json, transient=true, dataDir=data\}
   [junit4]   2> 6718 INFO  (coreLoadExecutor-37-thread-3-processing-x:collection4) [    x:collection4] o.a.s.c.SolrResourceLoader new SolrResourceLoader for directory: 'C:\Users\JenkinsSlave\workspace\Lucene-Solr-trunk-Windows\solr\build\solr-core\test\J0\temp\solr.core.TestLazyCores_2C68A00828D76E6E-001\tempDir-002\collection5'
   [junit4]   2> 6719 INFO  (coreLoadExecutor-37-thread-3-processing-x:collection4) [    x:collection4] o.a.s.c.SolrResourceLoader JNDI not configured for solr (NoInitialContextEx)
   [junit4]   2> 6719 INFO  (coreLoadExecutor-37-thread-3-processing-x:collection4) [    x:collection4] o.a.s.c.SolrResourceLoader solr home defaulted to 'solr/' (could not find system property or JNDI)
   [junit4]   2> 6718 INFO  (coreLoadExecutor-37-thread-2-processing-x:collection4) [    x:collection4] o.a.s.c.SolrResourceLoader new SolrResourceLoader for directory: 'C:\Users\JenkinsSlave\workspace\Lucene-Solr-trunk-Windows\solr\build\solr-core\test\J0\temp\solr.core.TestLazyCores_2C68A00828D76E6E-001\tempDir-002\collection2'
   [junit4]   2> 6721 INFO  (coreLoadExecutor-37-thread-2-processing-x:collection4) [    x:collection4] o.a.s.c.SolrResourceLoader JNDI not configured for solr (NoInitialContextEx)
   [junit4]   2> 6721 INFO  (coreLoadExecutor-37-thread-2-processing-x:collection4) [    x:collection4] o.a.s.c.SolrResourceLoader solr home defaulted to 'solr/' (could not find system property or JNDI)
   [junit4]   2> 6718 INFO  (coreLoadExecutor-37-thread-1-processing-x:collection4) [    x:collection4] o.a.s.c.SolrResourceLoader new SolrResourceLoader for directory: 'C:\Users\JenkinsSlave\workspace\Lucene-Solr-trunk-Windows\solr\build\solr-core\test\J0\temp\solr.core.TestLazyCores_2C68A00828D76E6E-001\tempDir-002\collection1'
   [junit4]   2> 6722 INFO  (coreLoadExecutor-37-thread-1-processing-x:collection4) [    x:collection4] o.a.s.c.SolrResourceLoader JNDI not configured for solr (NoInitialContextEx)
   [junit4]   2> 6722 INFO  (coreLoadExecutor-37-thread-1-processing-x:collection4) [    x:collection4] o.a.s.c.SolrResourceLoader solr home defaulted to 'solr/' (could not find system property or JNDI)
   [junit4]   2> 6771 INFO  (coreLoadExecutor-37-thread-1-processing-x:collection4) [    x:collection4] o.a.s.c.SolrConfig current version of requestparams : -1
   [junit4]   2> 6771 INFO  (coreLoadExecutor-37-thread-3-processing-x:collection4) [    x:collection4] o.a.s.c.SolrConfig current version of requestparams : -1
   [junit4]   2> 6776 INFO  (coreLoadExecutor-37-thread-1-processing-x:collection4) [    x:collection4] o.a.s.c.SolrConfig Using Lucene MatchVersion: 6.0.0
   [junit4]   2> 6790 INFO  (coreLoadExecutor-37-thread-3-processing-x:collection4) [    x:collection4] o.a.s.c.SolrConfig Using Lucene MatchVersion: 6.0.0
   [junit4]   2> 6790 INFO  (coreLoadExecutor-37-thread-2-processing-x:collection4) [    x:collection4] o.a.s.c.SolrConfig current version of requestparams : -1
   [junit4]   2> 6799 INFO  (coreLoadExecutor-37-thread-1-processing-x:collection4) [    x:collection4] o.a.s.c.SolrConfig Loaded SolrConfig: solrconfig.xml
   [junit4]   2> 6804 INFO  (coreLoadExecutor-37-thread-1-processing-x:collection4) [    x:collection4] o.a.s.s.IndexSchema [collection1] Schema name=tiny
   [junit4]   2> 6811 INFO  (coreLoadExecutor-37-thread-2-p

[...truncated too long message...]

re.getNewIndexDir(SolrCore.java:294)
   [junit4]   2> 	at org.apache.solr.core.SolrCore.initIndex(SolrCore.java:509)
   [junit4]   2> 	at org.apache.solr.core.SolrCore.<init>(SolrCore.java:761)
   [junit4]   2> 	at org.apache.solr.core.SolrCore.<init>(SolrCore.java:658)
   [junit4]   2> 	at org.apache.solr.core.CoreContainer.create(CoreContainer.java:817)
   [junit4]   2> 	at org.apache.solr.core.CoreContainer.access$000(CoreContainer.java:87)
   [junit4]   2> 	at org.apache.solr.core.CoreContainer$1.call(CoreContainer.java:467)
   [junit4]   2> 	at org.apache.solr.core.CoreContainer$1.call(CoreContainer.java:458)
   [junit4]   2> 	at java.util.concurrent.FutureTask.run(FutureTask.java:266)
   [junit4]   2> 	at org.apache.solr.common.util.ExecutorUtil$MDCAwareThreadPoolExecutor$1.run(ExecutorUtil.java:231)
   [junit4]   2> 	at java.util.concurrent.ThreadPoolExecutor.runWorker(ThreadPoolExecutor.java:1142)
   [junit4]   2> 	at java.util.concurrent.ThreadPoolExecutor$Worker.run(ThreadPoolExecutor.java:617)
   [junit4]   2> 	at java.lang.Thread.run(Thread.java:745)
   [junit4]   2> 
   [junit4]   2> org.apache.solr.common.util.ObjectReleaseTracker$ObjectTrackerException
   [junit4]   2> 	at org.apache.solr.common.util.ObjectReleaseTracker.track(ObjectReleaseTracker.java:42)
   [junit4]   2> 	at org.apache.solr.core.SolrCore.<init>(SolrCore.java:855)
   [junit4]   2> 	at org.apache.solr.core.SolrCore.<init>(SolrCore.java:658)
   [junit4]   2> 	at org.apache.solr.core.CoreContainer.create(CoreContainer.java:817)
   [junit4]   2> 	at org.apache.solr.core.CoreContainer.access$000(CoreContainer.java:87)
   [junit4]   2> 	at org.apache.solr.core.CoreContainer$1.call(CoreContainer.java:467)
   [junit4]   2> 	at org.apache.solr.core.CoreContainer$1.call(CoreContainer.java:458)
   [junit4]   2> 	at java.util.concurrent.FutureTask.run(FutureTask.java:266)
   [junit4]   2> 	at org.apache.solr.common.util.ExecutorUtil$MDCAwareThreadPoolExecutor$1.run(ExecutorUtil.java:231)
   [junit4]   2> 	at java.util.concurrent.ThreadPoolExecutor.runWorker(ThreadPoolExecutor.java:1142)
   [junit4]   2> 	at java.util.concurrent.ThreadPoolExecutor$Worker.run(ThreadPoolExecutor.java:617)
   [junit4]   2> 	at java.lang.Thread.run(Thread.java:745)
   [junit4]   2> 
   [junit4]   2> Feb 20, 2016 9:50:29 AM com.carrotsearch.randomizedtesting.ThreadLeakControl checkThreadLeaks
   [junit4]   2> WARNING: Will linger awaiting termination of 1 leaked thread(s).
   [junit4]   2> Feb 20, 2016 9:50:49 AM com.carrotsearch.randomizedtesting.ThreadLeakControl checkThreadLeaks
   [junit4]   2> SEVERE: 1 thread leaked from SUITE scope at org.apache.solr.core.TestLazyCores: 
   [junit4]   2>    1) Thread[id=106, name=searcherExecutor-129-thread-1, state=WAITING, group=TGRP-TestLazyCores]
   [junit4]   2>         at sun.misc.Unsafe.park(Native Method)
   [junit4]   2>         at java.util.concurrent.locks.LockSupport.park(LockSupport.java:175)
   [junit4]   2>         at java.util.concurrent.locks.AbstractQueuedSynchronizer$ConditionObject.await(AbstractQueuedSynchronizer.java:2039)
   [junit4]   2>         at java.util.concurrent.LinkedBlockingQueue.take(LinkedBlockingQueue.java:442)
   [junit4]   2>         at java.util.concurrent.ThreadPoolExecutor.getTask(ThreadPoolExecutor.java:1067)
   [junit4]   2>         at java.util.concurrent.ThreadPoolExecutor.runWorker(ThreadPoolExecutor.java:1127)
   [junit4]   2>         at java.util.concurrent.ThreadPoolExecutor$Worker.run(ThreadPoolExecutor.java:617)
   [junit4]   2>         at java.lang.Thread.run(Thread.java:745)
   [junit4]   2> Feb 20, 2016 9:50:49 AM com.carrotsearch.randomizedtesting.ThreadLeakControl tryToInterruptAll
   [junit4]   2> INFO: Starting to interrupt leaked threads:
   [junit4]   2>    1) Thread[id=106, name=searcherExecutor-129-thread-1, state=WAITING, group=TGRP-TestLazyCores]
   [junit4]   2> Feb 20, 2016 9:50:52 AM com.carrotsearch.randomizedtesting.ThreadLeakControl tryToInterruptAll
   [junit4]   2> SEVERE: There are still zombie threads that couldn't be terminated:
   [junit4]   2>    1) Thread[id=106, name=searcherExecutor-129-thread-1, state=WAITING, group=TGRP-TestLazyCores]
   [junit4]   2>         at sun.misc.Unsafe.park(Native Method)
   [junit4]   2>         at java.util.concurrent.locks.LockSupport.park(LockSupport.java:175)
   [junit4]   2>         at java.util.concurrent.locks.AbstractQueuedSynchronizer$ConditionObject.await(AbstractQueuedSynchronizer.java:2039)
   [junit4]   2>         at java.util.concurrent.LinkedBlockingQueue.take(LinkedBlockingQueue.java:442)
   [junit4]   2>         at java.util.concurrent.ThreadPoolExecutor.getTask(ThreadPoolExecutor.java:1067)
   [junit4]   2>         at java.util.concurrent.ThreadPoolExecutor.runWorker(ThreadPoolExecutor.java:1127)
   [junit4]   2>         at java.util.concurrent.ThreadPoolExecutor$Worker.run(ThreadPoolExecutor.java:617)
   [junit4]   2>         at java.lang.Thread.run(Thread.java:745)
   [junit4]   2> NOTE: test params are: codec=Asserting(Lucene60): {v_t=PostingsFormat(name=Memory doPackFST= true), id=PostingsFormat(name=Memory doPackFST= true), v_s=PostingsFormat(name=LuceneFixedGap), v_f=PostingsFormat(name=Memory doPackFST= false)}, docValues:{}, sim=RandomSimilarity(queryNorm=false,coord=yes): {}, locale=en-NZ, timezone=America/Eirunepe
   [junit4]   2> NOTE: Windows 7 6.1 amd64/Oracle Corporation 1.8.0_72 (64-bit)/cpus=3,threads=2,free=197523432,total=279969792
   [junit4]   2> NOTE: All tests run in this JVM: [TestLazyCores]
   [junit4]   2> NOTE: reproduce with: ant test  -Dtestcase=TestLazyCores -Dtests.seed=2C68A00828D76E6E -Dtests.slow=true -Dtests.locale=en-NZ -Dtests.timezone=America/Eirunepe -Dtests.asserts=true -Dtests.file.encoding=Cp1252
   [junit4] ERROR   0.00s J0 | TestLazyCores (suite) <<<
   [junit4]    > Throwable #1: java.lang.AssertionError: ObjectTracker found 4 object(s) that were not released!!! [MockDirectoryWrapper, MDCAwareThreadPoolExecutor, MockDirectoryWrapper, SolrCore]
   [junit4]    > 	at __randomizedtesting.SeedInfo.seed([2C68A00828D76E6E]:0)
   [junit4]    > 	at org.apache.solr.SolrTestCaseJ4.afterClass(SolrTestCaseJ4.java:228)
   [junit4]    > 	at java.lang.Thread.run(Thread.java:745)Throwable #2: com.carrotsearch.randomizedtesting.ThreadLeakError: 1 thread leaked from SUITE scope at org.apache.solr.core.TestLazyCores: 
   [junit4]    >    1) Thread[id=106, name=searcherExecutor-129-thread-1, state=WAITING, group=TGRP-TestLazyCores]
   [junit4]    >         at sun.misc.Unsafe.park(Native Method)
   [junit4]    >         at java.util.concurrent.locks.LockSupport.park(LockSupport.java:175)
   [junit4]    >         at java.util.concurrent.locks.AbstractQueuedSynchronizer$ConditionObject.await(AbstractQueuedSynchronizer.java:2039)
   [junit4]    >         at java.util.concurrent.LinkedBlockingQueue.take(LinkedBlockingQueue.java:442)
   [junit4]    >         at java.util.concurrent.ThreadPoolExecutor.getTask(ThreadPoolExecutor.java:1067)
   [junit4]    >         at java.util.concurrent.ThreadPoolExecutor.runWorker(ThreadPoolExecutor.java:1127)
   [junit4]    >         at java.util.concurrent.ThreadPoolExecutor$Worker.run(ThreadPoolExecutor.java:617)
   [junit4]    >         at java.lang.Thread.run(Thread.java:745)
   [junit4]    > 	at __randomizedtesting.SeedInfo.seed([2C68A00828D76E6E]:0)Throwable #3: com.carrotsearch.randomizedtesting.ThreadLeakError: There are still zombie threads that couldn't be terminated:
   [junit4]    >    1) Thread[id=106, name=searcherExecutor-129-thread-1, state=WAITING, group=TGRP-TestLazyCores]
   [junit4]    >         at sun.misc.Unsafe.park(Native Method)
   [junit4]    >         at java.util.concurrent.locks.LockSupport.park(LockSupport.java:175)
   [junit4]    >         at java.util.concurrent.locks.AbstractQueuedSynchronizer$ConditionObject.await(AbstractQueuedSynchronizer.java:2039)
   [junit4]    >         at java.util.concurrent.LinkedBlockingQueue.take(LinkedBlockingQueue.java:442)
   [junit4]    >         at java.util.concurrent.ThreadPoolExecutor.getTask(ThreadPoolExecutor.java:1067)
   [junit4]    >         at java.util.concurrent.ThreadPoolExecutor.runWorker(ThreadPoolExecutor.java:1127)
   [junit4]    >         at java.util.concurrent.ThreadPoolExecutor$Worker.run(ThreadPoolExecutor.java:617)
   [junit4]    >         at java.lang.Thread.run(Thread.java:745)
   [junit4]    > 	at __randomizedtesting.SeedInfo.seed([2C68A00828D76E6E]:0)
   [junit4] Completed [20/579 (1!)] on J0 in 164.89s, 8 tests, 1 failure, 2 errors <<< FAILURES!

[...truncated 1797 lines...]
BUILD FAILED
C:\Users\JenkinsSlave\workspace\Lucene-Solr-trunk-Windows\build.xml:740: The following error occurred while executing this line:
C:\Users\JenkinsSlave\workspace\Lucene-Solr-trunk-Windows\build.xml:684: The following error occurred while executing this line:
C:\Users\JenkinsSlave\workspace\Lucene-Solr-trunk-Windows\build.xml:59: The following error occurred while executing this line:
C:\Users\JenkinsSlave\workspace\Lucene-Solr-trunk-Windows\solr\build.xml:233: The following error occurred while executing this line:
C:\Users\JenkinsSlave\workspace\Lucene-Solr-trunk-Windows\solr\common-build.xml:524: The following error occurred while executing this line:
C:\Users\JenkinsSlave\workspace\Lucene-Solr-trunk-Windows\lucene\common-build.xml:1457: The following error occurred while executing this line:
C:\Users\JenkinsSlave\workspace\Lucene-Solr-trunk-Windows\lucene\common-build.xml:1014: There were test failures: 579 suites (8 ignored), 2331 tests, 3 suite-level errors, 1778 ignored (65 assumptions) [seed: 2C68A00828D76E6E]

Total time: 50 minutes 1 second
Build step 'Invoke Ant' marked build as failure
Archiving artifacts
[WARNINGS] Skipping publisher since build result is FAILURE
Recording test results
Email was triggered for: Failure - Any
Sending email for trigger: Failure - Any



Mime
View raw message