lucene-dev mailing list archives

Site index · List index
Message view « Date » · « Thread »
Top « Date » · « Thread »
From Policeman Jenkins Server <jenk...@thetaphi.de>
Subject [JENKINS-EA] Lucene-Solr-trunk-Linux (64bit/jdk-9-ea+107) - Build # 16033 - Still Failing!
Date Sun, 28 Feb 2016 09:30:34 GMT
Build: http://jenkins.thetaphi.de/job/Lucene-Solr-trunk-Linux/16033/
Java: 64bit/jdk-9-ea+107 -XX:+UseCompressedOops -XX:+UseConcMarkSweepGC

1 tests failed.
FAILED:  org.apache.lucene.util.automaton.TestDeterminism.testAgainstSimple

Error Message:
7

Stack Trace:
java.lang.ArrayIndexOutOfBoundsException: 7
	at __randomizedtesting.SeedInfo.seed([66057EEB16E4C6E9:5C36060EFADD97EE]:0)
	at org.apache.lucene.util.automaton.MinimizationOperations.minimize(MinimizationOperations.java:235)
	at org.apache.lucene.util.automaton.RegExp.toAutomatonInternal(RegExp.java:524)
	at org.apache.lucene.util.automaton.RegExp.findLeaves(RegExp.java:617)
	at org.apache.lucene.util.automaton.RegExp.toAutomatonInternal(RegExp.java:510)
	at org.apache.lucene.util.automaton.RegExp.toAutomaton(RegExp.java:495)
	at org.apache.lucene.util.automaton.RegExp.toAutomaton(RegExp.java:426)
	at org.apache.lucene.util.automaton.AutomatonTestUtil.randomSingleAutomaton(AutomatonTestUtil.java:262)
	at org.apache.lucene.util.automaton.AutomatonTestUtil.randomAutomaton(AutomatonTestUtil.java:276)
	at org.apache.lucene.util.automaton.TestDeterminism.testAgainstSimple(TestDeterminism.java:42)
	at sun.reflect.NativeMethodAccessorImpl.invoke0(Native Method)
	at sun.reflect.NativeMethodAccessorImpl.invoke(NativeMethodAccessorImpl.java:62)
	at sun.reflect.DelegatingMethodAccessorImpl.invoke(DelegatingMethodAccessorImpl.java:43)
	at java.lang.reflect.Method.invoke(Method.java:520)
	at com.carrotsearch.randomizedtesting.RandomizedRunner.invoke(RandomizedRunner.java:1764)
	at com.carrotsearch.randomizedtesting.RandomizedRunner$8.evaluate(RandomizedRunner.java:871)
	at com.carrotsearch.randomizedtesting.RandomizedRunner$9.evaluate(RandomizedRunner.java:907)
	at com.carrotsearch.randomizedtesting.RandomizedRunner$10.evaluate(RandomizedRunner.java:921)
	at org.apache.lucene.util.TestRuleSetupTeardownChained$1.evaluate(TestRuleSetupTeardownChained.java:49)
	at org.apache.lucene.util.AbstractBeforeAfterRule$1.evaluate(AbstractBeforeAfterRule.java:45)
	at org.apache.lucene.util.TestRuleThreadAndTestName$1.evaluate(TestRuleThreadAndTestName.java:48)
	at org.apache.lucene.util.TestRuleIgnoreAfterMaxFailures$1.evaluate(TestRuleIgnoreAfterMaxFailures.java:64)
	at org.apache.lucene.util.TestRuleMarkFailure$1.evaluate(TestRuleMarkFailure.java:47)
	at com.carrotsearch.randomizedtesting.rules.StatementAdapter.evaluate(StatementAdapter.java:36)
	at com.carrotsearch.randomizedtesting.ThreadLeakControl$StatementRunner.run(ThreadLeakControl.java:367)
	at com.carrotsearch.randomizedtesting.ThreadLeakControl.forkTimeoutingTask(ThreadLeakControl.java:809)
	at com.carrotsearch.randomizedtesting.ThreadLeakControl$3.evaluate(ThreadLeakControl.java:460)
	at com.carrotsearch.randomizedtesting.RandomizedRunner.runSingleTest(RandomizedRunner.java:880)
	at com.carrotsearch.randomizedtesting.RandomizedRunner$5.evaluate(RandomizedRunner.java:781)
	at com.carrotsearch.randomizedtesting.RandomizedRunner$6.evaluate(RandomizedRunner.java:816)
	at com.carrotsearch.randomizedtesting.RandomizedRunner$7.evaluate(RandomizedRunner.java:827)
	at org.apache.lucene.util.AbstractBeforeAfterRule$1.evaluate(AbstractBeforeAfterRule.java:45)
	at com.carrotsearch.randomizedtesting.rules.StatementAdapter.evaluate(StatementAdapter.java:36)
	at org.apache.lucene.util.TestRuleStoreClassName$1.evaluate(TestRuleStoreClassName.java:41)
	at com.carrotsearch.randomizedtesting.rules.NoShadowingOrOverridesOnMethodsRule$1.evaluate(NoShadowingOrOverridesOnMethodsRule.java:40)
	at com.carrotsearch.randomizedtesting.rules.NoShadowingOrOverridesOnMethodsRule$1.evaluate(NoShadowingOrOverridesOnMethodsRule.java:40)
	at com.carrotsearch.randomizedtesting.rules.StatementAdapter.evaluate(StatementAdapter.java:36)
	at com.carrotsearch.randomizedtesting.rules.StatementAdapter.evaluate(StatementAdapter.java:36)
	at com.carrotsearch.randomizedtesting.rules.StatementAdapter.evaluate(StatementAdapter.java:36)
	at org.apache.lucene.util.TestRuleAssertionsRequired$1.evaluate(TestRuleAssertionsRequired.java:53)
	at org.apache.lucene.util.TestRuleMarkFailure$1.evaluate(TestRuleMarkFailure.java:47)
	at org.apache.lucene.util.TestRuleIgnoreAfterMaxFailures$1.evaluate(TestRuleIgnoreAfterMaxFailures.java:64)
	at org.apache.lucene.util.TestRuleIgnoreTestSuites$1.evaluate(TestRuleIgnoreTestSuites.java:54)
	at com.carrotsearch.randomizedtesting.rules.StatementAdapter.evaluate(StatementAdapter.java:36)
	at com.carrotsearch.randomizedtesting.ThreadLeakControl$StatementRunner.run(ThreadLeakControl.java:367)
	at java.lang.Thread.run(Thread.java:804)




Build Log:
[...truncated 1001 lines...]
   [junit4] Suite: org.apache.lucene.util.automaton.TestDeterminism
   [junit4]   2> NOTE: reproduce with: ant test  -Dtestcase=TestDeterminism -Dtests.method=testAgainstSimple
-Dtests.seed=66057EEB16E4C6E9 -Dtests.multiplier=3 -Dtests.slow=true -Dtests.locale=ur -Dtests.timezone=GB-Eire
-Dtests.asserts=true -Dtests.file.encoding=US-ASCII
   [junit4] ERROR   0.00s J0 | TestDeterminism.testAgainstSimple <<<
   [junit4]    > Throwable #1: java.lang.ArrayIndexOutOfBoundsException: 7
   [junit4]    > 	at __randomizedtesting.SeedInfo.seed([66057EEB16E4C6E9:5C36060EFADD97EE]:0)
   [junit4]    > 	at org.apache.lucene.util.automaton.MinimizationOperations.minimize(MinimizationOperations.java:235)
   [junit4]    > 	at org.apache.lucene.util.automaton.RegExp.toAutomatonInternal(RegExp.java:524)
   [junit4]    > 	at org.apache.lucene.util.automaton.RegExp.findLeaves(RegExp.java:617)
   [junit4]    > 	at org.apache.lucene.util.automaton.RegExp.toAutomatonInternal(RegExp.java:510)
   [junit4]    > 	at org.apache.lucene.util.automaton.RegExp.toAutomaton(RegExp.java:495)
   [junit4]    > 	at org.apache.lucene.util.automaton.RegExp.toAutomaton(RegExp.java:426)
   [junit4]    > 	at org.apache.lucene.util.automaton.AutomatonTestUtil.randomSingleAutomaton(AutomatonTestUtil.java:262)
   [junit4]    > 	at org.apache.lucene.util.automaton.AutomatonTestUtil.randomAutomaton(AutomatonTestUtil.java:276)
   [junit4]    > 	at org.apache.lucene.util.automaton.TestDeterminism.testAgainstSimple(TestDeterminism.java:42)
   [junit4]    > 	at java.lang.Thread.run(Thread.java:804)
   [junit4]   2> NOTE: test params are: codec=Asserting(Lucene60): {}, docValues:{}, sim=RandomSimilarity(queryNorm=false,coord=no):
{}, locale=ur, timezone=GB-Eire
   [junit4]   2> NOTE: Linux 3.19.0-51-generic amd64/Oracle Corporation 9-ea (64-bit)/cpus=12,threads=1,free=447247392,total=508952576
   [junit4]   2> NOTE: All tests run in this JVM: [TestCustomNorms, TestQueryCachingPolicy,
FiniteStringsIteratorTest, TestLucene53NormsFormat, TestVirtualMethod, TestBinaryDocValuesUpdates,
TestForTooMuchCloning, TestSimilarity2, TestMultiTermQueryRewrites, TestSearcherManager, TestAllFilesCheckIndexHeader,
TestBytesRef, TestCrash, TestIndexWriterOnVMError, TestFieldType, TestBlendedTermQuery, TestDateSort,
TestMultiset, TestDocCount, TestStressDeletes, TestDocIdSetBuilder, TestRegexpRandom, TestIndexSearcher,
TestLucene50StoredFieldsFormat, TestPerSegmentDeletes, TestCloseableThreadLocal, TestBoostQuery,
TestFixedBitSet, TestCharFilter, TestIndexWriterLockRelease, TestLSBRadixSorter, TestConstantScoreQuery,
TestSumDocFreq, TestTermsEnum, TestMutableValues, TestSpanBoostQuery, TestFilterLeafReader,
TestBlockPostingsFormat2, TestNeverDelete, TestSentinelIntSet, TestDisjunctionMaxQuery, TestIndexWriterUnicode,
TestPerFieldPostingsFormat, TestTimeLimitingCollector, TestMultiTermConstantScore, TestSpanTermQuery,
TestDocValuesIndexing, TestNewestSegment, TestUTF32ToUTF8, TestStringHelper, TestWeakIdentityMap,
TestDeterminism]
   [junit4] Completed [244/411 (1!)] on J0 in 0.72s, 2 tests, 1 error <<< FAILURES!

[...truncated 566 lines...]
BUILD FAILED
/home/jenkins/workspace/Lucene-Solr-trunk-Linux/build.xml:740: The following error occurred
while executing this line:
/home/jenkins/workspace/Lucene-Solr-trunk-Linux/build.xml:684: The following error occurred
while executing this line:
/home/jenkins/workspace/Lucene-Solr-trunk-Linux/build.xml:59: The following error occurred
while executing this line:
/home/jenkins/workspace/Lucene-Solr-trunk-Linux/lucene/build.xml:50: The following error occurred
while executing this line:
/home/jenkins/workspace/Lucene-Solr-trunk-Linux/lucene/common-build.xml:1457: The following
error occurred while executing this line:
/home/jenkins/workspace/Lucene-Solr-trunk-Linux/lucene/common-build.xml:1014: There were test
failures: 411 suites (1 ignored), 3423 tests, 1 error, 60 ignored (56 assumptions) [seed:
66057EEB16E4C6E9]

Total time: 6 minutes 16 seconds
Build step 'Invoke Ant' marked build as failure
Archiving artifacts
[WARNINGS] Skipping publisher since build result is FAILURE
Recording test results
Email was triggered for: Failure - Any
Sending email for trigger: Failure - Any



Mime
View raw message