lucene-dev mailing list archives

Site index · List index
Message view « Date » · « Thread »
Top « Date » · « Thread »
From Policeman Jenkins Server <jenk...@thetaphi.de>
Subject [JENKINS] Lucene-Solr-5.x-Windows (32bit/jdk1.7.0_80) - Build # 5454 - Failure!
Date Mon, 01 Feb 2016 18:16:44 GMT
Build: http://jenkins.thetaphi.de/job/Lucene-Solr-5.x-Windows/5454/
Java: 32bit/jdk1.7.0_80 -server -XX:+UseSerialGC

1 tests failed.
FAILED:  junit.framework.TestSuite.org.apache.solr.handler.TestSolrConfigHandlerCloud

Error Message:
ObjectTracker found 2 object(s) that were not released!!! [MockDirectoryWrapper, MockDirectoryWrapper]

Stack Trace:
java.lang.AssertionError: ObjectTracker found 2 object(s) that were not released!!! [MockDirectoryWrapper, MockDirectoryWrapper]
	at __randomizedtesting.SeedInfo.seed([270D9845923FE1E5]:0)
	at org.junit.Assert.fail(Assert.java:93)
	at org.junit.Assert.assertTrue(Assert.java:43)
	at org.junit.Assert.assertNull(Assert.java:551)
	at org.apache.solr.SolrTestCaseJ4.afterClass(SolrTestCaseJ4.java:229)
	at sun.reflect.GeneratedMethodAccessor15.invoke(Unknown Source)
	at sun.reflect.DelegatingMethodAccessorImpl.invoke(DelegatingMethodAccessorImpl.java:43)
	at java.lang.reflect.Method.invoke(Method.java:606)
	at com.carrotsearch.randomizedtesting.RandomizedRunner.invoke(RandomizedRunner.java:1764)
	at com.carrotsearch.randomizedtesting.RandomizedRunner$7.evaluate(RandomizedRunner.java:834)
	at com.carrotsearch.randomizedtesting.rules.StatementAdapter.evaluate(StatementAdapter.java:36)
	at com.carrotsearch.randomizedtesting.rules.SystemPropertiesRestoreRule$1.evaluate(SystemPropertiesRestoreRule.java:57)
	at org.apache.lucene.util.AbstractBeforeAfterRule$1.evaluate(AbstractBeforeAfterRule.java:46)
	at com.carrotsearch.randomizedtesting.rules.StatementAdapter.evaluate(StatementAdapter.java:36)
	at org.apache.lucene.util.TestRuleStoreClassName$1.evaluate(TestRuleStoreClassName.java:42)
	at com.carrotsearch.randomizedtesting.rules.NoShadowingOrOverridesOnMethodsRule$1.evaluate(NoShadowingOrOverridesOnMethodsRule.java:40)
	at com.carrotsearch.randomizedtesting.rules.NoShadowingOrOverridesOnMethodsRule$1.evaluate(NoShadowingOrOverridesOnMethodsRule.java:40)
	at com.carrotsearch.randomizedtesting.rules.StatementAdapter.evaluate(StatementAdapter.java:36)
	at com.carrotsearch.randomizedtesting.rules.StatementAdapter.evaluate(StatementAdapter.java:36)
	at com.carrotsearch.randomizedtesting.rules.StatementAdapter.evaluate(StatementAdapter.java:36)
	at org.apache.lucene.util.TestRuleAssertionsRequired$1.evaluate(TestRuleAssertionsRequired.java:54)
	at org.apache.lucene.util.TestRuleMarkFailure$1.evaluate(TestRuleMarkFailure.java:48)
	at org.apache.lucene.util.TestRuleIgnoreAfterMaxFailures$1.evaluate(TestRuleIgnoreAfterMaxFailures.java:65)
	at org.apache.lucene.util.TestRuleIgnoreTestSuites$1.evaluate(TestRuleIgnoreTestSuites.java:55)
	at com.carrotsearch.randomizedtesting.rules.StatementAdapter.evaluate(StatementAdapter.java:36)
	at com.carrotsearch.randomizedtesting.ThreadLeakControl$StatementRunner.run(ThreadLeakControl.java:367)
	at java.lang.Thread.run(Thread.java:745)




Build Log:
[...truncated 12028 lines...]
   [junit4] Suite: org.apache.solr.handler.TestSolrConfigHandlerCloud
   [junit4]   2> Creating dataDir: C:\Users\JenkinsSlave\workspace\Lucene-Solr-5.x-Windows\solr\build\solr-core\test\J1\temp\solr.handler.TestSolrConfigHandlerCloud_270D9845923FE1E5-001\init-core-data-001
   [junit4]   2> 3098527 INFO  (SUITE-TestSolrConfigHandlerCloud-seed#[270D9845923FE1E5]-worker) [    ] o.a.s.SolrTestCaseJ4 Randomized ssl (false) and clientAuth (false)
   [junit4]   2> 3098527 INFO  (SUITE-TestSolrConfigHandlerCloud-seed#[270D9845923FE1E5]-worker) [    ] o.a.s.BaseDistributedSearchTestCase Setting hostContext system property: /
   [junit4]   2> 3098532 INFO  (TEST-TestSolrConfigHandlerCloud.test-seed#[270D9845923FE1E5]) [    ] o.a.s.c.ZkTestServer STARTING ZK TEST SERVER
   [junit4]   2> 3098533 INFO  (Thread-5734) [    ] o.a.s.c.ZkTestServer client port:0.0.0.0/0.0.0.0:0
   [junit4]   2> 3098533 INFO  (Thread-5734) [    ] o.a.s.c.ZkTestServer Starting server
   [junit4]   2> 3098619 INFO  (TEST-TestSolrConfigHandlerCloud.test-seed#[270D9845923FE1E5]) [    ] o.a.s.c.ZkTestServer start zk server on port:52196
   [junit4]   2> 3098619 INFO  (TEST-TestSolrConfigHandlerCloud.test-seed#[270D9845923FE1E5]) [    ] o.a.s.c.c.SolrZkClient Using default ZkCredentialsProvider
   [junit4]   2> 3098621 INFO  (TEST-TestSolrConfigHandlerCloud.test-seed#[270D9845923FE1E5]) [    ] o.a.s.c.c.ConnectionManager Waiting for client to connect to ZooKeeper
   [junit4]   2> 3098624 INFO  (zkCallback-3253-thread-1) [    ] o.a.s.c.c.ConnectionManager Watcher org.apache.solr.common.cloud.ConnectionManager@1b05dde name:ZooKeeperConnection Watcher:127.0.0.1:52196 got event WatchedEvent state:SyncConnected type:None path:null path:null type:None
   [junit4]   2> 3098624 INFO  (TEST-TestSolrConfigHandlerCloud.test-seed#[270D9845923FE1E5]) [    ] o.a.s.c.c.ConnectionManager Client is connected to ZooKeeper
   [junit4]   2> 3098624 INFO  (TEST-TestSolrConfigHandlerCloud.test-seed#[270D9845923FE1E5]) [    ] o.a.s.c.c.SolrZkClient Using default ZkACLProvider
   [junit4]   2> 3098624 INFO  (TEST-TestSolrConfigHandlerCloud.test-seed#[270D9845923FE1E5]) [    ] o.a.s.c.c.SolrZkClient makePath: /solr
   [junit4]   2> 3098627 INFO  (TEST-TestSolrConfigHandlerCloud.test-seed#[270D9845923FE1E5]) [    ] o.a.s.c.c.SolrZkClient Using default ZkCredentialsProvider
   [junit4]   2> 3098629 INFO  (TEST-TestSolrConfigHandlerCloud.test-seed#[270D9845923FE1E5]) [    ] o.a.s.c.c.ConnectionManager Waiting for client to connect to ZooKeeper
   [junit4]   2> 3098631 INFO  (zkCallback-3254-thread-1) [    ] o.a.s.c.c.ConnectionManager Watcher org.apache.solr.common.cloud.ConnectionManager@16c0bc3 name:ZooKeeperConnection Watcher:127.0.0.1:52196/solr got event WatchedEvent state:SyncConnected type:None path:null path:null type:None
   [junit4]   2> 3098631 INFO  (TEST-TestSolrConfigHandlerCloud.test-seed#[270D9845923FE1E5]) [    ] o.a.s.c.c.ConnectionManager Client is connected to ZooKeeper
   [junit4]   2> 3098631 INFO  (TEST-TestSolrConfigHandlerCloud.test-seed#[270D9845923FE1E5]) [    ] o.a.s.c.c.SolrZkClient Using default ZkACLProvider
   [junit4]   2> 3098631 INFO  (TEST-TestSolrConfigHandlerCloud.test-seed#[270D9845923FE1E5]) [    ] o.a.s.c.c.SolrZkClient makePath: /collections/collection1
   [junit4]   2> 3098633 INFO  (TEST-TestSolrConfigHandlerCloud.test-seed#[270D9845923FE1E5]) [    ] o.a.s.c.c.SolrZkClient makePath: /collections/collection1/shards
   [junit4]   2> 3098636 INFO  (TEST-TestSolrConfigHandlerCloud.test-seed#[270D9845923FE1E5]) [    ] o.a.s.c.c.SolrZkClient makePath: /collections/control_collection
   [junit4]   2> 3098638 INFO  (TEST-TestSolrConfigHandlerCloud.test-seed#[270D9845923FE1E5]) [    ] o.a.s.c.c.SolrZkClient makePath: /collections/control_collection/shards
   [junit4]   2> 3098639 INFO  (TEST-TestSolrConfigHandlerCloud.test-seed#[270D9845923FE1E5]) [    ] o.a.s.c.AbstractZkTestCase put C:\Users\JenkinsSlave\workspace\Lucene-Solr-5.x-Windows\solr\core\src\test-files\solr\collection1\conf\solrconfig-tlog.xml to /configs/conf1/solrconfig.xml
   [junit4]   2> 3098640 INFO  (TEST-TestSolrConfigHandlerCloud.test-seed#[270D9845923FE1E5]) [    ] o.a.s.c.c.SolrZkClient makePath: /configs/conf1/solrconfig.xml
   [junit4]   2> 3098644 INFO  (TEST-TestSolrConfigHandlerCloud.test-seed#[270D9845923FE1E5]) [    ] o.a.s.c.AbstractZkTestCase put C:\Users\JenkinsSlave\workspace\Lucene-Solr-5.x-Windows\solr\core\src\test-files\solr\collection1\conf\schema.xml to /configs/conf1/schema.xml
   [junit4]   2> 3098644 INFO  (TEST-TestSolrConfigHandlerCloud.test-seed#[270D9845923FE1E5]) [    ] o.a.s.c.c.SolrZkClient makePath: /configs/conf1/schema.xml
   [junit4]   2> 3098648 INFO  (TEST-TestSolrConfigHandlerCloud.test-seed#[270D9845923FE1E5]) [    ] o.a.s.c.AbstractZkTestCase put C:\Users\JenkinsSlave\workspace\Lucene-Solr-5.x-Windows\solr\core\src\test-files\solr\collection1\conf\solrconfig.snippet.randomindexconfig.xml to /configs/conf1/solrconfig.snippet.randomindexconfig.xml
   [junit4]   2> 3098648 INFO  (TEST-TestSolrConfigHandlerCloud.test-seed#[270D9845923FE1E5]) [    ] o.a.s.c.c.SolrZkClient makePath: /configs/conf1/solrconfig.snippet.randomindexconfig.xml
   [junit4]   2> 3098650 INFO  (TEST-TestSolrConfigHandlerCloud.test-seed#[270D9845923FE1E5]) [    ] o.a.s.c.AbstractZkTestCase put C:\Users\JenkinsSlave\workspace\Lucene-Solr-5.x-Windows\solr\core\src\test-files\solr\collection1\conf\stopwords.txt to /configs/conf1/stopwords.txt
   [junit4]   2> 3098650 INFO  (TEST-TestSolrConfigHandlerCloud.test-seed#[270D9845923FE1E5]) [    ] o.a.s.c.c.SolrZkClient makePath: /configs/conf1/stopwords.txt
   [junit4]   2> 3098654 INFO  (TEST-TestSolrConfigHandlerCloud.test-seed#[270D9845923FE1E5]) [    ] o.a.s.c.AbstractZkTestCase put C:\Users\JenkinsSlave\workspace\Lucene-Solr-5.x-Windows\solr\core\src\test-files\solr\collection1\conf\protwords.txt to /configs/conf1/protwords.txt
   [junit4]   2> 3098654 INFO  (TEST-TestSolrConfigHandlerCloud.test-seed#[270D9845923FE1E5]) [    ] o.a.s.c.c.SolrZkClient makePath: /configs/conf1/protwords.txt
   [junit4]   2> 3098656 INFO  (TEST-TestSolrConfigHandlerCloud.test-seed#[270D9845923FE1E5]) [    ] o.a.s.c.AbstractZkTestCase put C:\Users\JenkinsSlave\workspace\Lucene-Solr-5.x-Windows\solr\core\src\test-files\solr\collection1\conf\currency.xml to /configs/conf1/currency.xml
   [junit4]   2> 3098656 INFO  (TEST-TestSolrConfigHandlerCloud.test-seed#[270D9845923FE1E5]) [    ] o.a.s.c.c.SolrZkClient makePath: /configs/conf1/currency.xml
   [junit4]   2> 3098658 INFO  (TEST-TestSolrConfigHandlerCloud.test-seed#[270D9845923FE1E5]) [    ] o.a.s.c.AbstractZkTestCase put C:\Users\JenkinsSlave\workspace\Lucene-Solr-5.x-Windows\solr\core\src\test-files\solr\collection1\conf\enumsConfig.xml to /configs/conf1/enumsConfig.xml
   [junit4]   2> 3098658 INFO  (TEST-TestSolrConfigHandlerCloud.test-seed#[270D9845923FE1E5]) [    ] o.a.s.c.c.SolrZkClient makePath: /configs/conf1/enumsConfig.xml
   [junit4]   2> 3098660 INFO  (TEST-TestSolrConfigHandlerCloud.test-seed#[270D9845923FE1E5]) [    ] o.a.s.c.AbstractZkTestCase put C:\Users\JenkinsSlave\workspace\Lucene-Solr-5.x-Windows\solr\core\src\test-files\solr\collection1\conf\open-exchange-rates.json to /configs/conf1/open-exchange-rates.json
   [junit4]   2> 3098660 INFO  (TEST-TestSolrConfigHandlerCloud.test-seed#[270D9845923FE1E5]) [    ] o.a.s.c.c.SolrZkClient makePath: /configs/conf1/open-exchange-rates.json
   [junit4]   2> 3098663 INFO  (TEST-TestSolrConfigHandlerCloud.test-seed#[270D9845923FE1E5]) [    ] o.a.s.c.AbstractZkTestCase put C:\Users\JenkinsSlave\workspace\Lucene-Solr-5.x-Windows\solr\core\src\test-files\solr\collection1\conf\mapping-ISOLatin1Accent.txt to /configs/conf1/mapping-ISOLatin1Accent.txt
   [junit4]   2> 3098664 INFO  (TEST-TestSolrConfigHandlerCloud.test-seed#[270D9845923FE1E5]) [    ] o.a.s.c.c.SolrZkClient makePath: /configs/conf1/mapping-ISOLatin1Accent.txt
   [junit4]   2> 3098666 INFO  (TEST-TestSolrConfigHandlerCloud.test-seed#[270D9845923FE1E5]) [    ] o.a.s.c.AbstractZkTestCase put C:\Users\JenkinsSlave\workspace\Lucene-Solr-5.x-Windows\solr\core\src\test-files\solr\collection1\conf\old_synonyms.txt to /configs/conf1/old_synonyms.txt
   [junit4]   2> 3098666 INFO  (TEST-TestSolrConfigHandlerCloud.test-seed#[270D9845923FE1E5]) [    ] o.a.s.c.c.SolrZkClient makePath: /configs/conf1/old_synonyms.txt
   [junit4]   2> 3098669 INFO  (TEST-TestSolrConfigHandlerCloud.test-seed#[270D9845923FE1E5]) [    ] o.a.s.c.AbstractZkTestCase put C:\Users\JenkinsSlave\workspace\Lucene-Solr-5.x-Windows\solr\core\src\test-files\solr\collection1\conf\synonyms.txt to /configs/conf1/synonyms.txt
   [junit4]   2> 3098669 INFO  (TEST-TestSolrConfigHandlerCloud.test-seed#[270D9845923FE1E5]) [    ] o.a.s.c.c.SolrZkClient makePath: /configs/conf1/synonyms.txt
   [junit4]   2> 3099092 INFO  (TEST-TestSolrConfigHandlerCloud.test-seed#[270D9845923FE1E5]) [    ] o.a.s.SolrTestCaseJ4 Writing core.properties file to C:\Users\JenkinsSlave\workspace\Lucene-Solr-5.x-Windows\solr\build\solr-core\test\J1\temp\solr.handler.TestSolrConfigHandlerCloud_270D9845923FE1E5-001\control-001\cores\collection1
   [junit4]   2> 3099094 INFO  (TEST-TestSolrConfigHandlerCloud.test-seed#[270D9845923FE1E5]) [    ] o.e.j.s.Server jetty-9.2.13.v20150730
   [junit4]   2> 3099098 INFO  (TEST-TestSolrConfigHandlerCloud.test-seed#[270D9845923FE1E5]) [    ] o.e.j.s.h.ContextHandler Started o.e.j.s.ServletContextHandler@8f5774{/,null,AVAILABLE}
   [junit4]   2> 3099098 INFO  (TEST-TestSolrConfigHandlerCloud.test-seed#[270D9845923FE1E5]) [    ] o.e.j.s.ServerConnector Started ServerConnector@b6ab04{HTTP/1.1}{127.0.0.1:52203}
   [junit4]   2> 3099098 INFO  (TEST-TestSolrConfigHandlerCloud.test-seed#[270D9845923FE1E5]) [    ] o.e.j.s.Server Started @3103209ms
   [junit4]   2> 3099098 INFO  (TEST-TestSolrConfigHandlerCloud.test-seed#[270D9845923FE1E5]) [    ] o.a.s.c.s.e.JettySolrRunner Jetty properties: {hostContext=/, solr.data.dir=C:\Users\JenkinsSlave\workspace\Lucene-Solr-5.x-Windows\solr\build\solr-core\test\J1\temp\solr.handler.TestSolrConfigHandlerCloud_270D9845923FE1E5-001\tempDir-001/control/data, hostPort=52203, coreRootDirectory=C:\Users\JenkinsSlave\workspace\Lucene-Solr-5.x-Windows\solr\build\solr-core\test\J1\..\..\..\..\..\..\..\..\..\Users\JenkinsSlave\workspace\Lucene-Solr-5.x-Windows\solr\build\solr-core\test\J1\temp\solr.handler.TestSolrConfigHandlerCloud_270D9845923FE1E5-001\control-001\cores}
   [junit4]   2> 3099098 INFO  (TEST-TestSolrConfigHandlerCloud.test-seed#[270D9845923FE1E5]) [    ] o.a.s.s.SolrDispatchFilter SolrDispatchFilter.init(): sun.misc.Launcher$AppClassLoader@b2933f
   [junit4]   2> 3099098 INFO  (TEST-TestSolrConfigHandlerCloud.test-seed#[270D9845923FE1E5]) [    ] o.a.s.c.SolrResourceLoader new SolrResourceLoader for directory: 'C:\Users\JenkinsSlave\workspace\Lucene-Solr-5.x-Windows\solr\build\solr-core\test\J1\temp\solr.handler.TestSolrConfigHandlerCloud_270D9845923FE1E5-001\control-001'
   [junit4]   2> 3099099 INFO  (TEST-TestSolrConfigHandlerCloud.test-seed#[270D9845923FE1E5]) [    ] o.a.s.c.SolrResourceLoader JNDI not configured for solr (NoInitialContextEx)
   [junit4]   2> 3099099 INFO  (TEST-TestSolrConfigHandlerCloud.test-seed#[270D9845923FE1E5]) [    ] o.a.s.c.SolrResourceLoader solr home defaulted to 'solr/' (could not find system property or JNDI)
   [junit4]   2> 3099099 INFO  (TEST-TestSolrConfigHandlerCloud.test-seed#[270D9845923FE1E5]) [    ] o.a.s.c.c.SolrZkClient Using default ZkCredentialsProvider
   [junit4]   2> 3099100 INFO  (TEST-TestSolrConfigHandlerCloud.test-seed#[270D9845923FE1E5]) [    ] o.a.s.c.c.ConnectionManager Waiting for client to connect to ZooKeeper
   [junit4]   2> 3099103 INFO  (zkCallback-3255-thread-1) [    ] o.a.s.c.c.ConnectionManager Watcher org.apache.solr.common.cloud.ConnectionManager@12a922c name:ZooKeeperConnection Watcher:127.0.0.1:52196/solr got event WatchedEvent state:SyncConnected type:None path:null path:null type:None
   [junit4]   2> 3099103 INFO  (TEST-TestSolrConfigHandlerCloud.test-seed#[270D9845923FE1E5]) [    ] o.a.s.c.c.ConnectionManager Client is connected to ZooKeeper
   [junit4]   2> 3099103 INFO  (TEST-TestSolrConfigHandlerCloud.test-seed#[270D9845923FE1E5]) [    ] o.a.s.c.c.SolrZkClient Using default ZkACLProvider
   [junit4]   2> 3099104 INFO  (TEST-TestSolrConfigHandlerCloud.test-seed#[270D9845923FE1E5]) [    ] o.a.s.s.SolrDispatchFilter Loading solr.xml from SolrHome (not found in ZooKeeper)
   [junit4]   2> 3099104 INFO  (TEST-TestSolrConfigHandlerCloud.test-seed#[270D9845923FE1E5]) [    ] o.a.s.c.SolrXmlConfig Loading container configuration from C:\Users\JenkinsSlave\workspace\Lucene-Solr-5.x-Windows\solr\build\solr-core\test\J1\temp\solr.handler.TestSolrConfigHandlerCloud_270D9845923FE1E5-001\control-001\solr.xml
   [junit4]   2> 3099142 INFO  (TEST-TestSolrConfigHandlerCloud.test-seed#[270D9845923FE1E5]) [    ] o.a.s.c.CorePropertiesLocator Config-defined core root directory: C:\Users\JenkinsSlave\workspace\Lucene-Solr-5.x-Windows\solr\build\solr-core\test\J1\..\..\..\..\..\..\..\..\..\Users\JenkinsSlave\workspace\Lucene-Solr-5.x-Windows\solr\build\solr-core\test\J1\temp\solr.handler.TestSolrConfigHandlerCloud_270D9845923FE1E5-001\control-001\cores
   [junit4]   2> 3099142 INFO  (TEST-TestSolrConfigHandlerCloud.test-seed#[270D9845923FE1E5]) [    ] o.a.s.c.CoreContainer New CoreContainer 9309167
   [junit4]   2> 3099142 INFO  (TEST-TestSolrConfigHandlerCloud.test-seed#[270D9845923FE1E5]) [    ] o.a.s.c.CoreContainer Loading cores into CoreContainer [instanceDir=C:\Users\JenkinsSlave\workspace\Lucene-Solr-5.x-Windows\solr\build\solr-core\test\J1\temp\solr.handler.TestSolrConfigHandlerCloud_270D9845923FE1E5-001\control-001]
   [junit4]   2> 3099142 WARN  (TEST-TestSolrConfigHandlerCloud.test-seed#[270D9845923FE1E5]) [    ] o.a.s.c.CoreContainer Couldn't add files from C:\Users\JenkinsSlave\workspace\Lucene-Solr-5.x-Windows\solr\build\solr-core\test\J1\temp\solr.handler.TestSolrConfigHandlerCloud_270D9845923FE1E5-001\control-001\lib to classpath: C:\Users\JenkinsSlave\workspace\Lucene-Solr-5.x-Windows\solr\build\solr-core\test\J1\temp\solr.handler.TestSolrConfigHandlerCloud_270D9845923FE1E5-001\control-001\lib
   [junit4]   2> 3099144 INFO  (TEST-TestSolrConfigHandlerCloud.test-seed#[270D9845923FE1E5]) [    ] o.a.s.h.c.HttpShardHandlerFactory created with socketTimeout : 90000,urlScheme : ,connTimeout : 15000,maxConnectionsPerHost : 20,maxConnections : 10000,corePoolSize : 0,maximumPoolSize : 2147483647,maxThreadIdleTime : 5,sizeOfQueue : -1,fairnessPolicy : false,useRetries : false,
   [junit4]   2> 3099147 INFO  (TEST-TestSolrConfigHandlerCloud.test-seed#[270D9845923FE1E5]) [    ] o.a.s.u.UpdateShardHandler Creating UpdateShardHandler HTTP client with params: socketTimeout=340000&connTimeout=45000&retry=true
   [junit4]   2> 3099147 INFO  (TEST-TestSolrConfigHandlerCloud.test-seed#[270D9845923FE1E5]) [    ] o.a.s.l.LogWatcher SLF4J impl is org.slf4j.impl.Log4jLoggerFactory
   [junit4]   2> 3099147 INFO  (TEST-TestSolrConfigHandlerCloud.test-seed#[270D9845923FE1E5]) [    ] o.a.s.l.LogWatcher Registering Log Listener [Log4j (org.slf4j.impl.Log4jLoggerFactory)]
   [junit4]   2> 3099147 INFO  (TEST-TestSolrConfigHandlerCloud.test-seed#[270D9845923FE1E5]) [    ] o.a.s.c.ZkContainer Zookeeper client=127.0.0.1:52196/solr
   [junit4]   2> 3099147 INFO  (TEST-TestSolrConfigHandlerCloud.test-seed#[270D9845923FE1E5]) [    ] o.a.s.c.ZkController zkHost includes chroot
   [junit4]   2> 3099147 INFO  (TEST-TestSolrConfigHandlerCloud.test-seed#[270D9845923FE1E5]) [    ] o.a.s.c.c.SolrZkClient Using default ZkCredentialsProvider
   [junit4]   2> 3099148 INFO  (TEST-TestSolrConfigHandlerCloud.test-seed#[270D9845923FE1E5]) [    ] o.a.s.c.c.ConnectionManager Waiting for client to connect to ZooKeeper
   [junit4]   2> 3099150 INFO  (zkCallback-3258-thread-1) [    ] o.a.s.c.c.ConnectionManager Watcher org.apache.solr.common.cloud.ConnectionManager@800bb5 name:ZooKeeperConnection Watcher:127.0.0.1:52196 got event WatchedEvent state:SyncConnected type:None path:null path:null type:None
   [junit4]   2> 3099150 INFO  (TEST-TestSolrConfigHandlerCloud.test-seed#[270D9845923FE1E5]) [    ] o.a.s.c.c.ConnectionManager Client is connected to ZooKeeper
   [junit4]   2> 3099150 INFO  (TEST-TestSolrConfigHandlerCloud.test-seed#[270D9845923FE1E5]) [    ] o.a.s.c.c.SolrZkClient Using default ZkACLProvider
   [junit4]   2> 3099153 INFO  (TEST-TestSolrConfigHandlerCloud.test-seed#[270D9845923FE1E5]) [n:127.0.0.1:52203_    ] o.a.s.c.c.ConnectionManager Waiting for client to connect to ZooKeeper
   [junit4]   2> 3099154 INFO  (zkCallback-3259-thread-1-processing-n:127.0.0.1:52203_) [n:127.0.0.1:52203_    ] o.a.s.c.c.ConnectionManager Watcher org.apache.solr.common.cloud.ConnectionManager@430347 name:ZooKeeperConnection Watcher:127.0.0.1:52196/solr got event WatchedEvent state:SyncConnected type:None path:null path:null type:None
   [junit4]   2> 3099154 INFO  (TEST-TestSolrConfigHandlerCloud.test-seed#[270D9845923FE1E5]) [n:127.0.0.1:52203_    ] o.a.s.c.c.ConnectionManager Client is connected to ZooKeeper
   [junit4]   2> 3099155 INFO  (TEST-TestSolrConfigHandlerCloud.test-seed#[270D9845923FE1E5]) [n:127.0.0.1:52203_    ] o.a.s.c.c.SolrZkClient makePath: /overseer/queue
   [junit4]   2> 3099158 INFO  (TEST-TestSolrConfigHandlerCloud.test-seed#[270D9845923FE1E5]) [n:127.0.0.1:52203_    ] o.a.s.c.c.SolrZkClient makePath: /overseer/collection-queue-work
   [junit4]   2> 3099161 INFO  (TEST-TestSolrConfigHandlerCloud.test-seed#[270D9845923FE1E5]) [n:127.0.0.1:52203_    ] o.a.s.c.c.SolrZkClient makePath: /overseer/collection-map-running
   [junit4]   2> 3099163 INFO  (TEST-TestSolrConfigHandlerCloud.test-seed#[270D9845923FE1E5]) [n:127.0.0.1:52203_    ] o.a.s.c.c.SolrZkClient makePath: /overseer/collection-map-completed
   [junit4]   2> 3099164 INFO  (TEST-TestSolrConfigHandlerCloud.test-seed#[270D9845923FE1E5]) [n:127.0.0.1:52203_    ] o.a.s.c.c.SolrZkClient makePath: /overseer/collection-map-failure
   [junit4]   2> 3099167 INFO  (TEST-TestSolrConfigHandlerCloud.test-seed#[270D9845923FE1E5]) [n:127.0.0.1:52203_    ] o.a.s.c.c.SolrZkClient makePath: /live_nodes
   [junit4]   2> 3099169 INFO  (TEST-TestSolrConfigHandlerCloud.test-seed#[270D9845923FE1E5]) [n:127.0.0.1:52203_    ] o.a.s.c.c.SolrZkClient makePath: /aliases.json
   [junit4]   2> 3099169 INFO  (TEST-TestSolrConfigHandlerCloud.test-seed#[270D9845923FE1E5]) [n:127.0.0.1:52203_    ] o.a.s.c.c.SolrZkClient makePath: /clusterstate.json
   [junit4]   2> 3099171 INFO  (TEST-TestSolrConfigHandlerCloud.test-seed#[270D9845923FE1E5]) [n:127.0.0.1:52203_    ] o.a.s.c.c.SolrZkClient makePath: /security.json
   [junit4]   2> 3099172 INFO  (TEST-TestSolrConfigHandlerCloud.test-seed#[270D9845923FE1E5]) [n:127.0.0.1:52203_    ] o.a.s.c.ZkController Register node as live in ZooKeeper:/live_nodes/127.0.0.1:52203_
   [junit4]   2> 3099172 INFO  (TEST-TestSolrConfigHandlerCloud.test-seed#[270D9845923FE1E5]) [n:127.0.0.1:52203_    ] o.a.s.c.c.SolrZkClient makePath: /live_nodes/127.0.0.1:52203_
   [junit4]   2> 3099174 INFO  (TEST-TestSolrConfigHandlerCloud.test-seed#[270D9845923FE1E5]) [n:127.0.0.1:52203_    ] o.a.s.c.c.SolrZkClient makePath: /overseer_elect
   [junit4]   2> 3099176 INFO  (TEST-TestSolrConfigHandlerCloud.test-seed#[270D9845923FE1E5]) [n:127.0.0.1:52203_    ] o.a.s.c.c.SolrZkClient makePath: /overseer_elect/election
   [junit4]   2> 3099178 INFO  (TEST-TestSolrConfigHandlerCloud.test-seed#[270D9845923FE1E5]) [n:127.0.0.1:52203_    ] o.a.s.c.Overseer Overseer (id=null) closing
   [junit4]   2> 3099179 INFO  (TEST-TestSolrConfigHandlerCloud.test-seed#[270D9845923FE1E5]) [n:127.0.0.1:52203_    ] o.a.s.c.LeaderElector Joined leadership election with path: /overseer_elect/election/95312289884209156-127.0.0.1:52203_-n_0000000000
   [junit4]   2> 3099179 INFO  (TEST-TestSolrConfigHandlerCloud.test-seed#[270D9845923FE1E5]) [n:127.0.0.1:52203_    ] o.a.s.c.OverseerElectionContext I am going to be the leader 127.0.0.1:52203_
   [junit4]   2> 3099179 INFO  (TEST-TestSolrConfigHandlerCloud.test-seed#[270D9845923FE1E5]) [n:127.0.0.1:52203_    ] o.a.s.c.c.SolrZkClient makePath: /overseer_elect/leader
   [junit4]   2> 3099180 INFO  (TEST-TestSolrConfigHandlerCloud.test-seed#[270D9845923FE1E5]) [n:127.0.0.1:52203_    ] o.a.s.c.Overseer Overseer (id=95312289884209156-127.0.0.1:52203_-n_0000000000) starting
   [junit4]   2> 3099181 INFO  (TEST-TestSolrConfigHandlerCloud.test-seed#[270D9845923FE1E5]) [n:127.0.0.1:52203_    ] o.a.s.c.c.SolrZkClient makePath: /overseer/queue-work
   [junit4]   2> 3099188 INFO  (TEST-TestSolrConfigHandlerCloud.test-seed#[270D9845923FE1E5]) [n:127.0.0.1:52203_    ] o.a.s.c.OverseerAutoReplicaFailoverThread Starting OverseerAutoReplicaFailoverThread autoReplicaFailoverWorkLoopDelay=10000 autoReplicaFailoverWaitAfterExpiration=30000 autoReplicaFailoverBadNodeExpiration=60000
   [junit4]   2> 3099189 INFO  (OverseerCollectionConfigSetProcessor-95312289884209156-127.0.0.1:52203_-n_0000000000) [n:127.0.0.1:52203_    ] o.a.s.c.OverseerTaskProcessor Process current queue of overseer operations
   [junit4]   2> 3099189 INFO  (TEST-TestSolrConfigHandlerCloud.test-seed#[270D9845923FE1E5]) [n:127.0.0.1:52203_    ] o.a.s.c.c.ZkStateReader Updating cluster state from ZooKeeper... 
   [junit4]   2> 3099189 INFO  (OverseerStateUpdate-95312289884209156-127.0.0.1:52203_-n_0000000000) [n:127.0.0.1:52203_    ] o.a.s.c.Overseer Starting to work on the main queue
   [junit4]   2> 3099205 INFO  (TEST-TestSolrConfigHandlerCloud.test-seed#[270D9845923FE1E5]) [n:127.0.0.1:52203_    ] o.a.s.c.CoreContainer Security conf doesn't exist. Skipping setup for authorization module.
   [junit4]   2> 3099206 INFO  (TEST-TestSolrConfigHandlerCloud.test-seed#[270D9845923FE1E5]) [n:127.0.0.1:52203_    ] o.a.s.c.CoreContainer No authentication plugin used.
   [junit4]   2> 3099207 INFO  (TEST-TestSolrConfigHandlerCloud.test-seed#[270D9845923FE1E5]) [n:127.0.0.1:52203_    ] o.a.s.c.CorePropertiesLocator Looking for core definitions underneath C:\Users\JenkinsSlave\workspace\Lucene-Solr-5.x-Windows\solr\build\solr-core\test\J1\..\..\..\..\..\..\..\..\..\Users\JenkinsSlave\workspace\Lucene-Solr-5.x-Windows\solr\build\solr-core\test\J1\temp\solr.handler.TestSolrConfigHandlerCloud_270D9845923FE1E5-001\control-001\cores
   [junit4]   2> 3099210 INFO  (TEST-TestSolrConfigHandlerCloud.test-seed#[270D9845923FE1E5]) [n:127.0.0.1:52203_    ] o.a.s.c.CoreDescriptor Created CoreDescriptor: {loadOnStartup=true, dataDir=data\, schema=schema.xml, name=collection1, coreNodeName=, transient=false, collection=control_collection, shard=, config=solrconfig.xml, configSetProperties=configsetprops.json}
   [junit4]   2> 3099210 INFO  (TEST-TestSolrConfigHandlerCloud.test-seed#[270D9845923FE1E5]) [n:127.0.0.1:52203_    ] o.a.s.c.CorePropertiesLocator Found core collection1 in C:\Users\JenkinsSlave\workspace\Lucene-Solr-5.x-Windows\solr\build\solr-core\test\J1\..\..\..\..\..\..\..\..\..\Users\JenkinsSlave\workspace\Lucene-Solr-5.x-Windows\solr\build\solr-core\test\J1\temp\solr.handler.TestSolrConfigHandlerCloud_270D9845923FE1E5-001\control-001\cores\collection1
   [junit4]   2> 3099210 INFO  (TEST-TestSolrConfigHandlerCloud.test-seed#[270D9845923FE1E5]) [n:127.0.0.1:52203_    ] o.a.s.c.CorePropertiesLocator Found 1 core definitions
   [junit4]   2> 3099211 INFO  (TEST-TestSolrConfigHandlerCloud.test-seed#[270D9845923FE1E5]) [n:127.0.0.1:52203_    ] o.a.s.s.SolrDispatchFilter user.dir=C:\Users\JenkinsSlave\workspace\Lucene-Solr-5.x-Windows\solr\build\solr-core\test\J1
   [junit4]   2> 3099211 INFO  (TEST-TestSolrConfigHandlerCloud.test-seed#[270D9845923FE1E5]) [n:127.0.0.1:52203_    ] o.a.s.s.SolrDispatchFilter SolrDispatchFilter.init() done
   [junit4]   2> 3099212 INFO  (coreLoadExecutor-6553-thread-1-processing-n:127.0.0.1:52203_) [n:127.0.0.1:52203_ c:control_collection   x:collection1] o.a.s.c.ZkController publishing state=down
   [junit4]   2> 3099212 INFO  (coreLoadExecutor-6553-thread-1-processing-n:127.0.0.1:52203_) [n:127.0.0.1:52203_ c:control_collection   x:collection1] o.a.s.c.ZkController numShards not found on descriptor - reading it from system property
   [junit4]   2> 3099213 INFO  (OverseerStateUpdate-95312289884209156-127.0.0.1:52203_-n_0000000000) [n:127.0.0.1:52203_    ] o.a.s.c.Overseer processMessage: queueSize: 1, message = {
   [junit4]   2>   "roles":null,
   [junit4]   2>   "node_name":"127.0.0.1:52203_",
   [junit4]   2>   "operation":"state",
   [junit4]   2>   "numShards":"1",
   [junit4]   2>   "core":"collection1",
   [junit4]   2>   "shard":null,
   [junit4]   2>   "state":"down",
   [junit4]   2>   "collection":"control_collection",
   [junit4]   2>   "base_url":"http://127.0.0.1:52203"} current state version: 0
   [junit4]   2> 3099213 INFO  (coreLoadExecutor-6553-thread-1-processing-n:127.0.0.1:52203_) [n:127.0.0.1:52203_ c:control_collection   x:collection1] o.a.s.c.ZkController look for our core node name
   [junit4]   2> 3099214 INFO  (OverseerStateUpdate-95312289884209156-127.0.0.1:52203_-n_0000000000) [n:127.0.0.1:52203_    ] o.a.s.c.o.ReplicaMutator Update state numShards=1 message={
   [junit4]   2>   "roles":null,
   [junit4]   2>   "node_name":"127.0.0.1:52203_",
   [junit4]   2>   "operation":"state",
   [junit4]   2>   "numShards":"1",
   [junit4]   2>   "core":"collection1",
   [junit4]   2>   "shard":null,
   [junit4]   2>   "state":"down",
   [junit4]   2>   "collection":"control_collection",
   [junit4]   2>   "base_url":"http://127.0.0.1:52203"}
   [junit4]   2> 3099214 INFO  (OverseerStateUpdate-95312289884209156-127.0.0.1:52203_-n_0000000000) [n:127.0.0.1:52203_    ] o.a.s.c.o.ClusterStateMutator building a new cName: control_collection
   [junit4]   2> 3099216 INFO  (OverseerStateUpdate-95312289884209156-127.0.0.1:52203_-n_0000000000) [n:127.0.0.1:52203_    ] o.a.s.c.o.ReplicaMutator Assigning new node to shard shard=shard1
   [junit4]   2> 3099218 INFO  (zkCallback-3259-thread-1-processing-n:127.0.0.1:52203_) [n:127.0.0.1:52203_    ] o.a.s.c.c.ZkStateReader A cluster state change: [WatchedEvent state:SyncConnected type:NodeDataChanged path:/clusterstate.json], has occurred - updating... (live nodes size: [1])
   [junit4]   2> 3100079 INFO  (coreLoadExecutor-6553-thread-1-processing-n:127.0.0.1:52203_) [n:127.0.0.1:52203_ c:control_collection   x:collection1] o.a.s.c.ZkController waiting to find shard id in clusterstate for collection1
   [junit4]   2> 3100079 INFO  (coreLoadExecutor-6553-thread-1-processing-n:127.0.0.1:52203_) [n:127.0.0.1:52203_ c:control_collection   x:collection1] o.a.s.c.ZkController Check for collection zkNode:control_collection
   [junit4]   2> 3100080 INFO  (coreLoadExecutor-6553-thread-1-processing-n:127.0.0.1:52203_) [n:127.0.0.1:52203_ c:control_collection   x:collection1] o.a.s.c.ZkController Collection zkNode exists
   [junit4]   2> 3100080 INFO  (coreLoadExecutor-6553-thread-1-processing-n:127.0.0.1:52203_) [n:127.0.0.1:52203_ c:control_collection   x:collection1] o.a.s.c.c.ZkStateReader Load collection config from: [/collections/control_collection]
   [junit4]   2> 3100080 INFO  (coreLoadExecutor-6553-thread-1-processing-n:127.0.0.1:52203_) [n:127.0.0.1:52203_ c:control_collection   x:collection1] o.a.s.c.c.ZkStateReader path=[/collections/control_collection] [configName]=[conf1] specified config exists in ZooKeeper
   [junit4]   2> 3100080 INFO  (coreLoadExecutor-6553-thread-1-processing-n:127.0.0.1:52203_) [n:127.0.0.1:52203_ c:control_collection   x:collection1] o.a.s.c.SolrResourceLoader new SolrResourceLoader for directory: 'C:\Users\JenkinsSlave\workspace\Lucene-Solr-5.x-Windows\solr\build\solr-core\test\J1\temp\solr.handler.TestSolrConfigHandlerCloud_270D9845923FE1E5-001\control-001\cores\collection1'
   [junit4]   2> 3100080 INFO  (coreLoadExecutor-6553-thread-1-processing-n:127.0.0.1:52203_) [n:127.0.0.1:52203_ c:control_collection   x:collection1] o.a.s.c.SolrResourceLoader JNDI not configured for solr (NoInitialContextEx)
   [junit4]   2> 3100080 INFO  (coreLoadExecutor-6553-thread-1-processing-n:127.0.0.1:52203_) [n:127.0.0.1:52203_ c:control_collection   x:collection1] o.a.s.c.SolrResourceLoader solr home defaulted to 'solr/' (could not find system property or JNDI)
   [junit4]   2> 3100084 INFO  (coreLoadExecutor-6553-thread-1-processing-n:127.0.0.1:52203_) [n:127.0.0.1:52203_ c:control_collection   x:collection1] o.a.s.c.Config loaded config solrconfig.xml with version 0 
   [junit4]   2> 3100098 INFO  (coreLoadExecutor-6553-thread-1-processing-n:127.0.0.1:52203_) [n:127.0.0.1:52203_ c:control_collection   x:collection1] o.a.s.c.SolrConfig current version of requestparams : -1
   [junit4]   2> 3100119 INFO  (coreLoadExecutor-6553-thread-1-processing-n:127.0.0.1:52203_) [n:127.0.0.1:52203_ c:control_collection   x:collection1] o.a.s.c.SolrConfig Using Lucene MatchVersion: 5.5.0
   [junit4]   2> 3100183 INFO  (coreLoadExecutor-6553-thread-1-processing-n:127.0.0.1:52203_) [n:127.0.0.1:52203_ c:control_collection   x:collection1] o.a.s.c.SolrConfig Loaded SolrConfig: solrconfig.xml
   [junit4]   2> 3100203 INFO  (coreLoadExecutor-6553-thread-1-processing-n:127.0.0.1:52203_) [n:127.0.0.1:52203_ c:control_collection   x:collection1] o.a.s.s.IndexSchema [collection1] Schema name=test
   [junit4]   2> 3100557 INFO  (coreLoadExecutor-6553-thread-1-processing-n:127.0.0.1:52203_) [n:127.0.0.1:52203_ c:control_collection   x:collection1] o.a.s.s.OpenExchangeRatesOrgProvider Initialized with rates=open-exchange-rates.json, refreshInterval=1440.
   [junit4]   2> 3100567 INFO  (coreLoadExecutor-6553-thread-1-processing-n:127.0.0.1:52203_) [n:127.0.0.1:52203_ c:control_collection   x:collection1] o.a.s.s.IndexSchema default search field in schema is text
   [junit4]   2> 3100568 INFO  (coreLoadExecutor-6553-thread-1-processing-n:127.0.0.1:52203_) [n:127.0.0.1:52203_ c:control_collection   x:collection1] o.a.s.s.IndexSchema unique key field: id
   [junit4]   2> 3100579 INFO  (coreLoadExecutor-6553-thread-1-processing-n:127.0.0.1:52203_) [n:127.0.0.1:52203_ c:control_collection   x:collection1] o.a.s.s.FileExchangeRateProvider Reloading exchange rates from file currency.xml
   [junit4]   2> 3100583 INFO  (coreLoadExecutor-6553-thread-1-processing-n:127.0.0.1:52203_) [n:127.0.0.1:52203_ c:control_collection   x:collection1] o.a.s.s.FileExchangeRateProvider Reloading exchange rates from file currency.xml
   [junit4]   2> 3100586 INFO  (coreLoadExecutor-6553-thread-1-processing-n:127.0.0.1:52203_) [n:127.0.0.1:52203_ c:control_collection   x:collection1] o.a.s.s.OpenExchangeRatesOrgProvider Reloading exchange rates from open-exchange-rates.json
   [junit4]   2> 3100587 INFO  (coreLoadExecutor-6553-thread-1-processing-n:127.0.0.1:52203_) [n:127.0.0.1:52203_ c:control_collection   x:collection1] o.a.s.s.OpenExchangeRatesOrgProvider Reloading exchange rates from open-exchange-rates.json
   [junit4]   2> 3100591 INFO  (coreLoadExecutor-6553-thread-1-processing-n:127.0.0.1:52203_) [n:127.0.0.1:52203_ c:control_collection   x:collection1] o.a.s.c.ConfigSetProperties Did not find ConfigSet properties, assuming default properties: Can't find resource 'configsetprops.json' in classpath or '/configs/conf1', cwd=C:\Users\JenkinsSlave\workspace\Lucene-Solr-5.x-Windows\solr\build\solr-core\test\J1
   [junit4]   2> 3100591 INFO  (coreLoadExecutor-6553-thread-1-processing-n:127.0.0.1:52203_) [n:127.0.0.1:52203_ c:control_collection   x:collection1] o.a.s.c.CoreContainer Creating SolrCore 'collection1' using configuration from collection control_collection
   [junit4]   2> 3100591 INFO  (coreLoadExecutor-6553-thread-1-processing-n:127.0.0.1:52203_) [n:127.0.0.1:52203_ c:control_collection s:shard1 r:core_node1 x:collection1] o.a.s.c.SolrCore org.apache.solr.core.MockDirectoryFactory
   [junit4]   2> 3100591 INFO  (coreLoadExecutor-6553-thread-1-processing-n:127.0.0.1:52203_) [n:127.0.0.1:52203_ c:control_collection s:shard1 r:core_node1 x:collection1] o.a.s.c.SolrCore [[collection1] ] Opening new SolrCore at [C:\Users\JenkinsSlave\workspace\Lucene-Solr-5.x-Windows\solr\build\solr-core\test\J1\temp\solr.handler.TestSolrConfigHandlerCloud_270D9845923FE1E5-001\control-001\cores\collection1], dataDir=[C:\Users\JenkinsSlave\workspace\Lucene-Solr-5.x-Windows\solr\build\solr-core\test\J1\..\..\..\..\..\..\..\..\..\Users\JenkinsSlave\workspace\Lucene-Solr-5.x-Windows\solr\build\solr-core\test\J1\temp\solr.handler.TestSolrConfigHandlerCloud_270D9845923FE1E5-001\control-001\cores\collection1\data\]
   [junit4]   2> 3100592 INFO  (coreLoadExecutor-6553-thread-1-processing-n:127.0.0.1:52203_) [n:127.0.0.1:52203_ c:control_collection s:shard1 r:core_node1 x:collection1] o.a.s.c.JmxMonitoredMap JMX monitoring is enabled. Adding Solr mbeans to JMX Server: com.sun.jmx.mbeanserver.JmxMBeanServer@cb6ffa
   [junit4]   2> 3100592 INFO  (coreLoadExecutor-6553-thread-1-processing-n:127.0.0.1:52203_) [n:127.0.0.1:52203_ c:control_collection s:shard1 r:core_node1 x:collection1] o.a.s.c.CachingDirectoryFactory return new directory for C:\Users\JenkinsSlave\workspace\Lucene-Solr-5.x-Windows\solr\build\solr-core\test\J1\..\..\..\..\..\..\..\..\..\Users\JenkinsSlave\workspace\Lucene-Solr-5.x-Windows\solr\build\solr-core\test\J1\temp\solr.handler.TestSolrConfigHandlerCloud_270D9845923FE1E5-001\control-001\cores\collection1\data\
   [junit4]   2> 3100592 INFO  (coreLoadExecutor-6553-thread-1-processing-n:127.0.0.1:52203_) [n:127.0.0.1:52203_ c:control_collection s:shard1 r:core_node1 x:collection1] o.a.s.c.SolrCore New index directory detected: old=null new=C:\Users\JenkinsSlave\workspace\Lucene-Solr-5.x-Windows\solr\build\solr-core\test\J1\..\..\..\..\..\..\..\..\..\Users\JenkinsSlave\workspace\Lucene-Solr-5.x-Windows\solr\build\solr-core\test\J1\temp\solr.handler.TestSolrConfigHandlerCloud_270D9845923FE1E5-001\control-001\cores\collection1\data\index/
   [junit4]   2> 3100593 WARN  (coreLoadExecutor-6553-thread-1-processing-n:127.0.0.1:52203_) [n:127.0.0.1:52203_ c:control_collection s:shard1 r:core_node1 x:collection1] o.a.s.c.SolrCore [collection1] Solr index directory 'C:\Users\JenkinsSlave\workspace\Lucene-Solr-5.x-Windows\solr\build\solr-core\test\J1\..\..\..\..\..\..\..\..\..\Users\JenkinsSlave\workspace\Lucene-Solr-5.x-Windows\solr\build\solr-core\test\J1\temp\solr.handler.TestSolrConfigHandlerCloud_270D9845923FE1E5-001\control-001\cores\collection1\data\index' doesn't exist. Creating new index...
   [junit4]   2> 3100593 INFO  (coreLoadExecutor-6553-thread-1-processing-n:127.0.0.1:52203_) [n:127.0.0.1:52203_ c:control_collection s:shard1 r:core_node1 x:collection1] o.a.s.c.CachingDirectoryFactory return new directory for C:\Users\JenkinsSlave\workspace\Lucene-Solr-5.x-Windows\solr\build\solr-core\test\J1\..\..\..\..\..\..\..\..\..\Users\JenkinsSlave\workspace\Lucene-Solr-5.x-Windows\solr\build\solr-core\test\J1\temp\solr.handler.TestSolrConfigHandlerCloud_270D9845923FE1E5-001\control-001\cores\collection1\data\index
   [junit4]   2> 3100594 INFO  (coreLoadExecutor-6553-thread-1-processing-n:127.0.0.1:52203_) [n:127.0.0.1:52203_ c:control_collection s:shard1 r:core_node1 x:collection1] o.a.s.u.RandomMergePolicy RandomMergePolicy wrapping class org.apache.lucene.index.TieredMergePolicy: [TieredMergePolicy: maxMergeAtOnce=50, maxMergeAtOnceExplicit=48, maxMergedSegmentMB=24.1669921875, floorSegmentMB=1.6181640625, forceMergeDeletesPctAllowed=22.940295352268546, segmentsPerTier=35.0, maxCFSSegmentSizeMB=8.796093022207999E12, noCFSRatio=1.0
   [junit4]   2> 3100594 INFO  (coreLoadExecutor-6553-thread-1-processing-n:127.0.0.1:52203_) [n:127.0.0.1:52203_ c:control_collection s:shard1 r:core_node1 x:collection1] o.a.s.c.SolrDeletionPolicy SolrDeletionPolicy.onCommit: commits: num=1
   [junit4]   2> 	commit{dir=MockDirectoryWrapper(RAMDirectory@98a6b1 lockFactory=org.apache.lucene.store.SingleInstanceLockFactory@1e7d6c7),segFN=segments_1,generation=1}
   [junit4]   2> 3100594 INFO  (coreLoadExecutor-6553-thread-1-processing-n:127.0.0.1:52203_) [n:127.0.0.1:52203_ c:control_collection s:shard1 r:core_node1 x:collection1] o.a.s.c.SolrDeletionPolicy newest commit generation = 1
   [junit4]   2> 3100595 INFO  (OldIndexDirectoryCleanupThreadForCore-collection1) [n:127.0.0.1:52203_ c:control_collection s:shard1 r:core_node1 x:collection1] o.a.s.c.SolrCore Looking for old index directories to cleanup for core collection1 in C:\Users\JenkinsSlave\workspace\Lucene-Solr-5.x-Windows\solr\build\solr-core\test\J1\..\..\..\..\..\..\..\..\..\Users\JenkinsSlave\workspace\Lucene-Solr-5.x-Windows\solr\build\solr-core\test\J1\temp\solr.handler.TestSolrConfigHandlerCloud_270D9845923FE1E5-001\control-001\cores\collection1\data\
   [junit4]   2> 3100595 WARN  (OldIndexDirectoryCleanupThreadForCore-collection1) [n:127.0.0.1:52203_ c:control_collection s:shard1 r:core_node1 x:collection1] o.a.s.c.DirectoryFactory C:\Users\JenkinsSlave\workspace\Lucene-Solr-5.x-Windows\solr\build\solr-core\test\J1\..\..\..\..\..\..\..\..\..\Users\JenkinsSlave\workspace\Lucene-Solr-5.x-Windows\solr\build\solr-core\test\J1\temp\solr.handler.TestSolrConfigHandlerCloud_270D9845923FE1E5-001\control-001\cores\collection1\data\ does not point to a valid data directory; skipping clean-up of old index directories.
   [junit4]   2> 3100598 INFO  (coreLoadExecutor-6553-thread-1-processing-n:127.0.0.1:52203_) [n:127.0.0.1:52203_ c:control_collection s:shard1 r:core_node1 x:collection1] o.a.s.u.p.UpdateRequestProcessorChain creating updateRequestProcessorChain "nodistrib"
   [junit4]   2> 3100598 INFO  (coreLoadExecutor-6553-thread-1-processing-n:127.0.0.1:52203_) [n:127.0.0.1:52203_ c:control_collection s:shard1 r:core_node1 x:collection1] o.a.s.u.p.UpdateRequestProcessorChain creating updateRequestProcessorChain "dedupe"
   [junit4]   2> 3100599 INFO  (coreLoadExecutor-6553-thread-1-processing-n:127.0.0.1:52203_) [n:127.0.0.1:52203_ c:control_collection s:shard1 r:core_node1 x:collection1] o.a.s.u.p.UpdateRequestProcessorChain inserting DistributedUpdateProcessorFactory into updateRequestProcessorChain "dedupe"
   [junit4]   2> 3100599 INFO  (coreLoadExecutor-6553-thread-1-processing-n:127.0.0.1:52203_) [n:127.0.0.1:52203_ c:control_collection s:shard1 r:core_node1 x:collection1] o.a.s.u.p.UpdateRequestProcessorChain creating updateRequestProcessorChain "stored_sig"
   [junit4]   2> 3100599 INFO  (coreLoadExecutor-6553-thread-1-processing-n:127.0.0.1:52203_) [n:127.0.0.1:52203_ c:control_collection s:shard1 r:core_node1 x:collection1] o.a.s.u.p.UpdateRequestProcessorChain inserting DistributedUpdateProcessorFactory into updateRequestProcessorChain "stored_sig"
   [junit4]   2> 3100599 INFO  (coreLoadExecutor-6553-thread-1-processing-n:127.0.0.1:52203_) [n:127.0.0.1:52203_ c:control_collection s:shard1 r:core_node1 x:collection1] o.a.s.u.p.UpdateRequestProcessorChain creating updateRequestProcessorChain "distrib-dup-test-chain-explicit"
   [junit4]   2> 3100599 INFO  (coreLoadExecutor-6553-thread-1-processing-n:127.0.0.1:52203_) [n:127.0.0.1:52203_ c:control_collection s:shard1 r:core_node1 x:collection1] o.a.s.u.p.UpdateRequestProcessorChain creating updateRequestProcessorChain "distrib-dup-test-chain-implicit"
   [junit4]   2> 3100599 INFO  (coreLoadExecutor-6553-thread-1-processing-n:127.0.0.1:52203_) [n:127.0.0.1:52203_ c:control_collection s:shard1 r:core_node1 x:collection1] o.a.s.u.p.UpdateRequestProcessorChain inserting DistributedUpdateProcessorFactory into updateRequestProcessorChain "distrib-dup-test-chain-implicit"
   [junit4]   2> 3100599 INFO  (coreLoadExecutor-6553-thread-1-processing-n:127.0.0.1:52203_) [n:127.0.0.1:52203_ c:control_collection s:shard1 r:core_node1 x:collection1] o.a.s.c.SolrCore no updateRequestProcessorChain defined as default, creating implicit default
   [junit4]   2> 3100600 WARN  (coreLoadExecutor-6553-thread-1-processing-n:127.0.0.1:52203_) [n:127.0.0.1:52203_ c:control_collection s:shard1 r:core_node1 x:collection1] o.a.s.c.RequestHandlers INVALID paramSet a in requestHandler {type = requestHandler,name = /dump,class = DumpRequestHandler,args = {defaults={a=A,b=B}}}
   [junit4]   2> 3100611 INFO  (coreLoadExecutor-6553-thread-1-processing-n:127.0.0.1:52203_) [n:127.0.0.1:52203_ c:control_collection s:shard1 r:core_node1 x:collection1] o.a.s.h.l.XMLLoader xsltCacheLifetimeSeconds=60
   [junit4]   2> 3100612 INFO  (coreLoadExecutor-6553-thread-1-processing-n:127.0.0.1:52203_) [n:127.0.0.1:52203_ c:control_collection s:shard1 r:core_node1 x:collection1] o.a.s.h.l.XMLLoader xsltCacheLifetimeSeconds=60
   [junit4]   2> 3100615 INFO  (coreLoadExecutor-6553-thread-1-processing-n:127.0.0.1:52203_) [n:127.0.0.1:52203_ c:control_collection s:shard1 r:core_node1 x:collection1] o.a.s.h.l.XMLLoader xsltCacheLifetimeSeconds=60
   [junit4]   2> 3100618 INFO  (coreLoadExecutor-6553-thread-1-processing-n:127.0.0.1:52203_) [n:127.0.0.1:52203_ c:control_collection s:shard1 r:core_node1 x:collection1] o.a.s.h.l.XMLLoader xsltCacheLifetimeSeconds=60
   [junit4]   2> 3100622 INFO  (coreLoadExecutor-6553-thread-1-processing-n:127.0.0.1:52203_) [n:127.0.0.1:52203_ c:control_collection s:shard1 r:core_node1 x:collection1] o.a.s.c.RequestHandlers Registered paths: /update,/admin/threads,/update/csv,/admin/properties,/admin/mbeans,/admin/luke,/admin/segments,/schema,/admin/ping,standard,/config,/admin/logging,/update/json,/dump,/admin/system,/replication,/admin/file,/update/json/docs,/get,/admin/plugins
   [junit4]   2> 3100624 INFO  (coreLoadExecutor-6553-thread-1-processing-n:127.0.0.1:52203_) [n:127.0.0.1:52203_ c:control_collection s:shard1 r:core_node1 x:collection1] o.a.s.c.SolrCore Using default statsCache cache: org.apache.solr.search.stats.LocalStatsCache
   [junit4]   2> 3100626 INFO  (coreLoadExecutor-6553-thread-1-processing-n:127.0.0.1:52203_) [n:127.0.0.1:52203_ c:control_collection s:shard1 r:core_node1 x:collection1] o.a.s.u.UpdateHandler Using UpdateLog implementation: org.apache.solr.update.UpdateLog
   [junit4]   2> 3100627 INFO  (coreLoadExecutor-6553-thread-1-processing-n:127.0.0.1:52203_) [n:127.0.0.1:52203_ c:control_collection s:shard1 r:core_node1 x:collection1] o.a.s.u.UpdateLog Initializing UpdateLog: dataDir= defaultSyncLevel=FLUSH numRecordsToKeep=100 maxNumLogsToKeep=10 numVersionBuckets=65536
   [junit4]   2> 3100628 INFO  (coreLoadExecutor-6553-thread-1-processing-n:127.0.0.1:52203_) [n:127.0.0.1:52203_ c:control_collection s:shard1 r:core_node1 x:collection1] o.a.s.u.CommitTracker Hard AutoCommit: disabled
   [junit4]   2> 3100628 INFO  (coreLoadExecutor-6553-thread-1-processing-n:127.0.0.1:52203_) [n:127.0.0.1:52203_ c:control_collection s:shard1 r:core_node1 x:collection1] o.a.s.u.CommitTracker Soft AutoCommit: disabled
   [junit4]   2> 3100628 INFO  (coreLoadExecutor-6553-thread-1-processing-n:127.0.0.1:52203_) [n:127.0.0.1:52203_ c:control_collection s:shard1 r:core_node1 x:collection1] o.a.s.u.RandomMergePolicy RandomMergePolicy wrapping class org.apache.lucene.index.TieredMergePolicy: [TieredMergePolicy: maxMergeAtOnce=36, maxMergeAtOnceExplicit=11, maxMergedSegmentMB=93.1806640625, floorSegmentMB=1.57421875, forceMergeDeletesPctAllowed=12.110728794112424, segmentsPerTier=41.0, maxCFSSegmentSizeMB=8.796093022207999E12, noCFSRatio=0.45866275438685056
   [junit4]   2> 3100629 INFO  (coreLoadExecutor-6553-thread-1-processing-n:127.0.0.1:52203_) [n:127.0.0.1:52203_ c:control_collection s:shard1 r:core_node1 x:collection1] o.a.s.c.SolrDeletionPolicy SolrDeletionPolicy.onInit: commits: num=1
   [junit4]   2> 	commit{dir=MockDirectoryWrapper(RAMDirectory@98a6b1 lockFactory=org.apache.lucene.store.SingleInstanceLockFactory@1e7d6c7),segFN=segments_1,generation=1}
   [junit4]   2> 3100629 INFO  (coreLoadExecutor-6553-thread-1-processing-n:127.0.0.1:52203_) [n:127.0.0.1:52203_ c:control_collection s:shard1 r:core_node1 x:collection1] o.a.s.c.SolrDeletionPolicy newest commit generation = 1
   [junit4]   2> 3100629 INFO  (coreLoadExecutor-6553-thread-1-processing-n:127.0.0.1:52203_) [n:127.0.0.1:52203_ c:control_collection s:shard1 r:core_node1 x:collection1] o.a.s.s.SolrIndexSearcher Opening Searcher@1851d2d[collection1] main
   [junit4]   2> 3100629 INFO  (coreLoadExecutor-6553-thread-1-processing-n:127.0.0.1:52203_) [n:127.0.0.1:52203_ c:control_collection s:shard1 r:core_node1 x:collection1] o.a.s.c.c.ZkStateReader Load collection config from: [/collections/control_collection]
   [junit4]   2> 3100631 INFO  (coreLoadExecutor-6553-thread-1-processing-n:127.0.0.1:52203_) [n:127.0.0.1:52203_ c:control_collection s:shard1 r:core_node1 x:collection1] o.a.s.c.c.ZkStateReader path=[/collections/control_collection] [configName]=[conf1] specified config exists in ZooKeeper
   [junit4]   2> 3100631 INFO  (coreLoadExecutor-6553-thread-1-processing-n:127.0.0.1:52203_) [n:127.0.0.1:52203_ c:control_collection s:shard1 r:core_node1 x:collection1] o.a.s.r.ManagedResourceStorage Setting up ZooKeeper-based storage for the RestManager with znodeBase: /configs/conf1
   [junit4]   2> 3100631 INFO  (coreLoadExecutor-6553-thread-1-processing-n:127.0.0.1:52203_) [n:127.0.0.1:52203_ c:control_collection s:shard1 r:core_node1 x:collection1] o.a.s.r.ManagedResourceStorage Configured ZooKeeperStorageIO with znodeBase: /configs/conf1
   [junit4]   2> 3100631 INFO  (coreLoadExecutor-6553-thread-1-processing-n:127.0.0.1:52203_) [n:127.0.0.1:52203_ c:control_collection s:shard1 r:core_node1 x:collection1] o.a.s.r.RestManager Initializing RestManager with initArgs: {}
   [junit4]   2> 3100631 INFO  (coreLoadExecutor-6553-thread-1-processing-n:127.0.0.1:52203_) [n:127.0.0.1:52203_ c:control_collection s:shard1 r:core_node1 x:collection1] o.a.s.r.ManagedResourceStorage Reading _rest_managed.json using ZooKeeperStorageIO:path=/configs/conf1
   [junit4]   2> 3100632 INFO  (coreLoadExecutor-6553-thread-1-processing-n:127.0.0.1:52203_) [n:127.0.0.1:52203_ c:control_collection s:shard1 r:core_node1 x:collection1] o.a.s.r.ManagedResourceStorage No data found for znode /configs/conf1/_rest_managed.json
   [junit4]   2> 3100632 INFO  (coreLoadExecutor-6553-thread-1-processing-n:127.0.0.1:52203_) [n:127.0.0.1:52203_ c:control_collection s:shard1 r:core_node1 x:collection1] o.a.s.r.ManagedResourceStorage Loaded null at path _rest_managed.json using ZooKeeperStorageIO:path=/configs/conf1
   [junit4]   2> 3100632 INFO  (coreLoadExecutor-6553-thread-1-processing-n:127.0.0.1:52203_) [n:127.0.0.1:52203_ c:control_collection s:shard1 r:core_node1 x:collection1] o.a.s.r.RestManager Initializing 0 registered ManagedResources
   [junit4]   2> 3100632 INFO  (coreLoadExecutor-6553-thread-1-processing-n:127.0.0.1:52203_) [n:127.0.0.1:52203_ c:control_collection s:shard1 r:core_node1 x:collection1] o.a.s.h.ReplicationHandler Commits will be reserved for  10000
   [junit4]   2> 3100633 INFO  (searcherExecutor-6554-thread-1-processing-r:core_node1 n:127.0.0.1:52203_ x:collection1 s:shard1 c:control_collection) [n:127.0.0.1:52203_ c:control_collection s:shard1 r:core_node1 x:collection1] o.a.s.c.SolrCore [collection1] Registered new searcher Searcher@1851d2d[collection1] main{ExitableDirectoryReader(UninvertingDirectoryReader())}
   [junit4]   2> 3100633 INFO  (coreLoadExecutor-6553-thread-1-processing-n:127.0.0.1:52203_) [n:127.0.0.1:52203_ c:control_collection s:shard1 r:core_node1 x:collection1] o.a.s.u.UpdateLog Looking up max value of version field to seed version buckets
   [junit4]   2> 3100633 INFO  (coreLoadExecutor-6553-thread-1-processing-n:127.0.0.1:52203_) [n:127.0.0.1:52203_ c:control_collection s:shard1 r:core_node1 x:collection1] o.a.s.u.VersionInfo Refreshing highest value of _version_ for 65536 version buckets from index
   [junit4]   2> 3100633 INFO  (coreLoadExecutor-6553-thread-1-processing-n:127.0.0.1:52203_) [n:127.0.0.1:52203_ c:control_collection s:shard1 r:core_node1 x:collection1] o.a.s.u.VersionInfo No terms found for _version_, cannot seed version bucket highest value from index
   [junit4]   2> 3100633 INFO  (coreLoadExecutor-6553-thread-1-processing-n:127.0.0.1:52203_) [n:127.0.0.1:52203_ c:control_collection s:shard1 r:core_node1 x:collection1] o.a.s.u.UpdateLog Could not find max version in index or recent updates, using new clock 1524996640345161728
   [junit4]   2> 3100635 INFO  (coreLoadExecutor-6553-thread-1-processing-n:127.0.0.1:52203_) [n:127.0.0.1:52203_ c:control_collection s:shard1 r:core_node1 x:collection1] o.a.s.u.UpdateLog Took 2.0ms to seed version buckets with highest version 1524996640345161728
   [junit4]   2> 3100635 INFO  (coreLoadExecutor-6553-thread-1-processing-n:127.0.0.1:52203_) [n:127.0.0.1:52203_ c:control_collection s:shard1 r:core_node1 x:collection1] o.a.s.c.ZkController watch zkdir /configs/conf1
   [junit4]   2> 3100636 INFO  (coreLoadExecutor-6553-thread-1-processing-n:127.0.0.1:52203_) [n:127.0.0.1:52203_ c:control_collection s:shard1 r:core_node1 x:collection1] o.a.s.c.CoreContainer registering core: collection1
   [junit4]   2> 3100637 INFO  (coreZkRegister-6547-thread-1-processing-r:core_node1 n:127.0.0.1:52203_ x:collection1 s:shard1 c:control_collection) [n:127.0.0.1:52203_ c:control_collection s:shard1 r:core_node1 x:collection1] o.a.s.c.ZkController Register replica - core:collection1 address:http://127.0.0.1:52203 collection:control_collection shard:shard1
   [junit4]   2> 3100638 INFO  (coreZkRegister-6547-thread-1-processing-r:core_node1 n:127.0.0.1:52203_ x:collection1 s:shard1 c:control_collection) [n:127.0.0.1:52203_ c:control_collection s:shard1 r:core_node1 x:collection1] o.a.s.c.c.SolrZkClient makePath: /collections/control_collection/leader_elect/shard1/election
   [junit4]   2> 3100642 INFO  (coreZkRegister-6547-thread-1-processing-r:core_node1 n:127.0.0.1:52203_ x:collection1 s:shard1 c:control_collection) [n:127.0.0.1:52203_ c:control_collection s:shard1 r:core_node1 x:collection1] o.a.s.c.LeaderElector Joined leadership election with path: /collections/control_collection/leader_elect/shard1/election/95312289884209156-core_node1-n_0000000000
   [junit4]   2> 3100643 INFO  (coreZkRegister-6547-thread-1-processing-r:core_node1 n:127.0.0.1:52203_ x:collection1 s:shard1 c:control_collection) [n:127.0.0.1:52203_ c:control_collection s:shard1 r:core_node1 x:collection1] o.a.s.c.ShardLeaderElectionContext Running the leader process for shard=shard1 and weAreReplacement=false and leaderVoteWait=10000
   [junit4]   2> 3100644 INFO  (coreZkRegister-6547-thread-1-processing-r:core_node1 n:127.0.0.1:52203_ x:collection1 s:shard1 c:control_collection) [n:127.0.0.1:52203_ c:control_collection s:shard1 r:core_node1 x:collection1] o.a.s.c.ShardLeaderElectionContext Enough replicas found to continue.
   [junit4]   2> 3100644 INFO  (coreZkRegister-6547-thread-1-processing-r:core_node1 n:127.0.0.1:52203_ x:collection1 s:shard1 c:control_collection) [n:127.0.0.1:52203_ c:control_collection s:shard1 r:core_node1 x:collection1] o.a.s.c.ShardLeaderElectionContext I may be the new leader - try and sync
   [junit4]   2> 3100644 INFO  (coreZkRegister-6547-thread-1-processing-r:core_node1 n:127.0.0.1:52203_ x:collection1 s:shard1 c:control_collection) [n:127.0.0.1:52203_ c:control_collection s:shard1 r:core_node1 x:collection1] o.a.s.c.SyncStrategy Sync replicas to http://127.0.0.1:52203/collection1/
   [junit4]   2> 3100644 INFO  (coreZkRegister-6547-thread-1-processing-r:core_node1 n:127.0.0.1:52203_ x:collection1 s:shard1 c:control_collection) [n:127.0.0.1:52203_ c:control_collection s:shard1 r:core_node1 x:collection1] o.a.s.c.SyncStrategy Sync Success - now sync replicas to me
   [junit4]   2> 3100645 INFO  (coreZkRegister-6547-thread-1-processing-r:core_node1 n:127.0.0.1:52203_ x:collection1 s:shard1 c:control_collection) [n:127.0.0.1:52203_ c:control_collection s:shard1 r:core_node1 x:collection1] o.a.s.c.SyncStrategy http://127.0.0.1:52203/collection1/ has no replicas
   [junit4]   2> 3100645 INFO  (OverseerStateUpdate-95312289884209156-127.0.0.1:52203_-n_0000000000) [n:127.0.0.1:52203_    ] o.a.s.c.Overseer processMessage: queueSize: 1, message = {
   [junit4]   2>   "operation":"leader",
   [junit4]   2>   "shard":"shard1",
   [junit4]   2>   "collection":"control_collection"} current state version: 1
   [junit4]   2> 3100645 INFO  (coreZkRegister-6547-thread-1-processing-r:core_node1 n:127.0.0.1:52203_ x:collection1 s:shard1 c:control_collection) [n:127.0.0.1:52203_ c:control_collection s:shard1 r:core_node1 x:collection1] o.a.s.c.c.SolrZkClient makePath: /collections/control_collection/leaders/shard1
   [junit4]   2> 3100646 INFO  (zkCallback-3259-thread-1-processing-n:127.0.0.1:52203_) [n:127.0.0.1:52203_    ] o.a.s.c.c.ZkStateReader A cluster state change: [WatchedEvent state:SyncConnected type:NodeDataChanged path:/clusterstate.json], has occurred - updating... (live nodes size: [1])
   [junit4]   2> 3100649 INFO  (coreZkRegister-6547-thread-1-processing-r:core_node1 n:127.0.0.1:52203_ x:collection1 s:shard1 c:control_collection) [n:127.0.0.1:52203_ c:control_collection s:shard1 r:core_node1 x:collection1] o.a.s.c.ShardLeaderElectionContextBase Creating leader registration node
   [junit4]   2> 3100651 INFO  (coreZkRegister-6547-thread-1-processing-r:core_node1 n:127.0.0.1:52203_ x:collection1 s:shard1 c:control_collection) [n:127.0.0.1:52203_ c:control_collection s:shard1 r:core_node1 x:collection1] o.a.s.c.ShardLeaderElectionContext I am the new leader: http://127.0.0.1:52203/collection1/ shard1
   [junit4]   2> 3100652 INFO  (OverseerStateUpdate-95312289884209156-127.0.0.1:52203_-n_0000000000) [n:127.0.0.1:52203_    ] o.a.s.c.Overseer processMessage: queueSize: 1, message = {
   [junit4]   2>   "operation":"leader",
   [junit4]   2>   "shard":"shard1",
   [junit4]   2>   "collection":"control_collection",
   [junit4]   2>   "base_url":"http://127.0.0.1:52203",
   [junit4]   2>   "core":"collection1",
   [junit4]   2>   "state":"active"} current state version: 2
   [junit4]   2> 3100742 INFO  (zkCallback-3259-thread-1-processing-n:127.0.0.1:52203_) [n:127.0.0.1:52203_    ] o.a.s.c.c.ZkStateReader A cluster state change: [WatchedEvent state:SyncConnected type:NodeDataChanged path:/clusterstate.json], has occurred - updating... (live nodes size: [1])
   [junit4]   2> 3100784 INFO  (coreZkRegister-6547-thread-1-processing-r:core_node1 n:127.0.0.1:52203_ x:collection1 s:shard1 c:control_collection) [n:127.0.0.1:52203_ c:control_collection s:shard1 r:core_node1 x:collection1] o.a.s.c.ZkController We are http://127.0.0.1:52203/collection1/ and leader is http://127.0.0.1:52203/collection1/
   [junit4]   2> 3100784 INFO  (coreZkRegister-6547-thread-1-processing-r:core_node1 n:127.0.0.1:52203_ x:collection1 s:shard1 c:control_collection) [n:127.0.0.1:52203_ c:control_collection s:shard1 r:core_node1 x:collection1] o.a.s.c.ZkController No LogReplay needed for core=collection1 baseURL=http://127.0.0.1:52203
   [junit4]   2> 3100784 INFO  (coreZkRegister-6547-thread-1-processing-r:core_node1 n:127.0.0.1:52203_ x:collection1 s:shard1 c:control_collection) [n:127.0.0.1:52203_ c:control_collection s:shard1 r:core_node1 x:collection1] o.a.s.c.ZkController I am the leader, no recovery necessary
   [junit4]   2> 3100784 INFO  (coreZkRegister-6547-thread-1-processing-r:core_node1 n:127.0.0.1:52203_ x:collection1 s:shard1 c:control_collection) [n:127.0.0.1:52203_ c:control_collection s:shard1 r:core_node1 x:collection1] o.a.s.c.ZkController publishing state=active
   [junit4]   2> 3100784 INFO  (coreZkRegister-6547-thread-1-processing-r:core_node1 n:127.0.0.1:52203_ x:collection1 s:shard1 c:control_collection) [n:127.0.0.1:52203_ c:control_collection s:shard1 r:core_node1 x:collection1] o.a.s.c.ZkController numShards not found on descriptor - reading it from system property
   [junit4]   2> 3100786 INFO  (OverseerStateUpdate-95312289884209156-127.0.0.1:52203_-n_0000000000) [n:127.0.0.1:52203_    ] o.a.s.c.Overseer processMessage: queueSize: 1, message = {
   [junit4]   2>   "roles":null,
   [junit4]   2>   "core_node_name":"core_node1",
   [junit4]   2>   "node_name":"127.0.0.1:52203_",
   [junit4]   2>   "operation":"state",
   [junit4]   2>   "numShards":"1",
   [junit4]   2>   "core":"collection1",
   [junit4]   2>   "shard":"shard1",
   [junit4]   2>   "state":"active",
   [junit4]   2>   "collection":"control_collection",
   [junit4]   2>   "base_url":"http://127.0.0.1:52203"} current state version: 3
   [junit4]   2> 3100787 INFO  (OverseerStateUpdate-95312289884209156-127.0.0.1:52203_-n_0000000000) [n:127.0.0.1:52203_    ] o.a.s.c.o.ReplicaMutator Update state numShards=1 message={
   [junit4]   2>   "roles":null,
   [junit4]   2>   "core_node_name":"core_node1",
   [junit4]   2>   "node_name":"127.0.0.1:52203_",
   [junit4]   2>   "operation":"state",
   [junit4]   2>   "numShards":"1",
   [junit4]   2>   "core":"collection1",
   [junit4]   2>   "shard":"shard1",
   [junit4]   2>   "state":"active",
   [junit4]   2>   "collection":"control_collection",
   [junit4]   2>   "base_url":"http://127.0.0.1:52203"}
   [junit4]   2> 3100876 INFO  (zkCallback-3259-thread-1-processing-n:127.0.0.1:52203_) [n:127.0.0.1:52203_    ] o.a.s.c.c.ZkStateReader A cluster state change: [WatchedEvent state:SyncConnected type:NodeDataChanged path:/clusterstate.json], has occurred - updating... (live nodes size: [1])
   [junit4]   2> 3100941 INFO  (TEST-TestSolrConfigHandlerCloud.test-seed#[270D9845923FE1E5]) [    ] o.a.s.c.c.SolrZkClient Using default ZkCredentialsProvider
   [junit4]   2> 3100942 INFO  (TEST-TestSolrConfigHandlerCloud.test-seed#[270D9845923FE1E5]) [    ] o.a.s.c.c.ConnectionManager Waiting for client to connect to ZooKeeper
   [junit4]   2> 3100943 INFO  (zkCallback-3261-thread-1) [    ] o.a.s.c.c.ConnectionManager Watcher org.apache.solr.common.cloud.ConnectionManager@19462ba name:ZooKeeperConnection Watcher:127.0.0.1:52196/solr got event WatchedEvent state:SyncConnected type:None path:null path:null type:None
   [junit4]   2> 3100943 INFO  (TEST-TestSolrConfigHandlerCloud.test-seed#[270D9845923FE1E5]) [    ] o.a.s.c.c.ConnectionManager Client is connected to ZooKeeper
   [junit4]   2> 3100943 INFO  (TEST-TestSolrConfigHandlerCloud.test-seed#[270D9845923FE1E5]) [    ] o.a.s.c.c.SolrZkClient Using default ZkACLProvider
   [junit4]   2> 3100943 INFO  (TEST-TestSolrConfigHandlerCloud.test-seed#[270D9845923FE1E5]) [    ] o.a.s.c.c.ZkStateReader Updating cluster state from ZooKeeper... 
   [junit4]   2> 3100947 INFO  (TEST-TestSolrConfigHandlerCloud.test-seed#[270D9845923FE1E5]) [    ] o.a.s.c.ChaosMonkey monkey: init - expire sessions:false cause connection loss:false
   [junit4]   2> 3101405 INFO  (TEST-TestSolrConfigHandlerCloud.test-seed#[270D9845923FE1E5]) [    ] o.a.s.SolrTestCaseJ4 Writing core.properties file to C:\Users\JenkinsSlave\workspace\Lucene-Solr-5.x-Windows\solr\build\solr-core\test\J1\temp\solr.handler.TestSolrConfigHandlerCloud_270D9845923FE1E5-001\shard-1-001\cores\collection1
   [junit4]   2> 3101408 INFO  (TEST-TestSolrConfigHandlerCloud.test-seed#[270D9845923FE1E5]) [    ] o.a.s.c.AbstractFullDistribZkTestBase create jetty 1 in directory C:\Users\JenkinsSlave\workspace\Lucene-Solr-5.x-Windows\solr\build\solr-core\test\J1\temp\solr.handler.TestSolrConfigHandlerCloud_270D9845923FE1E5-001\shard-1-001
   [junit4]   2> 3101408 INFO  (TEST-TestSolrConfigHandlerCloud.test-seed#[270D9845923FE1E5]) [    ] o.e.j.s.Server jetty-9.2.13.v20150730
   [junit4]   2> 3101410 INFO  (TEST-TestSolrConfigHandlerCloud.test-seed#[270D9845923FE1E5]) [    ] o.e.j.s.h.ContextHandler Started o.e.j.s.ServletContextHandler@8fecd3{/,null,AVAILABLE}
   [junit4]   2> 3101411 INFO  (TEST-TestSolrConfigHandlerCloud.test-seed#[270D9845923FE1E5]) [    ] o.e.j.s.ServerConnector Started ServerConnector@1051716{HTTP/1.1}{127.0.0.1:52218}
   [junit4]   2> 3101411 INFO  (TEST-TestSolrConfigHandlerCloud.test-seed#[270D9845923FE1E5]) [    ] o.e.j.s.Server Started @3105522ms
   [junit4]   2> 3101411 INFO  (TEST-TestSolrConfigHandlerCloud.test-seed#[270D9845923FE1E5]) [    ] o.a.s.c.s.e.JettySolrRunner Jetty properties: {solrconfig=solrconfig.xml, solr.data.dir=C:\Users\JenkinsSlave\workspace\Lucene-Solr-5.x-Windows\solr\build\solr-core\test\J1\temp\solr.handler.TestSolrConfigHandlerCloud_270D9845923FE1E5-001\tempDir-001/jetty1, hostPort=52218, coreRootDirectory=C:\Users\JenkinsSlave\workspace\Lucene-Solr-5.x-Windows\solr\build\solr-core\test\J1\temp\solr.handler.TestSolrConfigHandlerCloud_270D9845923FE1E5-001\shard-1-001\cores, hostContext=/}
   [junit4]   2> 3101411 INFO  (TEST-TestSolrConfigHandlerCloud.test-seed#[270D9845923FE1E5]) [    ] o.a.s.s.SolrDispatchFilter SolrDispatchFilter.init(): sun.misc.Launcher$AppClassLoader@b2933f
   [junit4]   2> 3101411 INFO  (TEST-TestSolrConfigHandlerCloud.test-seed#[270D9845923FE1E5]) [    ] o.a.s.c.SolrResourceLoader new SolrResourceLoader for directory: 'C:\Users\JenkinsSlave\workspace\Lucene-Solr-5.x-Windows\solr\build\solr-core\test\J1\temp\solr.handler.TestSolrConfigHandlerCloud_270D9845923FE1E5-001\shard-1-001'
   [junit4]   2> 3101412 INFO  (TEST-TestSolrConfigHandlerCloud.test-seed#[270D9845923FE1E5]) [    ] o.a.s.c.SolrResourceLoader JNDI not configured for solr (NoInitialContextEx)
   [junit4]   2> 3101412 INFO  (TEST-TestSolrConfigHandlerCloud.test-seed#[270D9845923FE1E5]) [    ] o.a.s.c.SolrResourceLoader solr home defaulted to 'solr/' (could not find system property or JNDI)
   [junit4]   2> 3101413 INFO  (TEST-TestSolrConfigHandlerCloud.test-seed#[270D9845923FE1E5]) [    ] o.a.s.c.c.SolrZkClient Using default ZkCredentialsProvider
   [junit4]   2> 3101414 INFO  (TEST-TestSolrConfigHandlerCloud.test-seed#[270D9845923FE1E5]) [    ] o.a.s.c.c.ConnectionManager Waiting for client to connect to ZooKeeper
   [junit4]   2> 3101416 INFO  (zkCallback-3262-thread-1) [    ] o.a.s.c.c.ConnectionManager Watcher org.apache.solr.common.cloud.ConnectionManager@6a7d69 name:ZooKeeperConnection Watcher:127.0.0.1:52196/solr got event WatchedEvent state:SyncConnected type:None path:null path:null type:None
   [junit4]   2> 3101416 INFO  (TEST-TestSolrConfigHandlerCloud.test-seed#[270D9845923FE1E5]) [    ] o.a.s.c.c.ConnectionManager Client is connected to ZooKeeper
   [junit4]   2> 3101417 INFO  (TEST-TestSolrConfigHandlerCloud.test-seed#[270D9845923FE1E5]) [    ] o.a.s.c.c.SolrZkClient Using default ZkACLProvider
   [junit4]   2> 3101418 INFO  (TEST-TestSolrConfigHandlerCloud.test-seed#[270D9845923FE1E5]) [    ] o.a.s.s.SolrDispatchFilter Loading solr.xml from SolrHome (not found in ZooKeeper)
   [junit4]   2> 3101418 INFO  (TEST-TestSolrConfigHandlerCloud.test-seed#[270D9845923FE1E5]) [    ] o.a.s.c.SolrXmlConfig Loading container configuration from C:\Users\JenkinsSlave\workspace\Lucene-Solr-5.x-Windows\solr\build\solr-core\test\J1\temp\solr.handler.TestSolrConfigHandlerCloud_270D9845923FE1E5-001\shard-1-001\solr.xml
   [junit4]   2> 3101446 INFO  (TEST-TestSolrConfigHandlerCloud.test-seed#[270D9845923FE1E5]) [    ] o.a.s.c.CorePropertiesLocator Config-defined core root directory: C:\Users\JenkinsSlave\workspace\Lucene-Solr-5.x-Windows\solr\build\solr-core\test\J1\temp\solr.handler.TestSolrConfigHandlerCloud_270D9845923FE1E5-001\shard-1-001\cores
   [junit4]   2> 3101446 INFO  (TEST-TestSolrConfigHandlerCloud.test-seed#[270D9845923FE1E5]) [    ] o.a.s.c.CoreContainer New CoreContainer 21844917
   [junit4]   2> 3101446 INFO  (TEST-TestSolrConfigHandlerCloud.test-seed#[270D9845923FE1E5]) [    ] o.a.s.c.CoreContainer Loading cores into CoreContainer [instanceDir=C:\Users\JenkinsSlave\workspace\Lucene-Solr-5.x-Windows\solr\build\solr-core\test\J1\temp\solr.handler.TestSolrConfigHandlerCloud_270D9845923FE1E5-001\shard-1-001]
   [junit4]   2> 3101447 WARN  (TEST-TestSolrConfigHandlerCloud.test-seed#[270D9845923FE1E5]) [    ] o.a.s.c.CoreContainer Couldn't add files from C:\Users\JenkinsSlave\workspace\Lucene-Solr-5.x-Windows\solr\build\solr-core\test\J1\temp\solr.handler.TestSolrConfigHandlerCloud_270D9845923FE1E5-001\shard-1-001\lib to classpath: C:\Users\JenkinsSlave\workspace\Lucene-Solr-5.x-Windows\solr\build\solr-core\test\J1\temp\solr.handler.TestSolrConfigHandlerCloud_270D9845923FE1E5-001\shard-1-001\lib
   [junit4]   2> 3101447 INFO  (TEST-TestSolrConfigHandlerCloud.test-seed#[270D9845923FE1E5]) [    ] o.a.s.h.c.HttpShardHandlerFactory created with socketTimeout : 90000,urlScheme : ,connTimeout : 15000,maxConnectionsPerHost : 20,maxConnections : 10000,corePoolSize : 0,maximumPoolSize : 2147483647,maxThreadIdleTime : 5,sizeOfQueue : -1,fairnessPolicy : false,useRetries : false,
   [junit4]   2> 3101450 INFO  (TEST-TestSolrConfigHandlerCloud.test-seed#[270D9845923FE1E5]) [    ] o.a.s.u.UpdateShardHandler Creating UpdateShardHandler HTTP client with params: socketTimeout=340000&connTimeout=45000&retry=true
   [junit4]   2> 3101451 INFO  (TEST-TestSolrConfigHandlerCloud.test-seed#[270D9845923FE1E5]) [    ] o.a.s.l.LogWatcher SLF4J impl is org.slf4j.impl.Log4jLoggerFactory
   [junit4]   2> 3101451 INFO  (TEST-TestSolrConfigHandlerCloud.test-seed#[270D9845923FE1E5]) [    ] o.a.s.l.LogWatcher Registering Log Listener [Log4j (org.slf4j.impl.Log4jLoggerFactory)]
   [junit4]   2> 3101451 INFO  (TEST-TestSolrConfigHandlerCloud.test-seed#[270D9845923FE1E5]) [    ] o.a.s.c.ZkContainer Zookeeper client=127.0.0.1:52196/solr
   [junit4]   2> 3101451 INFO  (TEST-TestSolrConfigHandlerCloud.test-seed#[270D9845923FE1E5]) [    ] o.a.s.c.ZkController zkHost includes chroot
   [junit4]   2> 3101451 INFO  (TEST-TestSolrConfigHandlerCloud.test-seed#[270D9845923FE1E5]) [    ] o.a.s.c.c.SolrZkClient Using default ZkCredentialsProvider
   [junit4]   2> 3101452 INFO  (TEST-TestSolrConfigHandlerCloud.test-seed#[270D9845923FE1E5]) [    ] o.a.s.c.c.ConnectionManager Waiting for client to connect to ZooKeeper
   [junit4]   2> 3101454 INFO  (zkCallback-3265-thread-1) [    ] o.a.s.c.c.ConnectionManager Watcher org.apache.solr.common.cloud.ConnectionManager@151833e name:ZooKeeperConnection Watcher:127.0.0.1:52196 got event WatchedEvent state:SyncConnected type:None path:null path:null type:None
   [junit4]   2> 3101454 INFO  (TEST-TestSolrConfigHandlerCloud.test-seed#[270D9845923FE1E5]) [    ] o.a.s.c.c.ConnectionManager Client is connected to ZooKeeper
   [junit4]   2> 3101455 INFO  (TEST-TestSolrConfigHandlerCloud.test-seed#[270D9845923FE1E5]) [    ] o.a.s.c.c.SolrZkClient Using default ZkACLProvider
   [junit4]   2> 3101457 INFO  (TEST-TestSolrConfigHandlerCloud.test-seed#[270D9845923FE1E5]) [n:127.0.0.1:52218_    ] o.a.s.c.c.ConnectionManager Waiting for client to connect to ZooKeeper
   [junit4]   2> 3101459 INFO  (zkCallback-3266-thread-1-processing-n:127.0.0.1:52218_) [n:127.0.0.1:52218_    ] o.a.s.c.c.ConnectionManager Watcher org.apache.solr.common.cloud.ConnectionManager@6761f9 name:ZooKeeperConnection Watcher:127.0.0.1:52196/solr got event WatchedEvent state:SyncConnected type:None path:null path:null type:None
   [junit4]   2> 3101459 INFO  (TEST-TestSolrConfigHandlerCloud.test-seed#[270D9845923FE1E5]) [n:127.0.0.1:52218_    ] o.a.s.c.c.ConnectionManager Client is connected to ZooKeeper
   [junit4]   2> 3101466 INFO  (TEST-TestSolrConfigHandlerCloud.test-seed#[270D9845923FE1E5]) [n:127.0.0.1:52218_    ] o.a.s.c.c.ZkStateReader Updating cluster state from ZooKeeper... 
   [junit4]   2> 3102336 INFO  (TEST-TestSolrConfigHandlerCloud.test-seed#[270D9845923FE1E5]) [n:127.0.0.1:52218_    ] o.a.s.c.ZkController Register node as live in ZooKeeper:/live_nodes/127.0.0.1:52218_
   [junit4]   2> 3102336 INFO  (TEST-TestSolrConfigHandlerCloud.test-seed#[270D9845923FE1E5]) [n:127.0.0.1:52218_    ] o.a.s.c.c.SolrZkClient makePath: /live_nodes/127.0.0.1:52218_
   [junit4]   2> 3102337 INFO  (zkCallback-3266-thread-1-processing-n:127.0.0.1:52218_) [n:127.0.0.1:52218_    ] o.a.s.c.c.ZkStateReader A live node change: [WatchedEvent state:SyncConnected type:NodeChildrenChanged path:/live_nodes], has occurred - updating... (live nodes size: [1])
   [junit4]   2> 3102337 INFO  (zkCallback-3259-thread-1-processing-n:127.0.0.1:52203_) [n:127.0.0.1:52203_    ] o.a.s.c.c.ZkStateReader A live node change: [WatchedEvent state:SyncConnected type:NodeChildrenChanged path:/live_nodes], has occurred - updating... (live nodes size: [1])
   [junit4]   2> 3102337 INFO  (zkCallback-3261-thread-1) [    ] o.a.s.c.c.ZkStateReader A live node change: [WatchedEvent state:SyncConnected type:NodeChildrenChanged path:/live_nodes], has occurred - updating... (live nodes size: [1])
   [junit4]   2> 3102339 INFO  (TEST-TestSolrConfigHandlerCloud.test-seed#[270D9845923FE1E5]) [n:127.0.0.1:52218_    ] o.a.s.c.Overseer Overseer (id=null) closing
   [junit4]   2> 3102340 INFO  (TEST-TestSolrConfigHandlerCloud.test-seed#[270D9845923FE1E5]) [n:127.0.0.1:52218_    ] o.a.s.c.LeaderElector Joined leadership election with path: /overseer_elect/election/95312289884209160-127.0.0.1:52218_-n_0000000001
   [junit4]   2> 3102340 INFO  (TEST-TestSolrConfigHandlerCloud.test-seed#[270D9845923FE1E5]) [n:127.0.0.1:52218_    ] o.a.s.c.LeaderElector Watching path /overseer_elect/election/95312289884209156-127.0.0.1:52203_-n_0000000000 to know if I could be the leader
   [junit4]   2> 3102349 INFO  (TEST-TestSolrConfigHandlerCloud.test-seed#[270D9845923FE1E5]) [n:127.0.0.1:52218_    ] o.a.s.c.CoreContainer Security conf doesn't exist. Skipping setup for authorization module.
   [junit4]   2> 3102349 INFO  (TEST-TestSolrConfigHandlerCloud.test-seed#[270D9845923FE1E5]) [n:127.0.0.1:52218_    ] o.a.s.c.CoreContainer No authentication plugin used.
   [junit4]   2> 3102350 INFO  (TEST-TestSolrConfigHandlerCloud.test-seed#[270D9845923FE1E5]) [n:127.0.0.1:52218_    ] o.a.s.c.CorePropertiesLocator Looking for core definitions underneath C:\Users\JenkinsSlave\workspace\Lucene-Solr-5.x-Windows\solr\build\solr-core\test\J1\temp\solr.handler.TestSolrConfigHandlerCloud_270D9845923FE1E5-001\shard-1-001\cores
   [junit4]   2> 3102351 INFO  (TEST-TestSolrConfigHandlerCloud.test-seed#[270D9845923FE1E5]) [n:127.0.0.1:52218_    ] o.a.s.c.CoreDescriptor Created CoreDescriptor: {transient=false, config=solrconfig.xml, configSetProperties=configsetprops.json, shard=, dataDir=data\, schema=schema.xml, coreNodeName=, name=collection1, loadOnStartup=true, collection=collection1}
   [junit4]   2> 3102351 INFO  (TEST-TestSolrConfigHandlerCloud.test-seed#[270D9845923FE1E5]) [n:127.0.0.1:52218_    ] o.a.s.c.CorePropertiesLocator Found core collection1 in C:\Users\JenkinsSlave\workspace\Lucene-Solr-5.x-Windows\solr\build\solr-core\test\J1\temp\solr.handler.TestSolrConfigHandlerCloud_270D9845923FE1E5-001\shard-1-001\cores\collection1
   [junit4]   2> 3102351 INFO  (TEST-TestSolrConfigHandlerCloud.test-seed#[270D9845923FE1E5]) [n:127.0.0.1:52218_    ] o.a.s.c.CorePropertiesLocator Found 1 core definitions
   [junit4]   2> 3102352 INFO  (TEST-TestSolrConfigHandlerCloud.test-seed#[270D9845923FE1E5]) [n:127.0.0.1:52218_    ] o.a.s.s.SolrDispatchFilter user.dir=C:\Users\JenkinsSlave\workspace\Lucene-Solr-5.x-Windows\solr\build\solr-core\test\J1
   [junit4]   2> 3102352 INFO  (TEST-TestSolrConfigHandlerCloud.test-seed#[270D9845923FE1E5]) [n:127.0.0.1:52218_    ] o.a.s.s.SolrDispatchFilter SolrDispatchFilter.init() done
   [junit4]   2> 3102352 INFO  (coreLoadExecutor-6564-thread-1-processing-n:127.0.0.1:52218_) [n:127.0.0.1:52218_ c:collection1   x:collection1] o.a.s.c.ZkController publishing state=down
   [junit4]   2> 3102353 INFO  (coreLoadExecutor-6564-thread-1-processing-n:127.0.0.1:52218_) [n:127.0.0.1:52218_ c:collection1   x:collection1] o.a.s.c.ZkController numShards not found on descriptor - reading it from system property
   [junit4]   2> 3102354 INFO  (OverseerStateUpdate-95312289884209156-127.0.0.1:52203_-n_0000000000) [n:127.0.0.1:52203_    ] o.a.s.c.Overseer processMessage: queueSize: 1, message = {
   [junit4]   2>   "roles":null,
   [junit4]   2>   "node_name":"127.0.0.1:52218_",
   [junit4]   2>   "operation":"state",
   [junit4]   2>   "numShards":"2",
   [junit4]   2>   "core":"collection1",
   [junit4]   2>   "shard":null,
   [junit4]   2>   "state":"down",
   [junit4]   2>   "collection":"collection1",
   [junit4]   2>   "base_url":"http://127.0.0.1:52218"} current state version: 4
   [junit4]   2> 3102354 INFO  (coreLoadExecutor-6564-thread-1-processing-n:127.0.0.1:52218_) [n:127.0.0.1:52218_ c:collection1   x:collection1] o.a.s.c.ZkController look for our core node name
   [junit4]   2> 3102355 INFO  (OverseerStateUpdate-95312289884209156-127.0.0.1:52203_-n_0000000000) [n:127.0.0.1:52203_    ] o.a.s.c.o.ReplicaMutator Update state numShards=2 message={
   [junit4]   2>   "roles":null,
   [junit4]   2>   "node_name":"127.0.0.1:52218_",
   [junit4]   2>   "operation":"state",
   [junit4]   2>   "numShards":"2",
   [junit4]   2>   "core":"collection1",
   [junit4]   2>   "shard":null,
   [junit4]   2>   "state":"down",
   [junit4]   2>   "collection":"collection1",
   [junit4]   2>   "base_url":"http://127.0.0.1:52218"}
   [junit4]   2> 3102355 INFO  (OverseerStateUpdate-95312289884209156-127.0.0.1:52203_-n_0000000000) [n:127.0.0.1:52203_    ] o.a.s.c.o.ClusterStateMutator building a new cName: collection1
   [junit4]   2> 3102355 INFO  (OverseerStateUpdate-95312289884209156-127.0.0.1:52203_-n_0000000000) [n:127.0.0.1:52203_    ] o.a.s.c.o.ReplicaMutator Assigning new node to shard shard=shard2
   [junit4]   2> 3102356 INFO  (zkCallback-3261-thread-1) [    ] o.a.s.c.c.ZkStateReader A cluster state change: [WatchedEvent state:SyncConnected type:NodeDataChanged path:/clusterstate.json], has occurred - updating... (live nodes size: [2])
   [junit4]   2> 3102356 INFO  (zkCallback-3259-thread-1-processing-n:127.0.0.1:52203_) [n:127.0.0.1:52203_    ] o.a.s.c.c.ZkStateReader A cluster state change: [WatchedEvent state:SyncConnected type:NodeDataChanged path:/clusterstate.json], has occurred - updating... (live nodes size: [2])
   [junit4]   2> 3102357 INFO  (zkCallback-3266-thread-1-processing-n:127.0.0.1:52218_) [n:127.0.0.1:52218_    ] o.a.s.c.c.ZkStateReader A cluster state change: [WatchedEvent state:SyncConnected type:NodeDataChanged path:/clusterstate.json], has occurred - updating... (live nodes size: [2])
   [junit4]   2> 3103220 INFO  (coreLoadExecutor-6564-thread-1-processing-n:127.0.0.1:52218_) [n:127.0.0.1:52218_ c:collection1   x:collection1] o.a.s.c.ZkController waiting to find shard id in clusterstate for collection1
   [junit4]   2> 3103220 INFO  (coreLoadExecutor-6564-thread-1-processing-n:127.0.0.1:52218_) [n:127.0.0.1:52218_ c:collection1   x:collection1] o.a.s.c.ZkController Check for collection zkNode:collection1
   [junit4]   2> 3103220 INFO  (coreLoadExecutor-6564-thread-1-processing-n:127.0.0.1:52218_) [n:127.0.0.1:52218_ c:collection1   x:collection1] o.a.s.c.ZkController Collection zkNode exists
   [junit4]   2> 3103220 INFO  (coreLoadExecutor-6564-thread-1-processing-n:127.0.0.1:52218_) [n:127.0.0.1:52218_ c:collection1   x:collection1] o.a.s.c.c.ZkStateReader Load collection config from: [/collections/collection1]
   [junit4]   2> 3103220 INFO  (coreLoadExecutor-6564-thread-1-processing-n:127.0.0.1:52218_) [n:127.0.0.1:52218_ c:collection1   x:collection1] o.a.s.c.c.ZkStateReader path=[/collections/collection1] [configName]=[conf1] specified config exists in ZooKeeper
   [junit4]   2> 3103220 INFO  (coreLoadExecutor-6564-thread-1-processing-n:127.0.0.1:52218_) [n:127.0.0.1:52218_ c:collection1   x:collection1] o.a.s.c.SolrResourceLoader new SolrResourceLoader for directory: 'C:\Users\JenkinsSlave\workspace\Lucene-Solr-5.x-Windows\solr\build\solr-core\test\J1\temp\solr.handler.TestSolrConfigHandlerCloud_270D9845923FE1E5-001\shard-1-001\cores\collection1'
   [junit4]   2> 3103221 INFO  (coreLoadExecutor-6564-thread-1-processing-n:127.0.0.1:52218_) [n:127.0.0.1:52218_ c:collection1   x:collection1] o.a.s.c.SolrResourceLoader JNDI not configured for solr (NoInitialContextEx)
   [junit4]   2> 3103221 INFO  (coreLoadExecutor-6564-thread-1-processing-n:127.0.0.1:52218_) [n:127.0.0.1:52218_ c:collection1   x:collection1] o.a.s.c.SolrResourceLoader solr home defaulted to 'solr/' (could not find system property or JNDI)
   [junit4]   2> 3103223 INFO  (coreLoadExecutor-6564-thread-1-processing-n:127.0.0.1:52218_) [n:127.0.0.1:52218_ c:collection1   x:collection1] o.a.s.c.Config loaded config solrconfig.xml with version 0 
   [junit4]   2> 3103232 INFO  (coreLoadExecutor-6564-thread-1-processing-n:127.0.0.1:52218_) [n:127.0.0.1:52218_ c:collection1   x:collection1] o.a.s.c.SolrConfig current version of requestparams : -1
   [junit4]   2> 3103247 INFO  (coreLoadExecutor-6564-thread-1-processing-n:127.0.0.1:52218_) [n:127.0.0.1:52218_ c:collection1   x:collection1] o.a.s.c.SolrConfig Using Lucene MatchVersion: 5.5.0
   [junit4]   2> 3103295 INFO  (coreLoadExecutor-6564-thread-1-processing-n:127.0.0.1:52218_) [n:127.0.0.1:52218_ c:collection1   x:collection1] o.a.s.c.SolrConfig Loaded SolrConfig: solrconfig.xml
   [junit4]   2> 3103306 INFO  (coreLoadExecutor-6564-thread-1-processing-n:127.0.0.1:52218_) [n:127.0.0.1:52218_ c:collection1   x:collection1] o.a.s.s.IndexSchema [collection1] Schema name=test
   [junit4]   2> 3103569 INFO  (coreLoadExecutor-6564-thread-1-processing-n:127.0.0.1:52218_) [n:127.0.0.1:52218_ c:collection1   x:collection1] o.a.s.s.OpenExchangeRatesOrgProvider Initialized with rates=open-exchange-rates.json, refreshInterval=1440.
   [junit4]   2> 3103578 INFO  (coreLoadExecutor-6564-thread-1-processing-n:127.0.0.1:52218_) [n:127.0.0.1:52218_ c:collection1   x:collection1] o.a.s.s.IndexSchema default search field in schema is text
   [junit4]   2> 3103579 INFO  (coreLoadExecutor-6564-thread-1-processing-n:127.0.0.1:52218_) [n:127.0.0.1:52218_ c:collection1   x:collection1] o.a.s.s.IndexSchema unique key field: id
   [junit4]   2> 3103589 INFO  (coreLoadExecutor-6564-thread-1-processing-n:127.0.0.1:52218_) [n:127.0.0.1:52218_ c:collection1   x:collection1] o.a.s.s.FileExchangeRateProvider Reloading exchange rates from file currency.xml
   [junit4]   2> 3103593 INFO  (coreLoadExecutor-6564-thread-1-processing-n:127.0.0.1:52218_) [n:127.0.0.1:52218_ c:collection1   x:collection1] o.a.s.s.FileExchangeRateProvider Reloading exchange rates from file currency.xml
   [junit4]   2> 3103595 INFO  (coreLoadExecutor-6564-thread-1-processing-n:127.0.0.1:52218_) [n:127.0.0.1:52218_ c:collection1   x:collection1] o.a.s.s.OpenExchangeRatesOrgProvider Reloading exchange rates from open-exchange-rates.json
   [junit4]   2> 3103596 INFO  (coreLoadExecutor-6564-thread-1-processing-n:127.0.0.1:52218_) [n:127.0.0.1:52218_ c:collection1   x:collection1] o.a.s.s.OpenExchangeRatesOrgProvider Reloading exchange rates from open-exchange-rates.json
   [junit4]   2> 3103599 INFO  (coreLoadExecutor-6564-thread-1-processing-n:127.0.0.1:52218_) [n:127.0.0.1:52218_ c:collection1   x:collection1] o.a.s.c.ConfigSetProperties Did not find ConfigSet properties, assuming default properties: Can't find resource 'configsetprops.json' in classpath or '/configs/conf1', cwd=C:\Users\JenkinsSlave\workspace\Lucene-Solr-5.x-Windows\solr\build\solr-core\test\J1
   [junit4]   2> 3103599 INFO  (coreLoadExecutor-6564-thread-1-processing-n:127.0.0.1:52218_) [n:127.0.0.1:52218_ c:collection1   x:collection1] o.a.s.c.CoreContainer Creating SolrCore 'collection1' using configuration from collection collection1
   [junit4]   2> 3103600 INFO  (coreLoadExecutor-6564-thread-1-processing-n:127.0.0.1:52218_) [n:127.0.0.1:52218_ c:collection1 s:shard2 r:core_node1 x:collection1] o.a.s.c.SolrCore org.apache.solr.core.MockDirectoryFactory
   [junit4]   2> 3103600 INFO  (coreLoadExecutor-6564-thread-1-processing-n:127.0.0.1:52218_) [n:127.0.0.1:52218_ c:collection1 s:shard2 r:core_node1 x:collection1] o.a.s.c.SolrCore [[collection1] ] Opening new SolrCore at [C:\Users\JenkinsSlave\workspace\Lucene-Solr-5.x-Windows\solr\build\solr-core\test\J1\temp\solr.handler.TestSolrConfigHandlerCloud_270D9845923FE1E5-001\shard-1-001\cores\collection1], dataDir=[C:\Users\JenkinsSlave\workspace\Lucene-Solr-5.x-Windows\solr\build\solr-core\test\J1\temp\solr.handler.TestSolrConfigHandlerCloud_270D9845923FE1E5-001\shard-1-001\cores\collection1\data\]
   [junit4]   2> 3103600 INFO  (coreLoadExecutor-6564-thread-1-processing-n:127.0.0.1:52218_) [n:127.0.0.1:52218_ c:collection1 s:shard2 r:core_node1 x:collection1] o.a.s.c.JmxMonitoredMap JMX monitoring is enabled. Adding Solr mbeans to JMX Server: com.sun.jmx.mbeanserver.JmxMBeanServer@cb6ffa
   [junit4]   2> 3103600 INFO  (coreLoadExecutor-6564-thread-1-processing-n:127.0.0.1:52218_) [n:127.0.0.1:52218_ c:collection1 s:shard2 r:core_node1 x:collection1] o.a.s.c.CachingDirectoryFactory return new directory for C:\Users\JenkinsSlave\workspace\Lucene-Solr-5.x-Windows\solr\build\solr-core\test\J1\temp\solr.handler.TestSolrConfigHandlerCloud_270D9845923FE1E5-001\shard-1-001\cores\collection1\data\
   [junit4]   2> 3103601 INFO  (coreLoadExecutor-6564-thread-1-processing-n:127.0.0.1:52218_) [n:127.0.0.1:52218_ c:collection1 s:shard2 r:core_node1 x:collection1] o.a.s.c.SolrCore New index directory detected: old=null new=C:\Users\JenkinsSlave\workspace\Lucene-Solr-5.x-Windows\solr\build\solr-core\test\J1\temp\solr.handler.TestSolrConfigHandlerCloud_270D9845923FE1E5-001\shard-1-001\cores\collection1\data\index/
   [junit4]   2> 3103601 WARN  (coreLoadExecutor-6564-thread-1-processing-n:127.0.0.1:52218_) [n:127.0.0.1:52218_ c:collection1 s:shard2 r:core_node1 x:collection1] o.a.s.c.SolrCore [collection1] Solr index directory 'C:\Users\JenkinsSlave\workspace\Lucene-Solr-5.x-Windows\solr\build\solr-core\test\J1\temp\solr.handler.TestSolrConfigHandlerCloud_270D9845923FE1E5-001\shard-1-001\cores\collection1\data\index' doesn't exist. Creating new index...
   [junit4]   2> 3103601 INFO  (coreLoadExecutor-6564-thread-1-processing-n:127.0.0.1:52218_) [n:127.0.0.1:52218_ c:collection1 s:shard2 r:core_node1 x:collection1] o.a.s.c.CachingDirectoryFactory return new directory for C:\Users\JenkinsSlave\workspace\Lucene-Solr-5.x-Windows\solr\build\solr-core\test\J1\temp\solr.handler.TestSolrConfigHandlerCloud_270D9845923FE1E5-001\shard-1-001\cores\collection1\data\index
   [junit4]   2> 3103601 INFO  (coreLoadExecutor-6564-thread-1-processing-n:127.0.0.1:52218_) [n:127.0.0.1:52218_ c:collection1 s:shard2 r:core_node1 x:collection1] o.a.s.u.RandomMergePolicy RandomMergePolicy wrapping class org.apache.lucene.index.TieredMergePolicy: [TieredMergePolicy: maxMergeAtOnce=50, maxMergeAtOnceExplicit=48, maxMergedSegmentMB=24.1669921875, floorSegmentMB=1.6181640625, forceMergeDeletesPctAllowed=22.940295352268546, segmentsPerTier=35.0, maxCFSSegmentSizeMB=8.796093022207999E12, noCFSRatio=1.0
   [junit4]   2> 3103602 INFO  (coreLoadExecutor-6564-thread-1-processing-n:127.0.0.1:52218_) [n:127.0.0.1:52218_ c:collection1 s:shard2 r:core_node1 x:collection1] o.a.s.c.SolrDeletionPolicy SolrDeletionPolicy.onCommit: commits: num=1
   [junit4]   2> 	commit{dir=MockDirectoryWrapper(RAMDirectory@ae500a lockFactory=org.apache.lucene.store.SingleInstanceLockFactory@8e3c0),segFN=segments_1,generation=1}
   [junit4]   2> 3103602 INFO  (coreLoadExecutor-6564-thread-1-processing-n:127.0.0.1:52218_) [n:127.0.0.1:52218_ c:collection1 s:shard2 r:core_node1 x:collection1] o.a.s.c.SolrDeletionPolicy newest commit generation = 1
   [junit4]   2> 3103602 INFO  (OldIndexDirectoryCleanupThreadForCore-collection1) [n:127.0.0.1:52218_ c:collection1 s:shard2 r:core_node1 x:collection1] o.a.s.c.SolrCore Looking for old index directories to cleanup for core collection1 in C:\Users\JenkinsSlave\workspace\Lucene-Solr-5.x-Windows\solr\build\solr-core\test\J1\temp\solr.handler.TestSolrConfigHandlerCloud_270D9845923FE1E5-001\shard-1-001\cores\collection1\data\
   [junit4]   2> 3103603 WARN  (OldIndexDirectoryCleanupThreadForCore-collection1) [n:127.0.0.1:52218_ c:collection1 s:shard2 r:core_node1 x:collection1] o.a.s.c.DirectoryFactory C:\Users\JenkinsSlave\workspace\Lucene-Solr-5.x-Windows\solr\build\solr-core\test\J1\temp\solr.handler.TestSolrConfigHandlerCloud_270D9845923FE1E5-001\shard-1-001\cores\collection1\data\ does not point to a valid data directory; skipping clean-up of old index directories.
   [junit4]   2> 3103605 INFO  (coreLoadExecutor-6564-thread-1-processing-n:127.0.0.1:52218_) [n:127.0.0.1:52218_ c:collection1 s:shard2 r:core_node1 x:collection1] o.a.s.u.p.UpdateRequestProcessorChain creating updateRequestProcessorChain "nodistrib"
   [junit4]   2> 3103606 INFO  (coreLoadExecutor-6564-thread-1-processing-n:127.0.0.1:52218_) [n:127.0.0.1:52218_ c:collection1 s:shard2 r:core_node1 x:collection1] o.a.s.u.p.UpdateRequestProcessorChain creating updateRequestProcessorChain "dedupe"
   [junit4]   2> 3103606 INFO  (coreLoadExecutor-6564-thread-1-processing-n:127.0.0.1:52218_) [n:127.0.0.1:52218_ c:collection1 s:shard2 r:core_node1 x:collection1] o.a.s.u.p.UpdateRequestProcessorChain inserting DistributedUpdateProcessorFactory into updateRequestProcessorChain "dedupe"
   [junit4]   2> 3103606 INFO  (coreLoadExecutor-6564-thread-1-processing-n:127.0.0.1:52218_) [n:127.0.0.1:52218_ c:collection1 s:shard2 r:core_node1 x:collection1] o.a.s.u.p.UpdateRequestProcessorChain creating updateRequestProcessorChain "stored_sig"
   [junit4]   2> 3103606 INFO  (coreLoadExecutor-6564-thread-1-processing-n:127.0.0.1:52218_) [n:127.0.0.1:52218_ c:collection1 s:shard2 r:core_node1 x:collection1] o.a.s.u.p.UpdateRequestProcessorChain inserting DistributedUpdateProcessorFactory into updateRequestProcessorChain "stored_sig"
   [junit4]   2> 3103606 INFO  (coreLoadExecutor-6564-thread-1-processing-n:127.0.0.1:52218_) [n:127.0.0.1:52218_ c:collection1 s:shard2 r:core_node1 x:collection1] o.a.s.u.p.UpdateRequestProcessorChain creating updateRequestProcessorChain "distrib-dup-test-chain-explicit"
   [junit4]   2> 3103606 INFO  (coreLoadExecutor-6564-thread-1-processing-n:127.0.0.1:52218_) [n:127.0.0.1:52218_ c:collection1 s:shard2 r:core_node1 x:collection1] o.a.s.u.p.UpdateRequestProcessorChain creating updateRequestProcessorChain "distrib-dup-test-chain-implicit"
   [junit4]   2> 3103606 INFO  (coreLoadExecutor-6564-thread-1-processing-n:127.0.0.1:52218_) [n:127.0.0.1:52218_ c:collection1 s:shard2 r:core_node1 x:collection1] o.a.s.u.p.UpdateRequestProcessorChain inserting DistributedUpdateProcessorFactory into updateRequestProcessorChain "distrib-dup-test-chain-implicit"
   [junit4]   2> 3103606 INFO  (coreLoadExecutor-6564-thread-1-processing-n:127.0.0.1:52218_) [n:127.0.0.1:52218_ c:collection1 s:shard2 r:core_node1 x:collection1] o.a.s.c.SolrCore no updateRequestProcessorChain defined as default, creating i

[...truncated too long message...]

er.java:151)
   [junit4]   2> 	at org.apache.solr.schema.FieldTypePluginLoader.init(FieldTypePluginLoader.java:54)
   [junit4]   2> 	at org.apache.solr.util.plugin.AbstractPluginLoader.load(AbstractPluginLoader.java:192)
   [junit4]   2> 	... 9 more
   [junit4]   2> Caused by: java.io.IOException: Error opening /configs/conf1/enumsConfig.xml
   [junit4]   2> 	at org.apache.solr.cloud.ZkSolrResourceLoader.openResource(ZkSolrResourceLoader.java:93)
   [junit4]   2> 	at org.apache.solr.schema.EnumField.init(EnumField.java:101)
   [junit4]   2> 	... 13 more
   [junit4]   2> Caused by: org.apache.zookeeper.KeeperException$SessionExpiredException: KeeperErrorCode = Session expired for /configs/conf1/enumsConfig.xml
   [junit4]   2> 	at org.apache.zookeeper.KeeperException.create(KeeperException.java:127)
   [junit4]   2> 	at org.apache.zookeeper.KeeperException.create(KeeperException.java:51)
   [junit4]   2> 	at org.apache.zookeeper.ZooKeeper.exists(ZooKeeper.java:1045)
   [junit4]   2> 	at org.apache.solr.common.cloud.SolrZkClient$5.execute(SolrZkClient.java:312)
   [junit4]   2> 	at org.apache.solr.common.cloud.SolrZkClient$5.execute(SolrZkClient.java:309)
   [junit4]   2> 	at org.apache.solr.common.cloud.ZkCmdExecutor.retryOperation(ZkCmdExecutor.java:61)
   [junit4]   2> 	at org.apache.solr.common.cloud.SolrZkClient.exists(SolrZkClient.java:309)
   [junit4]   2> 	at org.apache.solr.cloud.ZkController.pathExists(ZkController.java:838)
   [junit4]   2> 	at org.apache.solr.cloud.ZkSolrResourceLoader.openResource(ZkSolrResourceLoader.java:87)
   [junit4]   2> 	... 14 more
   [junit4]   2> NOTE: test params are: codec=CheapBastard, sim=RandomSimilarity(queryNorm=false,coord=crazy): {}, locale=da-DK, timezone=MST
   [junit4]   2> NOTE: Windows 7 6.1 x86/Oracle Corporation 1.7.0_80 (32-bit)/cpus=3,threads=1,free=115440456,total=491065344
   [junit4]   2> NOTE: All tests run in this JVM: [DistributedFacetPivotWhiteBoxTest, TestLeaderInitiatedRecoveryThread, BinaryUpdateRequestHandlerTest, IgnoreCommitOptimizeUpdateProcessorFactoryTest, TestSolr4Spatial, TestDistribDocBasedVersion, TestTrieFacet, UUIDUpdateProcessorFallbackTest, TestOmitPositions, TestJsonRequest, PreAnalyzedUpdateProcessorTest, LukeRequestHandlerTest, TestDocBasedVersionConstraints, FacetPivotSmallTest, AnalysisErrorHandlingTest, SynonymTokenizerTest, MultiTermTest, TestRecovery, TestBlendedInfixSuggestions, TestShortCircuitedRequests, OutputWriterTest, SuggestComponentContextFilterQueryTest, TestFuzzyAnalyzedSuggestions, CollectionStateFormat2Test, TermVectorComponentTest, HdfsCollectionsAPIDistributedZkTest, CustomCollectionTest, NoCacheHeaderTest, TestUtils, TestDefaultStatsCache, DistribDocExpirationUpdateProcessorTest, SharedFSAutoReplicaFailoverUtilsTest, BasicFunctionalityTest, OpenExchangeRatesOrgProviderTest, TestReversedWildcardFilterFactory, TestSolrDeletionPolicy2, ForceLeaderTest, SignatureUpdateProcessorFactoryTest, DistributedMLTComponentTest, TestCharFilters, HdfsLockFactoryTest, TestFieldCollectionResource, SuggesterTSTTest, SmileWriterTest, SimpleMLTQParserTest, TestSolrCoreProperties, CoreMergeIndexesAdminHandlerTest, TermVectorComponentDistributedTest, TestNRTOpen, RequestHandlersTest, SortSpecParsingTest, DistributedDebugComponentTest, TestClusterStateMutator, FieldAnalysisRequestHandlerTest, DeleteShardTest, OverriddenZkACLAndCredentialsProvidersTest, TestZkChroot, TestQuerySenderListener, BadIndexSchemaTest, BigEndianAscendingWordDeserializerTest, TestRandomFaceting, ConfigSetsAPITest, TestObjectReleaseTracker, TestFoldingMultitermQuery, ZkStateWriterTest, EnumFieldTest, CoreAdminHandlerTest, SpellPossibilityIteratorTest, TestDistributedMissingSort, CloneFieldUpdateProcessorFactoryTest, OverseerRolesTest, LeaderInitiatedRecoveryOnShardRestartTest, ConnectionReuseTest, TestMacros, TestRTGBase, DistributedFacetPivotLargeTest, TestConfigSetProperties, TestBM25SimilarityFactory, ShowFileRequestHandlerTest, HdfsBasicDistributedZk2Test, HLLUtilTest, ConjunctionSolrSpellCheckerTest, AliasIntegrationTest, FileUtilsTest, TestExclusionRuleCollectionAccess, ShardRoutingCustomTest, FullSolrCloudDistribCmdsTest, TestSimpleTrackingShardHandler, ChaosMonkeySafeLeaderTest, AutoCommitTest, TestSolrIndexConfig, LeaderFailoverAfterPartitionTest, TestHdfsUpdateLog, SuggesterWFSTTest, TestAtomicUpdateErrorCases, DistributedFacetPivotSmallAdvancedTest, TestSystemIdResolver, StatsComponentTest, TestCopyFieldCollectionResource, TestRequestForwarding, TestStandardQParsers, EchoParamsTest, RestartWhileUpdatingTest, TestPerFieldSimilarity, SuggesterTest, TestInitQParser, SSLMigrationTest, TestPKIAuthenticationPlugin, DateMathParserTest, TestDistributedGrouping, SpellCheckComponentTest, TestSerializedLuceneMatchVersion, SpellingQueryConverterTest, TestFieldTypeCollectionResource, TestFastOutputStream, CurrencyFieldOpenExchangeTest, TestInfoStreamLogging, TestSolrJ, TestUseDocValuesAsStored2, BitVectorTest, TestBinaryField, TestManagedResourceStorage, ZkNodePropsTest, DistanceFunctionTest, CloudExitableDirectoryReaderTest, TestReqParamsAPI, TestBadConfig, TestSolrQueryParser, TestSearcherReuse, TestBulkSchemaConcurrent, TestOrdValues, TestSha256AuthenticationProvider, TestCloudManagedSchemaConcurrent, TestJoin, TestMiniSolrCloudClusterSSL, TestRandomForceMergePolicy, TestSchemaNameResource, UniqFieldsUpdateProcessorFactoryTest, NumericFieldsTest, BasicDistributedZk2Test, CollectionsAPIDistributedZkTest, SyncSliceTest, LeaderElectionIntegrationTest, BasicZkTest, LeaderElectionTest, ZkSolrClientTest, TestDistributedSearch, DirectUpdateHandlerOptimizeTest, SortByFunctionTest, DebugComponentTest, IndexBasedSpellCheckerTest, TestQueryUtils, DirectSolrSpellCheckerTest, PrimitiveFieldTypeTest, TermsComponentTest, TestValueSourceCache, MoreLikeThisHandlerTest, FastVectorHighlighterTest, LoggingHandlerTest, TestCollationField, ReturnFieldsTest, JSONWriterTest, QueryParsingTest, TestPartialUpdateDeduplication, TestPHPSerializedResponseWriter, TestComponentsName, TestBinaryResponseWriter, HighlighterConfigTest, UpdateParamsTest, AlternateDirectoryTest, CopyFieldTest, ResponseLogComponentTest, BadComponentTest, TestStressRecovery, TestMergePolicyConfig, TestSearchPerf, MinimalSchemaTest, TestElisionMultitermQuery, TestConfig, DirectSolrConnectionTest, NotRequiredUniqueKeyTest, TestDFRSimilarityFactory, TestLMJelinekMercerSimilarityFactory, TestFastWriter, ResourceLoaderTest, TestFastLRUCache, PreAnalyzedFieldTest, PrimUtilsTest, TestSuggestSpellingConverter, DateFieldTest, DOMUtilTest, RAMDirectoryFactoryTest, ClusterStateTest, TestLRUCache, TestDocumentBuilder, CursorPagingTest, DistributedIntervalFacetingTest, SolrTestCaseJ4Test, TestCrossCoreJoin, TestJettySolrRunner, AsyncCallRequestStatusResponseTest, CleanupOldIndexTest, CollectionReloadTest, ConnectionManagerTest, DeleteInactiveReplicaTest, DistribJoinFromCollectionTest, OutOfBoxZkACLAndCredentialsProvidersTest, OverseerTaskQueueTest, RemoteQueryErrorTest, ShardSplitTest, TestCloudInspectUtil, TestCloudPivotFacet, TestCollectionAPI, TestConfigSetsAPI, TestConfigSetsAPIExclusivity, TestConfigSetsAPIZkFailure, TestLeaderElectionZkExpiry, TestMiniSolrCloudClusterBase, TestSolrCloudWithKerberosAlt, VMParamsZkACLAndCredentialsProvidersTest, HdfsChaosMonkeyNothingIsSafeTest, HdfsChaosMonkeySafeLeaderTest, HdfsNNFailoverTest, HdfsRecoverLeaseTest, HdfsRecoveryZkTest, HdfsRestartWhileUpdatingTest, HdfsSyncSliceTest, HdfsThreadLeakTest, HdfsWriteToMultipleCollectionsTest, ZkStateReaderTest, CachingDirectoryFactoryTest, DirectoryFactoryTest, ExitableDirectoryReaderTest, HdfsDirectoryFactoryTest, QueryResultKeyTest, TestConfigOverlay, TestConfigSets, TestDynamicLoading, TestShardHandlerFactory, TestSolrConfigHandler, TestSolrDynamicMBean, TestSolrXml, RequestLoggingTest, TestBlobHandler, TestRestoreCore, TestSolrConfigHandlerCloud]
   [junit4]   2> NOTE: reproduce with: ant test  -Dtestcase=TestSolrConfigHandlerCloud -Dtests.seed=270D9845923FE1E5 -Dtests.slow=true -Dtests.locale=da-DK -Dtests.timezone=MST -Dtests.asserts=true -Dtests.file.encoding=US-ASCII
   [junit4] ERROR   0.00s J1 | TestSolrConfigHandlerCloud (suite) <<<
   [junit4]    > Throwable #1: java.lang.AssertionError: ObjectTracker found 2 object(s) that were not released!!! [MockDirectoryWrapper, MockDirectoryWrapper]
   [junit4]    > 	at __randomizedtesting.SeedInfo.seed([270D9845923FE1E5]:0)
   [junit4]    > 	at org.apache.solr.SolrTestCaseJ4.afterClass(SolrTestCaseJ4.java:229)
   [junit4]    > 	at java.lang.Thread.run(Thread.java:745)
   [junit4] Completed [484/566 (1!)] on J1 in 77.93s, 1 test, 1 failure <<< FAILURES!

[...truncated 260 lines...]
BUILD FAILED
C:\Users\JenkinsSlave\workspace\Lucene-Solr-5.x-Windows\build.xml:750: The following error occurred while executing this line:
C:\Users\JenkinsSlave\workspace\Lucene-Solr-5.x-Windows\build.xml:694: The following error occurred while executing this line:
C:\Users\JenkinsSlave\workspace\Lucene-Solr-5.x-Windows\build.xml:59: The following error occurred while executing this line:
C:\Users\JenkinsSlave\workspace\Lucene-Solr-5.x-Windows\solr\build.xml:233: The following error occurred while executing this line:
C:\Users\JenkinsSlave\workspace\Lucene-Solr-5.x-Windows\solr\common-build.xml:534: The following error occurred while executing this line:
C:\Users\JenkinsSlave\workspace\Lucene-Solr-5.x-Windows\lucene\common-build.xml:1477: The following error occurred while executing this line:
C:\Users\JenkinsSlave\workspace\Lucene-Solr-5.x-Windows\lucene\common-build.xml:1033: There were test failures: 566 suites (7 ignored), 2271 tests, 1 suite-level error, 93 ignored (49 assumptions) [seed: 270D9845923FE1E5]

Total time: 82 minutes 32 seconds
Build step 'Invoke Ant' marked build as failure
Archiving artifacts
[WARNINGS] Skipping publisher since build result is FAILURE
Recording test results
Email was triggered for: Failure - Any
Sending email for trigger: Failure - Any



Mime
View raw message