lucene-dev mailing list archives

Site index · List index
Message view « Date » · « Thread »
Top « Date » · « Thread »
From Policeman Jenkins Server <jenk...@thetaphi.de>
Subject [JENKINS-EA] Lucene-Solr-trunk-Linux (64bit/jdk-9-ea+107) - Build # 16043 - Still Failing!
Date Mon, 29 Feb 2016 06:43:32 GMT
Build: http://jenkins.thetaphi.de/job/Lucene-Solr-trunk-Linux/16043/
Java: 64bit/jdk-9-ea+107 -XX:-UseCompressedOops -XX:+UseParallelGC

1 tests failed.
FAILED:  org.apache.lucene.util.automaton.TestOperations.testIsFinite

Error Message:
6

Stack Trace:
java.lang.ArrayIndexOutOfBoundsException: 6
	at __randomizedtesting.SeedInfo.seed([BBE64C3C1562001B:9BDFBD2C592BDF8D]:0)
	at org.apache.lucene.util.automaton.MinimizationOperations.minimize(MinimizationOperations.java:235)
	at org.apache.lucene.util.automaton.RegExp.toAutomatonInternal(RegExp.java:524)
	at org.apache.lucene.util.automaton.RegExp.toAutomaton(RegExp.java:495)
	at org.apache.lucene.util.automaton.RegExp.toAutomaton(RegExp.java:426)
	at org.apache.lucene.util.automaton.AutomatonTestUtil.randomSingleAutomaton(AutomatonTestUtil.java:262)
	at org.apache.lucene.util.automaton.AutomatonTestUtil.randomAutomaton(AutomatonTestUtil.java:277)
	at org.apache.lucene.util.automaton.TestOperations.testIsFinite(TestOperations.java:122)
	at sun.reflect.NativeMethodAccessorImpl.invoke0(Native Method)
	at sun.reflect.NativeMethodAccessorImpl.invoke(NativeMethodAccessorImpl.java:62)
	at sun.reflect.DelegatingMethodAccessorImpl.invoke(DelegatingMethodAccessorImpl.java:43)
	at java.lang.reflect.Method.invoke(Method.java:520)
	at com.carrotsearch.randomizedtesting.RandomizedRunner.invoke(RandomizedRunner.java:1764)
	at com.carrotsearch.randomizedtesting.RandomizedRunner$8.evaluate(RandomizedRunner.java:871)
	at com.carrotsearch.randomizedtesting.RandomizedRunner$9.evaluate(RandomizedRunner.java:907)
	at com.carrotsearch.randomizedtesting.RandomizedRunner$10.evaluate(RandomizedRunner.java:921)
	at org.apache.lucene.util.TestRuleSetupTeardownChained$1.evaluate(TestRuleSetupTeardownChained.java:49)
	at org.apache.lucene.util.AbstractBeforeAfterRule$1.evaluate(AbstractBeforeAfterRule.java:45)
	at org.apache.lucene.util.TestRuleThreadAndTestName$1.evaluate(TestRuleThreadAndTestName.java:48)
	at org.apache.lucene.util.TestRuleIgnoreAfterMaxFailures$1.evaluate(TestRuleIgnoreAfterMaxFailures.java:64)
	at org.apache.lucene.util.TestRuleMarkFailure$1.evaluate(TestRuleMarkFailure.java:47)
	at com.carrotsearch.randomizedtesting.rules.StatementAdapter.evaluate(StatementAdapter.java:36)
	at com.carrotsearch.randomizedtesting.ThreadLeakControl$StatementRunner.run(ThreadLeakControl.java:367)
	at com.carrotsearch.randomizedtesting.ThreadLeakControl.forkTimeoutingTask(ThreadLeakControl.java:809)
	at com.carrotsearch.randomizedtesting.ThreadLeakControl$3.evaluate(ThreadLeakControl.java:460)
	at com.carrotsearch.randomizedtesting.RandomizedRunner.runSingleTest(RandomizedRunner.java:880)
	at com.carrotsearch.randomizedtesting.RandomizedRunner$5.evaluate(RandomizedRunner.java:781)
	at com.carrotsearch.randomizedtesting.RandomizedRunner$6.evaluate(RandomizedRunner.java:816)
	at com.carrotsearch.randomizedtesting.RandomizedRunner$7.evaluate(RandomizedRunner.java:827)
	at org.apache.lucene.util.AbstractBeforeAfterRule$1.evaluate(AbstractBeforeAfterRule.java:45)
	at com.carrotsearch.randomizedtesting.rules.StatementAdapter.evaluate(StatementAdapter.java:36)
	at org.apache.lucene.util.TestRuleStoreClassName$1.evaluate(TestRuleStoreClassName.java:41)
	at com.carrotsearch.randomizedtesting.rules.NoShadowingOrOverridesOnMethodsRule$1.evaluate(NoShadowingOrOverridesOnMethodsRule.java:40)
	at com.carrotsearch.randomizedtesting.rules.NoShadowingOrOverridesOnMethodsRule$1.evaluate(NoShadowingOrOverridesOnMethodsRule.java:40)
	at com.carrotsearch.randomizedtesting.rules.StatementAdapter.evaluate(StatementAdapter.java:36)
	at com.carrotsearch.randomizedtesting.rules.StatementAdapter.evaluate(StatementAdapter.java:36)
	at com.carrotsearch.randomizedtesting.rules.StatementAdapter.evaluate(StatementAdapter.java:36)
	at org.apache.lucene.util.TestRuleAssertionsRequired$1.evaluate(TestRuleAssertionsRequired.java:53)
	at org.apache.lucene.util.TestRuleMarkFailure$1.evaluate(TestRuleMarkFailure.java:47)
	at org.apache.lucene.util.TestRuleIgnoreAfterMaxFailures$1.evaluate(TestRuleIgnoreAfterMaxFailures.java:64)
	at org.apache.lucene.util.TestRuleIgnoreTestSuites$1.evaluate(TestRuleIgnoreTestSuites.java:54)
	at com.carrotsearch.randomizedtesting.rules.StatementAdapter.evaluate(StatementAdapter.java:36)
	at com.carrotsearch.randomizedtesting.ThreadLeakControl$StatementRunner.run(ThreadLeakControl.java:367)
	at java.lang.Thread.run(Thread.java:804)




Build Log:
[...truncated 1519 lines...]
   [junit4] Suite: org.apache.lucene.util.automaton.TestOperations
   [junit4]   2> NOTE: reproduce with: ant test  -Dtestcase=TestOperations -Dtests.method=testIsFinite
-Dtests.seed=BBE64C3C1562001B -Dtests.multiplier=3 -Dtests.slow=true -Dtests.locale=rn -Dtests.timezone=America/Jujuy
-Dtests.asserts=true -Dtests.file.encoding=UTF-8
   [junit4] ERROR   0.00s J1 | TestOperations.testIsFinite <<<
   [junit4]    > Throwable #1: java.lang.ArrayIndexOutOfBoundsException: 6
   [junit4]    > 	at __randomizedtesting.SeedInfo.seed([BBE64C3C1562001B:9BDFBD2C592BDF8D]:0)
   [junit4]    > 	at org.apache.lucene.util.automaton.MinimizationOperations.minimize(MinimizationOperations.java:235)
   [junit4]    > 	at org.apache.lucene.util.automaton.RegExp.toAutomatonInternal(RegExp.java:524)
   [junit4]    > 	at org.apache.lucene.util.automaton.RegExp.toAutomaton(RegExp.java:495)
   [junit4]    > 	at org.apache.lucene.util.automaton.RegExp.toAutomaton(RegExp.java:426)
   [junit4]    > 	at org.apache.lucene.util.automaton.AutomatonTestUtil.randomSingleAutomaton(AutomatonTestUtil.java:262)
   [junit4]    > 	at org.apache.lucene.util.automaton.AutomatonTestUtil.randomAutomaton(AutomatonTestUtil.java:277)
   [junit4]    > 	at org.apache.lucene.util.automaton.TestOperations.testIsFinite(TestOperations.java:122)
   [junit4]    > 	at java.lang.Thread.run(Thread.java:804)
   [junit4]   2> NOTE: test params are: codec=Asserting(Lucene60): {}, docValues:{}, sim=ClassicSimilarity,
locale=rn, timezone=America/Jujuy
   [junit4]   2> NOTE: Linux 3.19.0-51-generic amd64/Oracle Corporation 9-ea (64-bit)/cpus=12,threads=1,free=268041952,total=435683328
   [junit4]   2> NOTE: All tests run in this JVM: [TestIndexWriterExceptions, TestFieldsReader,
TestScoreCachingWrappingScorer, TestRateLimiter, TestSpanSearchEquivalence, TestPackedInts,
TestSameScoresWithThreads, TestBooleanScorer, TestBooleanQuery, TestRegExp, TestPrefixInBooleanQuery,
TestSimpleExplanations, TestHugeRamFile, TestFlushByRamOrCountsPolicy, TestBlockPostingsFormat3,
Test2BSortedDocValuesFixedSorted, TestSortedNumericSortField, TestDocValues, TestEarlyTermination,
TestRollingBuffer, TestSetOnce, TestDocumentsWriterStallControl, TestSegmentMerger, TestBasics,
TestRegexpQuery, TestMergePolicyWrapper, TestPerFieldPostingsFormat2, TestIndexWriterOutOfFileDescriptors,
TestFieldMaskingSpanQuery, TestFlex, TestAddIndexes, TestSameTokenSamePosition, TestRecyclingIntBlockAllocator,
TestStressNRT, TestParallelTermEnum, TestRamUsageEstimator, TestBooleanCoord, TestByteBlockPool,
TestByteSlices, TestMmapDirectory, TestNRTReaderWithThreads, TestAutomatonQueryUnicode, TestPositionIncrement,
TestScorerPerf, TestPerFieldDocValuesFormat, TestRAMDirectory, TestLevenshteinAutomata, TestSpanMultiTermQueryWrapper,
TestSingleInstanceLockFactory, TestCollectionUtil, TestPrefixRandom, TestSegmentTermDocs,
TestSnapshotDeletionPolicy, TestBoolean2, TestAllFilesDetectTruncation, TestPositiveScoresOnlyCollector,
TestMatchAllDocsQuery, TestSegmentTermEnum, TestOmitNorms, TestDuelingCodecs, TestIndexWriterFromReader,
TestRoaringDocIdSet, TestTopFieldCollector, TestNeedsScores, TestIndexWriterNRTIsCurrent,
TestSwappedIndexFiles, TestDocsAndPositions, TestNRTCachingDirectory, TestStressIndexing,
TestPerFieldPostingsFormat, TestDirectoryReader, TestFixedBitSet, TestSegmentReader, TestPagedBytes,
TestToken, TestSimpleSearchEquivalence, TestSimilarityBase, TestTermsEnum2, TestIndexWriterOnDiskFull,
TestPostingsOffsets, TestSpanExplanations, TestLazyProxSkipping, TestMergeSchedulerExternal,
TestBagOfPostings, TestLiveFieldValues, TestPrefixCodedTerms, TestParallelReaderEmptyIndex,
TestFileSwitchDirectory, TestWildcardRandom, TestBooleanQueryVisitSubscorers, TestConstantScoreQuery,
TestBinaryTerms, TestField, TestSpanExplanationsOfNonMatches, TestSmallFloat, TestNumericTokenStream,
TestFilterIterator, TestCachingCollector, TestSpanFirstQuery, TestNoMergePolicy, TestIndexWriterLockRelease,
TestCharFilter, TestCloseableThreadLocal, TestCodecHoldsOpenFiles, TestNGramPhraseQuery, Test2BPositions,
TestNewestSegment, TestReusableStringReader, TestGrowableByteArrayDataOutput, TestQueryCachingPolicy,
TestQueryRescorer, TestSynonymQuery, TestClassicSimilarity, TestSpanBoostQuery, TestSpanCollection,
TestSpanContainQuery, TestSpanNearQuery, TestSpanNotQuery, TestSpanOrQuery, TestSpansEnum,
TestBytesRefArray, TestCharsRefBuilder, TestFixedBitDocIdSet, TestInPlaceMergeSorter, TestIntArrayDocIdSet,
TestIntroSorter, TestLSBRadixSorter, TestLongBitSet, TestMergedIterator, TestNotDocIdSet,
TestSparseFixedBitDocIdSet, TestStringHelper, TestTimSorter, FiniteStringsIteratorTest, LimitedFiniteStringsIteratorTest,
TestAutomaton, TestOperations]
   [junit4] Completed [407/411 (1!)] on J1 in 0.19s, 5 tests, 1 error <<< FAILURES!

[...truncated 33 lines...]
BUILD FAILED
/home/jenkins/workspace/Lucene-Solr-trunk-Linux/build.xml:740: The following error occurred
while executing this line:
/home/jenkins/workspace/Lucene-Solr-trunk-Linux/build.xml:684: The following error occurred
while executing this line:
/home/jenkins/workspace/Lucene-Solr-trunk-Linux/build.xml:59: The following error occurred
while executing this line:
/home/jenkins/workspace/Lucene-Solr-trunk-Linux/lucene/build.xml:50: The following error occurred
while executing this line:
/home/jenkins/workspace/Lucene-Solr-trunk-Linux/lucene/common-build.xml:1457: The following
error occurred while executing this line:
/home/jenkins/workspace/Lucene-Solr-trunk-Linux/lucene/common-build.xml:1014: There were test
failures: 411 suites (1 ignored), 3423 tests, 1 error, 60 ignored (56 assumptions) [seed:
BBE64C3C1562001B]

Total time: 6 minutes 29 seconds
Build step 'Invoke Ant' marked build as failure
Archiving artifacts
[WARNINGS] Skipping publisher since build result is FAILURE
Recording test results
Email was triggered for: Failure - Any
Sending email for trigger: Failure - Any



Mime
View raw message