lucene-dev mailing list archives

Site index · List index
Message view « Date » · « Thread »
Top « Date » · « Thread »
From Apache Jenkins Server <jenk...@builds.apache.org>
Subject [JENKINS] Lucene-Solr-Tests-trunk-Java8 - Build # 894 - Failure
Date Sun, 28 Feb 2016 13:19:57 GMT
Build: https://builds.apache.org/job/Lucene-Solr-Tests-trunk-Java8/894/

1 tests failed.
FAILED:  org.apache.solr.handler.TestReqParamsAPI.test

Error Message:
Could not get expected value  'first' for path 'response/params/x/_appends_/add' full output: {   "responseHeader":{     "status":0,     "QTime":0},   "response":{     "znodeVersion":3,     "params":{       "x":{         "a":"A val",         "b":"B val",         "":{"v":0}},       "y":{         "p":"P val",         "q":"Q val",         "":{"v":2}}}}}

Stack Trace:
java.lang.AssertionError: Could not get expected value  'first' for path 'response/params/x/_appends_/add' full output: {
  "responseHeader":{
    "status":0,
    "QTime":0},
  "response":{
    "znodeVersion":3,
    "params":{
      "x":{
        "a":"A val",
        "b":"B val",
        "":{"v":0}},
      "y":{
        "p":"P val",
        "q":"Q val",
        "":{"v":2}}}}}
	at __randomizedtesting.SeedInfo.seed([FDFC00EBE9027634:75A83F3147FE1BCC]:0)
	at org.junit.Assert.fail(Assert.java:93)
	at org.junit.Assert.assertTrue(Assert.java:43)
	at org.apache.solr.core.TestSolrConfigHandler.testForResponseElement(TestSolrConfigHandler.java:458)
	at org.apache.solr.handler.TestReqParamsAPI.testReqParams(TestReqParamsAPI.java:236)
	at org.apache.solr.handler.TestReqParamsAPI.test(TestReqParamsAPI.java:67)
	at sun.reflect.NativeMethodAccessorImpl.invoke0(Native Method)
	at sun.reflect.NativeMethodAccessorImpl.invoke(NativeMethodAccessorImpl.java:62)
	at sun.reflect.DelegatingMethodAccessorImpl.invoke(DelegatingMethodAccessorImpl.java:43)
	at java.lang.reflect.Method.invoke(Method.java:497)
	at com.carrotsearch.randomizedtesting.RandomizedRunner.invoke(RandomizedRunner.java:1764)
	at com.carrotsearch.randomizedtesting.RandomizedRunner$8.evaluate(RandomizedRunner.java:871)
	at com.carrotsearch.randomizedtesting.RandomizedRunner$9.evaluate(RandomizedRunner.java:907)
	at com.carrotsearch.randomizedtesting.RandomizedRunner$10.evaluate(RandomizedRunner.java:921)
	at org.apache.solr.BaseDistributedSearchTestCase$ShardsRepeatRule$ShardsFixedStatement.callStatement(BaseDistributedSearchTestCase.java:996)
	at org.apache.solr.BaseDistributedSearchTestCase$ShardsRepeatRule$ShardsStatement.evaluate(BaseDistributedSearchTestCase.java:971)
	at com.carrotsearch.randomizedtesting.rules.SystemPropertiesRestoreRule$1.evaluate(SystemPropertiesRestoreRule.java:57)
	at org.apache.lucene.util.TestRuleSetupTeardownChained$1.evaluate(TestRuleSetupTeardownChained.java:49)
	at org.apache.lucene.util.AbstractBeforeAfterRule$1.evaluate(AbstractBeforeAfterRule.java:45)
	at org.apache.lucene.util.TestRuleThreadAndTestName$1.evaluate(TestRuleThreadAndTestName.java:48)
	at org.apache.lucene.util.TestRuleIgnoreAfterMaxFailures$1.evaluate(TestRuleIgnoreAfterMaxFailures.java:64)
	at org.apache.lucene.util.TestRuleMarkFailure$1.evaluate(TestRuleMarkFailure.java:47)
	at com.carrotsearch.randomizedtesting.rules.StatementAdapter.evaluate(StatementAdapter.java:36)
	at com.carrotsearch.randomizedtesting.ThreadLeakControl$StatementRunner.run(ThreadLeakControl.java:367)
	at com.carrotsearch.randomizedtesting.ThreadLeakControl.forkTimeoutingTask(ThreadLeakControl.java:809)
	at com.carrotsearch.randomizedtesting.ThreadLeakControl$3.evaluate(ThreadLeakControl.java:460)
	at com.carrotsearch.randomizedtesting.RandomizedRunner.runSingleTest(RandomizedRunner.java:880)
	at com.carrotsearch.randomizedtesting.RandomizedRunner$5.evaluate(RandomizedRunner.java:781)
	at com.carrotsearch.randomizedtesting.RandomizedRunner$6.evaluate(RandomizedRunner.java:816)
	at com.carrotsearch.randomizedtesting.RandomizedRunner$7.evaluate(RandomizedRunner.java:827)
	at com.carrotsearch.randomizedtesting.rules.StatementAdapter.evaluate(StatementAdapter.java:36)
	at com.carrotsearch.randomizedtesting.rules.SystemPropertiesRestoreRule$1.evaluate(SystemPropertiesRestoreRule.java:57)
	at org.apache.lucene.util.AbstractBeforeAfterRule$1.evaluate(AbstractBeforeAfterRule.java:45)
	at com.carrotsearch.randomizedtesting.rules.StatementAdapter.evaluate(StatementAdapter.java:36)
	at org.apache.lucene.util.TestRuleStoreClassName$1.evaluate(TestRuleStoreClassName.java:41)
	at com.carrotsearch.randomizedtesting.rules.NoShadowingOrOverridesOnMethodsRule$1.evaluate(NoShadowingOrOverridesOnMethodsRule.java:40)
	at com.carrotsearch.randomizedtesting.rules.NoShadowingOrOverridesOnMethodsRule$1.evaluate(NoShadowingOrOverridesOnMethodsRule.java:40)
	at com.carrotsearch.randomizedtesting.rules.StatementAdapter.evaluate(StatementAdapter.java:36)
	at com.carrotsearch.randomizedtesting.rules.StatementAdapter.evaluate(StatementAdapter.java:36)
	at com.carrotsearch.randomizedtesting.rules.StatementAdapter.evaluate(StatementAdapter.java:36)
	at org.apache.lucene.util.TestRuleAssertionsRequired$1.evaluate(TestRuleAssertionsRequired.java:53)
	at org.apache.lucene.util.TestRuleMarkFailure$1.evaluate(TestRuleMarkFailure.java:47)
	at org.apache.lucene.util.TestRuleIgnoreAfterMaxFailures$1.evaluate(TestRuleIgnoreAfterMaxFailures.java:64)
	at org.apache.lucene.util.TestRuleIgnoreTestSuites$1.evaluate(TestRuleIgnoreTestSuites.java:54)
	at com.carrotsearch.randomizedtesting.rules.StatementAdapter.evaluate(StatementAdapter.java:36)
	at com.carrotsearch.randomizedtesting.ThreadLeakControl$StatementRunner.run(ThreadLeakControl.java:367)
	at java.lang.Thread.run(Thread.java:745)




Build Log:
[...truncated 11920 lines...]
   [junit4] Suite: org.apache.solr.handler.TestReqParamsAPI
   [junit4]   2> Creating dataDir: /x1/jenkins/jenkins-slave/workspace/Lucene-Solr-Tests-trunk-Java8/solr/build/solr-core/test/J1/temp/solr.handler.TestReqParamsAPI_FDFC00EBE9027634-001/init-core-data-001
   [junit4]   2> 1870776 INFO  (SUITE-TestReqParamsAPI-seed#[FDFC00EBE9027634]-worker) [    ] o.a.s.SolrTestCaseJ4 Randomized ssl (true) and clientAuth (true)
   [junit4]   2> 1870776 INFO  (SUITE-TestReqParamsAPI-seed#[FDFC00EBE9027634]-worker) [    ] o.a.s.BaseDistributedSearchTestCase Setting hostContext system property: /er_n/iw
   [junit4]   2> 1870780 INFO  (TEST-TestReqParamsAPI.test-seed#[FDFC00EBE9027634]) [    ] o.a.s.c.ZkTestServer STARTING ZK TEST SERVER
   [junit4]   2> 1870780 INFO  (Thread-5719) [    ] o.a.s.c.ZkTestServer client port:0.0.0.0/0.0.0.0:0
   [junit4]   2> 1870780 INFO  (Thread-5719) [    ] o.a.s.c.ZkTestServer Starting server
   [junit4]   2> 1870880 INFO  (TEST-TestReqParamsAPI.test-seed#[FDFC00EBE9027634]) [    ] o.a.s.c.ZkTestServer start zk server on port:42951
   [junit4]   2> 1870881 INFO  (TEST-TestReqParamsAPI.test-seed#[FDFC00EBE9027634]) [    ] o.a.s.c.c.SolrZkClient Using default ZkCredentialsProvider
   [junit4]   2> 1870888 INFO  (TEST-TestReqParamsAPI.test-seed#[FDFC00EBE9027634]) [    ] o.a.s.c.c.ConnectionManager Waiting for client to connect to ZooKeeper
   [junit4]   2> 1870893 INFO  (zkCallback-2450-thread-1) [    ] o.a.s.c.c.ConnectionManager Watcher org.apache.solr.common.cloud.ConnectionManager@6694162a name:ZooKeeperConnection Watcher:127.0.0.1:42951 got event WatchedEvent state:SyncConnected type:None path:null path:null type:None
   [junit4]   2> 1870893 INFO  (TEST-TestReqParamsAPI.test-seed#[FDFC00EBE9027634]) [    ] o.a.s.c.c.ConnectionManager Client is connected to ZooKeeper
   [junit4]   2> 1870893 INFO  (TEST-TestReqParamsAPI.test-seed#[FDFC00EBE9027634]) [    ] o.a.s.c.c.SolrZkClient Using default ZkACLProvider
   [junit4]   2> 1870894 INFO  (TEST-TestReqParamsAPI.test-seed#[FDFC00EBE9027634]) [    ] o.a.s.c.c.SolrZkClient makePath: /solr
   [junit4]   2> 1870896 INFO  (TEST-TestReqParamsAPI.test-seed#[FDFC00EBE9027634]) [    ] o.a.s.c.c.SolrZkClient Using default ZkCredentialsProvider
   [junit4]   2> 1870900 INFO  (TEST-TestReqParamsAPI.test-seed#[FDFC00EBE9027634]) [    ] o.a.s.c.c.ConnectionManager Waiting for client to connect to ZooKeeper
   [junit4]   2> 1870901 INFO  (zkCallback-2451-thread-1) [    ] o.a.s.c.c.ConnectionManager Watcher org.apache.solr.common.cloud.ConnectionManager@706d7ddc name:ZooKeeperConnection Watcher:127.0.0.1:42951/solr got event WatchedEvent state:SyncConnected type:None path:null path:null type:None
   [junit4]   2> 1870901 INFO  (TEST-TestReqParamsAPI.test-seed#[FDFC00EBE9027634]) [    ] o.a.s.c.c.ConnectionManager Client is connected to ZooKeeper
   [junit4]   2> 1870901 INFO  (TEST-TestReqParamsAPI.test-seed#[FDFC00EBE9027634]) [    ] o.a.s.c.c.SolrZkClient Using default ZkACLProvider
   [junit4]   2> 1870901 INFO  (TEST-TestReqParamsAPI.test-seed#[FDFC00EBE9027634]) [    ] o.a.s.c.c.SolrZkClient makePath: /collections/collection1
   [junit4]   2> 1870904 INFO  (TEST-TestReqParamsAPI.test-seed#[FDFC00EBE9027634]) [    ] o.a.s.c.c.SolrZkClient makePath: /collections/collection1/shards
   [junit4]   2> 1870906 INFO  (TEST-TestReqParamsAPI.test-seed#[FDFC00EBE9027634]) [    ] o.a.s.c.c.SolrZkClient makePath: /collections/control_collection
   [junit4]   2> 1870908 INFO  (TEST-TestReqParamsAPI.test-seed#[FDFC00EBE9027634]) [    ] o.a.s.c.c.SolrZkClient makePath: /collections/control_collection/shards
   [junit4]   2> 1870909 INFO  (TEST-TestReqParamsAPI.test-seed#[FDFC00EBE9027634]) [    ] o.a.s.c.AbstractZkTestCase put /x1/jenkins/jenkins-slave/workspace/Lucene-Solr-Tests-trunk-Java8/solr/core/src/test-files/solr/collection1/conf/solrconfig-tlog.xml to /configs/conf1/solrconfig.xml
   [junit4]   2> 1870910 INFO  (TEST-TestReqParamsAPI.test-seed#[FDFC00EBE9027634]) [    ] o.a.s.c.c.SolrZkClient makePath: /configs/conf1/solrconfig.xml
   [junit4]   2> 1870913 INFO  (TEST-TestReqParamsAPI.test-seed#[FDFC00EBE9027634]) [    ] o.a.s.c.AbstractZkTestCase put /x1/jenkins/jenkins-slave/workspace/Lucene-Solr-Tests-trunk-Java8/solr/core/src/test-files/solr/collection1/conf/schema.xml to /configs/conf1/schema.xml
   [junit4]   2> 1870913 INFO  (TEST-TestReqParamsAPI.test-seed#[FDFC00EBE9027634]) [    ] o.a.s.c.c.SolrZkClient makePath: /configs/conf1/schema.xml
   [junit4]   2> 1870915 INFO  (TEST-TestReqParamsAPI.test-seed#[FDFC00EBE9027634]) [    ] o.a.s.c.AbstractZkTestCase put /x1/jenkins/jenkins-slave/workspace/Lucene-Solr-Tests-trunk-Java8/solr/core/src/test-files/solr/collection1/conf/solrconfig.snippet.randomindexconfig.xml to /configs/conf1/solrconfig.snippet.randomindexconfig.xml
   [junit4]   2> 1870916 INFO  (TEST-TestReqParamsAPI.test-seed#[FDFC00EBE9027634]) [    ] o.a.s.c.c.SolrZkClient makePath: /configs/conf1/solrconfig.snippet.randomindexconfig.xml
   [junit4]   2> 1870921 INFO  (TEST-TestReqParamsAPI.test-seed#[FDFC00EBE9027634]) [    ] o.a.s.c.AbstractZkTestCase put /x1/jenkins/jenkins-slave/workspace/Lucene-Solr-Tests-trunk-Java8/solr/core/src/test-files/solr/collection1/conf/stopwords.txt to /configs/conf1/stopwords.txt
   [junit4]   2> 1870921 INFO  (TEST-TestReqParamsAPI.test-seed#[FDFC00EBE9027634]) [    ] o.a.s.c.c.SolrZkClient makePath: /configs/conf1/stopwords.txt
   [junit4]   2> 1870923 INFO  (TEST-TestReqParamsAPI.test-seed#[FDFC00EBE9027634]) [    ] o.a.s.c.AbstractZkTestCase put /x1/jenkins/jenkins-slave/workspace/Lucene-Solr-Tests-trunk-Java8/solr/core/src/test-files/solr/collection1/conf/protwords.txt to /configs/conf1/protwords.txt
   [junit4]   2> 1870923 INFO  (TEST-TestReqParamsAPI.test-seed#[FDFC00EBE9027634]) [    ] o.a.s.c.c.SolrZkClient makePath: /configs/conf1/protwords.txt
   [junit4]   2> 1870925 INFO  (TEST-TestReqParamsAPI.test-seed#[FDFC00EBE9027634]) [    ] o.a.s.c.AbstractZkTestCase put /x1/jenkins/jenkins-slave/workspace/Lucene-Solr-Tests-trunk-Java8/solr/core/src/test-files/solr/collection1/conf/currency.xml to /configs/conf1/currency.xml
   [junit4]   2> 1870925 INFO  (TEST-TestReqParamsAPI.test-seed#[FDFC00EBE9027634]) [    ] o.a.s.c.c.SolrZkClient makePath: /configs/conf1/currency.xml
   [junit4]   2> 1870927 INFO  (TEST-TestReqParamsAPI.test-seed#[FDFC00EBE9027634]) [    ] o.a.s.c.AbstractZkTestCase put /x1/jenkins/jenkins-slave/workspace/Lucene-Solr-Tests-trunk-Java8/solr/core/src/test-files/solr/collection1/conf/enumsConfig.xml to /configs/conf1/enumsConfig.xml
   [junit4]   2> 1870927 INFO  (TEST-TestReqParamsAPI.test-seed#[FDFC00EBE9027634]) [    ] o.a.s.c.c.SolrZkClient makePath: /configs/conf1/enumsConfig.xml
   [junit4]   2> 1870929 INFO  (TEST-TestReqParamsAPI.test-seed#[FDFC00EBE9027634]) [    ] o.a.s.c.AbstractZkTestCase put /x1/jenkins/jenkins-slave/workspace/Lucene-Solr-Tests-trunk-Java8/solr/core/src/test-files/solr/collection1/conf/open-exchange-rates.json to /configs/conf1/open-exchange-rates.json
   [junit4]   2> 1870929 INFO  (TEST-TestReqParamsAPI.test-seed#[FDFC00EBE9027634]) [    ] o.a.s.c.c.SolrZkClient makePath: /configs/conf1/open-exchange-rates.json
   [junit4]   2> 1870931 INFO  (TEST-TestReqParamsAPI.test-seed#[FDFC00EBE9027634]) [    ] o.a.s.c.AbstractZkTestCase put /x1/jenkins/jenkins-slave/workspace/Lucene-Solr-Tests-trunk-Java8/solr/core/src/test-files/solr/collection1/conf/mapping-ISOLatin1Accent.txt to /configs/conf1/mapping-ISOLatin1Accent.txt
   [junit4]   2> 1870931 INFO  (TEST-TestReqParamsAPI.test-seed#[FDFC00EBE9027634]) [    ] o.a.s.c.c.SolrZkClient makePath: /configs/conf1/mapping-ISOLatin1Accent.txt
   [junit4]   2> 1870933 INFO  (TEST-TestReqParamsAPI.test-seed#[FDFC00EBE9027634]) [    ] o.a.s.c.AbstractZkTestCase put /x1/jenkins/jenkins-slave/workspace/Lucene-Solr-Tests-trunk-Java8/solr/core/src/test-files/solr/collection1/conf/old_synonyms.txt to /configs/conf1/old_synonyms.txt
   [junit4]   2> 1870940 INFO  (TEST-TestReqParamsAPI.test-seed#[FDFC00EBE9027634]) [    ] o.a.s.c.c.SolrZkClient makePath: /configs/conf1/old_synonyms.txt
   [junit4]   2> 1870946 INFO  (TEST-TestReqParamsAPI.test-seed#[FDFC00EBE9027634]) [    ] o.a.s.c.AbstractZkTestCase put /x1/jenkins/jenkins-slave/workspace/Lucene-Solr-Tests-trunk-Java8/solr/core/src/test-files/solr/collection1/conf/synonyms.txt to /configs/conf1/synonyms.txt
   [junit4]   2> 1870946 INFO  (TEST-TestReqParamsAPI.test-seed#[FDFC00EBE9027634]) [    ] o.a.s.c.c.SolrZkClient makePath: /configs/conf1/synonyms.txt
   [junit4]   2> 1870948 INFO  (TEST-TestReqParamsAPI.test-seed#[FDFC00EBE9027634]) [    ] o.a.s.c.c.SolrZkClient Using default ZkCredentialsProvider
   [junit4]   2> 1870960 INFO  (TEST-TestReqParamsAPI.test-seed#[FDFC00EBE9027634]) [    ] o.a.s.c.c.ConnectionManager Waiting for client to connect to ZooKeeper
   [junit4]   2> 1870968 INFO  (zkCallback-2452-thread-1) [    ] o.a.s.c.c.ConnectionManager Watcher org.apache.solr.common.cloud.ConnectionManager@6bd43f53 name:ZooKeeperConnection Watcher:127.0.0.1:42951/solr got event WatchedEvent state:SyncConnected type:None path:null path:null type:None
   [junit4]   2> 1870968 INFO  (TEST-TestReqParamsAPI.test-seed#[FDFC00EBE9027634]) [    ] o.a.s.c.c.ConnectionManager Client is connected to ZooKeeper
   [junit4]   2> 1870969 INFO  (TEST-TestReqParamsAPI.test-seed#[FDFC00EBE9027634]) [    ] o.a.s.c.c.SolrZkClient Using default ZkACLProvider
   [junit4]   2> 1871097 INFO  (TEST-TestReqParamsAPI.test-seed#[FDFC00EBE9027634]) [    ] o.a.s.SolrTestCaseJ4 Writing core.properties file to /x1/jenkins/jenkins-slave/workspace/Lucene-Solr-Tests-trunk-Java8/solr/build/solr-core/test/J1/temp/solr.handler.TestReqParamsAPI_FDFC00EBE9027634-001/control-001/cores/collection1
   [junit4]   2> 1871108 INFO  (TEST-TestReqParamsAPI.test-seed#[FDFC00EBE9027634]) [    ] o.e.j.s.Server jetty-9.3.6.v20151106
   [junit4]   2> 1871117 INFO  (TEST-TestReqParamsAPI.test-seed#[FDFC00EBE9027634]) [    ] o.e.j.s.h.ContextHandler Started o.e.j.s.ServletContextHandler@7929213b{/er_n/iw,null,AVAILABLE}
   [junit4]   2> 1871118 INFO  (TEST-TestReqParamsAPI.test-seed#[FDFC00EBE9027634]) [    ] o.e.j.u.s.SslContextFactory x509=X509@74937180(solrtest,h=[],w=[]) for SslContextFactory@3d4837fe(file:///x1/jenkins/jenkins-slave/workspace/Lucene-Solr-Tests-trunk-Java8/solr/server/etc/test/solrtest.keystore,file:///x1/jenkins/jenkins-slave/workspace/Lucene-Solr-Tests-trunk-Java8/solr/server/etc/test/solrtest.keystore)
   [junit4]   2> 1871121 INFO  (TEST-TestReqParamsAPI.test-seed#[FDFC00EBE9027634]) [    ] o.e.j.s.ServerConnector Started ServerConnector@5a906dad{SSL,[ssl, http/1.1]}{127.0.0.1:48109}
   [junit4]   2> 1871121 INFO  (TEST-TestReqParamsAPI.test-seed#[FDFC00EBE9027634]) [    ] o.e.j.s.Server Started @1874307ms
   [junit4]   2> 1871121 INFO  (TEST-TestReqParamsAPI.test-seed#[FDFC00EBE9027634]) [    ] o.a.s.c.s.e.JettySolrRunner Jetty properties: {solr.data.dir=/x1/jenkins/jenkins-slave/workspace/Lucene-Solr-Tests-trunk-Java8/solr/build/solr-core/test/J1/temp/solr.handler.TestReqParamsAPI_FDFC00EBE9027634-001/tempDir-001/control/data, hostContext=/er_n/iw, hostPort=48109, coreRootDirectory=/x1/jenkins/jenkins-slave/workspace/Lucene-Solr-Tests-trunk-Java8/solr/build/solr-core/test/J1/../../../../../../../../../../x1/jenkins/jenkins-slave/workspace/Lucene-Solr-Tests-trunk-Java8/solr/build/solr-core/test/J1/temp/solr.handler.TestReqParamsAPI_FDFC00EBE9027634-001/control-001/cores}
   [junit4]   2> 1871122 INFO  (TEST-TestReqParamsAPI.test-seed#[FDFC00EBE9027634]) [    ] o.a.s.s.SolrDispatchFilter SolrDispatchFilter.init(): sun.misc.Launcher$AppClassLoader@4e0e2f2a
   [junit4]   2> 1871122 INFO  (TEST-TestReqParamsAPI.test-seed#[FDFC00EBE9027634]) [    ] o.a.s.c.SolrResourceLoader new SolrResourceLoader for directory: '/x1/jenkins/jenkins-slave/workspace/Lucene-Solr-Tests-trunk-Java8/solr/build/solr-core/test/J1/temp/solr.handler.TestReqParamsAPI_FDFC00EBE9027634-001/control-001'
   [junit4]   2> 1871122 INFO  (TEST-TestReqParamsAPI.test-seed#[FDFC00EBE9027634]) [    ] o.a.s.c.SolrResourceLoader JNDI not configured for solr (NoInitialContextEx)
   [junit4]   2> 1871122 INFO  (TEST-TestReqParamsAPI.test-seed#[FDFC00EBE9027634]) [    ] o.a.s.c.SolrResourceLoader solr home defaulted to 'solr/' (could not find system property or JNDI)
   [junit4]   2> 1871123 INFO  (TEST-TestReqParamsAPI.test-seed#[FDFC00EBE9027634]) [    ] o.a.s.c.c.SolrZkClient Using default ZkCredentialsProvider
   [junit4]   2> 1871123 INFO  (TEST-TestReqParamsAPI.test-seed#[FDFC00EBE9027634]) [    ] o.a.s.c.c.ConnectionManager Waiting for client to connect to ZooKeeper
   [junit4]   2> 1871134 INFO  (zkCallback-2453-thread-1) [    ] o.a.s.c.c.ConnectionManager Watcher org.apache.solr.common.cloud.ConnectionManager@29e3a2b3 name:ZooKeeperConnection Watcher:127.0.0.1:42951/solr got event WatchedEvent state:SyncConnected type:None path:null path:null type:None
   [junit4]   2> 1871135 INFO  (TEST-TestReqParamsAPI.test-seed#[FDFC00EBE9027634]) [    ] o.a.s.c.c.ConnectionManager Client is connected to ZooKeeper
   [junit4]   2> 1871135 INFO  (TEST-TestReqParamsAPI.test-seed#[FDFC00EBE9027634]) [    ] o.a.s.c.c.SolrZkClient Using default ZkACLProvider
   [junit4]   2> 1871136 INFO  (TEST-TestReqParamsAPI.test-seed#[FDFC00EBE9027634]) [    ] o.a.s.s.SolrDispatchFilter Loading solr.xml from SolrHome (not found in ZooKeeper)
   [junit4]   2> 1871136 INFO  (TEST-TestReqParamsAPI.test-seed#[FDFC00EBE9027634]) [    ] o.a.s.c.SolrXmlConfig Loading container configuration from /x1/jenkins/jenkins-slave/workspace/Lucene-Solr-Tests-trunk-Java8/solr/build/solr-core/test/J1/temp/solr.handler.TestReqParamsAPI_FDFC00EBE9027634-001/control-001/solr.xml
   [junit4]   2> 1871136 WARN  (NIOServerCxn.Factory:0.0.0.0/0.0.0.0:0) [    ] o.a.z.s.NIOServerCnxn caught end of stream exception
   [junit4]   2> EndOfStreamException: Unable to read additional data from client sessionid 0x153280410820003, likely client has closed socket
   [junit4]   2> 	at org.apache.zookeeper.server.NIOServerCnxn.doIO(NIOServerCnxn.java:228)
   [junit4]   2> 	at org.apache.zookeeper.server.NIOServerCnxnFactory.run(NIOServerCnxnFactory.java:208)
   [junit4]   2> 	at java.lang.Thread.run(Thread.java:745)
   [junit4]   2> 1871142 INFO  (TEST-TestReqParamsAPI.test-seed#[FDFC00EBE9027634]) [    ] o.a.s.c.CorePropertiesLocator Config-defined core root directory: /x1/jenkins/jenkins-slave/workspace/Lucene-Solr-Tests-trunk-Java8/solr/build/solr-core/test/J1/../../../../../../../../../../x1/jenkins/jenkins-slave/workspace/Lucene-Solr-Tests-trunk-Java8/solr/build/solr-core/test/J1/temp/solr.handler.TestReqParamsAPI_FDFC00EBE9027634-001/control-001/cores
   [junit4]   2> 1871142 INFO  (TEST-TestReqParamsAPI.test-seed#[FDFC00EBE9027634]) [    ] o.a.s.c.CoreContainer New CoreContainer 207130141
   [junit4]   2> 1871142 INFO  (TEST-TestReqParamsAPI.test-seed#[FDFC00EBE9027634]) [    ] o.a.s.c.CoreContainer Loading cores into CoreContainer [instanceDir=/x1/jenkins/jenkins-slave/workspace/Lucene-Solr-Tests-trunk-Java8/solr/build/solr-core/test/J1/temp/solr.handler.TestReqParamsAPI_FDFC00EBE9027634-001/control-001]
   [junit4]   2> 1871142 WARN  (TEST-TestReqParamsAPI.test-seed#[FDFC00EBE9027634]) [    ] o.a.s.c.CoreContainer Couldn't add files from /x1/jenkins/jenkins-slave/workspace/Lucene-Solr-Tests-trunk-Java8/solr/build/solr-core/test/J1/temp/solr.handler.TestReqParamsAPI_FDFC00EBE9027634-001/control-001/lib to classpath: /x1/jenkins/jenkins-slave/workspace/Lucene-Solr-Tests-trunk-Java8/solr/build/solr-core/test/J1/temp/solr.handler.TestReqParamsAPI_FDFC00EBE9027634-001/control-001/lib
   [junit4]   2> 1871142 INFO  (TEST-TestReqParamsAPI.test-seed#[FDFC00EBE9027634]) [    ] o.a.s.h.c.HttpShardHandlerFactory created with socketTimeout : 90000,urlScheme : ,connTimeout : 15000,maxConnectionsPerHost : 20,maxConnections : 10000,corePoolSize : 0,maximumPoolSize : 2147483647,maxThreadIdleTime : 5,sizeOfQueue : -1,fairnessPolicy : false,useRetries : false,
   [junit4]   2> 1871144 INFO  (TEST-TestReqParamsAPI.test-seed#[FDFC00EBE9027634]) [    ] o.a.s.u.UpdateShardHandler Creating UpdateShardHandler HTTP client with params: socketTimeout=340000&connTimeout=45000&retry=true
   [junit4]   2> 1871146 INFO  (TEST-TestReqParamsAPI.test-seed#[FDFC00EBE9027634]) [    ] o.a.s.l.LogWatcher SLF4J impl is org.slf4j.impl.Log4jLoggerFactory
   [junit4]   2> 1871146 INFO  (TEST-TestReqParamsAPI.test-seed#[FDFC00EBE9027634]) [    ] o.a.s.l.LogWatcher Registering Log Listener [Log4j (org.slf4j.impl.Log4jLoggerFactory)]
   [junit4]   2> 1871146 INFO  (TEST-TestReqParamsAPI.test-seed#[FDFC00EBE9027634]) [    ] o.a.s.c.ZkContainer Zookeeper client=127.0.0.1:42951/solr
   [junit4]   2> 1871146 INFO  (TEST-TestReqParamsAPI.test-seed#[FDFC00EBE9027634]) [    ] o.a.s.c.ZkController zkHost includes chroot
   [junit4]   2> 1871146 INFO  (TEST-TestReqParamsAPI.test-seed#[FDFC00EBE9027634]) [    ] o.a.s.c.c.SolrZkClient Using default ZkCredentialsProvider
   [junit4]   2> 1871149 INFO  (TEST-TestReqParamsAPI.test-seed#[FDFC00EBE9027634]) [    ] o.a.s.c.c.ConnectionManager Waiting for client to connect to ZooKeeper
   [junit4]   2> 1871171 INFO  (zkCallback-2456-thread-1) [    ] o.a.s.c.c.ConnectionManager Watcher org.apache.solr.common.cloud.ConnectionManager@4b21d061 name:ZooKeeperConnection Watcher:127.0.0.1:42951 got event WatchedEvent state:SyncConnected type:None path:null path:null type:None
   [junit4]   2> 1871171 INFO  (TEST-TestReqParamsAPI.test-seed#[FDFC00EBE9027634]) [    ] o.a.s.c.c.ConnectionManager Client is connected to ZooKeeper
   [junit4]   2> 1871171 INFO  (TEST-TestReqParamsAPI.test-seed#[FDFC00EBE9027634]) [    ] o.a.s.c.c.SolrZkClient Using default ZkACLProvider
   [junit4]   2> 1871184 INFO  (TEST-TestReqParamsAPI.test-seed#[FDFC00EBE9027634]) [n:127.0.0.1:48109_er_n%2Fiw    ] o.a.s.c.c.ConnectionManager Waiting for client to connect to ZooKeeper
   [junit4]   2> 1871184 INFO  (zkCallback-2457-thread-1-processing-n:127.0.0.1:48109_er_n%2Fiw) [n:127.0.0.1:48109_er_n%2Fiw    ] o.a.s.c.c.ConnectionManager Watcher org.apache.solr.common.cloud.ConnectionManager@33f3df0d name:ZooKeeperConnection Watcher:127.0.0.1:42951/solr got event WatchedEvent state:SyncConnected type:None path:null path:null type:None
   [junit4]   2> 1871184 INFO  (TEST-TestReqParamsAPI.test-seed#[FDFC00EBE9027634]) [n:127.0.0.1:48109_er_n%2Fiw    ] o.a.s.c.c.ConnectionManager Client is connected to ZooKeeper
   [junit4]   2> 1871186 INFO  (TEST-TestReqParamsAPI.test-seed#[FDFC00EBE9027634]) [n:127.0.0.1:48109_er_n%2Fiw    ] o.a.s.c.c.SolrZkClient makePath: /overseer/queue
   [junit4]   2> 1871188 INFO  (TEST-TestReqParamsAPI.test-seed#[FDFC00EBE9027634]) [n:127.0.0.1:48109_er_n%2Fiw    ] o.a.s.c.c.SolrZkClient makePath: /overseer/collection-queue-work
   [junit4]   2> 1871200 INFO  (TEST-TestReqParamsAPI.test-seed#[FDFC00EBE9027634]) [n:127.0.0.1:48109_er_n%2Fiw    ] o.a.s.c.c.SolrZkClient makePath: /overseer/collection-map-running
   [junit4]   2> 1871204 INFO  (TEST-TestReqParamsAPI.test-seed#[FDFC00EBE9027634]) [n:127.0.0.1:48109_er_n%2Fiw    ] o.a.s.c.c.SolrZkClient makePath: /overseer/collection-map-completed
   [junit4]   2> 1871208 INFO  (TEST-TestReqParamsAPI.test-seed#[FDFC00EBE9027634]) [n:127.0.0.1:48109_er_n%2Fiw    ] o.a.s.c.c.SolrZkClient makePath: /overseer/collection-map-failure
   [junit4]   2> 1871211 INFO  (TEST-TestReqParamsAPI.test-seed#[FDFC00EBE9027634]) [n:127.0.0.1:48109_er_n%2Fiw    ] o.a.s.c.c.SolrZkClient makePath: /live_nodes
   [junit4]   2> 1871212 INFO  (TEST-TestReqParamsAPI.test-seed#[FDFC00EBE9027634]) [n:127.0.0.1:48109_er_n%2Fiw    ] o.a.s.c.c.SolrZkClient makePath: /aliases.json
   [junit4]   2> 1871213 INFO  (TEST-TestReqParamsAPI.test-seed#[FDFC00EBE9027634]) [n:127.0.0.1:48109_er_n%2Fiw    ] o.a.s.c.c.SolrZkClient makePath: /clusterstate.json
   [junit4]   2> 1871214 INFO  (TEST-TestReqParamsAPI.test-seed#[FDFC00EBE9027634]) [n:127.0.0.1:48109_er_n%2Fiw    ] o.a.s.c.c.SolrZkClient makePath: /security.json
   [junit4]   2> 1871214 INFO  (TEST-TestReqParamsAPI.test-seed#[FDFC00EBE9027634]) [n:127.0.0.1:48109_er_n%2Fiw    ] o.a.s.c.c.SolrZkClient makePath: /overseer_elect
   [junit4]   2> 1871215 INFO  (TEST-TestReqParamsAPI.test-seed#[FDFC00EBE9027634]) [n:127.0.0.1:48109_er_n%2Fiw    ] o.a.s.c.c.SolrZkClient makePath: /overseer_elect/election
   [junit4]   2> 1871216 INFO  (TEST-TestReqParamsAPI.test-seed#[FDFC00EBE9027634]) [n:127.0.0.1:48109_er_n%2Fiw    ] o.a.s.c.Overseer Overseer (id=null) closing
   [junit4]   2> 1871216 INFO  (TEST-TestReqParamsAPI.test-seed#[FDFC00EBE9027634]) [n:127.0.0.1:48109_er_n%2Fiw    ] o.a.s.c.LeaderElector Joined leadership election with path: /overseer_elect/election/95464015026847749-127.0.0.1:48109_er_n%2Fiw-n_0000000000
   [junit4]   2> 1871217 INFO  (TEST-TestReqParamsAPI.test-seed#[FDFC00EBE9027634]) [n:127.0.0.1:48109_er_n%2Fiw    ] o.a.s.c.OverseerElectionContext I am going to be the leader 127.0.0.1:48109_er_n%2Fiw
   [junit4]   2> 1871217 INFO  (TEST-TestReqParamsAPI.test-seed#[FDFC00EBE9027634]) [n:127.0.0.1:48109_er_n%2Fiw    ] o.a.s.c.c.SolrZkClient makePath: /overseer_elect/leader
   [junit4]   2> 1871218 INFO  (TEST-TestReqParamsAPI.test-seed#[FDFC00EBE9027634]) [n:127.0.0.1:48109_er_n%2Fiw    ] o.a.s.c.Overseer Overseer (id=95464015026847749-127.0.0.1:48109_er_n%2Fiw-n_0000000000) starting
   [junit4]   2> 1871219 INFO  (TEST-TestReqParamsAPI.test-seed#[FDFC00EBE9027634]) [n:127.0.0.1:48109_er_n%2Fiw    ] o.a.s.c.c.SolrZkClient makePath: /overseer/queue-work
   [junit4]   2> 1871224 INFO  (TEST-TestReqParamsAPI.test-seed#[FDFC00EBE9027634]) [n:127.0.0.1:48109_er_n%2Fiw    ] o.a.s.c.OverseerAutoReplicaFailoverThread Starting OverseerAutoReplicaFailoverThread autoReplicaFailoverWorkLoopDelay=10000 autoReplicaFailoverWaitAfterExpiration=30000 autoReplicaFailoverBadNodeExpiration=60000
   [junit4]   2> 1871229 INFO  (OverseerCollectionConfigSetProcessor-95464015026847749-127.0.0.1:48109_er_n%2Fiw-n_0000000000) [n:127.0.0.1:48109_er_n%2Fiw    ] o.a.s.c.OverseerTaskProcessor Process current queue of overseer operations
   [junit4]   2> 1871229 INFO  (TEST-TestReqParamsAPI.test-seed#[FDFC00EBE9027634]) [n:127.0.0.1:48109_er_n%2Fiw    ] o.a.s.c.c.ZkStateReader Updating cluster state from ZooKeeper... 
   [junit4]   2> 1871235 INFO  (OverseerStateUpdate-95464015026847749-127.0.0.1:48109_er_n%2Fiw-n_0000000000) [n:127.0.0.1:48109_er_n%2Fiw    ] o.a.s.c.Overseer Starting to work on the main queue
   [junit4]   2> 1871241 INFO  (TEST-TestReqParamsAPI.test-seed#[FDFC00EBE9027634]) [n:127.0.0.1:48109_er_n%2Fiw    ] o.a.s.c.c.ZkStateReader Updated live nodes from ZooKeeper... (0) -> (0)
   [junit4]   2> 1871242 INFO  (TEST-TestReqParamsAPI.test-seed#[FDFC00EBE9027634]) [n:127.0.0.1:48109_er_n%2Fiw    ] o.a.s.c.ZkController Register node as live in ZooKeeper:/live_nodes/127.0.0.1:48109_er_n%2Fiw
   [junit4]   2> 1871244 INFO  (OverseerStateUpdate-95464015026847749-127.0.0.1:48109_er_n%2Fiw-n_0000000000) [n:127.0.0.1:48109_er_n%2Fiw    ] o.a.s.c.c.ZkStateReader Updated live nodes from ZooKeeper... (0) -> (0)
   [junit4]   2> 1871244 INFO  (TEST-TestReqParamsAPI.test-seed#[FDFC00EBE9027634]) [n:127.0.0.1:48109_er_n%2Fiw    ] o.a.s.c.c.SolrZkClient makePath: /live_nodes/127.0.0.1:48109_er_n%2Fiw
   [junit4]   2> 1871245 INFO  (zkCallback-2457-thread-1-processing-n:127.0.0.1:48109_er_n%2Fiw) [n:127.0.0.1:48109_er_n%2Fiw    ] o.a.s.c.c.ZkStateReader A live node change: [WatchedEvent state:SyncConnected type:NodeChildrenChanged path:/live_nodes], has occurred - updating... (live nodes size: [0])
   [junit4]   2> 1871245 INFO  (zkCallback-2457-thread-1-processing-n:127.0.0.1:48109_er_n%2Fiw) [n:127.0.0.1:48109_er_n%2Fiw    ] o.a.s.c.c.ZkStateReader Updated live nodes from ZooKeeper... (0) -> (1)
   [junit4]   2> 1871258 INFO  (TEST-TestReqParamsAPI.test-seed#[FDFC00EBE9027634]) [n:127.0.0.1:48109_er_n%2Fiw    ] o.a.s.c.CoreContainer Security conf doesn't exist. Skipping setup for authorization module.
   [junit4]   2> 1871258 INFO  (TEST-TestReqParamsAPI.test-seed#[FDFC00EBE9027634]) [n:127.0.0.1:48109_er_n%2Fiw    ] o.a.s.c.CoreContainer No authentication plugin used.
   [junit4]   2> 1871259 INFO  (TEST-TestReqParamsAPI.test-seed#[FDFC00EBE9027634]) [n:127.0.0.1:48109_er_n%2Fiw    ] o.a.s.c.CorePropertiesLocator Looking for core definitions underneath /x1/jenkins/jenkins-slave/workspace/Lucene-Solr-Tests-trunk-Java8/solr/build/solr-core/test/J1/../../../../../../../../../../x1/jenkins/jenkins-slave/workspace/Lucene-Solr-Tests-trunk-Java8/solr/build/solr-core/test/J1/temp/solr.handler.TestReqParamsAPI_FDFC00EBE9027634-001/control-001/cores
   [junit4]   2> 1871260 INFO  (TEST-TestReqParamsAPI.test-seed#[FDFC00EBE9027634]) [n:127.0.0.1:48109_er_n%2Fiw    ] o.a.s.c.CoreDescriptor Created CoreDescriptor: {name=collection1, config=solrconfig.xml, transient=false, schema=schema.xml, loadOnStartup=true, configSetProperties=configsetprops.json, collection=control_collection, coreNodeName=, dataDir=data/, shard=}
   [junit4]   2> 1871260 INFO  (TEST-TestReqParamsAPI.test-seed#[FDFC00EBE9027634]) [n:127.0.0.1:48109_er_n%2Fiw    ] o.a.s.c.CorePropertiesLocator Found core collection1 in /x1/jenkins/jenkins-slave/workspace/Lucene-Solr-Tests-trunk-Java8/solr/build/solr-core/test/J1/../../../../../../../../../../x1/jenkins/jenkins-slave/workspace/Lucene-Solr-Tests-trunk-Java8/solr/build/solr-core/test/J1/temp/solr.handler.TestReqParamsAPI_FDFC00EBE9027634-001/control-001/cores/collection1
   [junit4]   2> 1871260 INFO  (TEST-TestReqParamsAPI.test-seed#[FDFC00EBE9027634]) [n:127.0.0.1:48109_er_n%2Fiw    ] o.a.s.c.CorePropertiesLocator Found 1 core definitions
   [junit4]   2> 1871261 INFO  (coreLoadExecutor-6138-thread-1-processing-n:127.0.0.1:48109_er_n%2Fiw) [n:127.0.0.1:48109_er_n%2Fiw c:control_collection   x:collection1] o.a.s.c.ZkController publishing state=down
   [junit4]   2> 1871261 INFO  (coreLoadExecutor-6138-thread-1-processing-n:127.0.0.1:48109_er_n%2Fiw) [n:127.0.0.1:48109_er_n%2Fiw c:control_collection   x:collection1] o.a.s.c.ZkController numShards not found on descriptor - reading it from system property
   [junit4]   2> 1871263 INFO  (coreLoadExecutor-6138-thread-1-processing-n:127.0.0.1:48109_er_n%2Fiw) [n:127.0.0.1:48109_er_n%2Fiw c:control_collection   x:collection1] o.a.s.c.ZkController look for our core node name
   [junit4]   2> 1871269 INFO  (TEST-TestReqParamsAPI.test-seed#[FDFC00EBE9027634]) [n:127.0.0.1:48109_er_n%2Fiw    ] o.a.s.s.SolrDispatchFilter user.dir=/x1/jenkins/jenkins-slave/workspace/Lucene-Solr-Tests-trunk-Java8/solr/build/solr-core/test/J1
   [junit4]   2> 1871269 INFO  (TEST-TestReqParamsAPI.test-seed#[FDFC00EBE9027634]) [n:127.0.0.1:48109_er_n%2Fiw    ] o.a.s.s.SolrDispatchFilter SolrDispatchFilter.init() done
   [junit4]   2> 1871269 INFO  (OverseerStateUpdate-95464015026847749-127.0.0.1:48109_er_n%2Fiw-n_0000000000) [n:127.0.0.1:48109_er_n%2Fiw    ] o.a.s.c.Overseer processMessage: queueSize: 1, message = {
   [junit4]   2>   "core":"collection1",
   [junit4]   2>   "roles":null,
   [junit4]   2>   "base_url":"https://127.0.0.1:48109/er_n/iw",
   [junit4]   2>   "node_name":"127.0.0.1:48109_er_n%2Fiw",
   [junit4]   2>   "numShards":"1",
   [junit4]   2>   "state":"down",
   [junit4]   2>   "shard":null,
   [junit4]   2>   "collection":"control_collection",
   [junit4]   2>   "operation":"state"} current state version: 0
   [junit4]   2> 1871270 INFO  (OverseerStateUpdate-95464015026847749-127.0.0.1:48109_er_n%2Fiw-n_0000000000) [n:127.0.0.1:48109_er_n%2Fiw    ] o.a.s.c.o.ReplicaMutator Update state numShards=1 message={
   [junit4]   2>   "core":"collection1",
   [junit4]   2>   "roles":null,
   [junit4]   2>   "base_url":"https://127.0.0.1:48109/er_n/iw",
   [junit4]   2>   "node_name":"127.0.0.1:48109_er_n%2Fiw",
   [junit4]   2>   "numShards":"1",
   [junit4]   2>   "state":"down",
   [junit4]   2>   "shard":null,
   [junit4]   2>   "collection":"control_collection",
   [junit4]   2>   "operation":"state"}
   [junit4]   2> 1871270 INFO  (OverseerStateUpdate-95464015026847749-127.0.0.1:48109_er_n%2Fiw-n_0000000000) [n:127.0.0.1:48109_er_n%2Fiw    ] o.a.s.c.o.ClusterStateMutator building a new cName: control_collection
   [junit4]   2> 1871271 INFO  (OverseerStateUpdate-95464015026847749-127.0.0.1:48109_er_n%2Fiw-n_0000000000) [n:127.0.0.1:48109_er_n%2Fiw    ] o.a.s.c.o.ReplicaMutator Assigning new node to shard shard=shard1
   [junit4]   2> 1871277 INFO  (zkCallback-2457-thread-1-processing-n:127.0.0.1:48109_er_n%2Fiw) [n:127.0.0.1:48109_er_n%2Fiw    ] o.a.s.c.c.ZkStateReader A cluster state change: [WatchedEvent state:SyncConnected type:NodeDataChanged path:/clusterstate.json], has occurred - updating... (live nodes size: [1])
   [junit4]   2> 1872263 INFO  (coreLoadExecutor-6138-thread-1-processing-n:127.0.0.1:48109_er_n%2Fiw) [n:127.0.0.1:48109_er_n%2Fiw c:control_collection   x:collection1] o.a.s.c.ZkController waiting to find shard id in clusterstate for collection1
   [junit4]   2> 1872263 INFO  (coreLoadExecutor-6138-thread-1-processing-n:127.0.0.1:48109_er_n%2Fiw) [n:127.0.0.1:48109_er_n%2Fiw c:control_collection   x:collection1] o.a.s.c.ZkController Check for collection zkNode:control_collection
   [junit4]   2> 1872264 INFO  (coreLoadExecutor-6138-thread-1-processing-n:127.0.0.1:48109_er_n%2Fiw) [n:127.0.0.1:48109_er_n%2Fiw c:control_collection   x:collection1] o.a.s.c.ZkController Collection zkNode exists
   [junit4]   2> 1872264 INFO  (coreLoadExecutor-6138-thread-1-processing-n:127.0.0.1:48109_er_n%2Fiw) [n:127.0.0.1:48109_er_n%2Fiw c:control_collection   x:collection1] o.a.s.c.c.ZkStateReader Load collection config from: [/collections/control_collection]
   [junit4]   2> 1872264 INFO  (coreLoadExecutor-6138-thread-1-processing-n:127.0.0.1:48109_er_n%2Fiw) [n:127.0.0.1:48109_er_n%2Fiw c:control_collection   x:collection1] o.a.s.c.c.ZkStateReader path=[/collections/control_collection] [configName]=[conf1] specified config exists in ZooKeeper
   [junit4]   2> 1872264 INFO  (coreLoadExecutor-6138-thread-1-processing-n:127.0.0.1:48109_er_n%2Fiw) [n:127.0.0.1:48109_er_n%2Fiw c:control_collection   x:collection1] o.a.s.c.SolrResourceLoader new SolrResourceLoader for directory: '/x1/jenkins/jenkins-slave/workspace/Lucene-Solr-Tests-trunk-Java8/solr/build/solr-core/test/J1/temp/solr.handler.TestReqParamsAPI_FDFC00EBE9027634-001/control-001/cores/collection1'
   [junit4]   2> 1872265 INFO  (coreLoadExecutor-6138-thread-1-processing-n:127.0.0.1:48109_er_n%2Fiw) [n:127.0.0.1:48109_er_n%2Fiw c:control_collection   x:collection1] o.a.s.c.SolrResourceLoader JNDI not configured for solr (NoInitialContextEx)
   [junit4]   2> 1872265 INFO  (coreLoadExecutor-6138-thread-1-processing-n:127.0.0.1:48109_er_n%2Fiw) [n:127.0.0.1:48109_er_n%2Fiw c:control_collection   x:collection1] o.a.s.c.SolrResourceLoader solr home defaulted to 'solr/' (could not find system property or JNDI)
   [junit4]   2> 1872266 INFO  (coreLoadExecutor-6138-thread-1-processing-n:127.0.0.1:48109_er_n%2Fiw) [n:127.0.0.1:48109_er_n%2Fiw c:control_collection   x:collection1] o.a.s.c.Config loaded config solrconfig.xml with version 0 
   [junit4]   2> 1872302 INFO  (coreLoadExecutor-6138-thread-1-processing-n:127.0.0.1:48109_er_n%2Fiw) [n:127.0.0.1:48109_er_n%2Fiw c:control_collection   x:collection1] o.a.s.c.SolrConfig current version of requestparams : -1
   [junit4]   2> 1872305 WARN  (coreLoadExecutor-6138-thread-1-processing-n:127.0.0.1:48109_er_n%2Fiw) [n:127.0.0.1:48109_er_n%2Fiw c:control_collection   x:collection1] o.a.s.c.Config Beginning with Solr 5.5, <mergePolicy> is deprecated, use <mergePolicyFactory> instead.
   [junit4]   2> 1872315 INFO  (coreLoadExecutor-6138-thread-1-processing-n:127.0.0.1:48109_er_n%2Fiw) [n:127.0.0.1:48109_er_n%2Fiw c:control_collection   x:collection1] o.a.s.c.SolrConfig Using Lucene MatchVersion: 6.0.0
   [junit4]   2> 1872326 INFO  (coreLoadExecutor-6138-thread-1-processing-n:127.0.0.1:48109_er_n%2Fiw) [n:127.0.0.1:48109_er_n%2Fiw c:control_collection   x:collection1] o.a.s.c.SolrConfig Loaded SolrConfig: solrconfig.xml
   [junit4]   2> 1872333 INFO  (coreLoadExecutor-6138-thread-1-processing-n:127.0.0.1:48109_er_n%2Fiw) [n:127.0.0.1:48109_er_n%2Fiw c:control_collection   x:collection1] o.a.s.s.IndexSchema [collection1] Schema name=test
   [junit4]   2> 1872456 INFO  (coreLoadExecutor-6138-thread-1-processing-n:127.0.0.1:48109_er_n%2Fiw) [n:127.0.0.1:48109_er_n%2Fiw c:control_collection   x:collection1] o.a.s.s.OpenExchangeRatesOrgProvider Initialized with rates=open-exchange-rates.json, refreshInterval=1440.
   [junit4]   2> 1872463 INFO  (coreLoadExecutor-6138-thread-1-processing-n:127.0.0.1:48109_er_n%2Fiw) [n:127.0.0.1:48109_er_n%2Fiw c:control_collection   x:collection1] o.a.s.s.IndexSchema default search field in schema is text
   [junit4]   2> 1872464 INFO  (coreLoadExecutor-6138-thread-1-processing-n:127.0.0.1:48109_er_n%2Fiw) [n:127.0.0.1:48109_er_n%2Fiw c:control_collection   x:collection1] o.a.s.s.IndexSchema unique key field: id
   [junit4]   2> 1872471 INFO  (coreLoadExecutor-6138-thread-1-processing-n:127.0.0.1:48109_er_n%2Fiw) [n:127.0.0.1:48109_er_n%2Fiw c:control_collection   x:collection1] o.a.s.s.FileExchangeRateProvider Reloading exchange rates from file currency.xml
   [junit4]   2> 1872475 INFO  (coreLoadExecutor-6138-thread-1-processing-n:127.0.0.1:48109_er_n%2Fiw) [n:127.0.0.1:48109_er_n%2Fiw c:control_collection   x:collection1] o.a.s.s.FileExchangeRateProvider Reloading exchange rates from file currency.xml
   [junit4]   2> 1872477 INFO  (coreLoadExecutor-6138-thread-1-processing-n:127.0.0.1:48109_er_n%2Fiw) [n:127.0.0.1:48109_er_n%2Fiw c:control_collection   x:collection1] o.a.s.s.OpenExchangeRatesOrgProvider Reloading exchange rates from open-exchange-rates.json
   [junit4]   2> 1872478 INFO  (coreLoadExecutor-6138-thread-1-processing-n:127.0.0.1:48109_er_n%2Fiw) [n:127.0.0.1:48109_er_n%2Fiw c:control_collection   x:collection1] o.a.s.s.OpenExchangeRatesOrgProvider Reloading exchange rates from open-exchange-rates.json
   [junit4]   2> 1872479 INFO  (coreLoadExecutor-6138-thread-1-processing-n:127.0.0.1:48109_er_n%2Fiw) [n:127.0.0.1:48109_er_n%2Fiw c:control_collection   x:collection1] o.a.s.c.ConfigSetProperties Did not find ConfigSet properties, assuming default properties: Can't find resource 'configsetprops.json' in classpath or '/configs/conf1', cwd=/x1/jenkins/jenkins-slave/workspace/Lucene-Solr-Tests-trunk-Java8/solr/build/solr-core/test/J1
   [junit4]   2> 1872479 INFO  (coreLoadExecutor-6138-thread-1-processing-n:127.0.0.1:48109_er_n%2Fiw) [n:127.0.0.1:48109_er_n%2Fiw c:control_collection   x:collection1] o.a.s.c.CoreContainer Creating SolrCore 'collection1' using configuration from collection control_collection
   [junit4]   2> 1872479 INFO  (coreLoadExecutor-6138-thread-1-processing-n:127.0.0.1:48109_er_n%2Fiw) [n:127.0.0.1:48109_er_n%2Fiw c:control_collection s:shard1 r:core_node1 x:collection1] o.a.s.c.SolrCore org.apache.solr.core.MockDirectoryFactory
   [junit4]   2> 1872479 INFO  (coreLoadExecutor-6138-thread-1-processing-n:127.0.0.1:48109_er_n%2Fiw) [n:127.0.0.1:48109_er_n%2Fiw c:control_collection s:shard1 r:core_node1 x:collection1] o.a.s.c.SolrCore [[collection1] ] Opening new SolrCore at [/x1/jenkins/jenkins-slave/workspace/Lucene-Solr-Tests-trunk-Java8/solr/build/solr-core/test/J1/temp/solr.handler.TestReqParamsAPI_FDFC00EBE9027634-001/control-001/cores/collection1], dataDir=[/x1/jenkins/jenkins-slave/workspace/Lucene-Solr-Tests-trunk-Java8/solr/build/solr-core/test/J1/../../../../../../../../../../x1/jenkins/jenkins-slave/workspace/Lucene-Solr-Tests-trunk-Java8/solr/build/solr-core/test/J1/temp/solr.handler.TestReqParamsAPI_FDFC00EBE9027634-001/control-001/cores/collection1/data/]
   [junit4]   2> 1872480 INFO  (coreLoadExecutor-6138-thread-1-processing-n:127.0.0.1:48109_er_n%2Fiw) [n:127.0.0.1:48109_er_n%2Fiw c:control_collection s:shard1 r:core_node1 x:collection1] o.a.s.c.JmxMonitoredMap JMX monitoring is enabled. Adding Solr mbeans to JMX Server: com.sun.jmx.mbeanserver.JmxMBeanServer@4f7e4a82
   [junit4]   2> 1872480 INFO  (coreLoadExecutor-6138-thread-1-processing-n:127.0.0.1:48109_er_n%2Fiw) [n:127.0.0.1:48109_er_n%2Fiw c:control_collection s:shard1 r:core_node1 x:collection1] o.a.s.c.CachingDirectoryFactory return new directory for /x1/jenkins/jenkins-slave/workspace/Lucene-Solr-Tests-trunk-Java8/solr/build/solr-core/test/J1/../../../../../../../../../../x1/jenkins/jenkins-slave/workspace/Lucene-Solr-Tests-trunk-Java8/solr/build/solr-core/test/J1/temp/solr.handler.TestReqParamsAPI_FDFC00EBE9027634-001/control-001/cores/collection1/data
   [junit4]   2> 1872480 INFO  (coreLoadExecutor-6138-thread-1-processing-n:127.0.0.1:48109_er_n%2Fiw) [n:127.0.0.1:48109_er_n%2Fiw c:control_collection s:shard1 r:core_node1 x:collection1] o.a.s.c.SolrCore New index directory detected: old=null new=/x1/jenkins/jenkins-slave/workspace/Lucene-Solr-Tests-trunk-Java8/solr/build/solr-core/test/J1/../../../../../../../../../../x1/jenkins/jenkins-slave/workspace/Lucene-Solr-Tests-trunk-Java8/solr/build/solr-core/test/J1/temp/solr.handler.TestReqParamsAPI_FDFC00EBE9027634-001/control-001/cores/collection1/data/index/
   [junit4]   2> 1872480 WARN  (coreLoadExecutor-6138-thread-1-processing-n:127.0.0.1:48109_er_n%2Fiw) [n:127.0.0.1:48109_er_n%2Fiw c:control_collection s:shard1 r:core_node1 x:collection1] o.a.s.c.SolrCore [collection1] Solr index directory '/x1/jenkins/jenkins-slave/workspace/Lucene-Solr-Tests-trunk-Java8/solr/build/solr-core/test/J1/../../../../../../../../../../x1/jenkins/jenkins-slave/workspace/Lucene-Solr-Tests-trunk-Java8/solr/build/solr-core/test/J1/temp/solr.handler.TestReqParamsAPI_FDFC00EBE9027634-001/control-001/cores/collection1/data/index' doesn't exist. Creating new index...
   [junit4]   2> 1872481 INFO  (coreLoadExecutor-6138-thread-1-processing-n:127.0.0.1:48109_er_n%2Fiw) [n:127.0.0.1:48109_er_n%2Fiw c:control_collection s:shard1 r:core_node1 x:collection1] o.a.s.c.CachingDirectoryFactory return new directory for /x1/jenkins/jenkins-slave/workspace/Lucene-Solr-Tests-trunk-Java8/solr/build/solr-core/test/J1/../../../../../../../../../../x1/jenkins/jenkins-slave/workspace/Lucene-Solr-Tests-trunk-Java8/solr/build/solr-core/test/J1/temp/solr.handler.TestReqParamsAPI_FDFC00EBE9027634-001/control-001/cores/collection1/data/index
   [junit4]   2> 1872481 INFO  (coreLoadExecutor-6138-thread-1-processing-n:127.0.0.1:48109_er_n%2Fiw) [n:127.0.0.1:48109_er_n%2Fiw c:control_collection s:shard1 r:core_node1 x:collection1] o.a.s.u.RandomMergePolicy RandomMergePolicy wrapping class org.apache.lucene.index.AlcoholicMergePolicy: [AlcoholicMergePolicy: minMergeSize=0, mergeFactor=10, maxMergeSize=1278737577, maxMergeSizeForForcedMerge=9223372036854775807, calibrateSizeByDeletes=true, maxMergeDocs=2147483647, maxCFSSegmentSizeMB=8.796093022207999E12, noCFSRatio=0.1]
   [junit4]   2> 1872481 INFO  (coreLoadExecutor-6138-thread-1-processing-n:127.0.0.1:48109_er_n%2Fiw) [n:127.0.0.1:48109_er_n%2Fiw c:control_collection s:shard1 r:core_node1 x:collection1] o.a.s.c.SolrDeletionPolicy SolrDeletionPolicy.onCommit: commits: num=1
   [junit4]   2> 	commit{dir=MockDirectoryWrapper(RAMDirectory@6b6282a4 lockFactory=org.apache.lucene.store.SingleInstanceLockFactory@456a4c41),segFN=segments_1,generation=1}
   [junit4]   2> 1872481 INFO  (coreLoadExecutor-6138-thread-1-processing-n:127.0.0.1:48109_er_n%2Fiw) [n:127.0.0.1:48109_er_n%2Fiw c:control_collection s:shard1 r:core_node1 x:collection1] o.a.s.c.SolrDeletionPolicy newest commit generation = 1
   [junit4]   2> 1872484 INFO  (coreLoadExecutor-6138-thread-1-processing-n:127.0.0.1:48109_er_n%2Fiw) [n:127.0.0.1:48109_er_n%2Fiw c:control_collection s:shard1 r:core_node1 x:collection1] o.a.s.u.p.UpdateRequestProcessorChain creating updateRequestProcessorChain "nodistrib"
   [junit4]   2> 1872484 INFO  (coreLoadExecutor-6138-thread-1-processing-n:127.0.0.1:48109_er_n%2Fiw) [n:127.0.0.1:48109_er_n%2Fiw c:control_collection s:shard1 r:core_node1 x:collection1] o.a.s.u.p.UpdateRequestProcessorChain creating updateRequestProcessorChain "dedupe"
   [junit4]   2> 1872484 INFO  (coreLoadExecutor-6138-thread-1-processing-n:127.0.0.1:48109_er_n%2Fiw) [n:127.0.0.1:48109_er_n%2Fiw c:control_collection s:shard1 r:core_node1 x:collection1] o.a.s.u.p.UpdateRequestProcessorChain inserting DistributedUpdateProcessorFactory into updateRequestProcessorChain "dedupe"
   [junit4]   2> 1872485 INFO  (coreLoadExecutor-6138-thread-1-processing-n:127.0.0.1:48109_er_n%2Fiw) [n:127.0.0.1:48109_er_n%2Fiw c:control_collection s:shard1 r:core_node1 x:collection1] o.a.s.u.p.UpdateRequestProcessorChain creating updateRequestProcessorChain "stored_sig"
   [junit4]   2> 1872485 INFO  (coreLoadExecutor-6138-thread-1-processing-n:127.0.0.1:48109_er_n%2Fiw) [n:127.0.0.1:48109_er_n%2Fiw c:control_collection s:shard1 r:core_node1 x:collection1] o.a.s.u.p.UpdateRequestProcessorChain inserting DistributedUpdateProcessorFactory into updateRequestProcessorChain "stored_sig"
   [junit4]   2> 1872485 INFO  (coreLoadExecutor-6138-thread-1-processing-n:127.0.0.1:48109_er_n%2Fiw) [n:127.0.0.1:48109_er_n%2Fiw c:control_collection s:shard1 r:core_node1 x:collection1] o.a.s.u.p.UpdateRequestProcessorChain creating updateRequestProcessorChain "distrib-dup-test-chain-explicit"
   [junit4]   2> 1872485 INFO  (coreLoadExecutor-6138-thread-1-processing-n:127.0.0.1:48109_er_n%2Fiw) [n:127.0.0.1:48109_er_n%2Fiw c:control_collection s:shard1 r:core_node1 x:collection1] o.a.s.u.p.UpdateRequestProcessorChain creating updateRequestProcessorChain "distrib-dup-test-chain-implicit"
   [junit4]   2> 1872485 INFO  (coreLoadExecutor-6138-thread-1-processing-n:127.0.0.1:48109_er_n%2Fiw) [n:127.0.0.1:48109_er_n%2Fiw c:control_collection s:shard1 r:core_node1 x:collection1] o.a.s.u.p.UpdateRequestProcessorChain inserting DistributedUpdateProcessorFactory into updateRequestProcessorChain "distrib-dup-test-chain-implicit"
   [junit4]   2> 1872485 INFO  (coreLoadExecutor-6138-thread-1-processing-n:127.0.0.1:48109_er_n%2Fiw) [n:127.0.0.1:48109_er_n%2Fiw c:control_collection s:shard1 r:core_node1 x:collection1] o.a.s.c.SolrCore no updateRequestProcessorChain defined as default, creating implicit default
   [junit4]   2> 1872485 WARN  (coreLoadExecutor-6138-thread-1-processing-n:127.0.0.1:48109_er_n%2Fiw) [n:127.0.0.1:48109_er_n%2Fiw c:control_collection s:shard1 r:core_node1 x:collection1] o.a.s.c.RequestHandlers INVALID paramSet a in requestHandler {type = requestHandler,name = /dump,class = DumpRequestHandler,args = {defaults={a=A,b=B}}}
   [junit4]   2> 1872487 INFO  (coreLoadExecutor-6138-thread-1-processing-n:127.0.0.1:48109_er_n%2Fiw) [n:127.0.0.1:48109_er_n%2Fiw c:control_collection s:shard1 r:core_node1 x:collection1] o.a.s.h.l.XMLLoader xsltCacheLifetimeSeconds=60
   [junit4]   2> 1872488 INFO  (coreLoadExecutor-6138-thread-1-processing-n:127.0.0.1:48109_er_n%2Fiw) [n:127.0.0.1:48109_er_n%2Fiw c:control_collection s:shard1 r:core_node1 x:collection1] o.a.s.h.l.XMLLoader xsltCacheLifetimeSeconds=60
   [junit4]   2> 1872489 INFO  (coreLoadExecutor-6138-thread-1-processing-n:127.0.0.1:48109_er_n%2Fiw) [n:127.0.0.1:48109_er_n%2Fiw c:control_collection s:shard1 r:core_node1 x:collection1] o.a.s.h.l.XMLLoader xsltCacheLifetimeSeconds=60
   [junit4]   2> 1872489 INFO  (OldIndexDirectoryCleanupThreadForCore-collection1) [n:127.0.0.1:48109_er_n%2Fiw c:control_collection s:shard1 r:core_node1 x:collection1] o.a.s.c.SolrCore Looking for old index directories to cleanup for core collection1 in /x1/jenkins/jenkins-slave/workspace/Lucene-Solr-Tests-trunk-Java8/solr/build/solr-core/test/J1/../../../../../../../../../../x1/jenkins/jenkins-slave/workspace/Lucene-Solr-Tests-trunk-Java8/solr/build/solr-core/test/J1/temp/solr.handler.TestReqParamsAPI_FDFC00EBE9027634-001/control-001/cores/collection1/data/
   [junit4]   2> 1872490 WARN  (OldIndexDirectoryCleanupThreadForCore-collection1) [n:127.0.0.1:48109_er_n%2Fiw c:control_collection s:shard1 r:core_node1 x:collection1] o.a.s.c.DirectoryFactory /x1/jenkins/jenkins-slave/workspace/Lucene-Solr-Tests-trunk-Java8/solr/build/solr-core/test/J1/../../../../../../../../../../x1/jenkins/jenkins-slave/workspace/Lucene-Solr-Tests-trunk-Java8/solr/build/solr-core/test/J1/temp/solr.handler.TestReqParamsAPI_FDFC00EBE9027634-001/control-001/cores/collection1/data/ does not point to a valid data directory; skipping clean-up of old index directories.
   [junit4]   2> 1872490 INFO  (coreLoadExecutor-6138-thread-1-processing-n:127.0.0.1:48109_er_n%2Fiw) [n:127.0.0.1:48109_er_n%2Fiw c:control_collection s:shard1 r:core_node1 x:collection1] o.a.s.h.l.XMLLoader xsltCacheLifetimeSeconds=60
   [junit4]   2> 1872493 INFO  (coreLoadExecutor-6138-thread-1-processing-n:127.0.0.1:48109_er_n%2Fiw) [n:127.0.0.1:48109_er_n%2Fiw c:control_collection s:shard1 r:core_node1 x:collection1] o.a.s.c.RequestHandlers Registered paths: /admin/mbeans,standard,/dump,/update/csv,/sql,/update/json/docs,/admin/luke,/export,/admin/segments,/get,/admin/system,/replication,/admin/properties,/config,/stream,/schema,/admin/plugins,/admin/logging,/update/json,/admin/ping,/admin/threads,/update,/admin/file
   [junit4]   2> 1872494 INFO  (coreLoadExecutor-6138-thread-1-processing-n:127.0.0.1:48109_er_n%2Fiw) [n:127.0.0.1:48109_er_n%2Fiw c:control_collection s:shard1 r:core_node1 x:collection1] o.a.s.c.SolrCore Using default statsCache cache: org.apache.solr.search.stats.LocalStatsCache
   [junit4]   2> 1872499 INFO  (coreLoadExecutor-6138-thread-1-processing-n:127.0.0.1:48109_er_n%2Fiw) [n:127.0.0.1:48109_er_n%2Fiw c:control_collection s:shard1 r:core_node1 x:collection1] o.a.s.u.UpdateHandler Using UpdateLog implementation: org.apache.solr.update.UpdateLog
   [junit4]   2> 1872499 INFO  (coreLoadExecutor-6138-thread-1-processing-n:127.0.0.1:48109_er_n%2Fiw) [n:127.0.0.1:48109_er_n%2Fiw c:control_collection s:shard1 r:core_node1 x:collection1] o.a.s.u.UpdateLog Initializing UpdateLog: dataDir= defaultSyncLevel=FLUSH numRecordsToKeep=100 maxNumLogsToKeep=10 numVersionBuckets=65536
   [junit4]   2> 1872499 INFO  (coreLoadExecutor-6138-thread-1-processing-n:127.0.0.1:48109_er_n%2Fiw) [n:127.0.0.1:48109_er_n%2Fiw c:control_collection s:shard1 r:core_node1 x:collection1] o.a.s.u.CommitTracker Hard AutoCommit: disabled
   [junit4]   2> 1872500 INFO  (coreLoadExecutor-6138-thread-1-processing-n:127.0.0.1:48109_er_n%2Fiw) [n:127.0.0.1:48109_er_n%2Fiw c:control_collection s:shard1 r:core_node1 x:collection1] o.a.s.u.CommitTracker Soft AutoCommit: disabled
   [junit4]   2> 1872500 INFO  (coreLoadExecutor-6138-thread-1-processing-n:127.0.0.1:48109_er_n%2Fiw) [n:127.0.0.1:48109_er_n%2Fiw c:control_collection s:shard1 r:core_node1 x:collection1] o.a.s.u.RandomMergePolicy RandomMergePolicy wrapping class org.apache.lucene.index.MockRandomMergePolicy: org.apache.lucene.index.MockRandomMergePolicy@79b5a65b
   [junit4]   2> 1872500 INFO  (coreLoadExecutor-6138-thread-1-processing-n:127.0.0.1:48109_er_n%2Fiw) [n:127.0.0.1:48109_er_n%2Fiw c:control_collection s:shard1 r:core_node1 x:collection1] o.a.s.c.SolrDeletionPolicy SolrDeletionPolicy.onInit: commits: num=1
   [junit4]   2> 	commit{dir=MockDirectoryWrapper(RAMDirectory@6b6282a4 lockFactory=org.apache.lucene.store.SingleInstanceLockFactory@456a4c41),segFN=segments_1,generation=1}
   [junit4]   2> 1872500 INFO  (coreLoadExecutor-6138-thread-1-processing-n:127.0.0.1:48109_er_n%2Fiw) [n:127.0.0.1:48109_er_n%2Fiw c:control_collection s:shard1 r:core_node1 x:collection1] o.a.s.c.SolrDeletionPolicy newest commit generation = 1
   [junit4]   2> 1872500 INFO  (coreLoadExecutor-6138-thread-1-processing-n:127.0.0.1:48109_er_n%2Fiw) [n:127.0.0.1:48109_er_n%2Fiw c:control_collection s:shard1 r:core_node1 x:collection1] o.a.s.s.SolrIndexSearcher Opening [Searcher@ad36ba2[collection1] main]
   [junit4]   2> 1872501 INFO  (coreLoadExecutor-6138-thread-1-processing-n:127.0.0.1:48109_er_n%2Fiw) [n:127.0.0.1:48109_er_n%2Fiw c:control_collection s:shard1 r:core_node1 x:collection1] o.a.s.c.c.ZkStateReader Load collection config from: [/collections/control_collection]
   [junit4]   2> 1872501 INFO  (coreLoadExecutor-6138-thread-1-processing-n:127.0.0.1:48109_er_n%2Fiw) [n:127.0.0.1:48109_er_n%2Fiw c:control_collection s:shard1 r:core_node1 x:collection1] o.a.s.c.c.ZkStateReader path=[/collections/control_collection] [configName]=[conf1] specified config exists in ZooKeeper
   [junit4]   2> 1872501 INFO  (coreLoadExecutor-6138-thread-1-processing-n:127.0.0.1:48109_er_n%2Fiw) [n:127.0.0.1:48109_er_n%2Fiw c:control_collection s:shard1 r:core_node1 x:collection1] o.a.s.r.ManagedResourceStorage Setting up ZooKeeper-based storage for the RestManager with znodeBase: /configs/conf1
   [junit4]   2> 1872502 INFO  (coreLoadExecutor-6138-thread-1-processing-n:127.0.0.1:48109_er_n%2Fiw) [n:127.0.0.1:48109_er_n%2Fiw c:control_collection s:shard1 r:core_node1 x:collection1] o.a.s.r.ManagedResourceStorage Configured ZooKeeperStorageIO with znodeBase: /configs/conf1
   [junit4]   2> 1872502 INFO  (coreLoadExecutor-6138-thread-1-processing-n:127.0.0.1:48109_er_n%2Fiw) [n:127.0.0.1:48109_er_n%2Fiw c:control_collection s:shard1 r:core_node1 x:collection1] o.a.s.r.RestManager Initializing RestManager with initArgs: {}
   [junit4]   2> 1872502 INFO  (coreLoadExecutor-6138-thread-1-processing-n:127.0.0.1:48109_er_n%2Fiw) [n:127.0.0.1:48109_er_n%2Fiw c:control_collection s:shard1 r:core_node1 x:collection1] o.a.s.r.ManagedResourceStorage Reading _rest_managed.json using ZooKeeperStorageIO:path=/configs/conf1
   [junit4]   2> 1872502 INFO  (coreLoadExecutor-6138-thread-1-processing-n:127.0.0.1:48109_er_n%2Fiw) [n:127.0.0.1:48109_er_n%2Fiw c:control_collection s:shard1 r:core_node1 x:collection1] o.a.s.r.ManagedResourceStorage No data found for znode /configs/conf1/_rest_managed.json
   [junit4]   2> 1872502 INFO  (coreLoadExecutor-6138-thread-1-processing-n:127.0.0.1:48109_er_n%2Fiw) [n:127.0.0.1:48109_er_n%2Fiw c:control_collection s:shard1 r:core_node1 x:collection1] o.a.s.r.ManagedResourceStorage Loaded null at path _rest_managed.json using ZooKeeperStorageIO:path=/configs/conf1
   [junit4]   2> 1872502 INFO  (coreLoadExecutor-6138-thread-1-processing-n:127.0.0.1:48109_er_n%2Fiw) [n:127.0.0.1:48109_er_n%2Fiw c:control_collection s:shard1 r:core_node1 x:collection1] o.a.s.r.RestManager Initializing 0 registered ManagedResources
   [junit4]   2> 1872503 INFO  (coreLoadExecutor-6138-thread-1-processing-n:127.0.0.1:48109_er_n%2Fiw) [n:127.0.0.1:48109_er_n%2Fiw c:control_collection s:shard1 r:core_node1 x:collection1] o.a.s.h.ReplicationHandler Commits will be reserved for  10000
   [junit4]   2> 1872503 INFO  (searcherExecutor-6139-thread-1-processing-n:127.0.0.1:48109_er_n%2Fiw x:collection1 s:shard1 c:control_collection r:core_node1) [n:127.0.0.1:48109_er_n%2Fiw c:control_collection s:shard1 r:core_node1 x:collection1] o.a.s.c.SolrCore [collection1] Registered new searcher Searcher@ad36ba2[collection1] main{ExitableDirectoryReader(UninvertingDirectoryReader())}
   [junit4]   2> 1872503 INFO  (coreLoadExecutor-6138-thread-1-processing-n:127.0.0.1:48109_er_n%2Fiw) [n:127.0.0.1:48109_er_n%2Fiw c:control_collection s:shard1 r:core_node1 x:collection1] o.a.s.u.UpdateLog Looking up max value of version field to seed version buckets
   [junit4]   2> 1872504 INFO  (coreLoadExecutor-6138-thread-1-processing-n:127.0.0.1:48109_er_n%2Fiw) [n:127.0.0.1:48109_er_n%2Fiw c:control_collection s:shard1 r:core_node1 x:collection1] o.a.s.u.VersionInfo Refreshing highest value of _version_ for 65536 version buckets from index
   [junit4]   2> 1872504 INFO  (coreLoadExecutor-6138-thread-1-processing-n:127.0.0.1:48109_er_n%2Fiw) [n:127.0.0.1:48109_er_n%2Fiw c:control_collection s:shard1 r:core_node1 x:collection1] o.a.s.u.VersionInfo No terms found for _version_, cannot seed version bucket highest value from index
   [junit4]   2> 1872504 INFO  (coreLoadExecutor-6138-thread-1-processing-n:127.0.0.1:48109_er_n%2Fiw) [n:127.0.0.1:48109_er_n%2Fiw c:control_collection s:shard1 r:core_node1 x:collection1] o.a.s.u.UpdateLog Could not find max version in index or recent updates, using new clock 1527424242235211776
   [junit4]   2> 1872506 INFO  (coreLoadExecutor-6138-thread-1-processing-n:127.0.0.1:48109_er_n%2Fiw) [n:127.0.0.1:48109_er_n%2Fiw c:control_collection s:shard1 r:core_node1 x:collection1] o.a.s.u.UpdateLog Took 2.0ms to seed version buckets with highest version 1527424242235211776
   [junit4]   2> 1872507 INFO  (coreLoadExecutor-6138-thread-1-processing-n:127.0.0.1:48109_er_n%2Fiw) [n:127.0.0.1:48109_er_n%2Fiw c:control_collection s:shard1 r:core_node1 x:collection1] o.a.s.c.ZkController watch zkdir /configs/conf1
   [junit4]   2> 1872507 INFO  (coreLoadExecutor-6138-thread-1-processing-n:127.0.0.1:48109_er_n%2Fiw) [n:127.0.0.1:48109_er_n%2Fiw c:control_collection s:shard1 r:core_node1 x:collection1] o.a.s.c.CoreContainer registering core: collection1
   [junit4]   2> 1872508 INFO  (coreZkRegister-6132-thread-1-processing-n:127.0.0.1:48109_er_n%2Fiw x:collection1 s:shard1 c:control_collection r:core_node1) [n:127.0.0.1:48109_er_n%2Fiw c:control_collection s:shard1 r:core_node1 x:collection1] o.a.s.c.ZkController Register replica - core:collection1 address:https://127.0.0.1:48109/er_n/iw collection:control_collection shard:shard1
   [junit4]   2> 1872509 INFO  (coreZkRegister-6132-thread-1-processing-n:127.0.0.1:48109_er_n%2Fiw x:collection1 s:shard1 c:control_collection r:core_node1) [n:127.0.0.1:48109_er_n%2Fiw c:control_collection s:shard1 r:core_node1 x:collection1] o.a.s.c.c.SolrZkClient makePath: /collections/control_collection/leader_elect/shard1/election
   [junit4]   2> 1872514 INFO  (coreZkRegister-6132-thread-1-processing-n:127.0.0.1:48109_er_n%2Fiw x:collection1 s:shard1 c:control_collection r:core_node1) [n:127.0.0.1:48109_er_n%2Fiw c:control_collection s:shard1 r:core_node1 x:collection1] o.a.s.c.LeaderElector Joined leadership election with path: /collections/control_collection/leader_elect/shard1/election/95464015026847749-core_node1-n_0000000000
   [junit4]   2> 1872517 INFO  (coreZkRegister-6132-thread-1-processing-n:127.0.0.1:48109_er_n%2Fiw x:collection1 s:shard1 c:control_collection r:core_node1) [n:127.0.0.1:48109_er_n%2Fiw c:control_collection s:shard1 r:core_node1 x:collection1] o.a.s.c.ShardLeaderElectionContext Running the leader process for shard=shard1 and weAreReplacement=false and leaderVoteWait=10000
   [junit4]   2> 1872519 INFO  (coreZkRegister-6132-thread-1-processing-n:127.0.0.1:48109_er_n%2Fiw x:collection1 s:shard1 c:control_collection r:core_node1) [n:127.0.0.1:48109_er_n%2Fiw c:control_collection s:shard1 r:core_node1 x:collection1] o.a.s.c.ShardLeaderElectionContext Enough replicas found to continue.
   [junit4]   2> 1872519 INFO  (OverseerStateUpdate-95464015026847749-127.0.0.1:48109_er_n%2Fiw-n_0000000000) [n:127.0.0.1:48109_er_n%2Fiw    ] o.a.s.c.Overseer processMessage: queueSize: 1, message = {
   [junit4]   2>   "operation":"leader",
   [junit4]   2>   "shard":"shard1",
   [junit4]   2>   "collection":"control_collection"} current state version: 1
   [junit4]   2> 1872519 INFO  (coreZkRegister-6132-thread-1-processing-n:127.0.0.1:48109_er_n%2Fiw x:collection1 s:shard1 c:control_collection r:core_node1) [n:127.0.0.1:48109_er_n%2Fiw c:control_collection s:shard1 r:core_node1 x:collection1] o.a.s.c.ShardLeaderElectionContext I may be the new leader - try and sync
   [junit4]   2> 1872519 INFO  (coreZkRegister-6132-thread-1-processing-n:127.0.0.1:48109_er_n%2Fiw x:collection1 s:shard1 c:control_collection r:core_node1) [n:127.0.0.1:48109_er_n%2Fiw c:control_collection s:shard1 r:core_node1 x:collection1] o.a.s.c.SyncStrategy Sync replicas to https://127.0.0.1:48109/er_n/iw/collection1/
   [junit4]   2> 1872519 INFO  (coreZkRegister-6132-thread-1-processing-n:127.0.0.1:48109_er_n%2Fiw x:collection1 s:shard1 c:control_collection r:core_node1) [n:127.0.0.1:48109_er_n%2Fiw c:control_collection s:shard1 r:core_node1 x:collection1] o.a.s.c.SyncStrategy Sync Success - now sync replicas to me
   [junit4]   2> 1872519 INFO  (coreZkRegister-6132-thread-1-processing-n:127.0.0.1:48109_er_n%2Fiw x:collection1 s:shard1 c:control_collection r:core_node1) [n:127.0.0.1:48109_er_n%2Fiw c:control_collection s:shard1 r:core_node1 x:collection1] o.a.s.c.SyncStrategy https://127.0.0.1:48109/er_n/iw/collection1/ has no replicas
   [junit4]   2> 1872522 INFO  (coreZkRegister-6132-thread-1-processing-n:127.0.0.1:48109_er_n%2Fiw x:collection1 s:shard1 c:control_collection r:core_node1) [n:127.0.0.1:48109_er_n%2Fiw c:control_collection s:shard1 r:core_node1 x:collection1] o.a.s.c.c.SolrZkClient makePath: /collections/control_collection/leaders/shard1
   [junit4]   2> 1872525 INFO  (coreZkRegister-6132-thread-1-processing-n:127.0.0.1:48109_er_n%2Fiw x:collection1 s:shard1 c:control_collection r:core_node1) [n:127.0.0.1:48109_er_n%2Fiw c:control_collection s:shard1 r:core_node1 x:collection1] o.a.s.c.ShardLeaderElectionContextBase Creating leader registration node /collections/control_collection/leaders/shard1/leader after winning as /collections/control_collection/leader_elect/shard1/election/95464015026847749-core_node1-n_0000000000
   [junit4]   2> 1872527 INFO  (coreZkRegister-6132-thread-1-processing-n:127.0.0.1:48109_er_n%2Fiw x:collection1 s:shard1 c:control_collection r:core_node1) [n:127.0.0.1:48109_er_n%2Fiw c:control_collection s:shard1 r:core_node1 x:collection1] o.a.s.c.ShardLeaderElectionContext I am the new leader: https://127.0.0.1:48109/er_n/iw/collection1/ shard1
   [junit4]   2> 1872527 INFO  (OverseerStateUpdate-95464015026847749-127.0.0.1:48109_er_n%2Fiw-n_0000000000) [n:127.0.0.1:48109_er_n%2Fiw    ] o.a.s.c.Overseer processMessage: queueSize: 1, message = {
   [junit4]   2>   "operation":"leader",
   [junit4]   2>   "shard":"shard1",
   [junit4]   2>   "collection":"control_collection",
   [junit4]   2>   "base_url":"https://127.0.0.1:48109/er_n/iw",
   [junit4]   2>   "core":"collection1",
   [junit4]   2>   "state":"active"} current state version: 1
   [junit4]   2> 1872634 INFO  (zkCallback-2457-thread-1-processing-n:127.0.0.1:48109_er_n%2Fiw) [n:127.0.0.1:48109_er_n%2Fiw    ] o.a.s.c.c.ZkStateReader A cluster state change: [WatchedEvent state:SyncConnected type:NodeDataChanged path:/clusterstate.json], has occurred - updating... (live nodes size: [1])
   [junit4]   2> 1872678 INFO  (coreZkRegister-6132-thread-1-processing-n:127.0.0.1:48109_er_n%2Fiw x:collection1 s:shard1 c:control_collection r:core_node1) [n:127.0.0.1:48109_er_n%2Fiw c:control_collection s:shard1 r:core_node1 x:collection1] o.a.s.c.ZkController We are https://127.0.0.1:48109/er_n/iw/collection1/ and leader is https://127.0.0.1:48109/er_n/iw/collection1/
   [junit4]   2> 1872679 INFO  (coreZkRegister-6132-thread-1-processing-n:127.0.0.1:48109_er_n%2Fiw x:collection1 s:shard1 c:control_collection r:core_node1) [n:127.0.0.1:48109_er_n%2Fiw c:control_collection s:shard1 r:core_node1 x:collection1] o.a.s.c.ZkController No LogReplay needed for core=collection1 baseURL=https://127.0.0.1:48109/er_n/iw
   [junit4]   2> 1872679 INFO  (coreZkRegister-6132-thread-1-processing-n:127.0.0.1:48109_er_n%2Fiw x:collection1 s:shard1 c:control_collection r:core_node1) [n:127.0.0.1:48109_er_n%2Fiw c:control_collection s:shard1 r:core_node1 x:collection1] o.a.s.c.ZkController I am the leader, no recovery necessary
   [junit4]   2> 1872679 INFO  (coreZkRegister-6132-thread-1-processing-n:127.0.0.1:48109_er_n%2Fiw x:collection1 s:shard1 c:control_collection r:core_node1) [n:127.0.0.1:48109_er_n%2Fiw c:control_collection s:shard1 r:core_node1 x:collection1] o.a.s.c.ZkController publishing state=active
   [junit4]   2> 1872679 INFO  (coreZkRegister-6132-thread-1-processing-n:127.0.0.1:48109_er_n%2Fiw x:collection1 s:shard1 c:control_collection r:core_node1) [n:127.0.0.1:48109_er_n%2Fiw c:control_collection s:shard1 r:core_node1 x:collection1] o.a.s.c.ZkController numShards not found on descriptor - reading it from system property
   [junit4]   2> 1872688 INFO  (OverseerStateUpdate-95464015026847749-127.0.0.1:48109_er_n%2Fiw-n_0000000000) [n:127.0.0.1:48109_er_n%2Fiw    ] o.a.s.c.Overseer processMessage: queueSize: 1, message = {
   [junit4]   2>   "core":"collection1",
   [junit4]   2>   "core_node_name":"core_node1",
   [junit4]   2>   "roles":null,
   [junit4]   2>   "base_url":"https://127.0.0.1:48109/er_n/iw",
   [junit4]   2>   "node_name":"127.0.0.1:48109_er_n%2Fiw",
   [junit4]   2>   "numShards":"1",
   [junit4]   2>   "state":"active",
   [junit4]   2>   "shard":"shard1",
   [junit4]   2>   "collection":"control_collection",
   [junit4]   2>   "operation":"state"} current state version: 2
   [junit4]   2> 1872690 INFO  (coreZkRegister-6132-thread-1-processing-n:127.0.0.1:48109_er_n%2Fiw x:collection1 s:shard1 c:control_collection r:core_node1) [n:127.0.0.1:48109_er_n%2Fiw c:control_collection s:shard1 r:core_node1 x:collection1] o.a.s.c.c.ZkStateReader Updated live nodes from ZooKeeper... (1) -> (1)
   [junit4]   2> 1872690 INFO  (OverseerStateUpdate-95464015026847749-127.0.0.1:48109_er_n%2Fiw-n_0000000000) [n:127.0.0.1:48109_er_n%2Fiw    ] o.a.s.c.o.ReplicaMutator Update state numShards=1 message={
   [junit4]   2>   "core":"collection1",
   [junit4]   2>   "core_node_name":"core_node1",
   [junit4]   2>   "roles":null,
   [junit4]   2>   "base_url":"https://127.0.0.1:48109/er_n/iw",
   [junit4]   2>   "node_name":"127.0.0.1:48109_er_n%2Fiw",
   [junit4]   2>   "numShards":"1",
   [junit4]   2>   "state":"active",
   [junit4]   2>   "shard":"shard1",
   [junit4]   2>   "collection":"control_collection",
   [junit4]   2>   "operation":"state"}
   [junit4]   2> 1872783 INFO  (TEST-TestReqParamsAPI.test-seed#[FDFC00EBE9027634]) [    ] o.a.s.c.c.SolrZkClient Using default ZkCredentialsProvider
   [junit4]   2> 1872786 INFO  (TEST-TestReqParamsAPI.test-seed#[FDFC00EBE9027634]) [    ] o.a.s.c.c.ConnectionManager Waiting for client to connect to ZooKeeper
   [junit4]   2> 1872786 INFO  (zkCallback-2459-thread-1) [    ] o.a.s.c.c.ConnectionManager Watcher org.apache.solr.common.cloud.ConnectionManager@18861338 name:ZooKeeperConnection Watcher:127.0.0.1:42951/solr got event WatchedEvent state:SyncConnected type:None path:null path:null type:None
   [junit4]   2> 1872787 INFO  (TEST-TestReqParamsAPI.test-seed#[FDFC00EBE9027634]) [    ] o.a.s.c.c.ConnectionManager Client is connected to ZooKeeper
   [junit4]   2> 1872787 INFO  (TEST-TestReqParamsAPI.test-seed#[FDFC00EBE9027634]) [    ] o.a.s.c.c.SolrZkClient Using default ZkACLProvider
   [junit4]   2> 1872787 INFO  (TEST-TestReqParamsAPI.test-seed#[FDFC00EBE9027634]) [    ] o.a.s.c.c.ZkStateReader Updating cluster state from ZooKeeper... 
   [junit4]   2> 1872788 INFO  (TEST-TestReqParamsAPI.test-seed#[FDFC00EBE9027634]) [    ] o.a.s.c.c.ZkStateReader Updated live nodes from ZooKeeper... (0) -> (1)
   [junit4]   2> 1872788 INFO  (TEST-TestReqParamsAPI.test-seed#[FDFC00EBE9027634]) [    ] o.a.s.c.ChaosMonkey monkey: init - expire sessions:false cause connection loss:false
   [junit4]   2> 1872788 INFO  (TEST-TestReqParamsAPI.test-seed#[FDFC00EBE9027634]) [    ] o.a.s.c.AbstractFullDistribZkTestBase Creating collection1 with stateFormat=2
   [junit4]   2> 1872789 INFO  (TEST-TestReqParamsAPI.test-seed#[FDFC00EBE9027634]) [    ] o.a.s.c.c.SolrZkClient Using default ZkCredentialsProvider
   [junit4]   2> 1872794 INFO  (zkCallback-2457-thread-1-processing-n:127.0.0.1:48109_er_n%2Fiw) [n:127.0.0.1:48109_er_n%2Fiw    ] o.a.s.c.c.ZkStateReader A cluster state change: [WatchedEvent state:SyncConnected type:NodeDataChanged path:/clusterstate.json], has occurred - updating... (live nodes size: [1])
   [junit4]   2> 1872796 INFO  (TEST-TestReqParamsAPI.test-seed#[FDFC00EBE9027634]) [    ] o.a.s.c.c.ConnectionManager Waiting for client to connect to ZooKeeper
   [junit4]   2> 1872796 INFO  (zkCallback-2459-thread-1) [    ] o.a.s.c.c.ZkStateReader A cluster state change: [WatchedEvent state:SyncConnected type:NodeDataChanged path:/clusterstate.json], has occurred - updating... (live nodes size: [1])
   [junit4]   2> 1872799 INFO  (zkCallback-2460-thread-1) [    ] o.a.s.c.c.ConnectionManager Watcher org.apache.solr.common.cloud.ConnectionManager@85e7e8c name:ZooKeeperConnection Watcher:127.0.0.1:42951/solr got event WatchedEvent state:SyncConnected type:None path:null path:null type:None
   [junit4]   2> 1872800 INFO  (TEST-TestReqParamsAPI.test-seed#[FDFC00EBE9027634]) [    ] o.a.s.c.c.ConnectionManager Client is connected to ZooKeeper
   [junit4]   2> 1872800 INFO  (TEST-TestReqParamsAPI.test-seed#[FDFC00EBE9027634]) [    ] o.a.s.c.c.SolrZkClient Using default ZkACLProvider
   [junit4]   2> 1872802 INFO  (OverseerStateUpdate-95464015026847749-127.0.0.1:48109_er_n%2Fiw-n_0000000000) [n:127.0.0.1:48109_er_n%2Fiw    ] o.a.s.c.Overseer processMessage: queueSize: 1, message = {
   [junit4]   2>   "operation":"create",
   [junit4]   2>   "name":"collection1",
   [junit4]   2>   "numShards":"2",
   [junit4]   2>   "stateFormat":"2"} current state version: 3
   [junit4]   2> 1872802 INFO  (OverseerStateUpdate-95464015026847749-127.0.0.1:48109_er_n%2Fiw-n_0000000000) [n:127.0.0.1:48109_er_n%2Fiw    ] o.a.s.c.o.ClusterStateMutator building a new cName: collection1
   [junit4]   2> 1872906 INFO  (OverseerStateUpdate-95464015026847749-127.0.0.1:48109_er_n%2Fiw-n_0000000000) [n:127.0.0.1:48109_er_n%2Fiw    ] o.a.s.c.o.ZkStateWriter going to create_collection /collections/collection1/state.json
   [junit4]   2> 1872935 INFO  (TEST-TestReqParamsAPI.test-seed#[FDFC00EBE9027634]) [    ] o.a.s.SolrTestCaseJ4 Writing core.properties file to /x1/jenkins/jenkins-slave/workspace/Lucene-Solr-Tests-trunk-Java8/solr/build/solr-core/test/J1/temp/solr.handler.TestReqParamsAPI_FDFC00EBE9027634-001/shard-1-001/cores/collection1
   [junit4]   2> 1872936 INFO  (TEST-TestReqParamsAPI.test-seed#[FDFC00EBE9027634]) [    ] o.a.s.c.AbstractFullDistribZkTestBase create jetty 1 in directory /x1/jenkins/jenkins-slave/workspace/Lucene-Solr-Tests-trunk-Java8/solr/build/solr-core/test/J1/temp/solr.handler.TestReqParamsAPI_FDFC00EBE9027634-001/shard-1-001
   [junit4]   2> 1872937 INFO  (TEST-TestReqParamsAPI.test-seed#[FDFC00EBE9027634]) [    ] o.e.j.s.Server jetty-9.3.6.v20151106
   [junit4]   2> 1872968 INFO  (TEST-TestReqParamsAPI.test-seed#[FDFC00EBE9027634]) [    ] o.e.j.s.h.ContextHandler Started o.e.j.s.ServletContextHandler@6c8e6484{/er_n/iw,null,AVAILABLE}
   [junit4]   2> 1872969 INFO  (TEST-TestReqParamsAPI.test-seed#[FDFC00EBE9027634]) [    ] o.e.j.u.s.SslContextFactory x509=X509@5218953(solrtest,h=[],w=[]) for SslContextFactory@10788173(file:///x1/jenkins/jenkins-slave/workspace/Lucene-Solr-Tests-trunk-Java8/solr/server/etc/test/solrtest.keystore,file:///x1/jenkins/jenkins-slave/workspace/Lucene-Solr-Tests-trunk-Java8/solr/server/etc/test/solrtest.keystore)
   [junit4]   2> 1872971 INFO  (TEST-TestReqParamsAPI.test-seed#[FDFC00EBE9027634]) [    ] o.e.j.s.ServerConnector Started ServerConnector@63e08645{SSL,[ssl, http/1.1]}{127.0.0.1:60356}
   [junit4]   2> 1872971 INFO  (TEST-TestReqParamsAPI.test-seed#[FDFC00EBE9027634]) [    ] o.e.j.s.Server Started @1876156ms
   [junit4]   2> 1872971 INFO  (TEST-TestReqParamsAPI.test-seed#[FDFC00EBE9027634]) [    ] o.a.s.c.s.e.JettySolrRunner Jetty properties: {solr.data.dir=/x1/jenkins/jenkins-slave/workspace/Lucene-Solr-Tests-trunk-Java8/solr/build/solr-core/test/J1/temp/solr.handler.TestReqParamsAPI_FDFC00EBE9027634-001/tempDir-001/jetty1, solrconfig=solrconfig.xml, hostContext=/er_n/iw, hostPort=60356, coreRootDirectory=/x1/jenkins/jenkins-slave/workspace/Lucene-Solr-Tests-trunk-Java8/solr/build/solr-core/test/J1/temp/solr.handler.TestReqParamsAPI_FDFC00EBE9027634-001/shard-1-001/cores}
   [junit4]   2> 1872972 INFO  (TEST-TestReqParamsAPI.test-seed#[FDFC00EBE9027634]) [    ] o.a.s.s.SolrDispatchFilter SolrDispatchFilter.init(): sun.misc.Launcher$AppClassLoader@4e0e2f2a
   [junit4]   2> 1872972 INFO  (TEST-TestReqParamsAPI.test-seed#[FDFC00EBE9027634]) [    ] o.a.s.c.SolrResourceLoader new SolrResourceLoader for directory: '/x1/jenkins/jenkins-slave/workspace/Lucene-Solr-Tests-trunk-Java8/solr/build/solr-core/test/J1/temp/solr.handler.TestReqParamsAPI_FDFC00EBE9027634-001/shard-1-001'
   [junit4]   2> 1872972 INFO  (TEST-TestReqParamsAPI.test-seed#[FDFC00EBE9027634]) [    ] o.a.s.c.SolrResourceLoader JNDI not configured for solr (NoInitialContextEx)
   [junit4]   2> 1872972 INFO  (TEST-TestReqParamsAPI.test-seed#[FDFC00EBE9027634]) [    ] o.a.s.c.SolrResourceLoader solr home defaulted to 'solr/' (could not find system property or JNDI)
   [junit4]   2> 1872972 INFO  (TEST-TestReqParamsAPI.test-seed#[FDFC00EBE9027634]) [    ] o.a.s.c.c.SolrZkClient Using default ZkCredentialsProvider
   [junit4]   2> 1872973 INFO  (TEST-TestReqParamsAPI.test-seed#[FDFC00EBE9027634]) [    ] o.a.s.c.c.ConnectionManager Waiting for client to connect to ZooKeeper
   [junit4]   2> 1872974 INFO  (zkCallback-2461-thread-1) [    ] o.a.s.c.c.ConnectionManager Watcher org.apache.solr.common.cloud.ConnectionManager@66f04443 name:ZooKeeperConnection Watcher:127.0.0.1:42951/solr got event WatchedEvent state:SyncConnected type:None path:null path:null type:None
   [junit4]   2> 1872974 INFO  (TEST-TestReqParamsAPI.test-seed#[FDFC00EBE9027634]) [    ] o.a.s.c.c.ConnectionManager Client is connected to ZooKeeper
   [junit4]   2> 1872974 INFO  (TEST-TestReqParamsAPI.test-seed#[FDFC00EBE9027634]) [    ] o.a.s.c.c.SolrZkClient Using default ZkACLProvider
   [junit4]   2> 1872975 INFO  (TEST-TestReqParamsAPI.test-seed#[FDFC00EBE9027634]) [    ] o.a.s.s.SolrDispatchFilter Loading solr.xml from SolrHome (not found in ZooKeeper)
   [junit4]   2> 1872975 INFO  (TEST-TestReqParamsAPI.test-seed#[FDFC00EBE9027634]) [    ] o.a.s.c.SolrXmlConfig Loading container configuration from /x1/jenkins/jenkins-slave/workspace/Lucene-Solr-Tests-trunk-Java8/solr/build/solr-core/test/J1/temp/solr.handler.TestReqParamsAPI_FDFC00EBE9027634-001/shard-1-001/solr.xml
   [junit4]   2> 1872991 INFO  (TEST-TestReqParamsAPI.test-seed#[FDFC00EBE9027634]) [    ] o.a.s.c.CorePropertiesLocator Config-defined core root directory: /x1/jenkins/jenkins-slave/workspace/Lucene-Solr-Tests-trunk-Java8/solr/build/solr-core/test/J1/temp/solr.handler.TestReqParamsAPI_FDFC00EBE9027634-001/shard-1-001/cores
   [junit4]   2> 1872991 INFO  (TEST-TestReqParamsAPI.test-seed#[FDFC00EBE9027634]) [    ] o.a.s.c.CoreContainer New CoreContainer 1123911831
   [junit4]   2> 1872991 INFO  (TEST-TestReqParamsAPI.test-seed#[FDFC00EBE9027634]) [    ] o.a.s.c.CoreContainer Loading cores into CoreContainer [instanceDir=/x1/jenkins/jenkins-slave/workspace/Lucene-Solr-Tests-trunk-Java8/solr/build/solr-core/test/J1/temp/solr.handler.TestReqParamsAPI_FDFC00EBE9027634-001/shard-1-001]
   [junit4]   2> 1872991 WARN  (TEST-TestReqParamsAPI.test-seed#[FDFC00EBE9027634]) [    ] o.a.s.c.CoreContainer Couldn't add files from /x1/jenkins/jenkins-slave/workspace/Lucene-Solr-Tests-trunk-Java8/solr/build/solr-core/test/J1/temp/solr.handler.TestReqParamsAPI_FDFC00EBE9027634-001/shard-1-001/lib to classpath: /x1/jenkins/jenkins-slave/workspace/Lucene-Solr-Tests-trunk-Java8/solr/build/solr-core/test/J1/temp/solr.handler.TestReqParamsAPI_FDFC00EBE9027634-001/shard-1-001/lib
   [junit4]   2> 1872991 INFO  (TEST-TestReqParamsAPI.test-seed#[FDFC00EBE9027634]) [    ] o.a.s.h.c.HttpShardHandlerFactory created with socketTimeout : 90000,urlScheme : ,connTimeout : 15000,maxConnectionsPerHost : 20,maxConnections : 10000,corePoolSize : 0,maximumPoolSize : 2147483647,maxThreadIdleTime : 5,sizeOfQueue : -1,fairnessPolicy : false,useRetries : false,
   [junit4]   2> 1872995 INFO  (TEST-TestReqParamsAPI.test-seed#[FDFC00EBE9027634]) [    ] o.a.s.u.UpdateShardHandler Creating UpdateShardHandler HTTP client with params: socketTimeout=340000&connTimeout=45000&retry=true
   [junit4]   2> 1872998 INFO  (TEST-TestReqParamsAPI.test-seed#[FDFC00EBE9027634]) [    ] o.a.s.l.LogWatcher SLF4J impl is org.slf4j.impl.Log4jLoggerFactory
   [junit4]   2> 1872998 INFO  (TEST-TestReqParamsAPI.test-seed#[FDFC00EBE9027634]) [    ] o.a.s.l.LogWatcher Registering Log Listener [Log4j (org.slf4j.impl.Log4jLoggerFactory)]
   [junit4]   2> 1872999 INFO  (TEST-TestReqParamsAPI.test-seed#[FDFC00EBE9027634]) [    ] o.a.s.c.ZkContainer Zookeeper client=127.0.0.1:42951/solr
   [junit4]   2> 1872999 INFO  (TEST-TestReqParamsAPI.test-seed#[FDFC00EBE9027634]) [    ] o.a.s.c.ZkController zkHost includes chroot
   [junit4]   2> 1872999 INFO  (TEST-TestReqParamsAPI.test-seed#[FDFC00EBE9027634]) [    ] o.a.s.c.c.SolrZkClient Using default ZkCredentialsProvider
   [junit4]   2> 1873003 INFO  (TEST-TestReqParamsAPI.test-seed#[FDFC00EBE9027634]) [    ] o.a.s.c.c.ConnectionManager Waiting for client to connect to ZooKeeper
   [junit4]   2> 1873021 INFO  (zkCallback-2464-thread-1) [    ] o.a.s.c.c.ConnectionManager Watcher org.apache.solr.common.cloud.ConnectionManager@640cdae8 name:ZooKeeperConnection Watcher:127.0.0.1:42951 got event WatchedEvent state:SyncConnected type:None path:null path:null type:None
   [junit4]   2> 1873022 INFO  (TEST-TestReqParamsAPI.test-seed#[FDFC00EBE9027634]) [    ] o.a.s.c.c.ConnectionManager Client is connected to ZooKeeper
   [junit4]   2> 1873022 INFO  (TEST-TestReqParamsAPI.test-seed#[FDFC00EBE9027634]) [    ] o.a.s.c.c.SolrZkClient Using default ZkACLProvider
   [junit4]   2> 1873023 INFO  (TEST-TestReqParamsAPI.test-seed#[FDFC00EBE9027634]) [n:127.0.0.1:60356_er_n%2Fiw    ] o.a.s.c.c.ConnectionManager Waiting for client to connect to ZooKeeper
   [junit4]   2> 1873025 INFO  (zkCallback-2465-thread-1-processing-n:127.0.0.1:60356_er_n%2Fiw) [n:127.0.0.1:60356_er_n%2Fiw    ] o.a.s.c.c.ConnectionManager Watcher org.apache.solr.common.cloud.ConnectionManager@17e286be name:ZooKeeperConnection Watcher:127.0.0.1:42951/solr got event WatchedEvent state:SyncConnected type:None path:null path:null type:None
   [junit4]   2> 1873025 INFO  (TEST-TestReqParamsAPI.test-seed#[FDFC00EBE9027634]) [n:127.0.0.1:60356_er_n%2Fiw    ] o.a.s.c.c.ConnectionManager Client is connected to ZooKeeper
   [junit4]   2> 1873030 INFO  (TEST-TestReqParamsAPI.test-seed#[FDFC00EBE9027634]) [n:127.0.0.1:60356_er_n%2Fiw    ] o.a.s.c.Overseer Overseer (id=null) closing
   [junit4]   2> 1873031 INFO  (TEST-TestReqParamsAPI.test-seed#[FDFC00EBE9027634]) [n:127.0.0.1:60356_er_n%2Fiw    ] o.a.s.c.LeaderElector Joined leadership election with path: /overseer_elect/election/95464015026847754-127.0.0.1:60356_er_n%2Fiw-n_0000000001
   [junit4]   2> 1873031 INFO  (TEST-TestReqParamsAPI.test-seed#[FDFC00EBE9027634]) [n:127.0.0.1:60356_er_n%2Fiw    ] o.a.s.c.LeaderElector Watching path /overseer_elect/election/95464015026847749-127.0.0.1:48109_er_n%2Fiw-n_0000000000 to know if I could be the leader
   [junit4]   2> 1873031 INFO  (TEST-TestReqParamsAPI.test-seed#[FDFC00EBE9027634]) [n:127.0.0.1:60356_er_n%2Fiw    ] o.a.s.c.c.ZkStateReader Updating cluster state from ZooKeeper... 
   [junit4]   2> 1873032 INFO  (TEST-TestReqParamsAPI.test-seed#[FDFC00EBE9027634]) [n:127.0.0.1:60356_er_n%2Fiw    ] o.a.s.c.c.ZkStateReader Updated live nodes from ZooKeeper... (0) -> (1)
   [junit4]   2> 1873033 INFO  (TEST-TestReqParamsAPI.test-seed#[FDFC00EBE9027634]) [n:127.0.0.1:60356_er_n%2Fiw    ] o.a.s.c.c.ZkStateReader Updating cluster state from ZooKeeper... 
   [junit4]   2> 1873034 INFO  (TEST-TestReqParamsAPI.test-seed#[FDFC00EBE9027634]) [n:127.0.0.1:60356_er_n%2Fiw    ] o.a.s.c.c.ZkStateReader Updated live nodes from ZooKeeper... (1) -> (1)
   [junit4]   2> 1873035 INFO  (TEST-TestReqParamsAPI.test-seed#[FDFC00EBE9027634]) [n:127.0.0.1:60356_er_n%2Fiw    ] o.a.s.c.ZkController Publish node=127.0.0.1:60356_er_n%2Fiw as DOWN
   [junit4]   2> 1873037 INFO  (OverseerStateUpdate-95464015026847749-127.0.0.1:48109_er_n%2Fiw-n_0000000000) [n:127.0.0.1:48109_er_n%2Fiw    ] o.a.s.c.Overseer processMessage: queueSize: 1, message = {
   [junit4]   2>   "operation":"downnode",
   [junit4]   2>   "node_name":"127.0.0.1:60356_er_n%2Fiw"} current state version: 3
   [junit4]   2> 1873037 INFO  (OverseerStateUpdate-95464015026847749-127.0.0.1:48109_er_n%2Fiw-n_0000000000) [n:127.0.0.1:48109_er_n%2Fiw    ] o.a.s.c.o.NodeMutator DownNode state invoked for node: 127.0.0.1:60356_er_n%2Fiw
   [junit4]   2> 1873038 INFO  (OverseerStateUpdate-95464015026847749-127.0.0.1:48109_er_n%2Fiw-n_0000000000) [n:127.0.0.1:48109_er_n%2Fiw    ] o.a.s.c.o.ZkStateWriter going to update_collection /collections/collection1/state.json version: 0
   [junit4]   2> 1873141 INFO  (zkCallback-2457-thread-1-processing-n:127.0.0.1:48109_er_n%2Fiw) [n:127.0.0.1:48109_er_n%2Fiw    ] o.a.s.c.c.ZkStateReader A cluster state change: [WatchedEvent state:SyncConnected type:NodeDataChanged path:/clusterstate.json], has occurred - updating... (live nodes size: [1])
   [junit4]   2> 1873141 INFO  (zkCallback-2459-thread-1) [    ] o.a.s.c.c.ZkStateReader A cluster state change: [WatchedEvent state:SyncConnected type:NodeDataChanged path:/clusterstate.json], has occurred - updating... (live nodes size: [1])
   [junit4]   2> 1873141 INFO  (zkCallback-2465-thread-1-processing-n:127.0.0.1:60356_er_n%2Fiw) [n:127.0.0.1:60356_er_n%2Fiw    ] o.a.s.c.c.ZkStateReader A cluster state change: [WatchedEvent state:SyncConnected type:NodeDataChanged path:/clusterstate.json], has occurred - updating... (live nodes size: [1])
   [junit4]   2> 1873144 INFO  (zkCallback-2465-thread-2-processing-n:127.0.0.1:60356_er_n%2Fiw) [n:127.0.0.1:60356_er_n%2Fiw    ] o.a.s.c.c.ZkStateReader A cluster state change: [WatchedEvent state:SyncConnected type:NodeDataChanged path:/clusterstate.json], has occurred - updating... (live nodes size: [1])
   [junit4]   2> 1874040 INFO  (TEST-TestReqParamsAPI.test-seed#[FDFC00EBE9027634]) [n:127.0.0.1:60356_er_n%2Fiw    ] o.a.s.c.ZkController Register node as live in ZooKeeper:/live_nodes/127.0.0.1:60356_er_n%2Fiw
   [junit4]   2> 1874041 INFO  (TEST-TestReqParamsAPI.test-seed#[FDFC00EBE9027634]) [n:127.0.0.1:60356_er_n%2Fiw    ] o.a.s.c.c.SolrZkClient makePath: /live_nodes/127.0.0.1:60356_er_n%2Fiw
   [junit4]   2> 1874042 INFO  (zkCallback-2457-thread-1-processing-n:127.0.0.1:48109_er_n%2Fiw) [n:127.0.0.1:48109_er_n%2Fiw    ] o.a.s.c.c.ZkStateReader A live node change: [WatchedEvent state:SyncConnected type:NodeChildrenChanged path:/live_nodes], has occurred - updating... (live nodes size: [1])
   [junit4]   2> 1874042 INFO  (zkCallback-2465-thread-2-processing-n:127.0.0.1:60356_er_n%2Fiw) [n:127.0.0.1:60356_er_n%2Fiw    ] o.a.s.c.c.ZkStateReader A live node change: [WatchedEvent state:SyncConnected type:NodeChildrenChanged path:/live_nodes], has occurred - updating... (live nodes size: [1])
   [junit4]   2> 1874042 INFO  (zkCallback-2465-thread-1-processing-n:127.0.0.1:60356_er_n%2Fiw) [n:127.0.0.1:60356_er_n%2Fiw    ] o.a.s.c.c.ZkStateReader A live node change: [WatchedEvent state:SyncConnected type:NodeChildrenChanged path:/live_nodes], has occurred - updating... (live nodes size: [1])
   [junit4]   2> 1874042 INFO  (zkCallback-2459-thread-1) [    ] o.a.s.c.c.ZkStateReader A live node change: [WatchedEvent state:SyncConnected type:NodeChildrenChanged path:/live_nodes], has occurred - updating... (live nodes size: [1])
   [junit4]   2> 1874042 INFO  (zkCallback-2457-thread-1-processing-n:127.0.0.1:48109_er_n%2Fiw) [n:127.0.0.1:48109_er_n%2Fiw    ] o.a.s.c.c.ZkStateReader Updated live nodes from ZooKeeper... (1) -> (2)
   [junit4]   2> 1874043 INFO  (zkCallback-2459-thread-1) [    ] o.a.s.c.c.ZkStateReader Updated live nodes from ZooKeeper... (1) -> (2)
   [junit4]   2> 1874043 INFO  (zkCallback-2465-thread-2-processing-n:127.0.0.1:60356_er_n%2Fiw) [n:127.0.0.1:60356_er_n%2Fiw    ] o.a.s.c.c.ZkStateReader Updated live nodes from ZooKeeper... (1) -> (2)
   [junit4]   2> 1874043 INFO  (zkCallback-2465-thread-1-processing-n:127.0.0.1:60356_er_n%2Fiw) [n:127.0.0.1:60356_er_n%2Fiw    ] o.a.s.c.c.ZkStateReader Updated live nodes from ZooKeeper... (2) -> (2)
   [junit4]   2> 1874052 INFO  (TEST-TestReqParamsAPI.test-seed#[FDFC00EBE9027634]) [n:127.0.0.1:60356_er_n%2Fiw    ] o.a.s.c.CoreContainer Security conf doesn't exist. Skipping setup for authorization module.
   [junit4]   2> 1874052 INFO  (TEST-TestReqParamsAPI.test-seed#[FDFC00EBE9027634]) [n:127.0.0.1:60356_er_n%2Fiw    ] o.a.s.c.CoreContainer No authentication plugin used.
   [junit4]   2> 1874053 INFO  (TEST-TestReqParamsAPI.test-seed#[FDFC00EBE9027634]) [n:127.0.0.1:60356_er_n%2Fiw    ] o.a.s.c.CorePropertiesLocator Looking for core definitions underneath /x1/jenkins/jenkins-slave/workspace/Lucene-Solr-Tests-trunk-Java8/solr/build/solr-core/test/J1/temp/solr.handler.TestReqParamsAPI_FDFC00EBE9027634-001/shard-1-001/cores
   [junit4]   2> 1874053 INFO  (TEST-TestReqParamsAPI.test-seed#[FDFC00EBE9027634]) [n:127.0.0.1:60356_er_n%2Fiw    ] o.a.s.c.CoreDescriptor Created CoreDescriptor: {name=collection1, config=solrconfig.xml, transient=false, schema=schema.xml, loadOnStartup=true, configSetProperties=configsetprops.json, collection=collection1, coreNodeName=, dataDir=data/, shard=}
   [junit4]   2> 1874053 INFO  (TEST-TestReqParamsAPI.test-seed#[FDFC00EBE9027634]) [n:127.0.0.1:60356_er_n%2Fiw    ] o.a.s.c.CorePropertiesLocator Found core collection1 in /x1/jenkins/jenkins-slave/workspace/Lucene-Solr-Tests-trunk-Java8/solr/build/solr-core/test/J1/temp/solr.handler.TestReqParamsAPI_FDFC00EBE9027634-001/shard-1-001/cores/collection1
   [junit4]   2> 1874054 INFO  (TEST-TestReqParamsAPI.test-seed#[FDFC00EBE9027634]) [n:127.0.0.1:60356_er_n%2Fiw    ] o.a.s.c.CorePropertiesLocator Found 1 core definitions
   [junit4]   2> 1874070 INFO  (coreLoadExecutor-6149-thread-1-processing-n:127.0.0.1:60356_er_n%2Fiw) [n:127.0.0.1:60356_er_n%2Fiw c:collection1   x:collection1] o.a.s.c.ZkController publishing state=down
   [junit4]   2> 1874070 INFO  (coreLoadExecutor-6149-thread-1-processing-n:127.0.0.1:60356_er_n%2Fiw) [n:127.0.0.1:60356_er_n%2Fiw c:collection1   x:collection1] o.a.s.c.ZkController numShards not found on descriptor - reading it from system property
   [junit4]   2> 1874071 INFO  (OverseerStateUpdate-95464015026847749-127.0.0.1:48109_er_n%2Fiw-n_0000000000) [n:127.0.0.1:48109_er_n%2Fiw    ] o.a.s.c.Overseer processMessage: queueSize: 1, message = {
   [junit4]   2>   "core":"collection1",
   [junit4]   2>   "roles":null,
   [junit4]   2>   "base_url":"https://127.0.0.1:60356/er_n/iw",
   [junit4]   2>   "node_name":"127.0.0.1:60356_er_n%2Fiw",
   [junit4]   2>   "numShards":"2",
   [junit4]   2>   "state":"down",
   [junit4]   2>   "shard":null,
   [junit4]   2>   "collection":"collection1",
   [junit4]   2>   "operation":"state"} current state version: 4
   [junit4]   2> 1874072 INFO  (OverseerStateUpdate-95464015026847749-127.0.0.1:48109_er_n%2Fiw-n_0000000000) [n:127.0.0.1:48109_er_n%2Fiw    ] o.a.s.c.o.ReplicaMutator Update state numShards=2 message={
   [junit4]   2>   "core":"collection1",
   [junit4]   2>   "roles":null,
   [junit4]   2>   "base_url":"https://127.0.0.1:60356/er_n/iw",
   [junit4]   2>   "node_name":"127.0.0.1:60356_er_n%2Fiw",
   [junit4]   2>   "numShards":"2",
   [junit4]   2>   "state":"down",
   [junit4]   2>   "shard":null,
   [junit4]   2>   "collection":"collection1",
   [junit4]   2>   "operation":"state"}
   [junit4]   2> 1874072 INFO  (OverseerStateUpdate-95464015026847749-127.0.0.1:48109_er_n%2Fiw-n_0000000000) [n:127.0.0.1:48109_er_n%2Fiw    ] o.a.s.c.o.ReplicaMutator Collection already exists with numShards=2
   [junit4]   2> 1874072 INFO  (OverseerStateUpdate-95464015026847749-127.0.0.1:48109_er_n%2Fiw-n_0000000000) [n:127.0.0.1:48109_er_n%2Fiw    ] o.a.s.c.o.ReplicaMutator Assigning new node to shard shard=shard2
   [junit4]   2> 1874077 INFO  (coreLoadExecutor-6149-thread-1-processing-n:127.0.0.1:60356_er_n%2Fiw) [n:127.0.0.1:60356_er_n%2Fiw c:collection1   x:collection1] o.a.s.c.ZkController Registering watch for collection collection1
   [junit4]   2> 1874077 INFO  (coreLoadExecutor-6149-thread-1-processing-n:127.0.0.1:60356_er_n%2Fiw) [n:127.0.0.1:60356_er_n%2Fiw c:collection1   x:collection1] o.a.s.c.c.ZkStateReader addZkWatch [collection1]
   [junit4]   2> 1874080 INFO  (coreLoadExecutor-6149-thread-1-processing-n:127.0.0.1:60356_er_n%2Fiw) [n:127.0.0.1:60356_er_n%2Fiw c:collection1   x:collection1] o.a.s.c.c

[...truncated too long message...]

tor.java:1142)
   [junit4]   2> 	at java.util.concurrent.ThreadPoolExecutor$Worker.run(ThreadPoolExecutor.java:617)
   [junit4]   2> 	at java.lang.Thread.run(Thread.java:745)
   [junit4]   2> 1902537 WARN  (zkCallback-2481-thread-4-processing-n:127.0.0.1:51712_er_n%2Fiw) [n:127.0.0.1:51712_er_n%2Fiw    ] o.a.s.c.c.ZkStateReader ZooKeeper watch triggered, but Solr cannot talk to ZK: [KeeperErrorCode = Session expired for /live_nodes]
   [junit4]   2> 1902539 INFO  (TEST-TestReqParamsAPI.test-seed#[FDFC00EBE9027634]) [    ] o.e.j.s.ServerConnector Stopped ServerConnector@7953ac73{SSL,[ssl, http/1.1]}{127.0.0.1:0}
   [junit4]   2> 1902539 INFO  (TEST-TestReqParamsAPI.test-seed#[FDFC00EBE9027634]) [    ] o.e.j.s.h.ContextHandler Stopped o.e.j.s.ServletContextHandler@78c9ff95{/er_n/iw,null,UNAVAILABLE}
   [junit4]   2> 1902554 INFO  (TEST-TestReqParamsAPI.test-seed#[FDFC00EBE9027634]) [    ] o.a.s.c.ZkTestServer connecting to 127.0.0.1:42951 42951
   [junit4]   2> 1902754 INFO  (Thread-5719) [    ] o.a.s.c.ZkTestServer connecting to 127.0.0.1:42951 42951
   [junit4]   2> 1902755 WARN  (Thread-5719) [    ] o.a.s.c.ZkTestServer Watch limit violations: 
   [junit4]   2> Maximum concurrent create/delete watches above limit:
   [junit4]   2> 
   [junit4]   2> 	40	/solr/configs/conf1
   [junit4]   2> 	10	/solr/aliases.json
   [junit4]   2> 	9	/solr/security.json
   [junit4]   2> 
   [junit4]   2> Maximum concurrent data watches above limit:
   [junit4]   2> 
   [junit4]   2> 	30	/solr/clusterstate.json
   [junit4]   2> 	4	/solr/collections/collection1/state.json
   [junit4]   2> 
   [junit4]   2> Maximum concurrent children watches above limit:
   [junit4]   2> 
   [junit4]   2> 	26	/solr/live_nodes
   [junit4]   2> 	10	/solr/collections
   [junit4]   2> 	5	/solr/overseer/collection-queue-work
   [junit4]   2> 	4	/solr/overseer/queue
   [junit4]   2> 
   [junit4]   2> NOTE: reproduce with: ant test  -Dtestcase=TestReqParamsAPI -Dtests.method=test -Dtests.seed=FDFC00EBE9027634 -Dtests.multiplier=2 -Dtests.slow=true -Dtests.locale=id -Dtests.timezone=America/Dominica -Dtests.asserts=true -Dtests.file.encoding=UTF-8
   [junit4] FAILURE 32.0s J1 | TestReqParamsAPI.test <<<
   [junit4]    > Throwable #1: java.lang.AssertionError: Could not get expected value  'first' for path 'response/params/x/_appends_/add' full output: {
   [junit4]    >   "responseHeader":{
   [junit4]    >     "status":0,
   [junit4]    >     "QTime":0},
   [junit4]    >   "response":{
   [junit4]    >     "znodeVersion":3,
   [junit4]    >     "params":{
   [junit4]    >       "x":{
   [junit4]    >         "a":"A val",
   [junit4]    >         "b":"B val",
   [junit4]    >         "":{"v":0}},
   [junit4]    >       "y":{
   [junit4]    >         "p":"P val",
   [junit4]    >         "q":"Q val",
   [junit4]    >         "":{"v":2}}}}}
   [junit4]    > 	at __randomizedtesting.SeedInfo.seed([FDFC00EBE9027634:75A83F3147FE1BCC]:0)
   [junit4]    > 	at org.apache.solr.core.TestSolrConfigHandler.testForResponseElement(TestSolrConfigHandler.java:458)
   [junit4]    > 	at org.apache.solr.handler.TestReqParamsAPI.testReqParams(TestReqParamsAPI.java:236)
   [junit4]    > 	at org.apache.solr.handler.TestReqParamsAPI.test(TestReqParamsAPI.java:67)
   [junit4]    > 	at org.apache.solr.BaseDistributedSearchTestCase$ShardsRepeatRule$ShardsFixedStatement.callStatement(BaseDistributedSearchTestCase.java:996)
   [junit4]    > 	at org.apache.solr.BaseDistributedSearchTestCase$ShardsRepeatRule$ShardsStatement.evaluate(BaseDistributedSearchTestCase.java:971)
   [junit4]    > 	at java.lang.Thread.run(Thread.java:745)
   [junit4]   2> 1902760 INFO  (SUITE-TestReqParamsAPI-seed#[FDFC00EBE9027634]-worker) [    ] o.a.s.SolrTestCaseJ4 ###deleteCore
   [junit4]   2> NOTE: leaving temporary files on disk at: /x1/jenkins/jenkins-slave/workspace/Lucene-Solr-Tests-trunk-Java8/solr/build/solr-core/test/J1/temp/solr.handler.TestReqParamsAPI_FDFC00EBE9027634-001
   [junit4]   2> Feb 28, 2016 1:15:00 PM com.carrotsearch.randomizedtesting.ThreadLeakControl checkThreadLeaks
   [junit4]   2> WARNING: Will linger awaiting termination of 1 leaked thread(s).
   [junit4]   2> NOTE: test params are: codec=Asserting(Lucene60): {}, docValues:{}, sim=ClassicSimilarity, locale=id, timezone=America/Dominica
   [junit4]   2> NOTE: Linux 3.13.0-52-generic amd64/Oracle Corporation 1.8.0_66 (64-bit)/cpus=4,threads=1,free=249490584,total=532152320
   [junit4]   2> NOTE: All tests run in this JVM: [TestPerFieldSimilarityWithDefaultOverride, TestSmileRequest, TestConfigSetsAPI, OpenExchangeRatesOrgProviderTest, TestDynamicLoading, TestLFUCache, AliasIntegrationTest, DOMUtilTest, TestLMJelinekMercerSimilarityFactory, DistributedTermsComponentTest, TestConfigReload, TestCursorMarkWithoutUniqueKey, CSVRequestHandlerTest, DistributedMLTComponentTest, TestLRUStatsCache, TestBulkSchemaConcurrent, ForceLeaderTest, AddSchemaFieldsUpdateProcessorFactoryTest, TermsComponentTest, UpdateRequestProcessorFactoryTest, DistributedFacetPivotLargeTest, DistanceFunctionTest, LoggingHandlerTest, TestMiniSolrCloudClusterSSL, ChaosMonkeySafeLeaderTest, FastVectorHighlighterTest, TestShortCircuitedRequests, FileUtilsTest, TestFastLRUCache, FullHLLTest, HdfsDirectoryFactoryTest, OpenCloseCoreStressTest, SolrIndexSplitterTest, TestStressUserVersions, TestDistributedGrouping, HdfsSyncSliceTest, SpellCheckCollatorTest, DocExpirationUpdateProcessorFactoryTest, BlockDirectoryTest, DistributedIntervalFacetingTest, TestFieldCollectionResource, TlogReplayBufferedWhileIndexingTest, TimeZoneUtilsTest, TestTrie, DocValuesMissingTest, TestCoreContainer, TestDistributedStatsComponentCardinality, ClusterStateUpdateTest, NumericFieldsTest, SimplePostToolTest, TestScoreJoinQPNoScore, TestShardHandlerFactory, MultiTermTest, CollectionReloadTest, LeaderInitiatedRecoveryOnCommitTest, ConvertedLegacyTest, SpatialHeatmapFacetsTest, TestSolrDeletionPolicy2, SolrInfoMBeanTest, SolrCloudExampleTest, SSLMigrationTest, TestSchemaResource, TestQueryTypes, IndexBasedSpellCheckerTest, TestPartialUpdateDeduplication, TestQueryUtils, TestSolrCoreProperties, TermVectorComponentTest, TestSurroundQueryParser, TestChildDocTransformer, TestMiniSolrCloudCluster, TestManagedResource, SolrPluginUtilsTest, SegmentsInfoRequestHandlerTest, HdfsLockFactoryTest, DeleteStatusTest, TestTrackingShardHandlerFactory, SortByFunctionTest, TestAddFieldRealTimeGet, CollectionsAPIDistributedZkTest, TestRawTransformer, TestUniqueKeyFieldResource, SparseHLLTest, TestFiltering, DeleteLastCustomShardedReplicaTest, TestSha256AuthenticationProvider, TestClusterStateMutator, ConnectionManagerTest, CdcrReplicationHandlerTest, WordBreakSolrSpellCheckerTest, HdfsRecoverLeaseTest, TestSolrCLIRunExample, TestSolrConfigHandlerConcurrent, DistributedQueryComponentOptimizationTest, ShardRoutingTest, TestFaceting, TestHashPartitioner, HardAutoCommitTest, SimpleFacetsTest, SpellCheckComponentTest, SolrCmdDistributorTest, BasicFunctionalityTest, TestLazyCores, CurrencyFieldXmlFileTest, SolrRequestParserTest, SuggesterTSTTest, SuggesterWFSTTest, NoCacheHeaderTest, SchemaVersionSpecificBehaviorTest, TestUpdate, TestAtomicUpdateErrorCases, QueryEqualityTest, DocValuesMultiTest, TestSolrDeletionPolicy1, StandardRequestHandlerTest, TestReversedWildcardFilterFactory, PrimitiveFieldTypeTest, XmlUpdateRequestHandlerTest, PathHierarchyTokenizerFactoryTest, FieldAnalysisRequestHandlerTest, TestCollationField, JSONWriterTest, QueryParsingTest, JsonLoaderTest, TestBinaryResponseWriter, UpdateParamsTest, SolrIndexConfigTest, TestElisionMultitermQuery, TestLuceneMatchVersion, TestXIncludeConfig, TestSweetSpotSimilarityFactory, TestIBSimilarityFactory, ResourceLoaderTest, PreAnalyzedFieldTest, TestSolrJ, TestUtils, SliceStateTest, TestRTGBase, TestHighlightDedupGrouping, TestTolerantSearch, TestEmbeddedSolrServerConstructors, TestJettySolrRunner, ActionThrottleTest, BaseCdcrDistributedZkTest, CdcrRequestHandlerTest, CollectionTooManyReplicasTest, DistribJoinFromCollectionTest, MigrateRouteKeyTest, OutOfBoxZkACLAndCredentialsProvidersTest, OverriddenZkACLAndCredentialsProvidersTest, OverseerCollectionConfigSetProcessorTest, OverseerRolesTest, RecoveryAfterSoftCommitTest, ShardSplitTest, TestSolrCloudWithKerberosAlt, HdfsBasicDistributedZk2Test, HdfsBasicDistributedZkTest, HdfsChaosMonkeyNothingIsSafeTest, HdfsChaosMonkeySafeLeaderTest, HdfsNNFailoverTest, TestConfigSetProperties, TestConfigSets, TestImplicitCoreProperties, TestInfoStreamLogging, TestInitParams, TestSolrDynamicMBean, TestSolrXml, RequestLoggingTest, TestReqParamsAPI]
   [junit4] Completed [493/581 (1!)] on J1 in 32.77s, 1 test, 1 failure <<< FAILURES!

[...truncated 303 lines...]
BUILD FAILED
/x1/jenkins/jenkins-slave/workspace/Lucene-Solr-Tests-trunk-Java8/build.xml:740: The following error occurred while executing this line:
/x1/jenkins/jenkins-slave/workspace/Lucene-Solr-Tests-trunk-Java8/build.xml:684: The following error occurred while executing this line:
/x1/jenkins/jenkins-slave/workspace/Lucene-Solr-Tests-trunk-Java8/build.xml:59: The following error occurred while executing this line:
/x1/jenkins/jenkins-slave/workspace/Lucene-Solr-Tests-trunk-Java8/solr/build.xml:233: The following error occurred while executing this line:
/x1/jenkins/jenkins-slave/workspace/Lucene-Solr-Tests-trunk-Java8/solr/common-build.xml:524: The following error occurred while executing this line:
/x1/jenkins/jenkins-slave/workspace/Lucene-Solr-Tests-trunk-Java8/lucene/common-build.xml:1457: The following error occurred while executing this line:
/x1/jenkins/jenkins-slave/workspace/Lucene-Solr-Tests-trunk-Java8/lucene/common-build.xml:1014: There were test failures: 581 suites (8 ignored), 2349 tests, 1 failure, 87 ignored (71 assumptions) [seed: FDFC00EBE9027634]

Total time: 60 minutes 2 seconds
Build step 'Invoke Ant' marked build as failure
Archiving artifacts
Recording test results
Email was triggered for: Failure - Any
Sending email for trigger: Failure - Any



Mime
View raw message