lucene-dev mailing list archives

Site index · List index
Message view « Date » · « Thread »
Top « Date » · « Thread »
From Policeman Jenkins Server <jenk...@thetaphi.de>
Subject [JENKINS] Lucene-Solr-5.5-Windows (64bit/jdk1.8.0_72) - Build # 14 - Still Failing!
Date Fri, 19 Feb 2016 23:39:01 GMT
Build: http://jenkins.thetaphi.de/job/Lucene-Solr-5.5-Windows/14/
Java: 64bit/jdk1.8.0_72 -XX:-UseCompressedOops -XX:+UseG1GC

1 tests failed.
FAILED:  org.apache.solr.cloud.rule.RulesTest.doIntegrationTest

Error Message:
Error from server at http://127.0.0.1:53280/e/jk: Could not identify nodes matching the rules [{"cores":"<4"}, {   "replica":"<2",   "node":"*"}, {"freedisk":">1"}]  tag values{   "127.0.0.1:53297_e%2Fjk":{     "node":"127.0.0.1:53297_e%2Fjk",     "cores":1,     "freedisk":1},   "127.0.0.1:53347_e%2Fjk":{     "node":"127.0.0.1:53347_e%2Fjk",     "cores":2,     "freedisk":1},   "127.0.0.1:53313_e%2Fjk":{     "node":"127.0.0.1:53313_e%2Fjk",     "cores":2,     "freedisk":1},   "127.0.0.1:53262_e%2Fjk":{     "node":"127.0.0.1:53262_e%2Fjk",     "cores":1,     "freedisk":1},   "127.0.0.1:53280_e%2Fjk":{     "node":"127.0.0.1:53280_e%2Fjk",     "cores":1,     "freedisk":1},   "127.0.0.1:53333_e%2Fjk":{     "node":"127.0.0.1:53333_e%2Fjk",     "cores":1,     "freedisk":1}} Initial state for the coll : {"shard1":{     "127.0.0.1:53313_e%2Fjk":1,     "127.0.0.1:53347_e%2Fjk":1}}

Stack Trace:
org.apache.solr.client.solrj.impl.HttpSolrClient$RemoteSolrException: Error from server at http://127.0.0.1:53280/e/jk: Could not identify nodes matching the rules [{"cores":"<4"}, {
  "replica":"<2",
  "node":"*"}, {"freedisk":">1"}]
 tag values{
  "127.0.0.1:53297_e%2Fjk":{
    "node":"127.0.0.1:53297_e%2Fjk",
    "cores":1,
    "freedisk":1},
  "127.0.0.1:53347_e%2Fjk":{
    "node":"127.0.0.1:53347_e%2Fjk",
    "cores":2,
    "freedisk":1},
  "127.0.0.1:53313_e%2Fjk":{
    "node":"127.0.0.1:53313_e%2Fjk",
    "cores":2,
    "freedisk":1},
  "127.0.0.1:53262_e%2Fjk":{
    "node":"127.0.0.1:53262_e%2Fjk",
    "cores":1,
    "freedisk":1},
  "127.0.0.1:53280_e%2Fjk":{
    "node":"127.0.0.1:53280_e%2Fjk",
    "cores":1,
    "freedisk":1},
  "127.0.0.1:53333_e%2Fjk":{
    "node":"127.0.0.1:53333_e%2Fjk",
    "cores":1,
    "freedisk":1}}
Initial state for the coll : {"shard1":{
    "127.0.0.1:53313_e%2Fjk":1,
    "127.0.0.1:53347_e%2Fjk":1}}
	at __randomizedtesting.SeedInfo.seed([25880A5E9E88BC44:C0BB4DDF82FC4E46]:0)
	at org.apache.solr.client.solrj.impl.HttpSolrClient.executeMethod(HttpSolrClient.java:576)
	at org.apache.solr.client.solrj.impl.HttpSolrClient.request(HttpSolrClient.java:240)
	at org.apache.solr.client.solrj.impl.HttpSolrClient.request(HttpSolrClient.java:229)
	at org.apache.solr.client.solrj.SolrRequest.process(SolrRequest.java:149)
	at org.apache.solr.client.solrj.SolrRequest.process(SolrRequest.java:166)
	at org.apache.solr.cloud.rule.RulesTest.doIntegrationTest(RulesTest.java:82)
	at sun.reflect.NativeMethodAccessorImpl.invoke0(Native Method)
	at sun.reflect.NativeMethodAccessorImpl.invoke(NativeMethodAccessorImpl.java:62)
	at sun.reflect.DelegatingMethodAccessorImpl.invoke(DelegatingMethodAccessorImpl.java:43)
	at java.lang.reflect.Method.invoke(Method.java:498)
	at com.carrotsearch.randomizedtesting.RandomizedRunner.invoke(RandomizedRunner.java:1764)
	at com.carrotsearch.randomizedtesting.RandomizedRunner$8.evaluate(RandomizedRunner.java:871)
	at com.carrotsearch.randomizedtesting.RandomizedRunner$9.evaluate(RandomizedRunner.java:907)
	at com.carrotsearch.randomizedtesting.RandomizedRunner$10.evaluate(RandomizedRunner.java:921)
	at org.apache.solr.BaseDistributedSearchTestCase$ShardsRepeatRule$ShardsFixedStatement.callStatement(BaseDistributedSearchTestCase.java:964)
	at org.apache.solr.BaseDistributedSearchTestCase$ShardsRepeatRule$ShardsStatement.evaluate(BaseDistributedSearchTestCase.java:939)
	at com.carrotsearch.randomizedtesting.rules.SystemPropertiesRestoreRule$1.evaluate(SystemPropertiesRestoreRule.java:57)
	at org.apache.lucene.util.TestRuleSetupTeardownChained$1.evaluate(TestRuleSetupTeardownChained.java:49)
	at org.apache.lucene.util.AbstractBeforeAfterRule$1.evaluate(AbstractBeforeAfterRule.java:45)
	at org.apache.lucene.util.TestRuleThreadAndTestName$1.evaluate(TestRuleThreadAndTestName.java:48)
	at org.apache.lucene.util.TestRuleIgnoreAfterMaxFailures$1.evaluate(TestRuleIgnoreAfterMaxFailures.java:64)
	at org.apache.lucene.util.TestRuleMarkFailure$1.evaluate(TestRuleMarkFailure.java:47)
	at com.carrotsearch.randomizedtesting.rules.StatementAdapter.evaluate(StatementAdapter.java:36)
	at com.carrotsearch.randomizedtesting.ThreadLeakControl$StatementRunner.run(ThreadLeakControl.java:367)
	at com.carrotsearch.randomizedtesting.ThreadLeakControl.forkTimeoutingTask(ThreadLeakControl.java:809)
	at com.carrotsearch.randomizedtesting.ThreadLeakControl$3.evaluate(ThreadLeakControl.java:460)
	at com.carrotsearch.randomizedtesting.RandomizedRunner.runSingleTest(RandomizedRunner.java:880)
	at com.carrotsearch.randomizedtesting.RandomizedRunner$5.evaluate(RandomizedRunner.java:781)
	at com.carrotsearch.randomizedtesting.RandomizedRunner$6.evaluate(RandomizedRunner.java:816)
	at com.carrotsearch.randomizedtesting.RandomizedRunner$7.evaluate(RandomizedRunner.java:827)
	at com.carrotsearch.randomizedtesting.rules.StatementAdapter.evaluate(StatementAdapter.java:36)
	at com.carrotsearch.randomizedtesting.rules.SystemPropertiesRestoreRule$1.evaluate(SystemPropertiesRestoreRule.java:57)
	at org.apache.lucene.util.AbstractBeforeAfterRule$1.evaluate(AbstractBeforeAfterRule.java:45)
	at com.carrotsearch.randomizedtesting.rules.StatementAdapter.evaluate(StatementAdapter.java:36)
	at org.apache.lucene.util.TestRuleStoreClassName$1.evaluate(TestRuleStoreClassName.java:41)
	at com.carrotsearch.randomizedtesting.rules.NoShadowingOrOverridesOnMethodsRule$1.evaluate(NoShadowingOrOverridesOnMethodsRule.java:40)
	at com.carrotsearch.randomizedtesting.rules.NoShadowingOrOverridesOnMethodsRule$1.evaluate(NoShadowingOrOverridesOnMethodsRule.java:40)
	at com.carrotsearch.randomizedtesting.rules.StatementAdapter.evaluate(StatementAdapter.java:36)
	at com.carrotsearch.randomizedtesting.rules.StatementAdapter.evaluate(StatementAdapter.java:36)
	at com.carrotsearch.randomizedtesting.rules.StatementAdapter.evaluate(StatementAdapter.java:36)
	at org.apache.lucene.util.TestRuleAssertionsRequired$1.evaluate(TestRuleAssertionsRequired.java:53)
	at org.apache.lucene.util.TestRuleMarkFailure$1.evaluate(TestRuleMarkFailure.java:47)
	at org.apache.lucene.util.TestRuleIgnoreAfterMaxFailures$1.evaluate(TestRuleIgnoreAfterMaxFailures.java:64)
	at org.apache.lucene.util.TestRuleIgnoreTestSuites$1.evaluate(TestRuleIgnoreTestSuites.java:54)
	at com.carrotsearch.randomizedtesting.rules.StatementAdapter.evaluate(StatementAdapter.java:36)
	at com.carrotsearch.randomizedtesting.ThreadLeakControl$StatementRunner.run(ThreadLeakControl.java:367)
	at java.lang.Thread.run(Thread.java:745)




Build Log:
[...truncated 12134 lines...]
   [junit4] Suite: org.apache.solr.cloud.rule.RulesTest
   [junit4]   2> Creating dataDir: C:\Users\JenkinsSlave\workspace\Lucene-Solr-5.5-Windows\solr\build\solr-core\test\J1\temp\solr.cloud.rule.RulesTest_25880A5E9E88BC44-001\init-core-data-001
   [junit4]   2> 2599184 INFO  (SUITE-RulesTest-seed#[25880A5E9E88BC44]-worker) [    ] o.a.s.SolrTestCaseJ4 Randomized ssl (false) and clientAuth (false)
   [junit4]   2> 2599185 INFO  (SUITE-RulesTest-seed#[25880A5E9E88BC44]-worker) [    ] o.a.s.BaseDistributedSearchTestCase Setting hostContext system property: /e/jk
   [junit4]   2> 2599188 INFO  (TEST-RulesTest.testPortRule-seed#[25880A5E9E88BC44]) [    ] o.a.s.c.ZkTestServer STARTING ZK TEST SERVER
   [junit4]   2> 2599188 INFO  (Thread-7203) [    ] o.a.s.c.ZkTestServer client port:0.0.0.0/0.0.0.0:0
   [junit4]   2> 2599188 INFO  (Thread-7203) [    ] o.a.s.c.ZkTestServer Starting server
   [junit4]   2> 2599289 INFO  (TEST-RulesTest.testPortRule-seed#[25880A5E9E88BC44]) [    ] o.a.s.c.ZkTestServer start zk server on port:52977
   [junit4]   2> 2599289 INFO  (TEST-RulesTest.testPortRule-seed#[25880A5E9E88BC44]) [    ] o.a.s.c.c.SolrZkClient Using default ZkCredentialsProvider
   [junit4]   2> 2599290 INFO  (TEST-RulesTest.testPortRule-seed#[25880A5E9E88BC44]) [    ] o.a.s.c.c.ConnectionManager Waiting for client to connect to ZooKeeper
   [junit4]   2> 2599293 INFO  (zkCallback-2607-thread-1) [    ] o.a.s.c.c.ConnectionManager Watcher org.apache.solr.common.cloud.ConnectionManager@4485bccb name:ZooKeeperConnection Watcher:127.0.0.1:52977 got event WatchedEvent state:SyncConnected type:None path:null path:null type:None
   [junit4]   2> 2599294 INFO  (TEST-RulesTest.testPortRule-seed#[25880A5E9E88BC44]) [    ] o.a.s.c.c.ConnectionManager Client is connected to ZooKeeper
   [junit4]   2> 2599294 INFO  (TEST-RulesTest.testPortRule-seed#[25880A5E9E88BC44]) [    ] o.a.s.c.c.SolrZkClient Using default ZkACLProvider
   [junit4]   2> 2599294 INFO  (TEST-RulesTest.testPortRule-seed#[25880A5E9E88BC44]) [    ] o.a.s.c.c.SolrZkClient makePath: /solr
   [junit4]   2> 2599297 WARN  (NIOServerCxn.Factory:0.0.0.0/0.0.0.0:0) [    ] o.a.z.s.NIOServerCnxn caught end of stream exception
   [junit4]   2> EndOfStreamException: Unable to read additional data from client sessionid 0x152fbe00a4c0000, likely client has closed socket
   [junit4]   2> 	at org.apache.zookeeper.server.NIOServerCnxn.doIO(NIOServerCnxn.java:228)
   [junit4]   2> 	at org.apache.zookeeper.server.NIOServerCnxnFactory.run(NIOServerCnxnFactory.java:208)
   [junit4]   2> 	at java.lang.Thread.run(Thread.java:745)
   [junit4]   2> 2599297 INFO  (TEST-RulesTest.testPortRule-seed#[25880A5E9E88BC44]) [    ] o.a.s.c.c.SolrZkClient Using default ZkCredentialsProvider
   [junit4]   2> 2599300 INFO  (TEST-RulesTest.testPortRule-seed#[25880A5E9E88BC44]) [    ] o.a.s.c.c.ConnectionManager Waiting for client to connect to ZooKeeper
   [junit4]   2> 2599302 INFO  (zkCallback-2608-thread-1) [    ] o.a.s.c.c.ConnectionManager Watcher org.apache.solr.common.cloud.ConnectionManager@6378b242 name:ZooKeeperConnection Watcher:127.0.0.1:52977/solr got event WatchedEvent state:SyncConnected type:None path:null path:null type:None
   [junit4]   2> 2599304 INFO  (TEST-RulesTest.testPortRule-seed#[25880A5E9E88BC44]) [    ] o.a.s.c.c.ConnectionManager Client is connected to ZooKeeper
   [junit4]   2> 2599304 INFO  (TEST-RulesTest.testPortRule-seed#[25880A5E9E88BC44]) [    ] o.a.s.c.c.SolrZkClient Using default ZkACLProvider
   [junit4]   2> 2599304 INFO  (TEST-RulesTest.testPortRule-seed#[25880A5E9E88BC44]) [    ] o.a.s.c.c.SolrZkClient makePath: /collections/collection1
   [junit4]   2> 2599307 INFO  (TEST-RulesTest.testPortRule-seed#[25880A5E9E88BC44]) [    ] o.a.s.c.c.SolrZkClient makePath: /collections/collection1/shards
   [junit4]   2> 2599309 INFO  (TEST-RulesTest.testPortRule-seed#[25880A5E9E88BC44]) [    ] o.a.s.c.c.SolrZkClient makePath: /collections/control_collection
   [junit4]   2> 2599310 INFO  (TEST-RulesTest.testPortRule-seed#[25880A5E9E88BC44]) [    ] o.a.s.c.c.SolrZkClient makePath: /collections/control_collection/shards
   [junit4]   2> 2599313 INFO  (TEST-RulesTest.testPortRule-seed#[25880A5E9E88BC44]) [    ] o.a.s.c.AbstractZkTestCase put C:\Users\JenkinsSlave\workspace\Lucene-Solr-5.5-Windows\solr\core\src\test-files\solr\collection1\conf\solrconfig-tlog.xml to /configs/conf1/solrconfig.xml
   [junit4]   2> 2599313 INFO  (TEST-RulesTest.testPortRule-seed#[25880A5E9E88BC44]) [    ] o.a.s.c.c.SolrZkClient makePath: /configs/conf1/solrconfig.xml
   [junit4]   2> 2599316 INFO  (TEST-RulesTest.testPortRule-seed#[25880A5E9E88BC44]) [    ] o.a.s.c.AbstractZkTestCase put C:\Users\JenkinsSlave\workspace\Lucene-Solr-5.5-Windows\solr\core\src\test-files\solr\collection1\conf\schema.xml to /configs/conf1/schema.xml
   [junit4]   2> 2599317 INFO  (TEST-RulesTest.testPortRule-seed#[25880A5E9E88BC44]) [    ] o.a.s.c.c.SolrZkClient makePath: /configs/conf1/schema.xml
   [junit4]   2> 2599319 INFO  (TEST-RulesTest.testPortRule-seed#[25880A5E9E88BC44]) [    ] o.a.s.c.AbstractZkTestCase put C:\Users\JenkinsSlave\workspace\Lucene-Solr-5.5-Windows\solr\core\src\test-files\solr\collection1\conf\solrconfig.snippet.randomindexconfig.xml to /configs/conf1/solrconfig.snippet.randomindexconfig.xml
   [junit4]   2> 2599319 INFO  (TEST-RulesTest.testPortRule-seed#[25880A5E9E88BC44]) [    ] o.a.s.c.c.SolrZkClient makePath: /configs/conf1/solrconfig.snippet.randomindexconfig.xml
   [junit4]   2> 2599321 INFO  (TEST-RulesTest.testPortRule-seed#[25880A5E9E88BC44]) [    ] o.a.s.c.AbstractZkTestCase put C:\Users\JenkinsSlave\workspace\Lucene-Solr-5.5-Windows\solr\core\src\test-files\solr\collection1\conf\stopwords.txt to /configs/conf1/stopwords.txt
   [junit4]   2> 2599322 INFO  (TEST-RulesTest.testPortRule-seed#[25880A5E9E88BC44]) [    ] o.a.s.c.c.SolrZkClient makePath: /configs/conf1/stopwords.txt
   [junit4]   2> 2599324 INFO  (TEST-RulesTest.testPortRule-seed#[25880A5E9E88BC44]) [    ] o.a.s.c.AbstractZkTestCase put C:\Users\JenkinsSlave\workspace\Lucene-Solr-5.5-Windows\solr\core\src\test-files\solr\collection1\conf\protwords.txt to /configs/conf1/protwords.txt
   [junit4]   2> 2599324 INFO  (TEST-RulesTest.testPortRule-seed#[25880A5E9E88BC44]) [    ] o.a.s.c.c.SolrZkClient makePath: /configs/conf1/protwords.txt
   [junit4]   2> 2599327 INFO  (TEST-RulesTest.testPortRule-seed#[25880A5E9E88BC44]) [    ] o.a.s.c.AbstractZkTestCase put C:\Users\JenkinsSlave\workspace\Lucene-Solr-5.5-Windows\solr\core\src\test-files\solr\collection1\conf\currency.xml to /configs/conf1/currency.xml
   [junit4]   2> 2599327 INFO  (TEST-RulesTest.testPortRule-seed#[25880A5E9E88BC44]) [    ] o.a.s.c.c.SolrZkClient makePath: /configs/conf1/currency.xml
   [junit4]   2> 2599329 INFO  (TEST-RulesTest.testPortRule-seed#[25880A5E9E88BC44]) [    ] o.a.s.c.AbstractZkTestCase put C:\Users\JenkinsSlave\workspace\Lucene-Solr-5.5-Windows\solr\core\src\test-files\solr\collection1\conf\enumsConfig.xml to /configs/conf1/enumsConfig.xml
   [junit4]   2> 2599329 INFO  (TEST-RulesTest.testPortRule-seed#[25880A5E9E88BC44]) [    ] o.a.s.c.c.SolrZkClient makePath: /configs/conf1/enumsConfig.xml
   [junit4]   2> 2599332 INFO  (TEST-RulesTest.testPortRule-seed#[25880A5E9E88BC44]) [    ] o.a.s.c.AbstractZkTestCase put C:\Users\JenkinsSlave\workspace\Lucene-Solr-5.5-Windows\solr\core\src\test-files\solr\collection1\conf\open-exchange-rates.json to /configs/conf1/open-exchange-rates.json
   [junit4]   2> 2599333 INFO  (TEST-RulesTest.testPortRule-seed#[25880A5E9E88BC44]) [    ] o.a.s.c.c.SolrZkClient makePath: /configs/conf1/open-exchange-rates.json
   [junit4]   2> 2599335 INFO  (TEST-RulesTest.testPortRule-seed#[25880A5E9E88BC44]) [    ] o.a.s.c.AbstractZkTestCase put C:\Users\JenkinsSlave\workspace\Lucene-Solr-5.5-Windows\solr\core\src\test-files\solr\collection1\conf\mapping-ISOLatin1Accent.txt to /configs/conf1/mapping-ISOLatin1Accent.txt
   [junit4]   2> 2599335 INFO  (TEST-RulesTest.testPortRule-seed#[25880A5E9E88BC44]) [    ] o.a.s.c.c.SolrZkClient makePath: /configs/conf1/mapping-ISOLatin1Accent.txt
   [junit4]   2> 2599337 INFO  (TEST-RulesTest.testPortRule-seed#[25880A5E9E88BC44]) [    ] o.a.s.c.AbstractZkTestCase put C:\Users\JenkinsSlave\workspace\Lucene-Solr-5.5-Windows\solr\core\src\test-files\solr\collection1\conf\old_synonyms.txt to /configs/conf1/old_synonyms.txt
   [junit4]   2> 2599338 INFO  (TEST-RulesTest.testPortRule-seed#[25880A5E9E88BC44]) [    ] o.a.s.c.c.SolrZkClient makePath: /configs/conf1/old_synonyms.txt
   [junit4]   2> 2599340 INFO  (TEST-RulesTest.testPortRule-seed#[25880A5E9E88BC44]) [    ] o.a.s.c.AbstractZkTestCase put C:\Users\JenkinsSlave\workspace\Lucene-Solr-5.5-Windows\solr\core\src\test-files\solr\collection1\conf\synonyms.txt to /configs/conf1/synonyms.txt
   [junit4]   2> 2599341 INFO  (TEST-RulesTest.testPortRule-seed#[25880A5E9E88BC44]) [    ] o.a.s.c.c.SolrZkClient makePath: /configs/conf1/synonyms.txt
   [junit4]   2> 2599927 INFO  (TEST-RulesTest.testPortRule-seed#[25880A5E9E88BC44]) [    ] o.a.s.SolrTestCaseJ4 Writing core.properties file to C:\Users\JenkinsSlave\workspace\Lucene-Solr-5.5-Windows\solr\build\solr-core\test\J1\temp\solr.cloud.rule.RulesTest_25880A5E9E88BC44-001\control-001\cores\collection1
   [junit4]   2> 2599930 INFO  (TEST-RulesTest.testPortRule-seed#[25880A5E9E88BC44]) [    ] o.e.j.s.Server jetty-9.2.13.v20150730
   [junit4]   2> 2599932 INFO  (TEST-RulesTest.testPortRule-seed#[25880A5E9E88BC44]) [    ] o.e.j.s.h.ContextHandler Started o.e.j.s.ServletContextHandler@37d357{/e/jk,null,AVAILABLE}
   [junit4]   2> 2599933 INFO  (TEST-RulesTest.testPortRule-seed#[25880A5E9E88BC44]) [    ] o.e.j.s.ServerConnector Started ServerConnector@7f68203e{HTTP/1.1}{127.0.0.1:52984}
   [junit4]   2> 2599934 INFO  (TEST-RulesTest.testPortRule-seed#[25880A5E9E88BC44]) [    ] o.e.j.s.Server Started @2605104ms
   [junit4]   2> 2599934 INFO  (TEST-RulesTest.testPortRule-seed#[25880A5E9E88BC44]) [    ] o.a.s.c.s.e.JettySolrRunner Jetty properties: {solr.data.dir=C:\Users\JenkinsSlave\workspace\Lucene-Solr-5.5-Windows\solr\build\solr-core\test\J1\temp\solr.cloud.rule.RulesTest_25880A5E9E88BC44-001\tempDir-001/control/data, hostContext=/e/jk, hostPort=52984, coreRootDirectory=C:\Users\JenkinsSlave\workspace\Lucene-Solr-5.5-Windows\solr\build\solr-core\test\J1\..\..\..\..\..\..\..\..\..\Users\JenkinsSlave\workspace\Lucene-Solr-5.5-Windows\solr\build\solr-core\test\J1\temp\solr.cloud.rule.RulesTest_25880A5E9E88BC44-001\control-001\cores}
   [junit4]   2> 2599934 INFO  (TEST-RulesTest.testPortRule-seed#[25880A5E9E88BC44]) [    ] o.a.s.s.SolrDispatchFilter SolrDispatchFilter.init(): sun.misc.Launcher$AppClassLoader@73d16e93
   [junit4]   2> 2599934 INFO  (TEST-RulesTest.testPortRule-seed#[25880A5E9E88BC44]) [    ] o.a.s.c.SolrResourceLoader new SolrResourceLoader for directory: 'C:\Users\JenkinsSlave\workspace\Lucene-Solr-5.5-Windows\solr\build\solr-core\test\J1\temp\solr.cloud.rule.RulesTest_25880A5E9E88BC44-001\control-001'
   [junit4]   2> 2599934 INFO  (TEST-RulesTest.testPortRule-seed#[25880A5E9E88BC44]) [    ] o.a.s.c.SolrResourceLoader JNDI not configured for solr (NoInitialContextEx)
   [junit4]   2> 2599934 INFO  (TEST-RulesTest.testPortRule-seed#[25880A5E9E88BC44]) [    ] o.a.s.c.SolrResourceLoader solr home defaulted to 'solr/' (could not find system property or JNDI)
   [junit4]   2> 2599935 INFO  (TEST-RulesTest.testPortRule-seed#[25880A5E9E88BC44]) [    ] o.a.s.c.c.SolrZkClient Using default ZkCredentialsProvider
   [junit4]   2> 2599936 INFO  (TEST-RulesTest.testPortRule-seed#[25880A5E9E88BC44]) [    ] o.a.s.c.c.ConnectionManager Waiting for client to connect to ZooKeeper
   [junit4]   2> 2599937 INFO  (zkCallback-2609-thread-1) [    ] o.a.s.c.c.ConnectionManager Watcher org.apache.solr.common.cloud.ConnectionManager@6f513b95 name:ZooKeeperConnection Watcher:127.0.0.1:52977/solr got event WatchedEvent state:SyncConnected type:None path:null path:null type:None
   [junit4]   2> 2599937 INFO  (TEST-RulesTest.testPortRule-seed#[25880A5E9E88BC44]) [    ] o.a.s.c.c.ConnectionManager Client is connected to ZooKeeper
   [junit4]   2> 2599937 INFO  (TEST-RulesTest.testPortRule-seed#[25880A5E9E88BC44]) [    ] o.a.s.c.c.SolrZkClient Using default ZkACLProvider
   [junit4]   2> 2599938 INFO  (TEST-RulesTest.testPortRule-seed#[25880A5E9E88BC44]) [    ] o.a.s.s.SolrDispatchFilter Loading solr.xml from SolrHome (not found in ZooKeeper)
   [junit4]   2> 2599938 INFO  (TEST-RulesTest.testPortRule-seed#[25880A5E9E88BC44]) [    ] o.a.s.c.SolrXmlConfig Loading container configuration from C:\Users\JenkinsSlave\workspace\Lucene-Solr-5.5-Windows\solr\build\solr-core\test\J1\temp\solr.cloud.rule.RulesTest_25880A5E9E88BC44-001\control-001\solr.xml
   [junit4]   2> 2599947 INFO  (TEST-RulesTest.testPortRule-seed#[25880A5E9E88BC44]) [    ] o.a.s.c.CorePropertiesLocator Config-defined core root directory: C:\Users\JenkinsSlave\workspace\Lucene-Solr-5.5-Windows\solr\build\solr-core\test\J1\..\..\..\..\..\..\..\..\..\Users\JenkinsSlave\workspace\Lucene-Solr-5.5-Windows\solr\build\solr-core\test\J1\temp\solr.cloud.rule.RulesTest_25880A5E9E88BC44-001\control-001\cores
   [junit4]   2> 2599947 INFO  (TEST-RulesTest.testPortRule-seed#[25880A5E9E88BC44]) [    ] o.a.s.c.CoreContainer New CoreContainer 396519850
   [junit4]   2> 2599947 INFO  (TEST-RulesTest.testPortRule-seed#[25880A5E9E88BC44]) [    ] o.a.s.c.CoreContainer Loading cores into CoreContainer [instanceDir=C:\Users\JenkinsSlave\workspace\Lucene-Solr-5.5-Windows\solr\build\solr-core\test\J1\temp\solr.cloud.rule.RulesTest_25880A5E9E88BC44-001\control-001]
   [junit4]   2> 2599947 WARN  (TEST-RulesTest.testPortRule-seed#[25880A5E9E88BC44]) [    ] o.a.s.c.CoreContainer Couldn't add files from C:\Users\JenkinsSlave\workspace\Lucene-Solr-5.5-Windows\solr\build\solr-core\test\J1\temp\solr.cloud.rule.RulesTest_25880A5E9E88BC44-001\control-001\lib to classpath: C:\Users\JenkinsSlave\workspace\Lucene-Solr-5.5-Windows\solr\build\solr-core\test\J1\temp\solr.cloud.rule.RulesTest_25880A5E9E88BC44-001\control-001\lib
   [junit4]   2> 2599948 INFO  (TEST-RulesTest.testPortRule-seed#[25880A5E9E88BC44]) [    ] o.a.s.h.c.HttpShardHandlerFactory created with socketTimeout : 90000,urlScheme : ,connTimeout : 15000,maxConnectionsPerHost : 20,maxConnections : 10000,corePoolSize : 0,maximumPoolSize : 2147483647,maxThreadIdleTime : 5,sizeOfQueue : -1,fairnessPolicy : false,useRetries : false,
   [junit4]   2> 2599951 INFO  (TEST-RulesTest.testPortRule-seed#[25880A5E9E88BC44]) [    ] o.a.s.u.UpdateShardHandler Creating UpdateShardHandler HTTP client with params: socketTimeout=340000&connTimeout=45000&retry=true
   [junit4]   2> 2599951 INFO  (TEST-RulesTest.testPortRule-seed#[25880A5E9E88BC44]) [    ] o.a.s.l.LogWatcher SLF4J impl is org.slf4j.impl.Log4jLoggerFactory
   [junit4]   2> 2599951 INFO  (TEST-RulesTest.testPortRule-seed#[25880A5E9E88BC44]) [    ] o.a.s.l.LogWatcher Registering Log Listener [Log4j (org.slf4j.impl.Log4jLoggerFactory)]
   [junit4]   2> 2599952 INFO  (TEST-RulesTest.testPortRule-seed#[25880A5E9E88BC44]) [    ] o.a.s.c.ZkContainer Zookeeper client=127.0.0.1:52977/solr
   [junit4]   2> 2599952 INFO  (TEST-RulesTest.testPortRule-seed#[25880A5E9E88BC44]) [    ] o.a.s.c.ZkController zkHost includes chroot
   [junit4]   2> 2599952 INFO  (TEST-RulesTest.testPortRule-seed#[25880A5E9E88BC44]) [    ] o.a.s.c.c.SolrZkClient Using default ZkCredentialsProvider
   [junit4]   2> 2599953 INFO  (TEST-RulesTest.testPortRule-seed#[25880A5E9E88BC44]) [    ] o.a.s.c.c.ConnectionManager Waiting for client to connect to ZooKeeper
   [junit4]   2> 2599954 INFO  (zkCallback-2612-thread-1) [    ] o.a.s.c.c.ConnectionManager Watcher org.apache.solr.common.cloud.ConnectionManager@38fbf57f name:ZooKeeperConnection Watcher:127.0.0.1:52977 got event WatchedEvent state:SyncConnected type:None path:null path:null type:None
   [junit4]   2> 2599954 INFO  (TEST-RulesTest.testPortRule-seed#[25880A5E9E88BC44]) [    ] o.a.s.c.c.ConnectionManager Client is connected to ZooKeeper
   [junit4]   2> 2599955 INFO  (TEST-RulesTest.testPortRule-seed#[25880A5E9E88BC44]) [    ] o.a.s.c.c.SolrZkClient Using default ZkACLProvider
   [junit4]   2> 2599957 INFO  (TEST-RulesTest.testPortRule-seed#[25880A5E9E88BC44]) [n:127.0.0.1:52984_e%2Fjk    ] o.a.s.c.c.ConnectionManager Waiting for client to connect to ZooKeeper
   [junit4]   2> 2599959 INFO  (zkCallback-2613-thread-1-processing-n:127.0.0.1:52984_e%2Fjk) [n:127.0.0.1:52984_e%2Fjk    ] o.a.s.c.c.ConnectionManager Watcher org.apache.solr.common.cloud.ConnectionManager@7a41f297 name:ZooKeeperConnection Watcher:127.0.0.1:52977/solr got event WatchedEvent state:SyncConnected type:None path:null path:null type:None
   [junit4]   2> 2599959 INFO  (TEST-RulesTest.testPortRule-seed#[25880A5E9E88BC44]) [n:127.0.0.1:52984_e%2Fjk    ] o.a.s.c.c.ConnectionManager Client is connected to ZooKeeper
   [junit4]   2> 2599960 INFO  (TEST-RulesTest.testPortRule-seed#[25880A5E9E88BC44]) [n:127.0.0.1:52984_e%2Fjk    ] o.a.s.c.c.SolrZkClient makePath: /overseer/queue
   [junit4]   2> 2599962 INFO  (TEST-RulesTest.testPortRule-seed#[25880A5E9E88BC44]) [n:127.0.0.1:52984_e%2Fjk    ] o.a.s.c.c.SolrZkClient makePath: /overseer/collection-queue-work
   [junit4]   2> 2599965 INFO  (TEST-RulesTest.testPortRule-seed#[25880A5E9E88BC44]) [n:127.0.0.1:52984_e%2Fjk    ] o.a.s.c.c.SolrZkClient makePath: /overseer/collection-map-running
   [junit4]   2> 2599968 INFO  (TEST-RulesTest.testPortRule-seed#[25880A5E9E88BC44]) [n:127.0.0.1:52984_e%2Fjk    ] o.a.s.c.c.SolrZkClient makePath: /overseer/collection-map-completed
   [junit4]   2> 2599970 INFO  (TEST-RulesTest.testPortRule-seed#[25880A5E9E88BC44]) [n:127.0.0.1:52984_e%2Fjk    ] o.a.s.c.c.SolrZkClient makePath: /overseer/collection-map-failure
   [junit4]   2> 2599972 INFO  (TEST-RulesTest.testPortRule-seed#[25880A5E9E88BC44]) [n:127.0.0.1:52984_e%2Fjk    ] o.a.s.c.c.SolrZkClient makePath: /live_nodes
   [junit4]   2> 2599974 INFO  (TEST-RulesTest.testPortRule-seed#[25880A5E9E88BC44]) [n:127.0.0.1:52984_e%2Fjk    ] o.a.s.c.c.SolrZkClient makePath: /aliases.json
   [junit4]   2> 2599976 INFO  (TEST-RulesTest.testPortRule-seed#[25880A5E9E88BC44]) [n:127.0.0.1:52984_e%2Fjk    ] o.a.s.c.c.SolrZkClient makePath: /clusterstate.json
   [junit4]   2> 2599977 INFO  (TEST-RulesTest.testPortRule-seed#[25880A5E9E88BC44]) [n:127.0.0.1:52984_e%2Fjk    ] o.a.s.c.c.SolrZkClient makePath: /security.json
   [junit4]   2> 2599979 INFO  (TEST-RulesTest.testPortRule-seed#[25880A5E9E88BC44]) [n:127.0.0.1:52984_e%2Fjk    ] o.a.s.c.ZkController Register node as live in ZooKeeper:/live_nodes/127.0.0.1:52984_e%2Fjk
   [junit4]   2> 2599979 INFO  (TEST-RulesTest.testPortRule-seed#[25880A5E9E88BC44]) [n:127.0.0.1:52984_e%2Fjk    ] o.a.s.c.c.SolrZkClient makePath: /live_nodes/127.0.0.1:52984_e%2Fjk
   [junit4]   2> 2599980 INFO  (TEST-RulesTest.testPortRule-seed#[25880A5E9E88BC44]) [n:127.0.0.1:52984_e%2Fjk    ] o.a.s.c.c.SolrZkClient makePath: /overseer_elect
   [junit4]   2> 2599981 INFO  (TEST-RulesTest.testPortRule-seed#[25880A5E9E88BC44]) [n:127.0.0.1:52984_e%2Fjk    ] o.a.s.c.c.SolrZkClient makePath: /overseer_elect/election
   [junit4]   2> 2599983 INFO  (TEST-RulesTest.testPortRule-seed#[25880A5E9E88BC44]) [n:127.0.0.1:52984_e%2Fjk    ] o.a.s.c.Overseer Overseer (id=null) closing
   [junit4]   2> 2599983 INFO  (TEST-RulesTest.testPortRule-seed#[25880A5E9E88BC44]) [n:127.0.0.1:52984_e%2Fjk    ] o.a.s.c.LeaderElector Joined leadership election with path: /overseer_elect/election/95415481792200708-127.0.0.1:52984_e%2Fjk-n_0000000000
   [junit4]   2> 2599983 INFO  (TEST-RulesTest.testPortRule-seed#[25880A5E9E88BC44]) [n:127.0.0.1:52984_e%2Fjk    ] o.a.s.c.OverseerElectionContext I am going to be the leader 127.0.0.1:52984_e%2Fjk
   [junit4]   2> 2599983 INFO  (TEST-RulesTest.testPortRule-seed#[25880A5E9E88BC44]) [n:127.0.0.1:52984_e%2Fjk    ] o.a.s.c.c.SolrZkClient makePath: /overseer_elect/leader
   [junit4]   2> 2599985 INFO  (TEST-RulesTest.testPortRule-seed#[25880A5E9E88BC44]) [n:127.0.0.1:52984_e%2Fjk    ] o.a.s.c.Overseer Overseer (id=95415481792200708-127.0.0.1:52984_e%2Fjk-n_0000000000) starting
   [junit4]   2> 2599987 INFO  (TEST-RulesTest.testPortRule-seed#[25880A5E9E88BC44]) [n:127.0.0.1:52984_e%2Fjk    ] o.a.s.c.c.SolrZkClient makePath: /overseer/queue-work
   [junit4]   2> 2599994 INFO  (TEST-RulesTest.testPortRule-seed#[25880A5E9E88BC44]) [n:127.0.0.1:52984_e%2Fjk    ] o.a.s.c.OverseerAutoReplicaFailoverThread Starting OverseerAutoReplicaFailoverThread autoReplicaFailoverWorkLoopDelay=10000 autoReplicaFailoverWaitAfterExpiration=30000 autoReplicaFailoverBadNodeExpiration=60000
   [junit4]   2> 2599994 INFO  (OverseerCollectionConfigSetProcessor-95415481792200708-127.0.0.1:52984_e%2Fjk-n_0000000000) [n:127.0.0.1:52984_e%2Fjk    ] o.a.s.c.OverseerTaskProcessor Process current queue of overseer operations
   [junit4]   2> 2599994 INFO  (TEST-RulesTest.testPortRule-seed#[25880A5E9E88BC44]) [n:127.0.0.1:52984_e%2Fjk    ] o.a.s.c.c.ZkStateReader Updating cluster state from ZooKeeper... 
   [junit4]   2> 2599994 INFO  (OverseerStateUpdate-95415481792200708-127.0.0.1:52984_e%2Fjk-n_0000000000) [n:127.0.0.1:52984_e%2Fjk    ] o.a.s.c.Overseer Starting to work on the main queue
   [junit4]   2> 2600009 INFO  (TEST-RulesTest.testPortRule-seed#[25880A5E9E88BC44]) [n:127.0.0.1:52984_e%2Fjk    ] o.a.s.c.CoreContainer Security conf doesn't exist. Skipping setup for authorization module.
   [junit4]   2> 2600009 INFO  (TEST-RulesTest.testPortRule-seed#[25880A5E9E88BC44]) [n:127.0.0.1:52984_e%2Fjk    ] o.a.s.c.CoreContainer No authentication plugin used.
   [junit4]   2> 2600011 INFO  (TEST-RulesTest.testPortRule-seed#[25880A5E9E88BC44]) [n:127.0.0.1:52984_e%2Fjk    ] o.a.s.c.CorePropertiesLocator Looking for core definitions underneath C:\Users\JenkinsSlave\workspace\Lucene-Solr-5.5-Windows\solr\build\solr-core\test\J1\..\..\..\..\..\..\..\..\..\Users\JenkinsSlave\workspace\Lucene-Solr-5.5-Windows\solr\build\solr-core\test\J1\temp\solr.cloud.rule.RulesTest_25880A5E9E88BC44-001\control-001\cores
   [junit4]   2> 2600016 INFO  (TEST-RulesTest.testPortRule-seed#[25880A5E9E88BC44]) [n:127.0.0.1:52984_e%2Fjk    ] o.a.s.c.CoreDescriptor Created CoreDescriptor: {name=collection1, config=solrconfig.xml, transient=false, schema=schema.xml, loadOnStartup=true, configSetProperties=configsetprops.json, collection=control_collection, coreNodeName=, dataDir=data\, shard=}
   [junit4]   2> 2600016 INFO  (TEST-RulesTest.testPortRule-seed#[25880A5E9E88BC44]) [n:127.0.0.1:52984_e%2Fjk    ] o.a.s.c.CorePropertiesLocator Found core collection1 in C:\Users\JenkinsSlave\workspace\Lucene-Solr-5.5-Windows\solr\build\solr-core\test\J1\..\..\..\..\..\..\..\..\..\Users\JenkinsSlave\workspace\Lucene-Solr-5.5-Windows\solr\build\solr-core\test\J1\temp\solr.cloud.rule.RulesTest_25880A5E9E88BC44-001\control-001\cores\collection1
   [junit4]   2> 2600016 INFO  (TEST-RulesTest.testPortRule-seed#[25880A5E9E88BC44]) [n:127.0.0.1:52984_e%2Fjk    ] o.a.s.c.CorePropertiesLocator Found 1 core definitions
   [junit4]   2> 2600018 INFO  (TEST-RulesTest.testPortRule-seed#[25880A5E9E88BC44]) [n:127.0.0.1:52984_e%2Fjk    ] o.a.s.s.SolrDispatchFilter user.dir=C:\Users\JenkinsSlave\workspace\Lucene-Solr-5.5-Windows\solr\build\solr-core\test\J1
   [junit4]   2> 2600018 INFO  (TEST-RulesTest.testPortRule-seed#[25880A5E9E88BC44]) [n:127.0.0.1:52984_e%2Fjk    ] o.a.s.s.SolrDispatchFilter SolrDispatchFilter.init() done
   [junit4]   2> 2600018 INFO  (coreLoadExecutor-8649-thread-1-processing-n:127.0.0.1:52984_e%2Fjk) [n:127.0.0.1:52984_e%2Fjk c:control_collection   x:collection1] o.a.s.c.ZkController publishing state=down
   [junit4]   2> 2600018 INFO  (coreLoadExecutor-8649-thread-1-processing-n:127.0.0.1:52984_e%2Fjk) [n:127.0.0.1:52984_e%2Fjk c:control_collection   x:collection1] o.a.s.c.ZkController numShards not found on descriptor - reading it from system property
   [junit4]   2> 2600021 INFO  (OverseerStateUpdate-95415481792200708-127.0.0.1:52984_e%2Fjk-n_0000000000) [n:127.0.0.1:52984_e%2Fjk    ] o.a.s.c.Overseer processMessage: queueSize: 1, message = {
   [junit4]   2>   "core":"collection1",
   [junit4]   2>   "roles":null,
   [junit4]   2>   "base_url":"http://127.0.0.1:52984/e/jk",
   [junit4]   2>   "node_name":"127.0.0.1:52984_e%2Fjk",
   [junit4]   2>   "numShards":"1",
   [junit4]   2>   "state":"down",
   [junit4]   2>   "shard":null,
   [junit4]   2>   "collection":"control_collection",
   [junit4]   2>   "operation":"state"} current state version: 0
   [junit4]   2> 2600021 INFO  (coreLoadExecutor-8649-thread-1-processing-n:127.0.0.1:52984_e%2Fjk) [n:127.0.0.1:52984_e%2Fjk c:control_collection   x:collection1] o.a.s.c.ZkController look for our core node name
   [junit4]   2> 2600021 INFO  (OverseerStateUpdate-95415481792200708-127.0.0.1:52984_e%2Fjk-n_0000000000) [n:127.0.0.1:52984_e%2Fjk    ] o.a.s.c.o.ReplicaMutator Update state numShards=1 message={
   [junit4]   2>   "core":"collection1",
   [junit4]   2>   "roles":null,
   [junit4]   2>   "base_url":"http://127.0.0.1:52984/e/jk",
   [junit4]   2>   "node_name":"127.0.0.1:52984_e%2Fjk",
   [junit4]   2>   "numShards":"1",
   [junit4]   2>   "state":"down",
   [junit4]   2>   "shard":null,
   [junit4]   2>   "collection":"control_collection",
   [junit4]   2>   "operation":"state"}
   [junit4]   2> 2600022 INFO  (OverseerStateUpdate-95415481792200708-127.0.0.1:52984_e%2Fjk-n_0000000000) [n:127.0.0.1:52984_e%2Fjk    ] o.a.s.c.o.ClusterStateMutator building a new cName: control_collection
   [junit4]   2> 2600023 INFO  (OverseerStateUpdate-95415481792200708-127.0.0.1:52984_e%2Fjk-n_0000000000) [n:127.0.0.1:52984_e%2Fjk    ] o.a.s.c.o.ReplicaMutator Assigning new node to shard shard=shard1
   [junit4]   2> 2600024 INFO  (zkCallback-2613-thread-1-processing-n:127.0.0.1:52984_e%2Fjk) [n:127.0.0.1:52984_e%2Fjk    ] o.a.s.c.c.ZkStateReader A cluster state change: [WatchedEvent state:SyncConnected type:NodeDataChanged path:/clusterstate.json], has occurred - updating... (live nodes size: [1])
   [junit4]   2> 2601022 INFO  (coreLoadExecutor-8649-thread-1-processing-n:127.0.0.1:52984_e%2Fjk) [n:127.0.0.1:52984_e%2Fjk c:control_collection   x:collection1] o.a.s.c.ZkController waiting to find shard id in clusterstate for collection1
   [junit4]   2> 2601022 INFO  (coreLoadExecutor-8649-thread-1-processing-n:127.0.0.1:52984_e%2Fjk) [n:127.0.0.1:52984_e%2Fjk c:control_collection   x:collection1] o.a.s.c.ZkController Check for collection zkNode:control_collection
   [junit4]   2> 2601023 INFO  (coreLoadExecutor-8649-thread-1-processing-n:127.0.0.1:52984_e%2Fjk) [n:127.0.0.1:52984_e%2Fjk c:control_collection   x:collection1] o.a.s.c.ZkController Collection zkNode exists
   [junit4]   2> 2601023 INFO  (coreLoadExecutor-8649-thread-1-processing-n:127.0.0.1:52984_e%2Fjk) [n:127.0.0.1:52984_e%2Fjk c:control_collection   x:collection1] o.a.s.c.c.ZkStateReader Load collection config from: [/collections/control_collection]
   [junit4]   2> 2601024 INFO  (coreLoadExecutor-8649-thread-1-processing-n:127.0.0.1:52984_e%2Fjk) [n:127.0.0.1:52984_e%2Fjk c:control_collection   x:collection1] o.a.s.c.c.ZkStateReader path=[/collections/control_collection] [configName]=[conf1] specified config exists in ZooKeeper
   [junit4]   2> 2601024 INFO  (coreLoadExecutor-8649-thread-1-processing-n:127.0.0.1:52984_e%2Fjk) [n:127.0.0.1:52984_e%2Fjk c:control_collection   x:collection1] o.a.s.c.SolrResourceLoader new SolrResourceLoader for directory: 'C:\Users\JenkinsSlave\workspace\Lucene-Solr-5.5-Windows\solr\build\solr-core\test\J1\temp\solr.cloud.rule.RulesTest_25880A5E9E88BC44-001\control-001\cores\collection1'
   [junit4]   2> 2601024 INFO  (coreLoadExecutor-8649-thread-1-processing-n:127.0.0.1:52984_e%2Fjk) [n:127.0.0.1:52984_e%2Fjk c:control_collection   x:collection1] o.a.s.c.SolrResourceLoader JNDI not configured for solr (NoInitialContextEx)
   [junit4]   2> 2601024 INFO  (coreLoadExecutor-8649-thread-1-processing-n:127.0.0.1:52984_e%2Fjk) [n:127.0.0.1:52984_e%2Fjk c:control_collection   x:collection1] o.a.s.c.SolrResourceLoader solr home defaulted to 'solr/' (could not find system property or JNDI)
   [junit4]   2> 2601027 INFO  (coreLoadExecutor-8649-thread-1-processing-n:127.0.0.1:52984_e%2Fjk) [n:127.0.0.1:52984_e%2Fjk c:control_collection   x:collection1] o.a.s.c.Config loaded config solrconfig.xml with version 0 
   [junit4]   2> 2601037 INFO  (coreLoadExecutor-8649-thread-1-processing-n:127.0.0.1:52984_e%2Fjk) [n:127.0.0.1:52984_e%2Fjk c:control_collection   x:collection1] o.a.s.c.SolrConfig current version of requestparams : -1
   [junit4]   2> 2601043 INFO  (coreLoadExecutor-8649-thread-1-processing-n:127.0.0.1:52984_e%2Fjk) [n:127.0.0.1:52984_e%2Fjk c:control_collection   x:collection1] o.a.s.c.SolrConfig Using Lucene MatchVersion: 5.5.0
   [junit4]   2> 2601052 INFO  (coreLoadExecutor-8649-thread-1-processing-n:127.0.0.1:52984_e%2Fjk) [n:127.0.0.1:52984_e%2Fjk c:control_collection   x:collection1] o.a.s.c.SolrConfig Loaded SolrConfig: solrconfig.xml
   [junit4]   2> 2601059 INFO  (coreLoadExecutor-8649-thread-1-processing-n:127.0.0.1:52984_e%2Fjk) [n:127.0.0.1:52984_e%2Fjk c:control_collection   x:collection1] o.a.s.s.IndexSchema [collection1] Schema name=test
   [junit4]   2> 2601159 INFO  (coreLoadExecutor-8649-thread-1-processing-n:127.0.0.1:52984_e%2Fjk) [n:127.0.0.1:52984_e%2Fjk c:control_collection   x:collection1] o.a.s.s.OpenExchangeRatesOrgProvider Initialized with rates=open-exchange-rates.json, refreshInterval=1440.
   [junit4]   2> 2601166 INFO  (coreLoadExecutor-8649-thread-1-processing-n:127.0.0.1:52984_e%2Fjk) [n:127.0.0.1:52984_e%2Fjk c:control_collection   x:collection1] o.a.s.s.IndexSchema default search field in schema is text
   [junit4]   2> 2601167 INFO  (coreLoadExecutor-8649-thread-1-processing-n:127.0.0.1:52984_e%2Fjk) [n:127.0.0.1:52984_e%2Fjk c:control_collection   x:collection1] o.a.s.s.IndexSchema unique key field: id
   [junit4]   2> 2601176 INFO  (coreLoadExecutor-8649-thread-1-processing-n:127.0.0.1:52984_e%2Fjk) [n:127.0.0.1:52984_e%2Fjk c:control_collection   x:collection1] o.a.s.s.FileExchangeRateProvider Reloading exchange rates from file currency.xml
   [junit4]   2> 2601179 INFO  (coreLoadExecutor-8649-thread-1-processing-n:127.0.0.1:52984_e%2Fjk) [n:127.0.0.1:52984_e%2Fjk c:control_collection   x:collection1] o.a.s.s.FileExchangeRateProvider Reloading exchange rates from file currency.xml
   [junit4]   2> 2601181 INFO  (coreLoadExecutor-8649-thread-1-processing-n:127.0.0.1:52984_e%2Fjk) [n:127.0.0.1:52984_e%2Fjk c:control_collection   x:collection1] o.a.s.s.OpenExchangeRatesOrgProvider Reloading exchange rates from open-exchange-rates.json
   [junit4]   2> 2601182 INFO  (coreLoadExecutor-8649-thread-1-processing-n:127.0.0.1:52984_e%2Fjk) [n:127.0.0.1:52984_e%2Fjk c:control_collection   x:collection1] o.a.s.s.OpenExchangeRatesOrgProvider Reloading exchange rates from open-exchange-rates.json
   [junit4]   2> 2601185 INFO  (coreLoadExecutor-8649-thread-1-processing-n:127.0.0.1:52984_e%2Fjk) [n:127.0.0.1:52984_e%2Fjk c:control_collection   x:collection1] o.a.s.c.ConfigSetProperties Did not find ConfigSet properties, assuming default properties: Can't find resource 'configsetprops.json' in classpath or '/configs/conf1', cwd=C:\Users\JenkinsSlave\workspace\Lucene-Solr-5.5-Windows\solr\build\solr-core\test\J1
   [junit4]   2> 2601185 INFO  (coreLoadExecutor-8649-thread-1-processing-n:127.0.0.1:52984_e%2Fjk) [n:127.0.0.1:52984_e%2Fjk c:control_collection   x:collection1] o.a.s.c.CoreContainer Creating SolrCore 'collection1' using configuration from collection control_collection
   [junit4]   2> 2601185 INFO  (coreLoadExecutor-8649-thread-1-processing-n:127.0.0.1:52984_e%2Fjk) [n:127.0.0.1:52984_e%2Fjk c:control_collection s:shard1 r:core_node1 x:collection1] o.a.s.c.SolrCore org.apache.solr.core.MockDirectoryFactory
   [junit4]   2> 2601185 INFO  (coreLoadExecutor-8649-thread-1-processing-n:127.0.0.1:52984_e%2Fjk) [n:127.0.0.1:52984_e%2Fjk c:control_collection s:shard1 r:core_node1 x:collection1] o.a.s.c.SolrCore [[collection1] ] Opening new SolrCore at [C:\Users\JenkinsSlave\workspace\Lucene-Solr-5.5-Windows\solr\build\solr-core\test\J1\temp\solr.cloud.rule.RulesTest_25880A5E9E88BC44-001\control-001\cores\collection1], dataDir=[C:\Users\JenkinsSlave\workspace\Lucene-Solr-5.5-Windows\solr\build\solr-core\test\J1\..\..\..\..\..\..\..\..\..\Users\JenkinsSlave\workspace\Lucene-Solr-5.5-Windows\solr\build\solr-core\test\J1\temp\solr.cloud.rule.RulesTest_25880A5E9E88BC44-001\control-001\cores\collection1\data\]
   [junit4]   2> 2601185 INFO  (coreLoadExecutor-8649-thread-1-processing-n:127.0.0.1:52984_e%2Fjk) [n:127.0.0.1:52984_e%2Fjk c:control_collection s:shard1 r:core_node1 x:collection1] o.a.s.c.JmxMonitoredMap JMX monitoring is enabled. Adding Solr mbeans to JMX Server: com.sun.jmx.mbeanserver.JmxMBeanServer@337304cd
   [junit4]   2> 2601186 INFO  (coreLoadExecutor-8649-thread-1-processing-n:127.0.0.1:52984_e%2Fjk) [n:127.0.0.1:52984_e%2Fjk c:control_collection s:shard1 r:core_node1 x:collection1] o.a.s.c.CachingDirectoryFactory return new directory for C:\Users\JenkinsSlave\workspace\Lucene-Solr-5.5-Windows\solr\build\solr-core\test\J1\..\..\..\..\..\..\..\..\..\Users\JenkinsSlave\workspace\Lucene-Solr-5.5-Windows\solr\build\solr-core\test\J1\temp\solr.cloud.rule.RulesTest_25880A5E9E88BC44-001\control-001\cores\collection1\data\
   [junit4]   2> 2601186 INFO  (coreLoadExecutor-8649-thread-1-processing-n:127.0.0.1:52984_e%2Fjk) [n:127.0.0.1:52984_e%2Fjk c:control_collection s:shard1 r:core_node1 x:collection1] o.a.s.c.SolrCore New index directory detected: old=null new=C:\Users\JenkinsSlave\workspace\Lucene-Solr-5.5-Windows\solr\build\solr-core\test\J1\..\..\..\..\..\..\..\..\..\Users\JenkinsSlave\workspace\Lucene-Solr-5.5-Windows\solr\build\solr-core\test\J1\temp\solr.cloud.rule.RulesTest_25880A5E9E88BC44-001\control-001\cores\collection1\data\index/
   [junit4]   2> 2601186 WARN  (coreLoadExecutor-8649-thread-1-processing-n:127.0.0.1:52984_e%2Fjk) [n:127.0.0.1:52984_e%2Fjk c:control_collection s:shard1 r:core_node1 x:collection1] o.a.s.c.SolrCore [collection1] Solr index directory 'C:\Users\JenkinsSlave\workspace\Lucene-Solr-5.5-Windows\solr\build\solr-core\test\J1\..\..\..\..\..\..\..\..\..\Users\JenkinsSlave\workspace\Lucene-Solr-5.5-Windows\solr\build\solr-core\test\J1\temp\solr.cloud.rule.RulesTest_25880A5E9E88BC44-001\control-001\cores\collection1\data\index' doesn't exist. Creating new index...
   [junit4]   2> 2601187 INFO  (coreLoadExecutor-8649-thread-1-processing-n:127.0.0.1:52984_e%2Fjk) [n:127.0.0.1:52984_e%2Fjk c:control_collection s:shard1 r:core_node1 x:collection1] o.a.s.c.CachingDirectoryFactory return new directory for C:\Users\JenkinsSlave\workspace\Lucene-Solr-5.5-Windows\solr\build\solr-core\test\J1\..\..\..\..\..\..\..\..\..\Users\JenkinsSlave\workspace\Lucene-Solr-5.5-Windows\solr\build\solr-core\test\J1\temp\solr.cloud.rule.RulesTest_25880A5E9E88BC44-001\control-001\cores\collection1\data\index
   [junit4]   2> 2601187 INFO  (coreLoadExecutor-8649-thread-1-processing-n:127.0.0.1:52984_e%2Fjk) [n:127.0.0.1:52984_e%2Fjk c:control_collection s:shard1 r:core_node1 x:collection1] o.a.s.u.RandomMergePolicy RandomMergePolicy wrapping class org.apache.lucene.index.LogDocMergePolicy: [LogDocMergePolicy: minMergeSize=1000, mergeFactor=33, maxMergeSize=9223372036854775807, maxMergeSizeForForcedMerge=9223372036854775807, calibrateSizeByDeletes=true, maxMergeDocs=2147483647, maxCFSSegmentSizeMB=8.796093022207999E12, noCFSRatio=0.5099861165529019]
   [junit4]   2> 2601187 INFO  (coreLoadExecutor-8649-thread-1-processing-n:127.0.0.1:52984_e%2Fjk) [n:127.0.0.1:52984_e%2Fjk c:control_collection s:shard1 r:core_node1 x:collection1] o.a.s.c.SolrDeletionPolicy SolrDeletionPolicy.onCommit: commits: num=1
   [junit4]   2> 	commit{dir=MockDirectoryWrapper(RAMDirectory@70107f15 lockFactory=org.apache.lucene.store.SingleInstanceLockFactory@7d427de6),segFN=segments_1,generation=1}
   [junit4]   2> 2601187 INFO  (coreLoadExecutor-8649-thread-1-processing-n:127.0.0.1:52984_e%2Fjk) [n:127.0.0.1:52984_e%2Fjk c:control_collection s:shard1 r:core_node1 x:collection1] o.a.s.c.SolrDeletionPolicy newest commit generation = 1
   [junit4]   2> 2601188 INFO  (OldIndexDirectoryCleanupThreadForCore-collection1) [n:127.0.0.1:52984_e%2Fjk c:control_collection s:shard1 r:core_node1 x:collection1] o.a.s.c.SolrCore Looking for old index directories to cleanup for core collection1 in C:\Users\JenkinsSlave\workspace\Lucene-Solr-5.5-Windows\solr\build\solr-core\test\J1\..\..\..\..\..\..\..\..\..\Users\JenkinsSlave\workspace\Lucene-Solr-5.5-Windows\solr\build\solr-core\test\J1\temp\solr.cloud.rule.RulesTest_25880A5E9E88BC44-001\control-001\cores\collection1\data\
   [junit4]   2> 2601188 WARN  (OldIndexDirectoryCleanupThreadForCore-collection1) [n:127.0.0.1:52984_e%2Fjk c:control_collection s:shard1 r:core_node1 x:collection1] o.a.s.c.DirectoryFactory C:\Users\JenkinsSlave\workspace\Lucene-Solr-5.5-Windows\solr\build\solr-core\test\J1\..\..\..\..\..\..\..\..\..\Users\JenkinsSlave\workspace\Lucene-Solr-5.5-Windows\solr\build\solr-core\test\J1\temp\solr.cloud.rule.RulesTest_25880A5E9E88BC44-001\control-001\cores\collection1\data\ does not point to a valid data directory; skipping clean-up of old index directories.
   [junit4]   2> 2601188 INFO  (coreLoadExecutor-8649-thread-1-processing-n:127.0.0.1:52984_e%2Fjk) [n:127.0.0.1:52984_e%2Fjk c:control_collection s:shard1 r:core_node1 x:collection1] o.a.s.u.p.UpdateRequestProcessorChain creating updateRequestProcessorChain "nodistrib"
   [junit4]   2> 2601188 INFO  (coreLoadExecutor-8649-thread-1-processing-n:127.0.0.1:52984_e%2Fjk) [n:127.0.0.1:52984_e%2Fjk c:control_collection s:shard1 r:core_node1 x:collection1] o.a.s.u.p.UpdateRequestProcessorChain creating updateRequestProcessorChain "dedupe"
   [junit4]   2> 2601188 INFO  (coreLoadExecutor-8649-thread-1-processing-n:127.0.0.1:52984_e%2Fjk) [n:127.0.0.1:52984_e%2Fjk c:control_collection s:shard1 r:core_node1 x:collection1] o.a.s.u.p.UpdateRequestProcessorChain inserting DistributedUpdateProcessorFactory into updateRequestProcessorChain "dedupe"
   [junit4]   2> 2601188 INFO  (coreLoadExecutor-8649-thread-1-processing-n:127.0.0.1:52984_e%2Fjk) [n:127.0.0.1:52984_e%2Fjk c:control_collection s:shard1 r:core_node1 x:collection1] o.a.s.u.p.UpdateRequestProcessorChain creating updateRequestProcessorChain "stored_sig"
   [junit4]   2> 2601188 INFO  (coreLoadExecutor-8649-thread-1-processing-n:127.0.0.1:52984_e%2Fjk) [n:127.0.0.1:52984_e%2Fjk c:control_collection s:shard1 r:core_node1 x:collection1] o.a.s.u.p.UpdateRequestProcessorChain inserting DistributedUpdateProcessorFactory into updateRequestProcessorChain "stored_sig"
   [junit4]   2> 2601188 INFO  (coreLoadExecutor-8649-thread-1-processing-n:127.0.0.1:52984_e%2Fjk) [n:127.0.0.1:52984_e%2Fjk c:control_collection s:shard1 r:core_node1 x:collection1] o.a.s.u.p.UpdateRequestProcessorChain creating updateRequestProcessorChain "distrib-dup-test-chain-explicit"
   [junit4]   2> 2601188 INFO  (coreLoadExecutor-8649-thread-1-processing-n:127.0.0.1:52984_e%2Fjk) [n:127.0.0.1:52984_e%2Fjk c:control_collection s:shard1 r:core_node1 x:collection1] o.a.s.u.p.UpdateRequestProcessorChain creating updateRequestProcessorChain "distrib-dup-test-chain-implicit"
   [junit4]   2> 2601188 INFO  (coreLoadExecutor-8649-thread-1-processing-n:127.0.0.1:52984_e%2Fjk) [n:127.0.0.1:52984_e%2Fjk c:control_collection s:shard1 r:core_node1 x:collection1] o.a.s.u.p.UpdateRequestProcessorChain inserting DistributedUpdateProcessorFactory into updateRequestProcessorChain "distrib-dup-test-chain-implicit"
   [junit4]   2> 2601188 INFO  (coreLoadExecutor-8649-thread-1-processing-n:127.0.0.1:52984_e%2Fjk) [n:127.0.0.1:52984_e%2Fjk c:control_collection s:shard1 r:core_node1 x:collection1] o.a.s.c.SolrCore no updateRequestProcessorChain defined as default, creating implicit default
   [junit4]   2> 2601189 WARN  (coreLoadExecutor-8649-thread-1-processing-n:127.0.0.1:52984_e%2Fjk) [n:127.0.0.1:52984_e%2Fjk c:control_collection s:shard1 r:core_node1 x:collection1] o.a.s.c.RequestHandlers INVALID paramSet a in requestHandler {type = requestHandler,name = /dump,class = DumpRequestHandler,args = {defaults={a=A,b=B}}}
   [junit4]   2> 2601193 INFO  (coreLoadExecutor-8649-thread-1-processing-n:127.0.0.1:52984_e%2Fjk) [n:127.0.0.1:52984_e%2Fjk c:control_collection s:shard1 r:core_node1 x:collection1] o.a.s.h.l.XMLLoader xsltCacheLifetimeSeconds=60
   [junit4]   2> 2601194 INFO  (coreLoadExecutor-8649-thread-1-processing-n:127.0.0.1:52984_e%2Fjk) [n:127.0.0.1:52984_e%2Fjk c:control_collection s:shard1 r:core_node1 x:collection1] o.a.s.h.l.XMLLoader xsltCacheLifetimeSeconds=60
   [junit4]   2> 2601195 INFO  (coreLoadExecutor-8649-thread-1-processing-n:127.0.0.1:52984_e%2Fjk) [n:127.0.0.1:52984_e%2Fjk c:control_collection s:shard1 r:core_node1 x:collection1] o.a.s.h.l.XMLLoader xsltCacheLifetimeSeconds=60
   [junit4]   2> 2601196 INFO  (coreLoadExecutor-8649-thread-1-processing-n:127.0.0.1:52984_e%2Fjk) [n:127.0.0.1:52984_e%2Fjk c:control_collection s:shard1 r:core_node1 x:collection1] o.a.s.h.l.XMLLoader xsltCacheLifetimeSeconds=60
   [junit4]   2> 2601198 INFO  (coreLoadExecutor-8649-thread-1-processing-n:127.0.0.1:52984_e%2Fjk) [n:127.0.0.1:52984_e%2Fjk c:control_collection s:shard1 r:core_node1 x:collection1] o.a.s.c.RequestHandlers Registered paths: /admin/mbeans,standard,/dump,/update/csv,/update/json/docs,/admin/luke,/admin/segments,/get,/admin/system,/replication,/admin/properties,/config,/schema,/admin/plugins,/admin/logging,/update/json,/admin/threads,/admin/ping,/update,/admin/file
   [junit4]   2> 2601199 INFO  (coreLoadExecutor-8649-thread-1-processing-n:127.0.0.1:52984_e%2Fjk) [n:127.0.0.1:52984_e%2Fjk c:control_collection s:shard1 r:core_node1 x:collection1] o.a.s.c.SolrCore Using default statsCache cache: org.apache.solr.search.stats.LocalStatsCache
   [junit4]   2> 2601200 INFO  (coreLoadExecutor-8649-thread-1-processing-n:127.0.0.1:52984_e%2Fjk) [n:127.0.0.1:52984_e%2Fjk c:control_collection s:shard1 r:core_node1 x:collection1] o.a.s.u.UpdateHandler Using UpdateLog implementation: org.apache.solr.update.UpdateLog
   [junit4]   2> 2601200 INFO  (coreLoadExecutor-8649-thread-1-processing-n:127.0.0.1:52984_e%2Fjk) [n:127.0.0.1:52984_e%2Fjk c:control_collection s:shard1 r:core_node1 x:collection1] o.a.s.u.UpdateLog Initializing UpdateLog: dataDir= defaultSyncLevel=FLUSH numRecordsToKeep=100 maxNumLogsToKeep=10 numVersionBuckets=65536
   [junit4]   2> 2601202 INFO  (coreLoadExecutor-8649-thread-1-processing-n:127.0.0.1:52984_e%2Fjk) [n:127.0.0.1:52984_e%2Fjk c:control_collection s:shard1 r:core_node1 x:collection1] o.a.s.u.CommitTracker Hard AutoCommit: disabled
   [junit4]   2> 2601202 INFO  (coreLoadExecutor-8649-thread-1-processing-n:127.0.0.1:52984_e%2Fjk) [n:127.0.0.1:52984_e%2Fjk c:control_collection s:shard1 r:core_node1 x:collection1] o.a.s.u.CommitTracker Soft AutoCommit: disabled
   [junit4]   2> 2601202 INFO  (coreLoadExecutor-8649-thread-1-processing-n:127.0.0.1:52984_e%2Fjk) [n:127.0.0.1:52984_e%2Fjk c:control_collection s:shard1 r:core_node1 x:collection1] o.a.s.u.RandomMergePolicy RandomMergePolicy wrapping class org.apache.lucene.index.LogByteSizeMergePolicy: [LogByteSizeMergePolicy: minMergeSize=1677721, mergeFactor=35, maxMergeSize=2147483648, maxMergeSizeForForcedMerge=9223372036854775807, calibrateSizeByDeletes=true, maxMergeDocs=2147483647, maxCFSSegmentSizeMB=8.796093022207999E12, noCFSRatio=1.0]
   [junit4]   2> 2601203 INFO  (coreLoadExecutor-8649-thread-1-processing-n:127.0.0.1:52984_e%2Fjk) [n:127.0.0.1:52984_e%2Fjk c:control_collection s:shard1 r:core_node1 x:collection1] o.a.s.c.SolrDeletionPolicy SolrDeletionPolicy.onInit: commits: num=1
   [junit4]   2> 	commit{dir=MockDirectoryWrapper(RAMDirectory@70107f15 lockFactory=org.apache.lucene.store.SingleInstanceLockFactory@7d427de6),segFN=segments_1,generation=1}
   [junit4]   2> 2601203 INFO  (coreLoadExecutor-8649-thread-1-processing-n:127.0.0.1:52984_e%2Fjk) [n:127.0.0.1:52984_e%2Fjk c:control_collection s:shard1 r:core_node1 x:collection1] o.a.s.c.SolrDeletionPolicy newest commit generation = 1
   [junit4]   2> 2601203 INFO  (coreLoadExecutor-8649-thread-1-processing-n:127.0.0.1:52984_e%2Fjk) [n:127.0.0.1:52984_e%2Fjk c:control_collection s:shard1 r:core_node1 x:collection1] o.a.s.s.SolrIndexSearcher Opening Searcher@212655e[collection1] main
   [junit4]   2> 2601203 INFO  (coreLoadExecutor-8649-thread-1-processing-n:127.0.0.1:52984_e%2Fjk) [n:127.0.0.1:52984_e%2Fjk c:control_collection s:shard1 r:core_node1 x:collection1] o.a.s.c.c.ZkStateReader Load collection config from: [/collections/control_collection]
   [junit4]   2> 2601205 INFO  (coreLoadExecutor-8649-thread-1-processing-n:127.0.0.1:52984_e%2Fjk) [n:127.0.0.1:52984_e%2Fjk c:control_collection s:shard1 r:core_node1 x:collection1] o.a.s.c.c.ZkStateReader path=[/collections/control_collection] [configName]=[conf1] specified config exists in ZooKeeper
   [junit4]   2> 2601205 INFO  (coreLoadExecutor-8649-thread-1-processing-n:127.0.0.1:52984_e%2Fjk) [n:127.0.0.1:52984_e%2Fjk c:control_collection s:shard1 r:core_node1 x:collection1] o.a.s.r.ManagedResourceStorage Setting up ZooKeeper-based storage for the RestManager with znodeBase: /configs/conf1
   [junit4]   2> 2601206 INFO  (coreLoadExecutor-8649-thread-1-processing-n:127.0.0.1:52984_e%2Fjk) [n:127.0.0.1:52984_e%2Fjk c:control_collection s:shard1 r:core_node1 x:collection1] o.a.s.r.ManagedResourceStorage Configured ZooKeeperStorageIO with znodeBase: /configs/conf1
   [junit4]   2> 2601206 INFO  (coreLoadExecutor-8649-thread-1-processing-n:127.0.0.1:52984_e%2Fjk) [n:127.0.0.1:52984_e%2Fjk c:control_collection s:shard1 r:core_node1 x:collection1] o.a.s.r.RestManager Initializing RestManager with initArgs: {}
   [junit4]   2> 2601206 INFO  (coreLoadExecutor-8649-thread-1-processing-n:127.0.0.1:52984_e%2Fjk) [n:127.0.0.1:52984_e%2Fjk c:control_collection s:shard1 r:core_node1 x:collection1] o.a.s.r.ManagedResourceStorage Reading _rest_managed.json using ZooKeeperStorageIO:path=/configs/conf1
   [junit4]   2> 2601206 INFO  (coreLoadExecutor-8649-thread-1-processing-n:127.0.0.1:52984_e%2Fjk) [n:127.0.0.1:52984_e%2Fjk c:control_collection s:shard1 r:core_node1 x:collection1] o.a.s.r.ManagedResourceStorage No data found for znode /configs/conf1/_rest_managed.json
   [junit4]   2> 2601206 INFO  (coreLoadExecutor-8649-thread-1-processing-n:127.0.0.1:52984_e%2Fjk) [n:127.0.0.1:52984_e%2Fjk c:control_collection s:shard1 r:core_node1 x:collection1] o.a.s.r.ManagedResourceStorage Loaded null at path _rest_managed.json using ZooKeeperStorageIO:path=/configs/conf1
   [junit4]   2> 2601206 INFO  (coreLoadExecutor-8649-thread-1-processing-n:127.0.0.1:52984_e%2Fjk) [n:127.0.0.1:52984_e%2Fjk c:control_collection s:shard1 r:core_node1 x:collection1] o.a.s.r.RestManager Initializing 0 registered ManagedResources
   [junit4]   2> 2601206 INFO  (coreLoadExecutor-8649-thread-1-processing-n:127.0.0.1:52984_e%2Fjk) [n:127.0.0.1:52984_e%2Fjk c:control_collection s:shard1 r:core_node1 x:collection1] o.a.s.h.ReplicationHandler Commits will be reserved for  10000
   [junit4]   2> 2601207 INFO  (searcherExecutor-8650-thread-1-processing-n:127.0.0.1:52984_e%2Fjk x:collection1 s:shard1 c:control_collection r:core_node1) [n:127.0.0.1:52984_e%2Fjk c:control_collection s:shard1 r:core_node1 x:collection1] o.a.s.c.SolrCore [collection1] Registered new searcher Searcher@212655e[collection1] main{ExitableDirectoryReader(UninvertingDirectoryReader())}
   [junit4]   2> 2601207 INFO  (coreLoadExecutor-8649-thread-1-processing-n:127.0.0.1:52984_e%2Fjk) [n:127.0.0.1:52984_e%2Fjk c:control_collection s:shard1 r:core_node1 x:collection1] o.a.s.u.UpdateLog Looking up max value of version field to seed version buckets
   [junit4]   2> 2601207 INFO  (coreLoadExecutor-8649-thread-1-processing-n:127.0.0.1:52984_e%2Fjk) [n:127.0.0.1:52984_e%2Fjk c:control_collection s:shard1 r:core_node1 x:collection1] o.a.s.u.VersionInfo Refreshing highest value of _version_ for 65536 version buckets from index
   [junit4]   2> 2601207 INFO  (coreLoadExecutor-8649-thread-1-processing-n:127.0.0.1:52984_e%2Fjk) [n:127.0.0.1:52984_e%2Fjk c:control_collection s:shard1 r:core_node1 x:collection1] o.a.s.u.VersionInfo No terms found for _version_, cannot seed version bucket highest value from index
   [junit4]   2> 2601207 INFO  (coreLoadExecutor-8649-thread-1-processing-n:127.0.0.1:52984_e%2Fjk) [n:127.0.0.1:52984_e%2Fjk c:control_collection s:shard1 r:core_node1 x:collection1] o.a.s.u.UpdateLog Could not find max version in index or recent updates, using new clock 1526647710789140480
   [junit4]   2> 2601209 INFO  (coreLoadExecutor-8649-thread-1-processing-n:127.0.0.1:52984_e%2Fjk) [n:127.0.0.1:52984_e%2Fjk c:control_collection s:shard1 r:core_node1 x:collection1] o.a.s.u.UpdateLog Took 2.0ms to seed version buckets with highest version 1526647710789140480
   [junit4]   2> 2601209 INFO  (coreLoadExecutor-8649-thread-1-processing-n:127.0.0.1:52984_e%2Fjk) [n:127.0.0.1:52984_e%2Fjk c:control_collection s:shard1 r:core_node1 x:collection1] o.a.s.c.ZkController watch zkdir /configs/conf1
   [junit4]   2> 2601210 INFO  (coreLoadExecutor-8649-thread-1-processing-n:127.0.0.1:52984_e%2Fjk) [n:127.0.0.1:52984_e%2Fjk c:control_collection s:shard1 r:core_node1 x:collection1] o.a.s.c.CoreContainer registering core: collection1
   [junit4]   2> 2601210 INFO  (coreZkRegister-8643-thread-1-processing-n:127.0.0.1:52984_e%2Fjk x:collection1 s:shard1 c:control_collection r:core_node1) [n:127.0.0.1:52984_e%2Fjk c:control_collection s:shard1 r:core_node1 x:collection1] o.a.s.c.ZkController Register replica - core:collection1 address:http://127.0.0.1:52984/e/jk collection:control_collection shard:shard1
   [junit4]   2> 2601211 INFO  (coreZkRegister-8643-thread-1-processing-n:127.0.0.1:52984_e%2Fjk x:collection1 s:shard1 c:control_collection r:core_node1) [n:127.0.0.1:52984_e%2Fjk c:control_collection s:shard1 r:core_node1 x:collection1] o.a.s.c.c.SolrZkClient makePath: /collections/control_collection/leader_elect/shard1/election
   [junit4]   2> 2601215 INFO  (coreZkRegister-8643-thread-1-processing-n:127.0.0.1:52984_e%2Fjk x:collection1 s:shard1 c:control_collection r:core_node1) [n:127.0.0.1:52984_e%2Fjk c:control_collection s:shard1 r:core_node1 x:collection1] o.a.s.c.LeaderElector Joined leadership election with path: /collections/control_collection/leader_elect/shard1/election/95415481792200708-core_node1-n_0000000000
   [junit4]   2> 2601215 INFO  (coreZkRegister-8643-thread-1-processing-n:127.0.0.1:52984_e%2Fjk x:collection1 s:shard1 c:control_collection r:core_node1) [n:127.0.0.1:52984_e%2Fjk c:control_collection s:shard1 r:core_node1 x:collection1] o.a.s.c.ShardLeaderElectionContext Running the leader process for shard=shard1 and weAreReplacement=false and leaderVoteWait=10000
   [junit4]   2> 2601217 INFO  (coreZkRegister-8643-thread-1-processing-n:127.0.0.1:52984_e%2Fjk x:collection1 s:shard1 c:control_collection r:core_node1) [n:127.0.0.1:52984_e%2Fjk c:control_collection s:shard1 r:core_node1 x:collection1] o.a.s.c.ShardLeaderElectionContext Enough replicas found to continue.
   [junit4]   2> 2601217 INFO  (coreZkRegister-8643-thread-1-processing-n:127.0.0.1:52984_e%2Fjk x:collection1 s:shard1 c:control_collection r:core_node1) [n:127.0.0.1:52984_e%2Fjk c:control_collection s:shard1 r:core_node1 x:collection1] o.a.s.c.ShardLeaderElectionContext I may be the new leader - try and sync
   [junit4]   2> 2601217 INFO  (coreZkRegister-8643-thread-1-processing-n:127.0.0.1:52984_e%2Fjk x:collection1 s:shard1 c:control_collection r:core_node1) [n:127.0.0.1:52984_e%2Fjk c:control_collection s:shard1 r:core_node1 x:collection1] o.a.s.c.SyncStrategy Sync replicas to http://127.0.0.1:52984/e/jk/collection1/
   [junit4]   2> 2601217 INFO  (coreZkRegister-8643-thread-1-processing-n:127.0.0.1:52984_e%2Fjk x:collection1 s:shard1 c:control_collection r:core_node1) [n:127.0.0.1:52984_e%2Fjk c:control_collection s:shard1 r:core_node1 x:collection1] o.a.s.c.SyncStrategy Sync Success - now sync replicas to me
   [junit4]   2> 2601217 INFO  (coreZkRegister-8643-thread-1-processing-n:127.0.0.1:52984_e%2Fjk x:collection1 s:shard1 c:control_collection r:core_node1) [n:127.0.0.1:52984_e%2Fjk c:control_collection s:shard1 r:core_node1 x:collection1] o.a.s.c.SyncStrategy http://127.0.0.1:52984/e/jk/collection1/ has no replicas
   [junit4]   2> 2601217 INFO  (OverseerStateUpdate-95415481792200708-127.0.0.1:52984_e%2Fjk-n_0000000000) [n:127.0.0.1:52984_e%2Fjk    ] o.a.s.c.Overseer processMessage: queueSize: 1, message = {
   [junit4]   2>   "operation":"leader",
   [junit4]   2>   "shard":"shard1",
   [junit4]   2>   "collection":"control_collection"} current state version: 1
   [junit4]   2> 2601218 INFO  (coreZkRegister-8643-thread-1-processing-n:127.0.0.1:52984_e%2Fjk x:collection1 s:shard1 c:control_collection r:core_node1) [n:127.0.0.1:52984_e%2Fjk c:control_collection s:shard1 r:core_node1 x:collection1] o.a.s.c.c.SolrZkClient makePath: /collections/control_collection/leaders/shard1
   [junit4]   2> 2601220 INFO  (coreZkRegister-8643-thread-1-processing-n:127.0.0.1:52984_e%2Fjk x:collection1 s:shard1 c:control_collection r:core_node1) [n:127.0.0.1:52984_e%2Fjk c:control_collection s:shard1 r:core_node1 x:collection1] o.a.s.c.ShardLeaderElectionContextBase Creating leader registration node
   [junit4]   2> 2601222 INFO  (coreZkRegister-8643-thread-1-processing-n:127.0.0.1:52984_e%2Fjk x:collection1 s:shard1 c:control_collection r:core_node1) [n:127.0.0.1:52984_e%2Fjk c:control_collection s:shard1 r:core_node1 x:collection1] o.a.s.c.ShardLeaderElectionContext I am the new leader: http://127.0.0.1:52984/e/jk/collection1/ shard1
   [junit4]   2> 2601222 INFO  (OverseerStateUpdate-95415481792200708-127.0.0.1:52984_e%2Fjk-n_0000000000) [n:127.0.0.1:52984_e%2Fjk    ] o.a.s.c.Overseer processMessage: queueSize: 1, message = {
   [junit4]   2>   "operation":"leader",
   [junit4]   2>   "shard":"shard1",
   [junit4]   2>   "collection":"control_collection",
   [junit4]   2>   "base_url":"http://127.0.0.1:52984/e/jk",
   [junit4]   2>   "core":"collection1",
   [junit4]   2>   "state":"active"} current state version: 1
   [junit4]   2> 2601324 INFO  (zkCallback-2613-thread-1-processing-n:127.0.0.1:52984_e%2Fjk) [n:127.0.0.1:52984_e%2Fjk    ] o.a.s.c.c.ZkStateReader A cluster state change: [WatchedEvent state:SyncConnected type:NodeDataChanged path:/clusterstate.json], has occurred - updating... (live nodes size: [1])
   [junit4]   2> 2601374 INFO  (coreZkRegister-8643-thread-1-processing-n:127.0.0.1:52984_e%2Fjk x:collection1 s:shard1 c:control_collection r:core_node1) [n:127.0.0.1:52984_e%2Fjk c:control_collection s:shard1 r:core_node1 x:collection1] o.a.s.c.ZkController We are http://127.0.0.1:52984/e/jk/collection1/ and leader is http://127.0.0.1:52984/e/jk/collection1/
   [junit4]   2> 2601374 INFO  (coreZkRegister-8643-thread-1-processing-n:127.0.0.1:52984_e%2Fjk x:collection1 s:shard1 c:control_collection r:core_node1) [n:127.0.0.1:52984_e%2Fjk c:control_collection s:shard1 r:core_node1 x:collection1] o.a.s.c.ZkController No LogReplay needed for core=collection1 baseURL=http://127.0.0.1:52984/e/jk
   [junit4]   2> 2601374 INFO  (coreZkRegister-8643-thread-1-processing-n:127.0.0.1:52984_e%2Fjk x:collection1 s:shard1 c:control_collection r:core_node1) [n:127.0.0.1:52984_e%2Fjk c:control_collection s:shard1 r:core_node1 x:collection1] o.a.s.c.ZkController I am the leader, no recovery necessary
   [junit4]   2> 2601374 INFO  (coreZkRegister-8643-thread-1-processing-n:127.0.0.1:52984_e%2Fjk x:collection1 s:shard1 c:control_collection r:core_node1) [n:127.0.0.1:52984_e%2Fjk c:control_collection s:shard1 r:core_node1 x:collection1] o.a.s.c.ZkController publishing state=active
   [junit4]   2> 2601374 INFO  (coreZkRegister-8643-thread-1-processing-n:127.0.0.1:52984_e%2Fjk x:collection1 s:shard1 c:control_collection r:core_node1) [n:127.0.0.1:52984_e%2Fjk c:control_collection s:shard1 r:core_node1 x:collection1] o.a.s.c.ZkController numShards not found on descriptor - reading it from system property
   [junit4]   2> 2601376 INFO  (OverseerStateUpdate-95415481792200708-127.0.0.1:52984_e%2Fjk-n_0000000000) [n:127.0.0.1:52984_e%2Fjk    ] o.a.s.c.Overseer processMessage: queueSize: 1, message = {
   [junit4]   2>   "core":"collection1",
   [junit4]   2>   "core_node_name":"core_node1",
   [junit4]   2>   "roles":null,
   [junit4]   2>   "base_url":"http://127.0.0.1:52984/e/jk",
   [junit4]   2>   "node_name":"127.0.0.1:52984_e%2Fjk",
   [junit4]   2>   "numShards":"1",
   [junit4]   2>   "state":"active",
   [junit4]   2>   "shard":"shard1",
   [junit4]   2>   "collection":"control_collection",
   [junit4]   2>   "operation":"state"} current state version: 2
   [junit4]   2> 2601376 INFO  (OverseerStateUpdate-95415481792200708-127.0.0.1:52984_e%2Fjk-n_0000000000) [n:127.0.0.1:52984_e%2Fjk    ] o.a.s.c.o.ReplicaMutator Update state numShards=1 message={
   [junit4]   2>   "core":"collection1",
   [junit4]   2>   "core_node_name":"core_node1",
   [junit4]   2>   "roles":null,
   [junit4]   2>   "base_url":"http://127.0.0.1:52984/e/jk",
   [junit4]   2>   "node_name":"127.0.0.1:52984_e%2Fjk",
   [junit4]   2>   "numShards":"1",
   [junit4]   2>   "state":"active",
   [junit4]   2>   "shard":"shard1",
   [junit4]   2>   "collection":"control_collection",
   [junit4]   2>   "operation":"state"}
   [junit4]   2> 2601480 INFO  (zkCallback-2613-thread-1-processing-n:127.0.0.1:52984_e%2Fjk) [n:127.0.0.1:52984_e%2Fjk    ] o.a.s.c.c.ZkStateReader A cluster state change: [WatchedEvent state:SyncConnected type:NodeDataChanged path:/clusterstate.json], has occurred - updating... (live nodes size: [1])
   [junit4]   2> 2601519 INFO  (TEST-RulesTest.testPortRule-seed#[25880A5E9E88BC44]) [    ] o.a.s.c.c.SolrZkClient Using default ZkCredentialsProvider
   [junit4]   2> 2601520 INFO  (TEST-RulesTest.testPortRule-seed#[25880A5E9E88BC44]) [    ] o.a.s.c.c.ConnectionManager Waiting for client to connect to ZooKeeper
   [junit4]   2> 2601545 INFO  (zkCallback-2615-thread-1) [    ] o.a.s.c.c.ConnectionManager Watcher org.apache.solr.common.cloud.ConnectionManager@3c7b73b7 name:ZooKeeperConnection Watcher:127.0.0.1:52977/solr got event WatchedEvent state:SyncConnected type:None path:null path:null type:None
   [junit4]   2> 2601545 INFO  (TEST-RulesTest.testPortRule-seed#[25880A5E9E88BC44]) [    ] o.a.s.c.c.ConnectionManager Client is connected to ZooKeeper
   [junit4]   2> 2601546 INFO  (TEST-RulesTest.testPortRule-seed#[25880A5E9E88BC44]) [    ] o.a.s.c.c.SolrZkClient Using default ZkACLProvider
   [junit4]   2> 2601546 INFO  (TEST-RulesTest.testPortRule-seed#[25880A5E9E88BC44]) [    ] o.a.s.c.c.ZkStateReader Updating cluster state from ZooKeeper... 
   [junit4]   2> 2601548 INFO  (TEST-RulesTest.testPortRule-seed#[25880A5E9E88BC44]) [    ] o.a.s.c.ChaosMonkey monkey: init - expire sessions:false cause connection loss:false
   [junit4]   2> 2601548 INFO  (TEST-RulesTest.testPortRule-seed#[25880A5E9E88BC44]) [    ] o.a.s.c.AbstractFullDistribZkTestBase Creating collection1 with stateFormat=2
   [junit4]   2> 2601548 INFO  (TEST-RulesTest.testPortRule-seed#[25880A5E9E88BC44]) [    ] o.a.s.c.c.SolrZkClient Using default ZkCredentialsProvider
   [junit4]   2> 2601549 INFO  (TEST-RulesTest.testPortRule-seed#[25880A5E9E88BC44]) [    ] o.a.s.c.c.ConnectionManager Waiting for client to connect to ZooKeeper
   [junit4]   2> 2601550 INFO  (zkCallback-2616-thread-1) [    ] o.a.s.c.c.ConnectionManager Watcher org.apache.solr.common.cloud.ConnectionManager@19fb48c name:ZooKeeperConnection Watcher:127.0.0.1:52977/solr got event WatchedEvent state:SyncConnected type:None path:null path:null type:None
   [junit4]   2> 2601550 INFO  (TEST-RulesTest.testPortRule-seed#[25880A5E9E88BC44]) [    ] o.a.s.c.c.ConnectionManager Client is connected to ZooKeeper
   [junit4]   2> 2601550 INFO  (TEST-RulesTest.testPortRule-seed#[25880A5E9E88BC44]) [    ] o.a.s.c.c.SolrZkClient Using default ZkACLProvider
   [junit4]   2> 2601552 INFO  (OverseerStateUpdate-95415481792200708-127.0.0.1:52984_e%2Fjk-n_0000000000) [n:127.0.0.1:52984_e%2Fjk    ] o.a.s.c.Overseer processMessage: queueSize: 1, message = {
   [junit4]   2>   "operation":"create",
   [junit4]   2>   "name":"collection1",
   [junit4]   2>   "numShards":"2",
   [junit4]   2>   "stateFormat":"2"} current state version: 3
   [junit4]   2> 2601552 INFO  (OverseerStateUpdate-95415481792200708-127.0.0.1:52984_e%2Fjk-n_0000000000) [n:127.0.0.1:52984_e%2Fjk    ] o.a.s.c.o.ClusterStateMutator building a new cName: collection1
   [junit4]   2> 2601552 WARN  (NIOServerCxn.Factory:0.0.0.0/0.0.0.0:0) [    ] o.a.z.s.NIOServerCnxn caught end of stream exception
   [junit4]   2> EndOfStreamException: Unable to read additional data from client sessionid 0x152fbe00a4c0006, likely client has closed socket
   [junit4]   2> 	at org.apache.zookeeper.server.NIOServerCnxn.doIO(NIOServerCnxn.java:228)
   [junit4]   2> 	at org.apache.zookeeper.server.NIOServerCnxnFactory.run(NIOServerCnxnFactory.java:208)
   [junit4]   2> 	at java.lang.Thread.run(Thread.java:745)
   [junit4]   2> 2601656 INFO  (OverseerStateUpdate-95415481792200708-127.0.0.1:52984_e%2Fjk-n_0000000000) [n:127.0.0.1:52984_e%2Fjk    ] o.a.s.c.o.ZkStateWriter going to create_collection /collections/collection1/state.json
   [junit4]   2> 2602145 INFO  (TEST-RulesTest.testPortRule-seed#[25880A5E9E88BC44]) [    ] o.a.s.SolrTestCaseJ4 Writing core.properties file to C:\Users\JenkinsSlave\workspace\Lucene-Solr-5.5-Windows\solr\build\solr-core\test\J1\temp\solr.cloud.rule.RulesTest_25880A5E9E88BC44-001\shard-1-001\cores\collection1
   [junit4]   2> 2602146 INFO  (TEST-RulesTest.testPortRule-seed#[25880A5E9E88BC44]) [    ] o.a.s.c.AbstractFullDistribZkTestBase create jetty 1 in directory C:\Users\JenkinsSlave\workspace\Lucene-Solr-5.5-Windows\solr\build\solr-core\test\J1\temp\solr.cloud.rule.RulesTest_25880A5E9E88BC44-001\shard-1-001
   [junit4]   2> 2602147 INFO  (TEST-RulesTest.testPortRule-seed#[25880A5E9E88BC44]) [    ] o.e.j.s.Server jetty-9.2.13.v20150730
   [junit4]   2> 2602148 INFO  (TEST-RulesTest.testPortRule-seed#[25880A5E9E88BC44]) [    ] o.e.j.s.h.ContextHandler Started o.e.j.s.ServletContextHandler@4c36cabd{/e/jk,null,AVAILABLE}
   [junit4]   2> 2602149 INFO  (TEST-RulesTest.testPortRule-seed#[25880A5E9E88BC44]) [    ] o.e.j.s.ServerConnector Started ServerConnector@b8f0bae{HTTP/1.1}{127.0.0.1:53014}
   [junit4]   2> 2602149 INFO  (TEST-RulesTest.testPortRule-seed#[25880A5E9E88BC44]) [    ] o.e.j.s.Server Started @2607321ms
   [junit4]   2> 2602149 INFO  (TEST-RulesTest.testPortRule-seed#[25880A5E9E88BC44]) [    ] o.a.s.c.s.e.JettySolrRunner Jetty properties: {solr.data.dir=C:\Users\JenkinsSlave\workspace\Lucene-Solr-5.5-Windows\solr\build\solr-core\test\J1\temp\solr.cloud.rule.RulesTest_25880A5E9E88BC44-001\tempDir-001/jetty1, solrconfig=solrconfig.xml, hostContext=/e/jk, hostPort=53014, coreRootDirectory=C:\Users\JenkinsSlave\workspace\Lucene-Solr-5.5-Windows\solr\build\solr-core\test\J1\temp\solr.cloud.rule.RulesTest_25880A5E9E88BC44-001\shard-1-001\cores}
   [junit4]   2> 2602150 INFO  (TEST-RulesTest.testPortRule-seed#[25880A5E9E88BC44]) [    ] o.a.s.s.SolrDispatchFilter SolrDispatchFilter.init(): sun.misc.Launcher$AppClassLoader@73d16e93
   [junit4]   2> 2602150 INFO  (TEST-RulesTest.testPortRule-seed#[25880A5E9E88BC44]) [    ] o.a.s.c.SolrResourceLoader new SolrResourceLoader for directory: 'C:\Users\JenkinsSlave\workspace\Lucene-Solr-5.5-Windows\solr\build\solr-core\test\J1\temp\solr.cloud.rule.RulesTest_25880A5E9E88BC44-001\shard-1-001'
   [junit4]   2> 2602150 INFO  (TEST-RulesTest.testPortRule-seed#[25880A5E9E88BC44]) [    ] o.a.s.c.SolrResourceLoader JNDI not configured for solr (NoInitialContextEx)
   [junit4]   2> 2602150 INFO  (TEST-RulesTest.testPortRule-seed#[25880A5E9E88BC44]) [    ] o.a.s.c.SolrResourceLoader solr home defaulted to 'solr/' (could not find system property or JNDI)
   [junit4]   2> 2602150 INFO  (TEST-RulesTest.testPortRule-seed#[25880A5E9E88BC44]) [    ] o.a.s.c.c.SolrZkClient Using default ZkCredentialsProvider
   [junit4]   2> 2602151 INFO  (TEST-RulesTest.testPortRule-seed#[25880A5E9E88BC44]) [    ] o.a.s.c.c.ConnectionManager Waiting for client to connect to ZooKeeper
   [junit4]   2> 2602152 INFO  (zkCallback-2617-thread-1) [    ] o.a.s.c.c.ConnectionManager Watcher org.apache.solr.common.cloud.ConnectionManager@201f40a6 name:ZooKeeperConnection Watcher:127.0.0.1:52977/solr got event WatchedEvent state:SyncConnected type:None path:null path:null type:None
   [junit4]   2> 2602153 INFO  (TEST-RulesTest.testPortRule-seed#[25880A5E9E88BC44]) [    ] o.a.s.c.c.ConnectionManager Client is connected to ZooKeeper
   [junit4]   2> 2602153 INFO  (TEST-RulesTest.testPortRule-seed#[25880A5E9E88BC44]) [    ] o.a.s.c.c.SolrZkClient Using default ZkACLProvider
   [junit4]   2> 2602154 INFO  (TEST-RulesTest.testPortRule-seed#[25880A5E9E88BC44]) [    ] o.a.s.s.SolrDispatchFilter Loading solr.xml from SolrHome (not found in ZooKeeper)
   [junit4]   2> 2602154 INFO  (TEST-RulesTest.testPortRule-seed#[25880A5E9E88BC44]) [    ] o.a.s.c.SolrXmlConfig Loading container configuration from C:\Users\JenkinsSlave\workspace\Lucene-Solr-5.5-Windows\solr\build\solr-core\test\J1\temp\solr.cloud.rule.RulesTest_25880A5E9E88BC44-001\shard-1-001\solr.xml
   [junit4]   2> 2602164 INFO  (TEST-RulesTest.testPortRule-seed#[25880A5E9E88BC44]) [    ] o.a.s.c.CorePropertiesLocator Config-defined core root directory: C:\Users\JenkinsSlave\workspace\Lucene-Solr-5.5-Windows\solr\build\solr-core\test\J1\temp\solr.cloud.rule.RulesTest_25880A5E9E88BC44-001\shard-1-001\cores
   [junit4]   2> 2602164 INFO  (TEST-RulesTest.testPortRule-seed#[25880A5E9E88BC44]) [    ] o.a.s.c.CoreContainer New CoreContainer 1188724651
   [junit4]   2> 2602164 INFO  (TEST-RulesTest.testPortRule-seed#[25880A5E9E88BC44]) [    ] o.a.s.c.CoreContainer Loading cores into CoreContainer [instanceDir=C:\Users\JenkinsSlave\workspace\Lucene-Solr-5.5-Windows\solr\build\solr-core\test\J1\temp\solr.cloud.rule.RulesTest_25880A5E9E88BC44-001\shard-1-001]
   [junit4]   2> 2602165 WARN  (TEST-RulesTest.testPortRule-seed#[25880A5E9E88BC44]) [    ] o.a.s.c.CoreContainer Couldn't add files from C:\Users\JenkinsSlave\workspace\Lucene-Solr-5.5-Windows\solr\build\solr-core\test\J1\temp\solr.cloud.rule.RulesTest_25880A5E9E88BC44-001\shard-1-001\lib to classpath: C:\Users\JenkinsSlave\workspace\Lucene-Solr-5.5-Windows\solr\build\solr-core\test\J1\temp\solr.cloud.rule.RulesTest_25880A5E9E88BC44-001\shard-1-001\lib
   [junit4]   2> 2602165 INFO  (TEST-RulesTest.testPortRule-seed#[25880A5E9E88BC44]) [    ] o.a.s.h.c.HttpShardHandlerFactory created with socketTimeout : 90000,urlScheme : ,connTimeout : 15000,maxConnectionsPerHost : 20,maxConnections : 10000,corePoolSize : 0,maximumPoolSize : 2147483647,maxThreadIdleTime : 5,sizeOfQueue : -1,fairnessPolicy : false,useRetries : false,
   [junit4]   2> 2602168 INFO  (TEST-RulesTest.testPortRule-seed#[25880A5E9E88BC44]) [    ] o.a.s.u.UpdateShardHandler Creating UpdateShardHandler HTTP client with params: socketTimeout=340000&connTimeout=45000&retry=true
   [junit4]   2> 2602168 INFO  (TEST-RulesTest.testPortRule-seed#[25880A5E9E88BC44]) [    ] o.a.s.l.LogWatcher SLF4J impl is org.slf4j.impl.Log4jLoggerFactory
   [junit4]   2> 2602168 INFO  (TEST-RulesTest.testPortRule-seed#[25880A5E9E88BC44]) [    ] o.a.s.l.LogWatcher Registering Log Listener [Log4j (org.slf4j.impl.Log4jLoggerFactory)]
   [junit4]   2> 2602168 INFO  (TEST-RulesTest.testPortRule-seed#[25880A5E9E88BC44]) [    ] o.a.s.c.ZkContainer Zookeeper client=127.0.0.1:52977/solr
   [junit4]   2> 2602168 INFO  (TEST-RulesTest.testPortRule-seed#[25880A5E9E88BC44]) [    ] o.a.s.c.ZkController zkHost includes chroot
   [junit4]   2> 2602169 INFO  (TEST-RulesTest.testPortRule-seed#[25880A5E9E88BC44]) [    ] o.a.s.c.c.SolrZkClient Using default ZkCredentialsProvider
   [junit4]   2> 2602170 INFO  (TEST-RulesTest.testPortRule-seed#[25880A5E9E88BC44]) [    ] o.a.s.c.c.ConnectionManager Waiting for client to connect to ZooKeeper
   [junit4]   2> 2602171 INFO  (zkCallback-2620-thread-1) [    ] o.a.s.c.c.ConnectionManager Watcher org.apache.solr.common.cloud.ConnectionManager@df378de name:ZooKeeperConnection Watcher:127.0.0.1:52977 got event WatchedEvent state:SyncConnected type:None path:null path:null type:None
   [junit4]   2> 2602172 INFO  (TEST-RulesTest.testPortRule-seed#[25880A5E9E88BC44]) [    ] o.a.s.c.c.ConnectionManager Client is connected to ZooKeeper
   [junit4]   2> 2602172 INFO  (TEST-RulesTest.testPortRule-seed#[25880A5E9E88BC44]) [    ] o.a.s.c.c.SolrZkClient Using default ZkACLProvider
   [junit4]   2> 2602175 INFO  (TEST-RulesTest.testPortRule-seed#[25880A5E9E88BC44]) [n:127.0.0.1:53014_e%2Fjk    ] o.a.s.c.c.ConnectionManager Waiting for client to connect to ZooKeeper
   [junit4]   2> 2602176 INFO  (zkCallback-2621-thread-1-processing-n:127.0.0.1:53014_e%2Fjk) [n:127.0.0.1:53014_e%2Fjk    ] o.a.s.c.c.ConnectionManager Watcher org.apache.solr.common.cloud.ConnectionManager@3221479f name:ZooKeeperConnection Watcher:127.0.0.1:52977/solr got event WatchedEvent state:SyncConnected type:None path:null path:null type:None
   [junit4]   2> 2602177 INFO  (TEST-RulesTest.testPortRule-seed#[25880A5E9E88BC44]) [n:127.0.0.1:53014_e%2Fjk    ] o.a.s.c.c.ConnectionManager Client is connected to ZooKeeper
   [junit4]   2> 2602183 INFO  (TEST-RulesTest.testPortRule-seed#[25880A5E9E88BC44]) [n:127.0.0.1:53014_e%2Fjk    ] o.a.s.c.c.ZkStateReader Updating cluster state from ZooKeeper... 
   [junit4]   2> 2603188 INFO  (TEST-RulesTest.testPortRule-seed#[25880A5E9E88BC44]) [n:127.0.0.1:53014_e%2Fjk    ] o.a.s.c.ZkController Register node as live in ZooKeeper:/live_nodes/127.0.0.1:53014_e%2Fjk
   [junit4]   2> 2603189 INFO  (TEST-RulesTest.testPortRule-seed#[25880A5E9E88BC44]) [n:127.0.0.1:53014_e%2Fjk    ] o.a.s.c.c.SolrZkClient makePath: /live_nodes/127.0.0.1:53014_e%2Fjk
   [junit4]   2> 2603190 INFO  (zkCallback-2621-thread-1-processing-n:127.0.0.1:53014_e%2Fjk) [n:127.0.0.1:53014_e%2Fjk    ] o.a.s.c.c.ZkStateReader A live node change: [WatchedEvent state:SyncConnected type:NodeChildrenChanged path:/live_nodes], has occurred - updating... (live nodes size: [1])
   [junit4]   2> 2603190 INFO  (zkCallback-2615-thread-1) [    ] o.a.s.c.c.ZkStateReader A live node change: [WatchedEvent state:SyncConnected type:NodeChildrenChanged path:/live_nodes], has occurred - updating... (live nodes size: [1])
   [junit4]   2> 2603190 INFO  (zkCallback-2613-thread-1-processing-n:127.0.0.1:52984_e%2Fjk) [n:127.0.0.1:52984_e%2Fjk    ] o.a.s.c.c.ZkStateReader A live node change: [WatchedEvent state:SyncConnected type:NodeChildrenChanged path:/live_nodes], has occurred - updating... (live nodes size: [1])
   [junit4]   2> 2603192 INFO  (TEST-RulesTest.testPortRule-seed#[25880A5E9E88BC44]) [n:127.0.0.1:53014_e%2Fjk    ] o.a.s.c.Overseer Overseer (id=null) closing
   [junit4]   2> 2603193 INFO  (TEST-RulesTest.testPortRule-seed#[25880A5E9E88BC44]) [n:127.0.0.1:53014_e%2Fjk    ] o.a.s.c.LeaderElector Joined leadership election with path: /overseer_elect/election/95415481792200713-127.0.0.1:53014_e%2Fjk-n_0000000001
   [junit4]   2> 2603193 INFO  (TEST-RulesTest.testPortRule-seed#[25880A5E9E88BC44]) [n:127.0.0.1:53014_e%2Fjk    ] o.a.s.c.LeaderElector Watching path /overseer_elect/election/95415481792200708-127.0.0.1:52984_e%2Fjk-n_0000000000 to know if I could be the leader
   [junit4]   2> 2603213 INFO  (TEST-RulesTest.testPortRule-seed#[25880A5E9E88BC44]) [n:127.0.0.1:53014_e%2Fjk    ] o.a.s.c.CoreContainer Security conf doesn't exist. Skipping setup for authorization module.
   [junit4]   2> 2603213 INFO  (TEST-RulesTest.testPortRule-seed#[25880A5E9E88BC44]) [n:127.0.0.1:53014_e%2Fjk    ] o.a.s.c.CoreContainer No authentication plugin used.
   [junit4]   2> 2603214 INFO  (TEST-RulesTest.testPortRule-seed#[25880A5E9E88BC44]) [n:127.0.0.1:53014_e%2Fjk    ] o.a.s.c.CorePropertiesLocator Looking for core definitions underneath C:\Users\JenkinsSlave\workspace\Lucene-Solr-5.5-Windows\solr\build\solr-core\test\J1\temp\solr.cloud.rule.RulesTest_25880A5E9E88BC44-001\shard-1-001\cores
   [junit4]   2> 2603215 INFO  (TEST-RulesTest.testPortRule-seed#[25880A5E9E88BC44]) [n:127.0.0.1:53014_e%2Fjk    ] o.a.s.c.CoreDescriptor Created CoreDescriptor: {name=collection1, config=solrconfig.xml, transient=false, schema=schema.xml, loadOnStartup=true, configSetProperties=configsetprops.json, collection=collection1, coreNodeName=, dataDir=data\, shard=}
   [junit4]   2> 2603216 INFO  (TEST-RulesTest.testPortRule-seed#[25880A5E9E88BC44]) [n:127.0.0.1:53014_e%2Fjk    ] o.a.s.c.CorePropertiesLocator Found core collection1 in C:\Users\JenkinsSlave\workspace\Lucene-Solr-5.5-Windows\solr\build\solr-core\test\J1\temp\solr.cloud.rule.RulesTest_25880A5E9E88BC44-001\shard-1-001\cores\collection1
   [junit4]   2> 2603216 INFO  (TEST-RulesTest.testPortRule-seed#[25880A5E9E88BC44]) [n:127.0.0.1:53014_e%2Fjk    ] o.a.s.c.CorePropertiesLocator Found 1 core definitions
   [junit4]   2> 2603217 INFO  (TEST-RulesTest.testPortRule-seed#[25880A5E9E88BC44]) [n:127.0.0.1:53014_e%2Fjk    ] o.a.s.s.SolrDispatchFilter user.dir=C:\Users\JenkinsSlave\workspace\Lucene-Solr-5.5-Windows\solr\build\solr-core\test\J1
   [junit4]   2> 2603217 INFO  (TEST-RulesTest.testPortRule-seed#[25880A5E9E88BC44]) [n:127.0.0.1:53014_e%2Fjk    ] o.a.s.s.SolrDispatchFilter SolrDispatchFilter.init() done
   [junit4]   2> 2603217 INFO  (coreLoadExecutor-8660-thread-1-processing-n:127.0.0.1:53014_e%2Fjk) [n:127.0.0.1:53014_e%2Fjk c:collection1   x:collection1] o.a.s.c.ZkController publishing state=down
   [junit4]   2> 2603217 INFO  (coreLoadExecutor-8660-thread-1-processing-n:127.0.0.1:53014_e%2Fjk) [n:127.0.0.1:53014_e%2Fjk c:collection1   x:collection1] o.a.s.c.ZkController numShards not found on descriptor - reading it from system property
   [junit4]   2> 2603219 INFO  (coreLoadExecutor-8660-thread-1-processing-n:127.0.0.1:53014_e%2Fjk) [n:127.0.0.1:53014_e%2Fjk c:collection1   x:collection1] o.a.s.c.ZkController Registering watch for collection collection1
   [junit4]   2> 2603219 INFO  (coreLoadExecutor-8660-thread-1-processing-n:127.0.0.1:53014_e%2Fjk) [n:127.0.0.1:53014_e%2Fjk c:collection1   x:collection1] o.a.s.c.c.ZkStateReader addZkWatch [collection1]
   [junit4]   2> 2603219 INFO  (OverseerStateUpdate-95415481792200708-127.0.0.1:52984_e%2Fjk-n_0000000000) [n:127.0.0.1:52984_e%2Fjk    ] o.a.s.c.Overseer processMessage: queueSize: 1, message = {
   [junit4]   2>   "core":"collection1",
   [junit4]   2>   "roles":null,
   [junit4]   2>   "base_url":"http://127.0.0.1:53014/e/jk",
   [junit4]   2>   "node_name":"127.0.0.1:53014_e%2Fjk",
   [junit4]   2>   "numShards":"2",
   [junit4]   2>   "state":"down",
   [junit4]   2>   "shard":null,
   [junit4]   2>   "collection":"collection1",
   [junit4]   2>   "operation":"state"} current state version: 3
   [junit4]   2> 2603219 INFO  (coreLoadExecutor-8660-thread-1-processing-n:127.0.0.1:53014_e%2Fjk) [n:127.0.0.1:53014_e%2Fjk c:collection1   x:collection1] o.a.s.c.c.ZkStateReader Add data for [collection1] ver [0]
   [junit4]   2> 2603219 INFO  (coreLoadExecutor-8660-thread-1-processing-n:127.0.0.1:53014_e%2Fjk) [n:127.0.0.1:53014_e%2Fjk c:collection1   x:collection1] o.a.s.c.ZkController look for our core node name
   [junit4]   2> 2603220 INFO  (OverseerStateUpdate-95415481792200708-127.0.0.1:52984_e%2Fjk-n_0000000000) [n:127.0.0.1:52984_e%2Fjk    ] o.a.s.c.o.ReplicaMutator Update state numShards=2 message={
   [junit4]   2>   "core":"collection1",
   [junit4]   2>   "roles":null,
   [junit4]   2>   "base_url":"http://127.0.0.1:53014/e/jk",
   [junit4]   2>   "node_name":"127.0.0.1:53014_e%2Fjk",
   [junit4]   2>   "numShards":"2",
   [junit4]   2>   "state":"down",
   [junit4]   2>   "shard":null,
   [junit4]   2>   "collection":"collection1",
   [junit4]   2>   "operation":"state"}
   [junit4]   2> 2603220 INFO  (OverseerStateUpdate-95415481792200708-127.0.0.1:52984_e%2Fjk-n_0000000000) [n:127.0.0.1:52984_e%2Fjk    ] o.a.s.c.o.ReplicaMutator Collection already exists with numShards=2
   [junit4]   2> 2603220 INFO  (OverseerStateUpdate-95415481792200708-127.0.0.1:52984_e%2Fjk-n_0000000000) [n:127.0.0.1:52984_e%2Fjk    ] o.a.s.c.o.ReplicaMutator Assigning new node to shard shard=shard2
   [junit4]   2> 2603221 INFO  (OverseerStateUpdate-95415481792200708-127.0.0.1:52984_e%2Fjk-n_0000000000) [n:127.0.0.1:52984_e%2Fjk    ] o.a.s.c.o.ZkStateWriter going to update_collection /collections/collection1/state.json version: 0
   [junit4]   2> 2603221 INFO  (zkCallback-2621-thread-1-processing-n:127.0.0.1:53014_e%2Fjk) [n:127.0.0.1:53014_e%2Fjk    ] o.a.s.c.c.ZkStateReader A cluster state change: [WatchedEvent state:SyncConnected type:NodeDataChanged path:/collections/collection1/state.json] for collection [collection1] has occurred - updating... (live nodes size: [2])
   [junit4]   2> 2603222 INFO  (zkCallback-2621-thread-1-processing-n:127.0.0.1:53014_e%2Fjk) [n:127.0.0.1:53014_e%2Fjk    ] o.a.s.c.c.ZkStateReader Updating data for [collection1] from [0] to [1]
   [junit4]   2> 2604219 INFO  (coreLoadExecutor-8660-thread-1-processing-n:127.0.0.1:53014_e%2Fjk) [n:127.0.0.1:53014_e%2Fjk c:collection1   x:collection1] o.a.s.c.ZkController waiting to find shard id in clusterstate for collection1
   [junit4]   2> 2604219 INFO  (coreLoadExecutor-8660-thread-1-processing-n:127.0.0.1:53014_e%2Fjk) [n:127.0.0.1:53014_e%2Fjk c:collection1   x:collection1] o.a.s.c.ZkController Check for collection zkNode:collection1
   [junit4]   2> 2604219 INFO  (coreLoadExecutor-8660-thread-1-processing-n:127.0.0.1:53014_e%2Fjk) [n:127.0.0.1:53014_e%2Fjk c:collection1   x:collection1] o.a.s.c.ZkController Collection zkNode exists
   [junit4]   2> 2604219 INFO  (coreLoadExecutor-8660-thread-1-processing-n:127.0.0.1:53014_e%2Fjk) [n:127.0.0.1:53014_e%2Fjk c:collection1   x:collection1] o.a.s.c.c.ZkStateReader Load collection config from: [/collections/collection1]
   [junit4]   2> 2604220 INFO  (coreLoadExecutor-8660-thread-1-processing-n:127.0.0.1:53014_e%2Fjk) [n:127.0.0.1:53014_e%2Fjk c:collection1   x:collection1] o.a.s.c.c.ZkStateReader path=[/collections/collection1] [configName]=[conf1] specified config exists in ZooKeeper
   [junit4]   2> 2604220 INFO  (coreLoadExecutor-8660-thread-1-processing-n:127.0.0.1:53014_e%2Fjk) [n:127.0.0.1:53014_e%2Fjk c:collection1   x:collection1] o.a.s.c.SolrResourceLoader new SolrResourceLoader for directory: 'C:\Users\JenkinsSlave\workspace\Lucene-Solr-5.5-Windows\solr\build\solr-core\test\J1\temp\solr.cloud.rule.RulesTest_25880A5E9E88BC44-001\shard-1-001\cores\collection1'
   [junit4]   2> 2604220 INFO  (coreLoadExecutor-8660-thread-1-processing-n:127.0.0.1:53014_e%2Fjk) [n:127.0.0.1:53014_e%2Fjk c:collection1   x:collection1] o.a.s.c.SolrResourceLoader JNDI not configured for solr (NoInitialContextEx)
   [junit4]   2> 2604220 INFO  (coreLoadExecutor-8660-thread-1-processing-n:127.0.0.1:53014_e%2Fjk) [n:127.0.0.1:53014_e%2Fjk c:collection1   x:collection1] o.a.s.c.SolrResourceLoader solr home defaulted to 'solr/' (could not find system property or JNDI)
   [junit4]   2> 2604222 INFO  (coreLoadExecutor-8660-thread-1-processing-n:127.0.0.1:53014_e%2Fjk) [n:127.0.0.1:53014_e%2Fjk c:collection1   x:collection1] o.a.s.c.Config loaded config solrconfig.xml with version 0 
   [junit4]   2> 2604229 INFO  (coreLoadExecutor-8660-thread-1-processing-n:127.0.0.1:53014_e%2Fjk) [n:127.0.0.1:53014_e%2Fjk c:collection1   x:collection1] o.a.s.c.SolrConfig current version of requestparams : -1
   [junit4]   2> 2604232 INFO  (coreLoadExecutor-8660-thread-1-processing-n:127.0.0.1:53014_e%2Fjk) [n:127.0.0.1:53014_e%2Fjk c:collection1   x:collection1] o.a.s.c.SolrConfig Using Lucene MatchVersion: 5.5.0
   [junit4]   2> 2604240 INFO  (coreLoadExecutor-8660-thread-1-processing-n:127.0.0.1:53014_e%2Fjk) [n:127.0.0.1:53014_e%2Fjk c:collection1   x:collection1] o.a.s.c.SolrConfig Loaded SolrConfig: solrconfig.xml
   [junit4]   2> 2604258 INFO  (coreLoadExecutor-8660-thread-1-processing-n:127.0.0.1:53014_e%2Fjk) [n:127.0.0.1:53014_e%2Fjk c:collection1   x:collection1] o.a.s.s.IndexSchema [collection1] Schema name=test
   [junit4]   2> 2604355 INFO  (coreLoadExecutor-8660-thread-1-processing-n:127.0.0.1:53014_e%2Fjk) [n:127.0.0.1:53014_e%2Fjk c:collection1   x:collection1] o.a.s.s.OpenExchangeRatesOrgProvider Initialized with rates=open-exchange-rates.json, refreshInterval=1440.
   [junit4]   2> 2604361 INFO  (coreLoadExecutor-8660-thread-1-processing-n:127.0.0.1:53014_e%2Fjk) [n:127.0.0.1:53014_e%2Fjk c:collection1   x:collection1] o.a.s.s.IndexSchema default search field in schema is text
   [junit4]   2> 2604362 INFO  (coreLoadExecutor-8660-thread-1-processing-n:127.0.0.1:53014_e%2Fjk) [n:127.0.0.1:53014_e%2Fjk c:collection1   x:collection1] o.a.s.s.IndexSchema unique key field: id
   [junit4]   2> 2604370 INFO  (coreLoadExecutor-8660-thread-1-processing-n:127.0.0.1:53014_e%2Fjk) [n:127.0.0.1:53014_e%2Fjk c:collection1   x:collection1] o.a.s.s.FileExchangeRateProvider Reloading exchange rates from file currency.xml
   [junit4]   2> 2604373 INFO  (coreLoadExecutor-8660-thread-1-processing-n:127.0.0.1:53014_e%2Fjk) [n:127.0.0.1:53014_e%2Fjk c:collection1   x:collection1] o.a.s.s.FileExchangeRateProvider Reloading exchange rates from file currency.xml
   [junit4]   2> 2604375 INFO  (coreLoadExecutor-8660-thread-1-processing-n:127.0.0.1:53014_e%2Fjk) [n:127.0.0.1:53014_e%2Fjk c:collection1   x:collection1] o.a.s.s.OpenExchangeRatesOrgProvider Reloading exchange rates from open-exchange-rates.json
   [junit4]   2> 2604376 INFO  (coreLoadExecutor-8660-thread-1-processing-n:127.0.0.1:53014_e%2Fjk) [n:127.0.0.1:53014_e%2Fjk c:collection1   x:collection1] o.a.s.s.OpenExchangeRatesOrgProvider Reloading exchange rates from open-exchange-rates.json
   [junit4]   2> 2604381 INFO  (coreLoadExecutor-8660-thread-1-processing-n:127.0.0.1:53014_e%2Fjk) [n:127.0.0.1:53014_e%2Fjk c:collection1   x:collection1] o.a.s.c.ConfigSetProperties Did not find ConfigSet properties, assuming default properties: Can't find resource 'configsetprops.json' in classpath or '/configs/conf1', cwd=C:\Users\JenkinsSlave\workspace\Lucene-Solr-5.5-Windows\solr\build\solr-core\test\J1
   [junit4]   2> 2604382 INFO  (coreLoadExecutor-8660-thread-1-processing-n:127.0.0.1:53014_e%2Fjk) [n:127.0.0.1:53014_e%2Fjk c:collection1   x:collection1] o.a.

[...truncated too long message...]

disk":">1"}]
   [junit4]    >  tag values{
   [junit4]    >   "127.0.0.1:53297_e%2Fjk":{
   [junit4]    >     "node":"127.0.0.1:53297_e%2Fjk",
   [junit4]    >     "cores":1,
   [junit4]    >     "freedisk":1},
   [junit4]    >   "127.0.0.1:53347_e%2Fjk":{
   [junit4]    >     "node":"127.0.0.1:53347_e%2Fjk",
   [junit4]    >     "cores":2,
   [junit4]    >     "freedisk":1},
   [junit4]    >   "127.0.0.1:53313_e%2Fjk":{
   [junit4]    >     "node":"127.0.0.1:53313_e%2Fjk",
   [junit4]    >     "cores":2,
   [junit4]    >     "freedisk":1},
   [junit4]    >   "127.0.0.1:53262_e%2Fjk":{
   [junit4]    >     "node":"127.0.0.1:53262_e%2Fjk",
   [junit4]    >     "cores":1,
   [junit4]    >     "freedisk":1},
   [junit4]    >   "127.0.0.1:53280_e%2Fjk":{
   [junit4]    >     "node":"127.0.0.1:53280_e%2Fjk",
   [junit4]    >     "cores":1,
   [junit4]    >     "freedisk":1},
   [junit4]    >   "127.0.0.1:53333_e%2Fjk":{
   [junit4]    >     "node":"127.0.0.1:53333_e%2Fjk",
   [junit4]    >     "cores":1,
   [junit4]    >     "freedisk":1}}
   [junit4]    > Initial state for the coll : {"shard1":{
   [junit4]    >     "127.0.0.1:53313_e%2Fjk":1,
   [junit4]    >     "127.0.0.1:53347_e%2Fjk":1}}
   [junit4]    > 	at __randomizedtesting.SeedInfo.seed([25880A5E9E88BC44:C0BB4DDF82FC4E46]:0)
   [junit4]    > 	at org.apache.solr.client.solrj.impl.HttpSolrClient.executeMethod(HttpSolrClient.java:576)
   [junit4]    > 	at org.apache.solr.client.solrj.impl.HttpSolrClient.request(HttpSolrClient.java:240)
   [junit4]    > 	at org.apache.solr.client.solrj.impl.HttpSolrClient.request(HttpSolrClient.java:229)
   [junit4]    > 	at org.apache.solr.client.solrj.SolrRequest.process(SolrRequest.java:149)
   [junit4]    > 	at org.apache.solr.client.solrj.SolrRequest.process(SolrRequest.java:166)
   [junit4]    > 	at org.apache.solr.cloud.rule.RulesTest.doIntegrationTest(RulesTest.java:82)
   [junit4]    > 	at org.apache.solr.BaseDistributedSearchTestCase$ShardsRepeatRule$ShardsFixedStatement.callStatement(BaseDistributedSearchTestCase.java:964)
   [junit4]    > 	at org.apache.solr.BaseDistributedSearchTestCase$ShardsRepeatRule$ShardsStatement.evaluate(BaseDistributedSearchTestCase.java:939)
   [junit4]    > 	at java.lang.Thread.run(Thread.java:745)
   [junit4]   2> 2676998 INFO  (SUITE-RulesTest-seed#[25880A5E9E88BC44]-worker) [    ] o.a.s.SolrTestCaseJ4 ###deleteCore
   [junit4]   2> NOTE: leaving temporary files on disk at: C:\Users\JenkinsSlave\workspace\Lucene-Solr-5.5-Windows\solr\build\solr-core\test\J1\temp\solr.cloud.rule.RulesTest_25880A5E9E88BC44-001
   [junit4]   2> NOTE: test params are: codec=Asserting(Lucene54): {}, docValues:{}, sim=DefaultSimilarity, locale=is-IS, timezone=Asia/Jerusalem
   [junit4]   2> NOTE: Windows 7 6.1 amd64/Oracle Corporation 1.8.0_72 (64-bit)/cpus=3,threads=1,free=170398168,total=536870912
   [junit4]   2> NOTE: All tests run in this JVM: [DateMathParserTest, TestSerializedLuceneMatchVersion, RecoveryAfterSoftCommitTest, TestRandomRequestDistribution, CacheHeaderTest, TestSolrQueryParserResource, TestConfigSetImmutable, SortSpecParsingTest, SuggestComponentTest, MigrateRouteKeyTest, TestReloadAndDeleteDocs, TestSolrDeletionPolicy2, BufferStoreTest, DistribJoinFromCollectionTest, OutputWriterTest, TestValueSourceCache, SolrPluginUtilsTest, TestFieldSortValues, IgnoreCommitOptimizeUpdateProcessorFactoryTest, TestCoreDiscovery, TestBlobHandler, TestWriterPerf, TestCollationFieldDocValues, QueryResultKeyTest, TestPKIAuthenticationPlugin, SolrCmdDistributorTest, FullHLLTest, TestBinaryField, AutoCommitTest, TestImplicitCoreProperties, TestCharFilters, IndexSchemaRuntimeFieldTest, OutOfBoxZkACLAndCredentialsProvidersTest, TestRecoveryHdfs, BigEndianAscendingWordDeserializerTest, DirectSolrConnectionTest, AnalysisErrorHandlingTest, TestFreeTextSuggestions, TestOrdValues, TestSmileRequest, TestSha256AuthenticationProvider, ResponseLogComponentTest, TestLeaderElectionZkExpiry, SearchHandlerTest, CheckHdfsIndexTest, TestObjectReleaseTracker, BasicFunctionalityTest, TestConfigSets, TestFastWriter, BinaryUpdateRequestHandlerTest, TestRangeQuery, EchoParamsTest, TestJoin, DirectUpdateHandlerOptimizeTest, CurrencyFieldOpenExchangeTest, DateRangeFieldTest, HdfsChaosMonkeySafeLeaderTest, TestSolr4Spatial, TestFuzzyAnalyzedSuggestions, TestMissingGroups, CollectionsAPIDistributedZkTest, SaslZkACLProviderTest, TestManagedSchemaDynamicFieldResource, MultiTermTest, SpellPossibilityIteratorTest, FileUtilsTest, TestInitParams, SuggesterTest, BadCopyFieldTest, ChaosMonkeySafeLeaderTest, EnumFieldTest, StressHdfsTest, TestJettySolrRunner, VMParamsZkACLAndCredentialsProvidersTest, BlockCacheTest, SpellCheckCollatorTest, TestSchemaManager, TestTrieFacet, TestCollationField, AnalyticsQueryTest, InfoHandlerTest, TestMacros, FileBasedSpellCheckerTest, PreAnalyzedUpdateProcessorTest, UUIDUpdateProcessorFallbackTest, TestSortingResponseWriter, TestReplicaProperties, ReplicationFactorTest, DistributedSuggestComponentTest, TestInitQParser, TestOmitPositions, HdfsRecoveryZkTest, TestCopyFieldCollectionResource, TestDFISimilarityFactory, TestStressRecovery, RequestHandlersTest, TestJsonFacets, CollectionsAPIAsyncDistributedZkTest, TestSimpleTrackingShardHandler, TestSolrCloudWithKerberosAlt, TestManagedStopFilterFactory, TestReversedWildcardFilterFactory, TestConfigSetsAPIExclusivity, SolrCoreCheckLockOnStartupTest, TestPHPSerializedResponseWriter, CachingDirectoryFactoryTest, TestIndexingPerformance, StatsComponentTest, TestBulkSchemaConcurrent, TestFieldTypeCollectionResource, SimpleCollectionCreateDeleteTest, TestDistributedMissingSort, LeaderInitiatedRecoveryOnCommitTest, HdfsBasicDistributedZkTest, TestFastOutputStream, MergeStrategyTest, TestRealTimeGet, SolrInfoMBeanTest, TestSearcherReuse, HdfsSyncSliceTest, MinimalSchemaTest, TestCustomDocTransformer, FieldMutatingUpdateProcessorTest, TestBulkSchemaAPI, TestCryptoKeys, DistanceFunctionTest, TestSystemIdResolver, TestSolrJ, LeaderElectionIntegrationTest, TestSchemaSimilarityResource, AsyncCallRequestStatusResponseTest, SortByFunctionTest, RuleEngineTest, DefaultValueUpdateProcessorTest, TestRawTransformer, TestLRUStatsCache, ConjunctionSolrSpellCheckerTest, UpdateRequestProcessorFactoryTest, HLLUtilTest, TestFiltering, TestComplexPhraseQParserPlugin, BasicDistributedZkTest, BasicDistributedZk2Test, UnloadDistributedZkTest, SyncSliceTest, OpenCloseCoreStressTest, ShardRoutingTest, BasicZkTest, RecoveryZkTest, TestReplicationHandler, TestZkChroot, ZkCLITest, TestRecovery, TermVectorComponentDistributedTest, SpellCheckComponentTest, PeerSyncTest, TestBadConfig, TestIndexSearcher, HighlighterTest, ShowFileRequestHandlerTest, CurrencyFieldXmlFileTest, SolrIndexSplitterTest, SignatureUpdateProcessorFactoryTest, TestExtendedDismaxParser, CoreAdminHandlerTest, DocValuesTest, TestTrie, SuggesterWFSTTest, PolyFieldTest, WordBreakSolrSpellCheckerTest, DocValuesMultiTest, TestSolrDeletionPolicy1, DebugComponentTest, IndexBasedSpellCheckerTest, DisMaxRequestHandlerTest, TestQueryUtils, DirectSolrSpellCheckerTest, TestQueryTypes, XmlUpdateRequestHandlerTest, MoreLikeThisHandlerTest, TestSolrQueryParser, FastVectorHighlighterTest, TestJmxIntegration, TestCSVResponseWriter, MBeansHandlerTest, TestAnalyzedSuggestions, CSVRequestHandlerTest, TestComponentsName, TestBinaryResponseWriter, HighlighterConfigTest, SOLR749Test, TestQuerySenderListener, UpdateParamsTest, AlternateDirectoryTest, TestSolrIndexConfig, TestQuerySenderNoQuery, CopyFieldTest, SolrIndexConfigTest, TestDocSet, NumericFieldsTest, TestConfig, TestSolrCoreProperties, TestLuceneMatchVersion, TestPerFieldSimilarity, TestLMJelinekMercerSimilarityFactory, TestBM25SimilarityFactory, ResourceLoaderTest, OpenExchangeRatesOrgProviderTest, TestSuggestSpellingConverter, DateFieldTest, TestUtils, ZkNodePropsTest, UUIDFieldTest, TestRTGBase, CursorPagingTest, DistributedIntervalFacetingTest, AssignTest, CleanupOldIndexTest, CloudExitableDirectoryReaderTest, CollectionStateFormat2Test, ConcurrentDeleteAndCreateCollectionTest, ConfigSetsAPITest, CustomCollectionTest, DeleteReplicaTest, DistribCursorPagingTest, DistribDocExpirationUpdateProcessorTest, ForceLeaderTest, LeaderFailoverAfterPartitionTest, LeaderInitiatedRecoveryOnShardRestartTest, MultiThreadedOCPTest, RollingRestartTest, TestCloudInspectUtil, TestCloudPivotFacet, TestCollectionAPI, TestDistribDocBasedVersion, TestDownShardTolerantSearch, TestLeaderInitiatedRecoveryThread, TestMiniSolrCloudCluster, TestRequestStatusCollectionAPI, RulesTest]
   [junit4] Completed [485/566 (1!)] on J1 in 77.84s, 3 tests, 1 error, 1 skipped <<< FAILURES!

[...truncated 263 lines...]
BUILD FAILED
C:\Users\JenkinsSlave\workspace\Lucene-Solr-5.5-Windows\build.xml:750: The following error occurred while executing this line:
C:\Users\JenkinsSlave\workspace\Lucene-Solr-5.5-Windows\build.xml:694: The following error occurred while executing this line:
C:\Users\JenkinsSlave\workspace\Lucene-Solr-5.5-Windows\build.xml:59: The following error occurred while executing this line:
C:\Users\JenkinsSlave\workspace\Lucene-Solr-5.5-Windows\solr\build.xml:233: The following error occurred while executing this line:
C:\Users\JenkinsSlave\workspace\Lucene-Solr-5.5-Windows\solr\common-build.xml:534: The following error occurred while executing this line:
C:\Users\JenkinsSlave\workspace\Lucene-Solr-5.5-Windows\lucene\common-build.xml:1477: The following error occurred while executing this line:
C:\Users\JenkinsSlave\workspace\Lucene-Solr-5.5-Windows\lucene\common-build.xml:1033: There were test failures: 566 suites (7 ignored), 2275 tests, 1 error, 94 ignored (49 assumptions) [seed: 25880A5E9E88BC44]

Total time: 72 minutes 51 seconds
Build step 'Invoke Ant' marked build as failure
Archiving artifacts
[WARNINGS] Skipping publisher since build result is FAILURE
Recording test results
Email was triggered for: Failure - Any
Sending email for trigger: Failure - Any



Mime
View raw message