lucene-dev mailing list archives

Site index · List index
Message view « Date » · « Thread »
Top « Date » · « Thread »
From Policeman Jenkins Server <jenk...@thetaphi.de>
Subject [JENKINS] Lucene-Solr-trunk-MacOSX (64bit/jdk1.8.0) - Build # 3060 - Failure!
Date Wed, 03 Feb 2016 15:53:16 GMT
Build: http://jenkins.thetaphi.de/job/Lucene-Solr-trunk-MacOSX/3060/
Java: 64bit/jdk1.8.0 -XX:+UseCompressedOops -XX:+UseSerialGC

3 tests failed.
FAILED:  org.apache.solr.client.solrj.impl.CloudSolrClientTest.test

Error Message:
IOException occured when talking to server at: http://127.0.0.1:59085/dnxmb/ya/collection1

Stack Trace:
org.apache.solr.client.solrj.SolrServerException: IOException occured when talking to server at: http://127.0.0.1:59085/dnxmb/ya/collection1
	at __randomizedtesting.SeedInfo.seed([9A70BCBE321361B1:122483649CEF0C49]:0)
	at org.apache.solr.client.solrj.impl.HttpSolrClient.executeMethod(HttpSolrClient.java:590)
	at org.apache.solr.client.solrj.impl.HttpSolrClient.request(HttpSolrClient.java:240)
	at org.apache.solr.client.solrj.impl.HttpSolrClient.request(HttpSolrClient.java:229)
	at org.apache.solr.client.solrj.impl.LBHttpSolrClient.doRequest(LBHttpSolrClient.java:372)
	at org.apache.solr.client.solrj.impl.LBHttpSolrClient.request(LBHttpSolrClient.java:325)
	at org.apache.solr.client.solrj.impl.CloudSolrClient.sendRequest(CloudSolrClient.java:1100)
	at org.apache.solr.client.solrj.impl.CloudSolrClient.requestWithRetryOnStaleState(CloudSolrClient.java:871)
	at org.apache.solr.client.solrj.impl.CloudSolrClient.request(CloudSolrClient.java:807)
	at org.apache.solr.client.solrj.SolrRequest.process(SolrRequest.java:150)
	at org.apache.solr.client.solrj.SolrClient.commit(SolrClient.java:485)
	at org.apache.solr.client.solrj.SolrClient.commit(SolrClient.java:464)
	at org.apache.solr.client.solrj.impl.CloudSolrClientTest.allTests(CloudSolrClientTest.java:198)
	at org.apache.solr.client.solrj.impl.CloudSolrClientTest.test(CloudSolrClientTest.java:118)
	at sun.reflect.NativeMethodAccessorImpl.invoke0(Native Method)
	at sun.reflect.NativeMethodAccessorImpl.invoke(NativeMethodAccessorImpl.java:62)
	at sun.reflect.DelegatingMethodAccessorImpl.invoke(DelegatingMethodAccessorImpl.java:43)
	at java.lang.reflect.Method.invoke(Method.java:498)
	at com.carrotsearch.randomizedtesting.RandomizedRunner.invoke(RandomizedRunner.java:1764)
	at com.carrotsearch.randomizedtesting.RandomizedRunner$8.evaluate(RandomizedRunner.java:871)
	at com.carrotsearch.randomizedtesting.RandomizedRunner$9.evaluate(RandomizedRunner.java:907)
	at com.carrotsearch.randomizedtesting.RandomizedRunner$10.evaluate(RandomizedRunner.java:921)
	at org.junit.rules.ExpectedException$ExpectedExceptionStatement.evaluate(ExpectedException.java:110)
	at org.apache.solr.BaseDistributedSearchTestCase$ShardsRepeatRule$ShardsFixedStatement.callStatement(BaseDistributedSearchTestCase.java:965)
	at org.apache.solr.BaseDistributedSearchTestCase$ShardsRepeatRule$ShardsStatement.evaluate(BaseDistributedSearchTestCase.java:940)
	at com.carrotsearch.randomizedtesting.rules.SystemPropertiesRestoreRule$1.evaluate(SystemPropertiesRestoreRule.java:57)
	at org.apache.lucene.util.TestRuleSetupTeardownChained$1.evaluate(TestRuleSetupTeardownChained.java:50)
	at org.apache.lucene.util.AbstractBeforeAfterRule$1.evaluate(AbstractBeforeAfterRule.java:46)
	at org.apache.lucene.util.TestRuleThreadAndTestName$1.evaluate(TestRuleThreadAndTestName.java:49)
	at org.apache.lucene.util.TestRuleIgnoreAfterMaxFailures$1.evaluate(TestRuleIgnoreAfterMaxFailures.java:65)
	at org.apache.lucene.util.TestRuleMarkFailure$1.evaluate(TestRuleMarkFailure.java:48)
	at com.carrotsearch.randomizedtesting.rules.StatementAdapter.evaluate(StatementAdapter.java:36)
	at com.carrotsearch.randomizedtesting.ThreadLeakControl$StatementRunner.run(ThreadLeakControl.java:367)
	at com.carrotsearch.randomizedtesting.ThreadLeakControl.forkTimeoutingTask(ThreadLeakControl.java:809)
	at com.carrotsearch.randomizedtesting.ThreadLeakControl$3.evaluate(ThreadLeakControl.java:460)
	at com.carrotsearch.randomizedtesting.RandomizedRunner.runSingleTest(RandomizedRunner.java:880)
	at com.carrotsearch.randomizedtesting.RandomizedRunner$5.evaluate(RandomizedRunner.java:781)
	at com.carrotsearch.randomizedtesting.RandomizedRunner$6.evaluate(RandomizedRunner.java:816)
	at com.carrotsearch.randomizedtesting.RandomizedRunner$7.evaluate(RandomizedRunner.java:827)
	at com.carrotsearch.randomizedtesting.rules.StatementAdapter.evaluate(StatementAdapter.java:36)
	at com.carrotsearch.randomizedtesting.rules.SystemPropertiesRestoreRule$1.evaluate(SystemPropertiesRestoreRule.java:57)
	at org.apache.lucene.util.AbstractBeforeAfterRule$1.evaluate(AbstractBeforeAfterRule.java:46)
	at com.carrotsearch.randomizedtesting.rules.StatementAdapter.evaluate(StatementAdapter.java:36)
	at org.apache.lucene.util.TestRuleStoreClassName$1.evaluate(TestRuleStoreClassName.java:42)
	at com.carrotsearch.randomizedtesting.rules.NoShadowingOrOverridesOnMethodsRule$1.evaluate(NoShadowingOrOverridesOnMethodsRule.java:40)
	at com.carrotsearch.randomizedtesting.rules.NoShadowingOrOverridesOnMethodsRule$1.evaluate(NoShadowingOrOverridesOnMethodsRule.java:40)
	at com.carrotsearch.randomizedtesting.rules.StatementAdapter.evaluate(StatementAdapter.java:36)
	at com.carrotsearch.randomizedtesting.rules.StatementAdapter.evaluate(StatementAdapter.java:36)
	at com.carrotsearch.randomizedtesting.rules.StatementAdapter.evaluate(StatementAdapter.java:36)
	at org.apache.lucene.util.TestRuleAssertionsRequired$1.evaluate(TestRuleAssertionsRequired.java:54)
	at org.apache.lucene.util.TestRuleMarkFailure$1.evaluate(TestRuleMarkFailure.java:48)
	at org.apache.lucene.util.TestRuleIgnoreAfterMaxFailures$1.evaluate(TestRuleIgnoreAfterMaxFailures.java:65)
	at org.apache.lucene.util.TestRuleIgnoreTestSuites$1.evaluate(TestRuleIgnoreTestSuites.java:55)
	at com.carrotsearch.randomizedtesting.rules.StatementAdapter.evaluate(StatementAdapter.java:36)
	at com.carrotsearch.randomizedtesting.ThreadLeakControl$StatementRunner.run(ThreadLeakControl.java:367)
	at java.lang.Thread.run(Thread.java:745)
Caused by: org.apache.http.NoHttpResponseException: 127.0.0.1:59085 failed to respond
	at org.apache.http.impl.conn.DefaultHttpResponseParser.parseHead(DefaultHttpResponseParser.java:143)
	at org.apache.http.impl.conn.DefaultHttpResponseParser.parseHead(DefaultHttpResponseParser.java:57)
	at org.apache.http.impl.io.AbstractMessageParser.parse(AbstractMessageParser.java:261)
	at org.apache.http.impl.AbstractHttpClientConnection.receiveResponseHeader(AbstractHttpClientConnection.java:283)
	at org.apache.http.impl.conn.DefaultClientConnection.receiveResponseHeader(DefaultClientConnection.java:251)
	at org.apache.http.impl.conn.ManagedClientConnectionImpl.receiveResponseHeader(ManagedClientConnectionImpl.java:197)
	at org.apache.http.protocol.HttpRequestExecutor.doReceiveResponse(HttpRequestExecutor.java:272)
	at org.apache.http.protocol.HttpRequestExecutor.execute(HttpRequestExecutor.java:124)
	at org.apache.http.impl.client.DefaultRequestDirector.tryExecute(DefaultRequestDirector.java:685)
	at org.apache.http.impl.client.DefaultRequestDirector.execute(DefaultRequestDirector.java:487)
	at org.apache.http.impl.client.AbstractHttpClient.doExecute(AbstractHttpClient.java:882)
	at org.apache.http.impl.client.CloseableHttpClient.execute(CloseableHttpClient.java:82)
	at org.apache.http.impl.client.CloseableHttpClient.execute(CloseableHttpClient.java:107)
	at org.apache.http.impl.client.CloseableHttpClient.execute(CloseableHttpClient.java:55)
	at org.apache.solr.client.solrj.impl.HttpSolrClient.executeMethod(HttpSolrClient.java:481)
	... 54 more


FAILED:  junit.framework.TestSuite.org.apache.solr.client.solrj.impl.CloudSolrClientTest

Error Message:
5 threads leaked from SUITE scope at org.apache.solr.client.solrj.impl.CloudSolrClientTest:     1) Thread[id=682, name=zkCallback-106-thread-1, state=TIMED_WAITING, group=TGRP-CloudSolrClientTest]         at sun.misc.Unsafe.park(Native Method)         at java.util.concurrent.locks.LockSupport.parkNanos(LockSupport.java:215)         at java.util.concurrent.SynchronousQueue$TransferStack.awaitFulfill(SynchronousQueue.java:460)         at java.util.concurrent.SynchronousQueue$TransferStack.transfer(SynchronousQueue.java:362)         at java.util.concurrent.SynchronousQueue.poll(SynchronousQueue.java:941)         at java.util.concurrent.ThreadPoolExecutor.getTask(ThreadPoolExecutor.java:1066)         at java.util.concurrent.ThreadPoolExecutor.runWorker(ThreadPoolExecutor.java:1127)         at java.util.concurrent.ThreadPoolExecutor$Worker.run(ThreadPoolExecutor.java:617)         at java.lang.Thread.run(Thread.java:745)    2) Thread[id=705, name=zkCallback-106-thread-2, state=TIMED_WAITING, group=TGRP-CloudSolrClientTest]         at sun.misc.Unsafe.park(Native Method)         at java.util.concurrent.locks.LockSupport.parkNanos(LockSupport.java:215)         at java.util.concurrent.SynchronousQueue$TransferStack.awaitFulfill(SynchronousQueue.java:460)         at java.util.concurrent.SynchronousQueue$TransferStack.transfer(SynchronousQueue.java:362)         at java.util.concurrent.SynchronousQueue.poll(SynchronousQueue.java:941)         at java.util.concurrent.ThreadPoolExecutor.getTask(ThreadPoolExecutor.java:1066)         at java.util.concurrent.ThreadPoolExecutor.runWorker(ThreadPoolExecutor.java:1127)         at java.util.concurrent.ThreadPoolExecutor$Worker.run(ThreadPoolExecutor.java:617)         at java.lang.Thread.run(Thread.java:745)    3) Thread[id=680, name=TEST-CloudSolrClientTest.test-seed#[9A70BCBE321361B1]-SendThread(127.0.0.1:59058), state=TIMED_WAITING, group=TGRP-CloudSolrClientTest]         at java.lang.Thread.sleep(Native Method)         at org.apache.zookeeper.client.StaticHostProvider.next(StaticHostProvider.java:101)         at org.apache.zookeeper.ClientCnxn$SendThread.startConnect(ClientCnxn.java:940)         at org.apache.zookeeper.ClientCnxn$SendThread.run(ClientCnxn.java:1003)    4) Thread[id=681, name=TEST-CloudSolrClientTest.test-seed#[9A70BCBE321361B1]-EventThread, state=WAITING, group=TGRP-CloudSolrClientTest]         at sun.misc.Unsafe.park(Native Method)         at java.util.concurrent.locks.LockSupport.park(LockSupport.java:175)         at java.util.concurrent.locks.AbstractQueuedSynchronizer$ConditionObject.await(AbstractQueuedSynchronizer.java:2039)         at java.util.concurrent.LinkedBlockingQueue.take(LinkedBlockingQueue.java:442)         at org.apache.zookeeper.ClientCnxn$EventThread.run(ClientCnxn.java:494)    5) Thread[id=706, name=zkCallback-106-thread-3, state=TIMED_WAITING, group=TGRP-CloudSolrClientTest]         at sun.misc.Unsafe.park(Native Method)         at java.util.concurrent.locks.LockSupport.parkNanos(LockSupport.java:215)         at java.util.concurrent.SynchronousQueue$TransferStack.awaitFulfill(SynchronousQueue.java:460)         at java.util.concurrent.SynchronousQueue$TransferStack.transfer(SynchronousQueue.java:362)         at java.util.concurrent.SynchronousQueue.poll(SynchronousQueue.java:941)         at java.util.concurrent.ThreadPoolExecutor.getTask(ThreadPoolExecutor.java:1066)         at java.util.concurrent.ThreadPoolExecutor.runWorker(ThreadPoolExecutor.java:1127)         at java.util.concurrent.ThreadPoolExecutor$Worker.run(ThreadPoolExecutor.java:617)         at java.lang.Thread.run(Thread.java:745)

Stack Trace:
com.carrotsearch.randomizedtesting.ThreadLeakError: 5 threads leaked from SUITE scope at org.apache.solr.client.solrj.impl.CloudSolrClientTest: 
   1) Thread[id=682, name=zkCallback-106-thread-1, state=TIMED_WAITING, group=TGRP-CloudSolrClientTest]
        at sun.misc.Unsafe.park(Native Method)
        at java.util.concurrent.locks.LockSupport.parkNanos(LockSupport.java:215)
        at java.util.concurrent.SynchronousQueue$TransferStack.awaitFulfill(SynchronousQueue.java:460)
        at java.util.concurrent.SynchronousQueue$TransferStack.transfer(SynchronousQueue.java:362)
        at java.util.concurrent.SynchronousQueue.poll(SynchronousQueue.java:941)
        at java.util.concurrent.ThreadPoolExecutor.getTask(ThreadPoolExecutor.java:1066)
        at java.util.concurrent.ThreadPoolExecutor.runWorker(ThreadPoolExecutor.java:1127)
        at java.util.concurrent.ThreadPoolExecutor$Worker.run(ThreadPoolExecutor.java:617)
        at java.lang.Thread.run(Thread.java:745)
   2) Thread[id=705, name=zkCallback-106-thread-2, state=TIMED_WAITING, group=TGRP-CloudSolrClientTest]
        at sun.misc.Unsafe.park(Native Method)
        at java.util.concurrent.locks.LockSupport.parkNanos(LockSupport.java:215)
        at java.util.concurrent.SynchronousQueue$TransferStack.awaitFulfill(SynchronousQueue.java:460)
        at java.util.concurrent.SynchronousQueue$TransferStack.transfer(SynchronousQueue.java:362)
        at java.util.concurrent.SynchronousQueue.poll(SynchronousQueue.java:941)
        at java.util.concurrent.ThreadPoolExecutor.getTask(ThreadPoolExecutor.java:1066)
        at java.util.concurrent.ThreadPoolExecutor.runWorker(ThreadPoolExecutor.java:1127)
        at java.util.concurrent.ThreadPoolExecutor$Worker.run(ThreadPoolExecutor.java:617)
        at java.lang.Thread.run(Thread.java:745)
   3) Thread[id=680, name=TEST-CloudSolrClientTest.test-seed#[9A70BCBE321361B1]-SendThread(127.0.0.1:59058), state=TIMED_WAITING, group=TGRP-CloudSolrClientTest]
        at java.lang.Thread.sleep(Native Method)
        at org.apache.zookeeper.client.StaticHostProvider.next(StaticHostProvider.java:101)
        at org.apache.zookeeper.ClientCnxn$SendThread.startConnect(ClientCnxn.java:940)
        at org.apache.zookeeper.ClientCnxn$SendThread.run(ClientCnxn.java:1003)
   4) Thread[id=681, name=TEST-CloudSolrClientTest.test-seed#[9A70BCBE321361B1]-EventThread, state=WAITING, group=TGRP-CloudSolrClientTest]
        at sun.misc.Unsafe.park(Native Method)
        at java.util.concurrent.locks.LockSupport.park(LockSupport.java:175)
        at java.util.concurrent.locks.AbstractQueuedSynchronizer$ConditionObject.await(AbstractQueuedSynchronizer.java:2039)
        at java.util.concurrent.LinkedBlockingQueue.take(LinkedBlockingQueue.java:442)
        at org.apache.zookeeper.ClientCnxn$EventThread.run(ClientCnxn.java:494)
   5) Thread[id=706, name=zkCallback-106-thread-3, state=TIMED_WAITING, group=TGRP-CloudSolrClientTest]
        at sun.misc.Unsafe.park(Native Method)
        at java.util.concurrent.locks.LockSupport.parkNanos(LockSupport.java:215)
        at java.util.concurrent.SynchronousQueue$TransferStack.awaitFulfill(SynchronousQueue.java:460)
        at java.util.concurrent.SynchronousQueue$TransferStack.transfer(SynchronousQueue.java:362)
        at java.util.concurrent.SynchronousQueue.poll(SynchronousQueue.java:941)
        at java.util.concurrent.ThreadPoolExecutor.getTask(ThreadPoolExecutor.java:1066)
        at java.util.concurrent.ThreadPoolExecutor.runWorker(ThreadPoolExecutor.java:1127)
        at java.util.concurrent.ThreadPoolExecutor$Worker.run(ThreadPoolExecutor.java:617)
        at java.lang.Thread.run(Thread.java:745)
	at __randomizedtesting.SeedInfo.seed([9A70BCBE321361B1]:0)


FAILED:  junit.framework.TestSuite.org.apache.solr.client.solrj.impl.CloudSolrClientTest

Error Message:
There are still zombie threads that couldn't be terminated:    1) Thread[id=682, name=zkCallback-106-thread-1, state=TIMED_WAITING, group=TGRP-CloudSolrClientTest]         at sun.misc.Unsafe.park(Native Method)         at java.util.concurrent.locks.LockSupport.parkNanos(LockSupport.java:215)         at java.util.concurrent.SynchronousQueue$TransferStack.awaitFulfill(SynchronousQueue.java:460)         at java.util.concurrent.SynchronousQueue$TransferStack.transfer(SynchronousQueue.java:362)         at java.util.concurrent.SynchronousQueue.poll(SynchronousQueue.java:941)         at java.util.concurrent.ThreadPoolExecutor.getTask(ThreadPoolExecutor.java:1066)         at java.util.concurrent.ThreadPoolExecutor.runWorker(ThreadPoolExecutor.java:1127)         at java.util.concurrent.ThreadPoolExecutor$Worker.run(ThreadPoolExecutor.java:617)         at java.lang.Thread.run(Thread.java:745)    2) Thread[id=705, name=zkCallback-106-thread-2, state=TIMED_WAITING, group=TGRP-CloudSolrClientTest]         at sun.misc.Unsafe.park(Native Method)         at java.util.concurrent.locks.LockSupport.parkNanos(LockSupport.java:215)         at java.util.concurrent.SynchronousQueue$TransferStack.awaitFulfill(SynchronousQueue.java:460)         at java.util.concurrent.SynchronousQueue$TransferStack.transfer(SynchronousQueue.java:362)         at java.util.concurrent.SynchronousQueue.poll(SynchronousQueue.java:941)         at java.util.concurrent.ThreadPoolExecutor.getTask(ThreadPoolExecutor.java:1066)         at java.util.concurrent.ThreadPoolExecutor.runWorker(ThreadPoolExecutor.java:1127)         at java.util.concurrent.ThreadPoolExecutor$Worker.run(ThreadPoolExecutor.java:617)         at java.lang.Thread.run(Thread.java:745)    3) Thread[id=680, name=TEST-CloudSolrClientTest.test-seed#[9A70BCBE321361B1]-SendThread(127.0.0.1:59058), state=TIMED_WAITING, group=TGRP-CloudSolrClientTest]         at java.lang.Thread.sleep(Native Method)         at org.apache.zookeeper.client.StaticHostProvider.next(StaticHostProvider.java:101)         at org.apache.zookeeper.ClientCnxn$SendThread.startConnect(ClientCnxn.java:940)         at org.apache.zookeeper.ClientCnxn$SendThread.run(ClientCnxn.java:1003)    4) Thread[id=706, name=zkCallback-106-thread-3, state=TIMED_WAITING, group=TGRP-CloudSolrClientTest]         at sun.misc.Unsafe.park(Native Method)         at java.util.concurrent.locks.LockSupport.parkNanos(LockSupport.java:215)         at java.util.concurrent.SynchronousQueue$TransferStack.awaitFulfill(SynchronousQueue.java:460)         at java.util.concurrent.SynchronousQueue$TransferStack.transfer(SynchronousQueue.java:362)         at java.util.concurrent.SynchronousQueue.poll(SynchronousQueue.java:941)         at java.util.concurrent.ThreadPoolExecutor.getTask(ThreadPoolExecutor.java:1066)         at java.util.concurrent.ThreadPoolExecutor.runWorker(ThreadPoolExecutor.java:1127)         at java.util.concurrent.ThreadPoolExecutor$Worker.run(ThreadPoolExecutor.java:617)         at java.lang.Thread.run(Thread.java:745)

Stack Trace:
com.carrotsearch.randomizedtesting.ThreadLeakError: There are still zombie threads that couldn't be terminated:
   1) Thread[id=682, name=zkCallback-106-thread-1, state=TIMED_WAITING, group=TGRP-CloudSolrClientTest]
        at sun.misc.Unsafe.park(Native Method)
        at java.util.concurrent.locks.LockSupport.parkNanos(LockSupport.java:215)
        at java.util.concurrent.SynchronousQueue$TransferStack.awaitFulfill(SynchronousQueue.java:460)
        at java.util.concurrent.SynchronousQueue$TransferStack.transfer(SynchronousQueue.java:362)
        at java.util.concurrent.SynchronousQueue.poll(SynchronousQueue.java:941)
        at java.util.concurrent.ThreadPoolExecutor.getTask(ThreadPoolExecutor.java:1066)
        at java.util.concurrent.ThreadPoolExecutor.runWorker(ThreadPoolExecutor.java:1127)
        at java.util.concurrent.ThreadPoolExecutor$Worker.run(ThreadPoolExecutor.java:617)
        at java.lang.Thread.run(Thread.java:745)
   2) Thread[id=705, name=zkCallback-106-thread-2, state=TIMED_WAITING, group=TGRP-CloudSolrClientTest]
        at sun.misc.Unsafe.park(Native Method)
        at java.util.concurrent.locks.LockSupport.parkNanos(LockSupport.java:215)
        at java.util.concurrent.SynchronousQueue$TransferStack.awaitFulfill(SynchronousQueue.java:460)
        at java.util.concurrent.SynchronousQueue$TransferStack.transfer(SynchronousQueue.java:362)
        at java.util.concurrent.SynchronousQueue.poll(SynchronousQueue.java:941)
        at java.util.concurrent.ThreadPoolExecutor.getTask(ThreadPoolExecutor.java:1066)
        at java.util.concurrent.ThreadPoolExecutor.runWorker(ThreadPoolExecutor.java:1127)
        at java.util.concurrent.ThreadPoolExecutor$Worker.run(ThreadPoolExecutor.java:617)
        at java.lang.Thread.run(Thread.java:745)
   3) Thread[id=680, name=TEST-CloudSolrClientTest.test-seed#[9A70BCBE321361B1]-SendThread(127.0.0.1:59058), state=TIMED_WAITING, group=TGRP-CloudSolrClientTest]
        at java.lang.Thread.sleep(Native Method)
        at org.apache.zookeeper.client.StaticHostProvider.next(StaticHostProvider.java:101)
        at org.apache.zookeeper.ClientCnxn$SendThread.startConnect(ClientCnxn.java:940)
        at org.apache.zookeeper.ClientCnxn$SendThread.run(ClientCnxn.java:1003)
   4) Thread[id=706, name=zkCallback-106-thread-3, state=TIMED_WAITING, group=TGRP-CloudSolrClientTest]
        at sun.misc.Unsafe.park(Native Method)
        at java.util.concurrent.locks.LockSupport.parkNanos(LockSupport.java:215)
        at java.util.concurrent.SynchronousQueue$TransferStack.awaitFulfill(SynchronousQueue.java:460)
        at java.util.concurrent.SynchronousQueue$TransferStack.transfer(SynchronousQueue.java:362)
        at java.util.concurrent.SynchronousQueue.poll(SynchronousQueue.java:941)
        at java.util.concurrent.ThreadPoolExecutor.getTask(ThreadPoolExecutor.java:1066)
        at java.util.concurrent.ThreadPoolExecutor.runWorker(ThreadPoolExecutor.java:1127)
        at java.util.concurrent.ThreadPoolExecutor$Worker.run(ThreadPoolExecutor.java:617)
        at java.lang.Thread.run(Thread.java:745)
	at __randomizedtesting.SeedInfo.seed([9A70BCBE321361B1]:0)




Build Log:
[...truncated 12474 lines...]
   [junit4] Suite: org.apache.solr.client.solrj.impl.CloudSolrClientTest
   [junit4]   2> Creating dataDir: /Users/jenkins/workspace/Lucene-Solr-trunk-MacOSX/solr/build/solr-solrj/test/J1/temp/solr.client.solrj.impl.CloudSolrClientTest_9A70BCBE321361B1-001/init-core-data-001
   [junit4]   2> 55643 INFO  (SUITE-CloudSolrClientTest-seed#[9A70BCBE321361B1]-worker) [    ] o.a.s.SolrTestCaseJ4 Randomized ssl (false) and clientAuth (false)
   [junit4]   2> 55643 INFO  (SUITE-CloudSolrClientTest-seed#[9A70BCBE321361B1]-worker) [    ] o.a.s.BaseDistributedSearchTestCase Setting hostContext system property: /dnxmb/ya
   [junit4]   2> 55647 WARN  (SUITE-CloudSolrClientTest-seed#[9A70BCBE321361B1]-worker) [    ] o.a.s.c.AbstractZkTestCase TEST_HOME() does not exist - solrj test?
   [junit4]   2> 55657 INFO  (TEST-CloudSolrClientTest.testWrongZkChrootTest-seed#[9A70BCBE321361B1]) [    ] o.a.s.c.ZkTestServer STARTING ZK TEST SERVER
   [junit4]   2> 55658 INFO  (Thread-47) [    ] o.a.s.c.ZkTestServer client port:0.0.0.0/0.0.0.0:0
   [junit4]   2> 55658 INFO  (Thread-47) [    ] o.a.s.c.ZkTestServer Starting server
   [junit4]   2> 55759 INFO  (TEST-CloudSolrClientTest.testWrongZkChrootTest-seed#[9A70BCBE321361B1]) [    ] o.a.s.c.ZkTestServer start zk server on port:58864
   [junit4]   2> 55760 INFO  (TEST-CloudSolrClientTest.testWrongZkChrootTest-seed#[9A70BCBE321361B1]) [    ] o.a.s.c.c.SolrZkClient Using default ZkCredentialsProvider
   [junit4]   2> 55763 INFO  (TEST-CloudSolrClientTest.testWrongZkChrootTest-seed#[9A70BCBE321361B1]) [    ] o.a.s.c.c.ConnectionManager Waiting for client to connect to ZooKeeper
   [junit4]   2> 55775 INFO  (zkCallback-14-thread-1) [    ] o.a.s.c.c.ConnectionManager Watcher org.apache.solr.common.cloud.ConnectionManager@12afd8ce name:ZooKeeperConnection Watcher:127.0.0.1:58864 got event WatchedEvent state:SyncConnected type:None path:null path:null type:None
   [junit4]   2> 55775 INFO  (TEST-CloudSolrClientTest.testWrongZkChrootTest-seed#[9A70BCBE321361B1]) [    ] o.a.s.c.c.ConnectionManager Client is connected to ZooKeeper
   [junit4]   2> 55776 INFO  (TEST-CloudSolrClientTest.testWrongZkChrootTest-seed#[9A70BCBE321361B1]) [    ] o.a.s.c.c.SolrZkClient Using default ZkACLProvider
   [junit4]   2> 55776 INFO  (TEST-CloudSolrClientTest.testWrongZkChrootTest-seed#[9A70BCBE321361B1]) [    ] o.a.s.c.c.SolrZkClient makePath: /solr
   [junit4]   2> 55788 INFO  (TEST-CloudSolrClientTest.testWrongZkChrootTest-seed#[9A70BCBE321361B1]) [    ] o.a.s.c.c.SolrZkClient Using default ZkCredentialsProvider
   [junit4]   2> 55790 INFO  (TEST-CloudSolrClientTest.testWrongZkChrootTest-seed#[9A70BCBE321361B1]) [    ] o.a.s.c.c.ConnectionManager Waiting for client to connect to ZooKeeper
   [junit4]   2> 55793 INFO  (zkCallback-15-thread-1) [    ] o.a.s.c.c.ConnectionManager Watcher org.apache.solr.common.cloud.ConnectionManager@351f25ef name:ZooKeeperConnection Watcher:127.0.0.1:58864/solr got event WatchedEvent state:SyncConnected type:None path:null path:null type:None
   [junit4]   2> 55793 INFO  (TEST-CloudSolrClientTest.testWrongZkChrootTest-seed#[9A70BCBE321361B1]) [    ] o.a.s.c.c.ConnectionManager Client is connected to ZooKeeper
   [junit4]   2> 55793 INFO  (TEST-CloudSolrClientTest.testWrongZkChrootTest-seed#[9A70BCBE321361B1]) [    ] o.a.s.c.c.SolrZkClient Using default ZkACLProvider
   [junit4]   2> 55797 INFO  (TEST-CloudSolrClientTest.testWrongZkChrootTest-seed#[9A70BCBE321361B1]) [    ] o.a.s.c.c.SolrZkClient makePath: /collections/collection1
   [junit4]   2> 55803 INFO  (TEST-CloudSolrClientTest.testWrongZkChrootTest-seed#[9A70BCBE321361B1]) [    ] o.a.s.c.c.SolrZkClient makePath: /collections/collection1/shards
   [junit4]   2> 55806 INFO  (TEST-CloudSolrClientTest.testWrongZkChrootTest-seed#[9A70BCBE321361B1]) [    ] o.a.s.c.c.SolrZkClient makePath: /collections/control_collection
   [junit4]   2> 55809 INFO  (TEST-CloudSolrClientTest.testWrongZkChrootTest-seed#[9A70BCBE321361B1]) [    ] o.a.s.c.c.SolrZkClient makePath: /collections/control_collection/shards
   [junit4]   2> 55814 INFO  (TEST-CloudSolrClientTest.testWrongZkChrootTest-seed#[9A70BCBE321361B1]) [    ] o.a.s.c.AbstractZkTestCase put /Users/jenkins/workspace/Lucene-Solr-trunk-MacOSX/solr/solrj/src/test-files/solrj/solr/collection1/conf/solrconfig.xml to /configs/conf1/solrconfig.xml
   [junit4]   2> 55814 INFO  (TEST-CloudSolrClientTest.testWrongZkChrootTest-seed#[9A70BCBE321361B1]) [    ] o.a.s.c.c.SolrZkClient makePath: /configs/conf1/solrconfig.xml
   [junit4]   2> 55820 INFO  (TEST-CloudSolrClientTest.testWrongZkChrootTest-seed#[9A70BCBE321361B1]) [    ] o.a.s.c.AbstractZkTestCase put /Users/jenkins/workspace/Lucene-Solr-trunk-MacOSX/solr/solrj/src/test-files/solrj/solr/collection1/conf/schema.xml to /configs/conf1/schema.xml
   [junit4]   2> 55820 INFO  (TEST-CloudSolrClientTest.testWrongZkChrootTest-seed#[9A70BCBE321361B1]) [    ] o.a.s.c.c.SolrZkClient makePath: /configs/conf1/schema.xml
   [junit4]   2> 55828 INFO  (TEST-CloudSolrClientTest.testWrongZkChrootTest-seed#[9A70BCBE321361B1]) [    ] o.a.s.c.AbstractZkTestCase skipping /Users/jenkins/workspace/Lucene-Solr-trunk-MacOSX/solr/solrj/src/test-files/solrj/solr/collection1/conf/solrconfig.snippet.randomindexconfig.xml because it doesn't exist
   [junit4]   2> 55830 INFO  (TEST-CloudSolrClientTest.testWrongZkChrootTest-seed#[9A70BCBE321361B1]) [    ] o.a.s.c.AbstractZkTestCase skipping /Users/jenkins/workspace/Lucene-Solr-trunk-MacOSX/solr/solrj/src/test-files/solrj/solr/collection1/conf/stopwords.txt because it doesn't exist
   [junit4]   2> 55831 INFO  (TEST-CloudSolrClientTest.testWrongZkChrootTest-seed#[9A70BCBE321361B1]) [    ] o.a.s.c.AbstractZkTestCase skipping /Users/jenkins/workspace/Lucene-Solr-trunk-MacOSX/solr/solrj/src/test-files/solrj/solr/collection1/conf/protwords.txt because it doesn't exist
   [junit4]   2> 55831 INFO  (TEST-CloudSolrClientTest.testWrongZkChrootTest-seed#[9A70BCBE321361B1]) [    ] o.a.s.c.AbstractZkTestCase skipping /Users/jenkins/workspace/Lucene-Solr-trunk-MacOSX/solr/solrj/src/test-files/solrj/solr/collection1/conf/currency.xml because it doesn't exist
   [junit4]   2> 55831 INFO  (TEST-CloudSolrClientTest.testWrongZkChrootTest-seed#[9A70BCBE321361B1]) [    ] o.a.s.c.AbstractZkTestCase skipping /Users/jenkins/workspace/Lucene-Solr-trunk-MacOSX/solr/solrj/src/test-files/solrj/solr/collection1/conf/enumsConfig.xml because it doesn't exist
   [junit4]   2> 55831 INFO  (TEST-CloudSolrClientTest.testWrongZkChrootTest-seed#[9A70BCBE321361B1]) [    ] o.a.s.c.AbstractZkTestCase skipping /Users/jenkins/workspace/Lucene-Solr-trunk-MacOSX/solr/solrj/src/test-files/solrj/solr/collection1/conf/open-exchange-rates.json because it doesn't exist
   [junit4]   2> 55832 INFO  (TEST-CloudSolrClientTest.testWrongZkChrootTest-seed#[9A70BCBE321361B1]) [    ] o.a.s.c.AbstractZkTestCase skipping /Users/jenkins/workspace/Lucene-Solr-trunk-MacOSX/solr/solrj/src/test-files/solrj/solr/collection1/conf/mapping-ISOLatin1Accent.txt because it doesn't exist
   [junit4]   2> 55832 INFO  (TEST-CloudSolrClientTest.testWrongZkChrootTest-seed#[9A70BCBE321361B1]) [    ] o.a.s.c.AbstractZkTestCase skipping /Users/jenkins/workspace/Lucene-Solr-trunk-MacOSX/solr/solrj/src/test-files/solrj/solr/collection1/conf/old_synonyms.txt because it doesn't exist
   [junit4]   2> 55832 INFO  (TEST-CloudSolrClientTest.testWrongZkChrootTest-seed#[9A70BCBE321361B1]) [    ] o.a.s.c.AbstractZkTestCase skipping /Users/jenkins/workspace/Lucene-Solr-trunk-MacOSX/solr/solrj/src/test-files/solrj/solr/collection1/conf/synonyms.txt because it doesn't exist
   [junit4]   2> 55834 WARN  (NIOServerCxn.Factory:0.0.0.0/0.0.0.0:0) [    ] o.a.z.s.NIOServerCnxn caught end of stream exception
   [junit4]   2> EndOfStreamException: Unable to read additional data from client sessionid 0x152a7d47b4a0001, likely client has closed socket
   [junit4]   2> 	at org.apache.zookeeper.server.NIOServerCnxn.doIO(NIOServerCnxn.java:228)
   [junit4]   2> 	at org.apache.zookeeper.server.NIOServerCnxnFactory.run(NIOServerCnxnFactory.java:208)
   [junit4]   2> 	at java.lang.Thread.run(Thread.java:745)
   [junit4]   2> 55880 INFO  (TEST-CloudSolrClientTest.testWrongZkChrootTest-seed#[9A70BCBE321361B1]) [    ] o.a.s.SolrTestCaseJ4 Writing core.properties file to /Users/jenkins/workspace/Lucene-Solr-trunk-MacOSX/solr/build/solr-solrj/test/J1/temp/solr.client.solrj.impl.CloudSolrClientTest_9A70BCBE321361B1-001/control-001/cores/collection1
   [junit4]   2> 55882 INFO  (TEST-CloudSolrClientTest.testWrongZkChrootTest-seed#[9A70BCBE321361B1]) [    ] o.e.j.s.Server jetty-9.2.13.v20150730
   [junit4]   2> 55886 INFO  (TEST-CloudSolrClientTest.testWrongZkChrootTest-seed#[9A70BCBE321361B1]) [    ] o.e.j.s.h.ContextHandler Started o.e.j.s.ServletContextHandler@5d8f981a{/dnxmb/ya,null,AVAILABLE}
   [junit4]   2> 55888 INFO  (TEST-CloudSolrClientTest.testWrongZkChrootTest-seed#[9A70BCBE321361B1]) [    ] o.e.j.s.ServerConnector Started ServerConnector@75639aff{HTTP/1.1}{127.0.0.1:58867}
   [junit4]   2> 55888 INFO  (TEST-CloudSolrClientTest.testWrongZkChrootTest-seed#[9A70BCBE321361B1]) [    ] o.e.j.s.Server Started @61091ms
   [junit4]   2> 55888 INFO  (TEST-CloudSolrClientTest.testWrongZkChrootTest-seed#[9A70BCBE321361B1]) [    ] o.a.s.c.s.e.JettySolrRunner Jetty properties: {solr.data.dir=/Users/jenkins/workspace/Lucene-Solr-trunk-MacOSX/solr/build/solr-solrj/test/J1/temp/solr.client.solrj.impl.CloudSolrClientTest_9A70BCBE321361B1-001/tempDir-001/control/data, hostContext=/dnxmb/ya, hostPort=58867, coreRootDirectory=/Users/jenkins/workspace/Lucene-Solr-trunk-MacOSX/solr/build/solr-solrj/test/J1/temp/solr.client.solrj.impl.CloudSolrClientTest_9A70BCBE321361B1-001/control-001/cores}
   [junit4]   2> 55890 INFO  (TEST-CloudSolrClientTest.testWrongZkChrootTest-seed#[9A70BCBE321361B1]) [    ] o.a.s.s.SolrDispatchFilter SolrDispatchFilter.init(): sun.misc.Launcher$AppClassLoader@1540e19d
   [junit4]   2> 55890 INFO  (TEST-CloudSolrClientTest.testWrongZkChrootTest-seed#[9A70BCBE321361B1]) [    ] o.a.s.c.SolrResourceLoader new SolrResourceLoader for directory: '/Users/jenkins/workspace/Lucene-Solr-trunk-MacOSX/solr/build/solr-solrj/test/J1/temp/solr.client.solrj.impl.CloudSolrClientTest_9A70BCBE321361B1-001/control-001'
   [junit4]   2> 55890 INFO  (TEST-CloudSolrClientTest.testWrongZkChrootTest-seed#[9A70BCBE321361B1]) [    ] o.a.s.c.SolrResourceLoader JNDI not configured for solr (NoInitialContextEx)
   [junit4]   2> 55890 INFO  (TEST-CloudSolrClientTest.testWrongZkChrootTest-seed#[9A70BCBE321361B1]) [    ] o.a.s.c.SolrResourceLoader solr home defaulted to 'solr/' (could not find system property or JNDI)
   [junit4]   2> 55891 INFO  (TEST-CloudSolrClientTest.testWrongZkChrootTest-seed#[9A70BCBE321361B1]) [    ] o.a.s.c.c.SolrZkClient Using default ZkCredentialsProvider
   [junit4]   2> 55893 INFO  (TEST-CloudSolrClientTest.testWrongZkChrootTest-seed#[9A70BCBE321361B1]) [    ] o.a.s.c.c.ConnectionManager Waiting for client to connect to ZooKeeper
   [junit4]   2> 55895 INFO  (zkCallback-16-thread-1) [    ] o.a.s.c.c.ConnectionManager Watcher org.apache.solr.common.cloud.ConnectionManager@17873312 name:ZooKeeperConnection Watcher:127.0.0.1:58864/solr got event WatchedEvent state:SyncConnected type:None path:null path:null type:None
   [junit4]   2> 55895 INFO  (TEST-CloudSolrClientTest.testWrongZkChrootTest-seed#[9A70BCBE321361B1]) [    ] o.a.s.c.c.ConnectionManager Client is connected to ZooKeeper
   [junit4]   2> 55896 INFO  (TEST-CloudSolrClientTest.testWrongZkChrootTest-seed#[9A70BCBE321361B1]) [    ] o.a.s.c.c.SolrZkClient Using default ZkACLProvider
   [junit4]   2> 55903 INFO  (TEST-CloudSolrClientTest.testWrongZkChrootTest-seed#[9A70BCBE321361B1]) [    ] o.a.s.s.SolrDispatchFilter Loading solr.xml from SolrHome (not found in ZooKeeper)
   [junit4]   2> 55903 INFO  (TEST-CloudSolrClientTest.testWrongZkChrootTest-seed#[9A70BCBE321361B1]) [    ] o.a.s.c.SolrXmlConfig Loading container configuration from /Users/jenkins/workspace/Lucene-Solr-trunk-MacOSX/solr/build/solr-solrj/test/J1/temp/solr.client.solrj.impl.CloudSolrClientTest_9A70BCBE321361B1-001/control-001/solr.xml
   [junit4]   2> 55911 INFO  (TEST-CloudSolrClientTest.testWrongZkChrootTest-seed#[9A70BCBE321361B1]) [    ] o.a.s.c.CorePropertiesLocator Config-defined core root directory: /Users/jenkins/workspace/Lucene-Solr-trunk-MacOSX/solr/build/solr-solrj/test/J1/temp/solr.client.solrj.impl.CloudSolrClientTest_9A70BCBE321361B1-001/control-001/cores
   [junit4]   2> 55911 INFO  (TEST-CloudSolrClientTest.testWrongZkChrootTest-seed#[9A70BCBE321361B1]) [    ] o.a.s.c.CoreContainer New CoreContainer 1602151593
   [junit4]   2> 55911 INFO  (TEST-CloudSolrClientTest.testWrongZkChrootTest-seed#[9A70BCBE321361B1]) [    ] o.a.s.c.CoreContainer Loading cores into CoreContainer [instanceDir=/Users/jenkins/workspace/Lucene-Solr-trunk-MacOSX/solr/build/solr-solrj/test/J1/temp/solr.client.solrj.impl.CloudSolrClientTest_9A70BCBE321361B1-001/control-001]
   [junit4]   2> 55912 WARN  (TEST-CloudSolrClientTest.testWrongZkChrootTest-seed#[9A70BCBE321361B1]) [    ] o.a.s.c.CoreContainer Couldn't add files from /Users/jenkins/workspace/Lucene-Solr-trunk-MacOSX/solr/build/solr-solrj/test/J1/temp/solr.client.solrj.impl.CloudSolrClientTest_9A70BCBE321361B1-001/control-001/lib to classpath: /Users/jenkins/workspace/Lucene-Solr-trunk-MacOSX/solr/build/solr-solrj/test/J1/temp/solr.client.solrj.impl.CloudSolrClientTest_9A70BCBE321361B1-001/control-001/lib
   [junit4]   2> 55912 INFO  (TEST-CloudSolrClientTest.testWrongZkChrootTest-seed#[9A70BCBE321361B1]) [    ] o.a.s.h.c.HttpShardHandlerFactory created with socketTimeout : 90000,urlScheme : ,connTimeout : 15000,maxConnectionsPerHost : 20,maxConnections : 10000,corePoolSize : 0,maximumPoolSize : 2147483647,maxThreadIdleTime : 5,sizeOfQueue : -1,fairnessPolicy : false,useRetries : false,
   [junit4]   2> 55914 INFO  (TEST-CloudSolrClientTest.testWrongZkChrootTest-seed#[9A70BCBE321361B1]) [    ] o.a.s.u.UpdateShardHandler Creating UpdateShardHandler HTTP client with params: socketTimeout=340000&connTimeout=45000&retry=true
   [junit4]   2> 55915 INFO  (TEST-CloudSolrClientTest.testWrongZkChrootTest-seed#[9A70BCBE321361B1]) [    ] o.a.s.l.LogWatcher SLF4J impl is org.slf4j.impl.Log4jLoggerFactory
   [junit4]   2> 55915 INFO  (TEST-CloudSolrClientTest.testWrongZkChrootTest-seed#[9A70BCBE321361B1]) [    ] o.a.s.l.LogWatcher Registering Log Listener [Log4j (org.slf4j.impl.Log4jLoggerFactory)]
   [junit4]   2> 55915 INFO  (TEST-CloudSolrClientTest.testWrongZkChrootTest-seed#[9A70BCBE321361B1]) [    ] o.a.s.c.ZkContainer Zookeeper client=127.0.0.1:58864/solr
   [junit4]   2> 55945 INFO  (TEST-CloudSolrClientTest.testWrongZkChrootTest-seed#[9A70BCBE321361B1]) [    ] o.a.s.c.ZkController zkHost includes chroot
   [junit4]   2> 55945 INFO  (TEST-CloudSolrClientTest.testWrongZkChrootTest-seed#[9A70BCBE321361B1]) [    ] o.a.s.c.c.SolrZkClient Using default ZkCredentialsProvider
   [junit4]   2> 55946 INFO  (TEST-CloudSolrClientTest.testWrongZkChrootTest-seed#[9A70BCBE321361B1]) [    ] o.a.s.c.c.ConnectionManager Waiting for client to connect to ZooKeeper
   [junit4]   2> 55949 INFO  (zkCallback-19-thread-1) [    ] o.a.s.c.c.ConnectionManager Watcher org.apache.solr.common.cloud.ConnectionManager@614de27a name:ZooKeeperConnection Watcher:127.0.0.1:58864 got event WatchedEvent state:SyncConnected type:None path:null path:null type:None
   [junit4]   2> 55950 INFO  (TEST-CloudSolrClientTest.testWrongZkChrootTest-seed#[9A70BCBE321361B1]) [    ] o.a.s.c.c.ConnectionManager Client is connected to ZooKeeper
   [junit4]   2> 55950 INFO  (TEST-CloudSolrClientTest.testWrongZkChrootTest-seed#[9A70BCBE321361B1]) [    ] o.a.s.c.c.SolrZkClient Using default ZkACLProvider
   [junit4]   2> 55965 INFO  (TEST-CloudSolrClientTest.testWrongZkChrootTest-seed#[9A70BCBE321361B1]) [n:127.0.0.1:58867_dnxmb%2Fya    ] o.a.s.c.c.ConnectionManager Waiting for client to connect to ZooKeeper
   [junit4]   2> 55968 INFO  (zkCallback-20-thread-1-processing-n:127.0.0.1:58867_dnxmb%2Fya) [n:127.0.0.1:58867_dnxmb%2Fya    ] o.a.s.c.c.ConnectionManager Watcher org.apache.solr.common.cloud.ConnectionManager@41b8bb1a name:ZooKeeperConnection Watcher:127.0.0.1:58864/solr got event WatchedEvent state:SyncConnected type:None path:null path:null type:None
   [junit4]   2> 55968 INFO  (TEST-CloudSolrClientTest.testWrongZkChrootTest-seed#[9A70BCBE321361B1]) [n:127.0.0.1:58867_dnxmb%2Fya    ] o.a.s.c.c.ConnectionManager Client is connected to ZooKeeper
   [junit4]   2> 55987 INFO  (TEST-CloudSolrClientTest.testWrongZkChrootTest-seed#[9A70BCBE321361B1]) [n:127.0.0.1:58867_dnxmb%2Fya    ] o.a.s.c.c.SolrZkClient makePath: /overseer/queue
   [junit4]   2> 56000 INFO  (TEST-CloudSolrClientTest.testWrongZkChrootTest-seed#[9A70BCBE321361B1]) [n:127.0.0.1:58867_dnxmb%2Fya    ] o.a.s.c.c.SolrZkClient makePath: /overseer/collection-queue-work
   [junit4]   2> 56012 INFO  (TEST-CloudSolrClientTest.testWrongZkChrootTest-seed#[9A70BCBE321361B1]) [n:127.0.0.1:58867_dnxmb%2Fya    ] o.a.s.c.c.SolrZkClient makePath: /overseer/collection-map-running
   [junit4]   2> 56026 INFO  (TEST-CloudSolrClientTest.testWrongZkChrootTest-seed#[9A70BCBE321361B1]) [n:127.0.0.1:58867_dnxmb%2Fya    ] o.a.s.c.c.SolrZkClient makePath: /overseer/collection-map-completed
   [junit4]   2> 56032 INFO  (TEST-CloudSolrClientTest.testWrongZkChrootTest-seed#[9A70BCBE321361B1]) [n:127.0.0.1:58867_dnxmb%2Fya    ] o.a.s.c.c.SolrZkClient makePath: /overseer/collection-map-failure
   [junit4]   2> 56058 INFO  (TEST-CloudSolrClientTest.testWrongZkChrootTest-seed#[9A70BCBE321361B1]) [n:127.0.0.1:58867_dnxmb%2Fya    ] o.a.s.c.c.SolrZkClient makePath: /live_nodes
   [junit4]   2> 56063 INFO  (TEST-CloudSolrClientTest.testWrongZkChrootTest-seed#[9A70BCBE321361B1]) [n:127.0.0.1:58867_dnxmb%2Fya    ] o.a.s.c.c.SolrZkClient makePath: /aliases.json
   [junit4]   2> 56067 INFO  (TEST-CloudSolrClientTest.testWrongZkChrootTest-seed#[9A70BCBE321361B1]) [n:127.0.0.1:58867_dnxmb%2Fya    ] o.a.s.c.c.SolrZkClient makePath: /clusterstate.json
   [junit4]   2> 56070 INFO  (TEST-CloudSolrClientTest.testWrongZkChrootTest-seed#[9A70BCBE321361B1]) [n:127.0.0.1:58867_dnxmb%2Fya    ] o.a.s.c.c.SolrZkClient makePath: /security.json
   [junit4]   2> 56073 INFO  (TEST-CloudSolrClientTest.testWrongZkChrootTest-seed#[9A70BCBE321361B1]) [n:127.0.0.1:58867_dnxmb%2Fya    ] o.a.s.c.ZkController Register node as live in ZooKeeper:/live_nodes/127.0.0.1:58867_dnxmb%2Fya
   [junit4]   2> 56078 INFO  (TEST-CloudSolrClientTest.testWrongZkChrootTest-seed#[9A70BCBE321361B1]) [n:127.0.0.1:58867_dnxmb%2Fya    ] o.a.s.c.c.SolrZkClient makePath: /live_nodes/127.0.0.1:58867_dnxmb%2Fya
   [junit4]   2> 56091 INFO  (TEST-CloudSolrClientTest.testWrongZkChrootTest-seed#[9A70BCBE321361B1]) [n:127.0.0.1:58867_dnxmb%2Fya    ] o.a.s.c.c.SolrZkClient makePath: /overseer_elect
   [junit4]   2> 56095 INFO  (TEST-CloudSolrClientTest.testWrongZkChrootTest-seed#[9A70BCBE321361B1]) [n:127.0.0.1:58867_dnxmb%2Fya    ] o.a.s.c.c.SolrZkClient makePath: /overseer_elect/election
   [junit4]   2> 56099 INFO  (TEST-CloudSolrClientTest.testWrongZkChrootTest-seed#[9A70BCBE321361B1]) [n:127.0.0.1:58867_dnxmb%2Fya    ] o.a.s.c.Overseer Overseer (id=null) closing
   [junit4]   2> 56100 INFO  (TEST-CloudSolrClientTest.testWrongZkChrootTest-seed#[9A70BCBE321361B1]) [n:127.0.0.1:58867_dnxmb%2Fya    ] o.a.s.c.LeaderElector Joined leadership election with path: /overseer_elect/election/95323073171554308-127.0.0.1:58867_dnxmb%2Fya-n_0000000000
   [junit4]   2> 56103 INFO  (TEST-CloudSolrClientTest.testWrongZkChrootTest-seed#[9A70BCBE321361B1]) [n:127.0.0.1:58867_dnxmb%2Fya    ] o.a.s.c.OverseerElectionContext I am going to be the leader 127.0.0.1:58867_dnxmb%2Fya
   [junit4]   2> 56103 INFO  (TEST-CloudSolrClientTest.testWrongZkChrootTest-seed#[9A70BCBE321361B1]) [n:127.0.0.1:58867_dnxmb%2Fya    ] o.a.s.c.c.SolrZkClient makePath: /overseer_elect/leader
   [junit4]   2> 56107 INFO  (TEST-CloudSolrClientTest.testWrongZkChrootTest-seed#[9A70BCBE321361B1]) [n:127.0.0.1:58867_dnxmb%2Fya    ] o.a.s.c.Overseer Overseer (id=95323073171554308-127.0.0.1:58867_dnxmb%2Fya-n_0000000000) starting
   [junit4]   2> 56119 INFO  (TEST-CloudSolrClientTest.testWrongZkChrootTest-seed#[9A70BCBE321361B1]) [n:127.0.0.1:58867_dnxmb%2Fya    ] o.a.s.c.c.SolrZkClient makePath: /overseer/queue-work
   [junit4]   2> 56166 INFO  (TEST-CloudSolrClientTest.testWrongZkChrootTest-seed#[9A70BCBE321361B1]) [n:127.0.0.1:58867_dnxmb%2Fya    ] o.a.s.c.OverseerAutoReplicaFailoverThread Starting OverseerAutoReplicaFailoverThread autoReplicaFailoverWorkLoopDelay=10000 autoReplicaFailoverWaitAfterExpiration=30000 autoReplicaFailoverBadNodeExpiration=60000
   [junit4]   2> 56184 INFO  (OverseerCollectionConfigSetProcessor-95323073171554308-127.0.0.1:58867_dnxmb%2Fya-n_0000000000) [n:127.0.0.1:58867_dnxmb%2Fya    ] o.a.s.c.OverseerTaskProcessor Process current queue of overseer operations
   [junit4]   2> 56184 INFO  (TEST-CloudSolrClientTest.testWrongZkChrootTest-seed#[9A70BCBE321361B1]) [n:127.0.0.1:58867_dnxmb%2Fya    ] o.a.s.c.c.ZkStateReader Updating cluster state from ZooKeeper... 
   [junit4]   2> 56190 INFO  (OverseerStateUpdate-95323073171554308-127.0.0.1:58867_dnxmb%2Fya-n_0000000000) [n:127.0.0.1:58867_dnxmb%2Fya    ] o.a.s.c.Overseer Starting to work on the main queue
   [junit4]   2> 56282 INFO  (TEST-CloudSolrClientTest.testWrongZkChrootTest-seed#[9A70BCBE321361B1]) [n:127.0.0.1:58867_dnxmb%2Fya    ] o.a.s.c.CoreContainer Security conf doesn't exist. Skipping setup for authorization module.
   [junit4]   2> 56282 INFO  (TEST-CloudSolrClientTest.testWrongZkChrootTest-seed#[9A70BCBE321361B1]) [n:127.0.0.1:58867_dnxmb%2Fya    ] o.a.s.c.CoreContainer No authentication plugin used.
   [junit4]   2> 56287 INFO  (TEST-CloudSolrClientTest.testWrongZkChrootTest-seed#[9A70BCBE321361B1]) [n:127.0.0.1:58867_dnxmb%2Fya    ] o.a.s.c.CorePropertiesLocator Looking for core definitions underneath /Users/jenkins/workspace/Lucene-Solr-trunk-MacOSX/solr/build/solr-solrj/test/J1/temp/solr.client.solrj.impl.CloudSolrClientTest_9A70BCBE321361B1-001/control-001/cores
   [junit4]   2> 56291 INFO  (TEST-CloudSolrClientTest.testWrongZkChrootTest-seed#[9A70BCBE321361B1]) [n:127.0.0.1:58867_dnxmb%2Fya    ] o.a.s.c.CoreDescriptor Created CoreDescriptor: {name=collection1, config=solrconfig.xml, transient=false, schema=schema.xml, loadOnStartup=true, configSetProperties=configsetprops.json, collection=control_collection, coreNodeName=, dataDir=data/, shard=}
   [junit4]   2> 56291 INFO  (TEST-CloudSolrClientTest.testWrongZkChrootTest-seed#[9A70BCBE321361B1]) [n:127.0.0.1:58867_dnxmb%2Fya    ] o.a.s.c.CorePropertiesLocator Found core collection1 in /Users/jenkins/workspace/Lucene-Solr-trunk-MacOSX/solr/build/solr-solrj/test/J1/temp/solr.client.solrj.impl.CloudSolrClientTest_9A70BCBE321361B1-001/control-001/cores/collection1
   [junit4]   2> 56291 INFO  (TEST-CloudSolrClientTest.testWrongZkChrootTest-seed#[9A70BCBE321361B1]) [n:127.0.0.1:58867_dnxmb%2Fya    ] o.a.s.c.CorePropertiesLocator Found 1 core definitions
   [junit4]   2> 56295 INFO  (TEST-CloudSolrClientTest.testWrongZkChrootTest-seed#[9A70BCBE321361B1]) [n:127.0.0.1:58867_dnxmb%2Fya    ] o.a.s.s.SolrDispatchFilter user.dir=/Users/jenkins/workspace/Lucene-Solr-trunk-MacOSX/solr/build/solr-solrj/test/J1
   [junit4]   2> 56295 INFO  (TEST-CloudSolrClientTest.testWrongZkChrootTest-seed#[9A70BCBE321361B1]) [n:127.0.0.1:58867_dnxmb%2Fya    ] o.a.s.s.SolrDispatchFilter SolrDispatchFilter.init() done
   [junit4]   2> 56295 INFO  (coreLoadExecutor-41-thread-1-processing-n:127.0.0.1:58867_dnxmb%2Fya) [n:127.0.0.1:58867_dnxmb%2Fya c:control_collection   x:collection1] o.a.s.c.ZkController publishing state=down
   [junit4]   2> 56295 INFO  (coreLoadExecutor-41-thread-1-processing-n:127.0.0.1:58867_dnxmb%2Fya) [n:127.0.0.1:58867_dnxmb%2Fya c:control_collection   x:collection1] o.a.s.c.ZkController numShards not found on descriptor - reading it from system property
   [junit4]   2> 56307 INFO  (OverseerStateUpdate-95323073171554308-127.0.0.1:58867_dnxmb%2Fya-n_0000000000) [n:127.0.0.1:58867_dnxmb%2Fya    ] o.a.s.c.Overseer processMessage: queueSize: 1, message = {
   [junit4]   2>   "core":"collection1",
   [junit4]   2>   "roles":null,
   [junit4]   2>   "base_url":"http://127.0.0.1:58867/dnxmb/ya",
   [junit4]   2>   "node_name":"127.0.0.1:58867_dnxmb%2Fya",
   [junit4]   2>   "numShards":"1",
   [junit4]   2>   "state":"down",
   [junit4]   2>   "shard":null,
   [junit4]   2>   "collection":"control_collection",
   [junit4]   2>   "operation":"state"} current state version: 0
   [junit4]   2> 56317 INFO  (coreLoadExecutor-41-thread-1-processing-n:127.0.0.1:58867_dnxmb%2Fya) [n:127.0.0.1:58867_dnxmb%2Fya c:control_collection   x:collection1] o.a.s.c.ZkController look for our core node name
   [junit4]   2> 56328 INFO  (OverseerStateUpdate-95323073171554308-127.0.0.1:58867_dnxmb%2Fya-n_0000000000) [n:127.0.0.1:58867_dnxmb%2Fya    ] o.a.s.c.o.ReplicaMutator Update state numShards=1 message={
   [junit4]   2>   "core":"collection1",
   [junit4]   2>   "roles":null,
   [junit4]   2>   "base_url":"http://127.0.0.1:58867/dnxmb/ya",
   [junit4]   2>   "node_name":"127.0.0.1:58867_dnxmb%2Fya",
   [junit4]   2>   "numShards":"1",
   [junit4]   2>   "state":"down",
   [junit4]   2>   "shard":null,
   [junit4]   2>   "collection":"control_collection",
   [junit4]   2>   "operation":"state"}
   [junit4]   2> 56332 INFO  (OverseerStateUpdate-95323073171554308-127.0.0.1:58867_dnxmb%2Fya-n_0000000000) [n:127.0.0.1:58867_dnxmb%2Fya    ] o.a.s.c.o.ClusterStateMutator building a new cName: control_collection
   [junit4]   2> 56356 INFO  (OverseerStateUpdate-95323073171554308-127.0.0.1:58867_dnxmb%2Fya-n_0000000000) [n:127.0.0.1:58867_dnxmb%2Fya    ] o.a.s.c.o.ReplicaMutator Assigning new node to shard shard=shard1
   [junit4]   2> 56366 INFO  (zkCallback-20-thread-1-processing-n:127.0.0.1:58867_dnxmb%2Fya) [n:127.0.0.1:58867_dnxmb%2Fya    ] o.a.s.c.c.ZkStateReader A cluster state change: [WatchedEvent state:SyncConnected type:NodeDataChanged path:/clusterstate.json], has occurred - updating... (live nodes size: [1])
   [junit4]   2> 57319 INFO  (coreLoadExecutor-41-thread-1-processing-n:127.0.0.1:58867_dnxmb%2Fya) [n:127.0.0.1:58867_dnxmb%2Fya c:control_collection   x:collection1] o.a.s.c.ZkController waiting to find shard id in clusterstate for collection1
   [junit4]   2> 57320 INFO  (coreLoadExecutor-41-thread-1-processing-n:127.0.0.1:58867_dnxmb%2Fya) [n:127.0.0.1:58867_dnxmb%2Fya c:control_collection   x:collection1] o.a.s.c.ZkController Check for collection zkNode:control_collection
   [junit4]   2> 57321 INFO  (coreLoadExecutor-41-thread-1-processing-n:127.0.0.1:58867_dnxmb%2Fya) [n:127.0.0.1:58867_dnxmb%2Fya c:control_collection   x:collection1] o.a.s.c.ZkController Collection zkNode exists
   [junit4]   2> 57321 INFO  (coreLoadExecutor-41-thread-1-processing-n:127.0.0.1:58867_dnxmb%2Fya) [n:127.0.0.1:58867_dnxmb%2Fya c:control_collection   x:collection1] o.a.s.c.c.ZkStateReader Load collection config from: [/collections/control_collection]
   [junit4]   2> 57323 INFO  (coreLoadExecutor-41-thread-1-processing-n:127.0.0.1:58867_dnxmb%2Fya) [n:127.0.0.1:58867_dnxmb%2Fya c:control_collection   x:collection1] o.a.s.c.c.ZkStateReader path=[/collections/control_collection] [configName]=[conf1] specified config exists in ZooKeeper
   [junit4]   2> 57323 INFO  (coreLoadExecutor-41-thread-1-processing-n:127.0.0.1:58867_dnxmb%2Fya) [n:127.0.0.1:58867_dnxmb%2Fya c:control_collection   x:collection1] o.a.s.c.SolrResourceLoader new SolrResourceLoader for directory: '/Users/jenkins/workspace/Lucene-Solr-trunk-MacOSX/solr/build/solr-solrj/test/J1/temp/solr.client.solrj.impl.CloudSolrClientTest_9A70BCBE321361B1-001/control-001/cores/collection1'
   [junit4]   2> 57323 INFO  (coreLoadExecutor-41-thread-1-processing-n:127.0.0.1:58867_dnxmb%2Fya) [n:127.0.0.1:58867_dnxmb%2Fya c:control_collection   x:collection1] o.a.s.c.SolrResourceLoader JNDI not configured for solr (NoInitialContextEx)
   [junit4]   2> 57323 INFO  (coreLoadExecutor-41-thread-1-processing-n:127.0.0.1:58867_dnxmb%2Fya) [n:127.0.0.1:58867_dnxmb%2Fya c:control_collection   x:collection1] o.a.s.c.SolrResourceLoader solr home defaulted to 'solr/' (could not find system property or JNDI)
   [junit4]   2> 57328 INFO  (coreLoadExecutor-41-thread-1-processing-n:127.0.0.1:58867_dnxmb%2Fya) [n:127.0.0.1:58867_dnxmb%2Fya c:control_collection   x:collection1] o.a.s.c.Config loaded config solrconfig.xml with version 0 
   [junit4]   2> 57335 INFO  (coreLoadExecutor-41-thread-1-processing-n:127.0.0.1:58867_dnxmb%2Fya) [n:127.0.0.1:58867_dnxmb%2Fya c:control_collection   x:collection1] o.a.s.c.SolrConfig current version of requestparams : -1
   [junit4]   2> 57337 INFO  (coreLoadExecutor-41-thread-1-processing-n:127.0.0.1:58867_dnxmb%2Fya) [n:127.0.0.1:58867_dnxmb%2Fya c:control_collection   x:collection1] o.a.s.c.SolrConfig Using Lucene MatchVersion: 6.0.0
   [junit4]   2> 57350 INFO  (coreLoadExecutor-41-thread-1-processing-n:127.0.0.1:58867_dnxmb%2Fya) [n:127.0.0.1:58867_dnxmb%2Fya c:control_collection   x:collection1] o.a.s.c.SolrConfig Loaded SolrConfig: solrconfig.xml
   [junit4]   2> 57375 INFO  (coreLoadExecutor-41-thread-1-processing-n:127.0.0.1:58867_dnxmb%2Fya) [n:127.0.0.1:58867_dnxmb%2Fya c:control_collection   x:collection1] o.a.s.s.IndexSchema [collection1] Schema name=test
   [junit4]   2> 57564 INFO  (coreLoadExecutor-41-thread-1-processing-n:127.0.0.1:58867_dnxmb%2Fya) [n:127.0.0.1:58867_dnxmb%2Fya c:control_collection   x:collection1] o.a.s.s.IndexSchema default search field in schema is text
   [junit4]   2> 57564 INFO  (coreLoadExecutor-41-thread-1-processing-n:127.0.0.1:58867_dnxmb%2Fya) [n:127.0.0.1:58867_dnxmb%2Fya c:control_collection   x:collection1] o.a.s.s.IndexSchema unique key field: id
   [junit4]   2> 57565 WARN  (coreLoadExecutor-41-thread-1-processing-n:127.0.0.1:58867_dnxmb%2Fya) [n:127.0.0.1:58867_dnxmb%2Fya c:control_collection   x:collection1] o.a.s.s.IndexSchema Field lowerfilt1and2 is not multivalued and destination for multiple copyFields (2)
   [junit4]   2> 57565 WARN  (coreLoadExecutor-41-thread-1-processing-n:127.0.0.1:58867_dnxmb%2Fya) [n:127.0.0.1:58867_dnxmb%2Fya c:control_collection   x:collection1] o.a.s.s.IndexSchema Field text is not multivalued and destination for multiple copyFields (3)
   [junit4]   2> 57573 INFO  (coreLoadExecutor-41-thread-1-processing-n:127.0.0.1:58867_dnxmb%2Fya) [n:127.0.0.1:58867_dnxmb%2Fya c:control_collection   x:collection1] o.a.s.c.ConfigSetProperties Did not find ConfigSet properties, assuming default properties: Can't find resource 'configsetprops.json' in classpath or '/configs/conf1', cwd=/Users/jenkins/workspace/Lucene-Solr-trunk-MacOSX/solr/build/solr-solrj/test/J1
   [junit4]   2> 57573 INFO  (coreLoadExecutor-41-thread-1-processing-n:127.0.0.1:58867_dnxmb%2Fya) [n:127.0.0.1:58867_dnxmb%2Fya c:control_collection   x:collection1] o.a.s.c.CoreContainer Creating SolrCore 'collection1' using configuration from collection control_collection
   [junit4]   2> 57573 INFO  (coreLoadExecutor-41-thread-1-processing-n:127.0.0.1:58867_dnxmb%2Fya) [n:127.0.0.1:58867_dnxmb%2Fya c:control_collection s:shard1 r:core_node1 x:collection1] o.a.s.c.SolrCore org.apache.solr.core.MockDirectoryFactory
   [junit4]   2> 57574 INFO  (coreLoadExecutor-41-thread-1-processing-n:127.0.0.1:58867_dnxmb%2Fya) [n:127.0.0.1:58867_dnxmb%2Fya c:control_collection s:shard1 r:core_node1 x:collection1] o.a.s.c.SolrCore [[collection1] ] Opening new SolrCore at [/Users/jenkins/workspace/Lucene-Solr-trunk-MacOSX/solr/build/solr-solrj/test/J1/temp/solr.client.solrj.impl.CloudSolrClientTest_9A70BCBE321361B1-001/control-001/cores/collection1], dataDir=[/Users/jenkins/workspace/Lucene-Solr-trunk-MacOSX/solr/build/solr-solrj/test/J1/temp/solr.client.solrj.impl.CloudSolrClientTest_9A70BCBE321361B1-001/control-001/cores/collection1/data/]
   [junit4]   2> 57574 INFO  (coreLoadExecutor-41-thread-1-processing-n:127.0.0.1:58867_dnxmb%2Fya) [n:127.0.0.1:58867_dnxmb%2Fya c:control_collection s:shard1 r:core_node1 x:collection1] o.a.s.c.SolrCore JMX monitoring not detected for core: collection1
   [junit4]   2> 57574 INFO  (coreLoadExecutor-41-thread-1-processing-n:127.0.0.1:58867_dnxmb%2Fya) [n:127.0.0.1:58867_dnxmb%2Fya c:control_collection s:shard1 r:core_node1 x:collection1] o.a.s.c.CachingDirectoryFactory return new directory for /Users/jenkins/workspace/Lucene-Solr-trunk-MacOSX/solr/build/solr-solrj/test/J1/temp/solr.client.solrj.impl.CloudSolrClientTest_9A70BCBE321361B1-001/control-001/cores/collection1/data
   [junit4]   2> 57574 INFO  (coreLoadExecutor-41-thread-1-processing-n:127.0.0.1:58867_dnxmb%2Fya) [n:127.0.0.1:58867_dnxmb%2Fya c:control_collection s:shard1 r:core_node1 x:collection1] o.a.s.c.SolrCore New index directory detected: old=null new=/Users/jenkins/workspace/Lucene-Solr-trunk-MacOSX/solr/build/solr-solrj/test/J1/temp/solr.client.solrj.impl.CloudSolrClientTest_9A70BCBE321361B1-001/control-001/cores/collection1/data/index/
   [junit4]   2> 57574 WARN  (coreLoadExecutor-41-thread-1-processing-n:127.0.0.1:58867_dnxmb%2Fya) [n:127.0.0.1:58867_dnxmb%2Fya c:control_collection s:shard1 r:core_node1 x:collection1] o.a.s.c.SolrCore [collection1] Solr index directory '/Users/jenkins/workspace/Lucene-Solr-trunk-MacOSX/solr/build/solr-solrj/test/J1/temp/solr.client.solrj.impl.CloudSolrClientTest_9A70BCBE321361B1-001/control-001/cores/collection1/data/index' doesn't exist. Creating new index...
   [junit4]   2> 57574 INFO  (coreLoadExecutor-41-thread-1-processing-n:127.0.0.1:58867_dnxmb%2Fya) [n:127.0.0.1:58867_dnxmb%2Fya c:control_collection s:shard1 r:core_node1 x:collection1] o.a.s.c.CachingDirectoryFactory return new directory for /Users/jenkins/workspace/Lucene-Solr-trunk-MacOSX/solr/build/solr-solrj/test/J1/temp/solr.client.solrj.impl.CloudSolrClientTest_9A70BCBE321361B1-001/control-001/cores/collection1/data/index
   [junit4]   2> 57575 INFO  (coreLoadExecutor-41-thread-1-processing-n:127.0.0.1:58867_dnxmb%2Fya) [n:127.0.0.1:58867_dnxmb%2Fya c:control_collection s:shard1 r:core_node1 x:collection1] o.a.s.c.SolrDeletionPolicy SolrDeletionPolicy.onCommit: commits: num=1
   [junit4]   2> 	commit{dir=MockDirectoryWrapper(RAMDirectory@516093f8 lockFactory=org.apache.lucene.store.SingleInstanceLockFactory@56122ad0),segFN=segments_1,generation=1}
   [junit4]   2> 57575 INFO  (coreLoadExecutor-41-thread-1-processing-n:127.0.0.1:58867_dnxmb%2Fya) [n:127.0.0.1:58867_dnxmb%2Fya c:control_collection s:shard1 r:core_node1 x:collection1] o.a.s.c.SolrDeletionPolicy newest commit generation = 1
   [junit4]   2> 57575 INFO  (OldIndexDirectoryCleanupThreadForCore-collection1) [n:127.0.0.1:58867_dnxmb%2Fya c:control_collection s:shard1 r:core_node1 x:collection1] o.a.s.c.SolrCore Looking for old index directories to cleanup for core collection1 in /Users/jenkins/workspace/Lucene-Solr-trunk-MacOSX/solr/build/solr-solrj/test/J1/temp/solr.client.solrj.impl.CloudSolrClientTest_9A70BCBE321361B1-001/control-001/cores/collection1/data/
   [junit4]   2> 57576 WARN  (OldIndexDirectoryCleanupThreadForCore-collection1) [n:127.0.0.1:58867_dnxmb%2Fya c:control_collection s:shard1 r:core_node1 x:collection1] o.a.s.c.DirectoryFactory /Users/jenkins/workspace/Lucene-Solr-trunk-MacOSX/solr/build/solr-solrj/test/J1/temp/solr.client.solrj.impl.CloudSolrClientTest_9A70BCBE321361B1-001/control-001/cores/collection1/data/ does not point to a valid data directory; skipping clean-up of old index directories.
   [junit4]   2> 57579 INFO  (coreLoadExecutor-41-thread-1-processing-n:127.0.0.1:58867_dnxmb%2Fya) [n:127.0.0.1:58867_dnxmb%2Fya c:control_collection s:shard1 r:core_node1 x:collection1] o.a.s.c.SolrCore no updateRequestProcessorChain defined as default, creating implicit default
   [junit4]   2> 57583 INFO  (coreLoadExecutor-41-thread-1-processing-n:127.0.0.1:58867_dnxmb%2Fya) [n:127.0.0.1:58867_dnxmb%2Fya c:control_collection s:shard1 r:core_node1 x:collection1] o.a.s.h.l.XMLLoader xsltCacheLifetimeSeconds=60
   [junit4]   2> 57584 INFO  (coreLoadExecutor-41-thread-1-processing-n:127.0.0.1:58867_dnxmb%2Fya) [n:127.0.0.1:58867_dnxmb%2Fya c:control_collection s:shard1 r:core_node1 x:collection1] o.a.s.h.l.XMLLoader xsltCacheLifetimeSeconds=60
   [junit4]   2> 57585 INFO  (coreLoadExecutor-41-thread-1-processing-n:127.0.0.1:58867_dnxmb%2Fya) [n:127.0.0.1:58867_dnxmb%2Fya c:control_collection s:shard1 r:core_node1 x:collection1] o.a.s.h.l.XMLLoader xsltCacheLifetimeSeconds=60
   [junit4]   2> 57586 INFO  (coreLoadExecutor-41-thread-1-processing-n:127.0.0.1:58867_dnxmb%2Fya) [n:127.0.0.1:58867_dnxmb%2Fya c:control_collection s:shard1 r:core_node1 x:collection1] o.a.s.h.l.XMLLoader xsltCacheLifetimeSeconds=60
   [junit4]   2> 57604 INFO  (coreLoadExecutor-41-thread-1-processing-n:127.0.0.1:58867_dnxmb%2Fya) [n:127.0.0.1:58867_dnxmb%2Fya c:control_collection s:shard1 r:core_node1 x:collection1] o.a.s.c.RequestHandlers Registered paths: /admin/mbeans,standard,,/update/csv,/sql,/update/json/docs,/admin/luke,/export,/admin/segments,/get,/admin/system,/replication,/admin/properties,/config,/stream,/schema,/admin/plugins,/admin/logging,/update/json,/admin/threads,/admin/ping,/update,/admin/file
   [junit4]   2> 57605 INFO  (coreLoadExecutor-41-thread-1-processing-n:127.0.0.1:58867_dnxmb%2Fya) [n:127.0.0.1:58867_dnxmb%2Fya c:control_collection s:shard1 r:core_node1 x:collection1] o.a.s.c.SolrCore Using default statsCache cache: org.apache.solr.search.stats.LocalStatsCache
   [junit4]   2> 57606 INFO  (coreLoadExecutor-41-thread-1-processing-n:127.0.0.1:58867_dnxmb%2Fya) [n:127.0.0.1:58867_dnxmb%2Fya c:control_collection s:shard1 r:core_node1 x:collection1] o.a.s.u.UpdateHandler Using UpdateLog implementation: org.apache.solr.update.UpdateLog
   [junit4]   2> 57606 INFO  (coreLoadExecutor-41-thread-1-processing-n:127.0.0.1:58867_dnxmb%2Fya) [n:127.0.0.1:58867_dnxmb%2Fya c:control_collection s:shard1 r:core_node1 x:collection1] o.a.s.u.UpdateLog Initializing UpdateLog: dataDir= defaultSyncLevel=FLUSH numRecordsToKeep=100 maxNumLogsToKeep=10 numVersionBuckets=65536
   [junit4]   2> 57608 INFO  (coreLoadExecutor-41-thread-1-processing-n:127.0.0.1:58867_dnxmb%2Fya) [n:127.0.0.1:58867_dnxmb%2Fya c:control_collection s:shard1 r:core_node1 x:collection1] o.a.s.u.CommitTracker Hard AutoCommit: disabled
   [junit4]   2> 57608 INFO  (coreLoadExecutor-41-thread-1-processing-n:127.0.0.1:58867_dnxmb%2Fya) [n:127.0.0.1:58867_dnxmb%2Fya c:control_collection s:shard1 r:core_node1 x:collection1] o.a.s.u.CommitTracker Soft AutoCommit: disabled
   [junit4]   2> 57608 INFO  (coreLoadExecutor-41-thread-1-processing-n:127.0.0.1:58867_dnxmb%2Fya) [n:127.0.0.1:58867_dnxmb%2Fya c:control_collection s:shard1 r:core_node1 x:collection1] o.a.s.c.SolrDeletionPolicy SolrDeletionPolicy.onInit: commits: num=1
   [junit4]   2> 	commit{dir=MockDirectoryWrapper(RAMDirectory@516093f8 lockFactory=org.apache.lucene.store.SingleInstanceLockFactory@56122ad0),segFN=segments_1,generation=1}
   [junit4]   2> 57608 INFO  (coreLoadExecutor-41-thread-1-processing-n:127.0.0.1:58867_dnxmb%2Fya) [n:127.0.0.1:58867_dnxmb%2Fya c:control_collection s:shard1 r:core_node1 x:collection1] o.a.s.c.SolrDeletionPolicy newest commit generation = 1
   [junit4]   2> 57609 INFO  (coreLoadExecutor-41-thread-1-processing-n:127.0.0.1:58867_dnxmb%2Fya) [n:127.0.0.1:58867_dnxmb%2Fya c:control_collection s:shard1 r:core_node1 x:collection1] o.a.s.s.SolrIndexSearcher Opening [Searcher@309cd765[collection1] main]
   [junit4]   2> 57609 INFO  (coreLoadExecutor-41-thread-1-processing-n:127.0.0.1:58867_dnxmb%2Fya) [n:127.0.0.1:58867_dnxmb%2Fya c:control_collection s:shard1 r:core_node1 x:collection1] o.a.s.c.c.ZkStateReader Load collection config from: [/collections/control_collection]
   [junit4]   2> 57611 INFO  (coreLoadExecutor-41-thread-1-processing-n:127.0.0.1:58867_dnxmb%2Fya) [n:127.0.0.1:58867_dnxmb%2Fya c:control_collection s:shard1 r:core_node1 x:collection1] o.a.s.c.c.ZkStateReader path=[/collections/control_collection] [configName]=[conf1] specified config exists in ZooKeeper
   [junit4]   2> 57611 INFO  (coreLoadExecutor-41-thread-1-processing-n:127.0.0.1:58867_dnxmb%2Fya) [n:127.0.0.1:58867_dnxmb%2Fya c:control_collection s:shard1 r:core_node1 x:collection1] o.a.s.r.ManagedResourceStorage Setting up ZooKeeper-based storage for the RestManager with znodeBase: /configs/conf1
   [junit4]   2> 57616 INFO  (coreLoadExecutor-41-thread-1-processing-n:127.0.0.1:58867_dnxmb%2Fya) [n:127.0.0.1:58867_dnxmb%2Fya c:control_collection s:shard1 r:core_node1 x:collection1] o.a.s.r.ManagedResourceStorage Configured ZooKeeperStorageIO with znodeBase: /configs/conf1
   [junit4]   2> 57616 INFO  (coreLoadExecutor-41-thread-1-processing-n:127.0.0.1:58867_dnxmb%2Fya) [n:127.0.0.1:58867_dnxmb%2Fya c:control_collection s:shard1 r:core_node1 x:collection1] o.a.s.r.RestManager Initializing RestManager with initArgs: {}
   [junit4]   2> 57616 INFO  (coreLoadExecutor-41-thread-1-processing-n:127.0.0.1:58867_dnxmb%2Fya) [n:127.0.0.1:58867_dnxmb%2Fya c:control_collection s:shard1 r:core_node1 x:collection1] o.a.s.r.ManagedResourceStorage Reading _rest_managed.json using ZooKeeperStorageIO:path=/configs/conf1
   [junit4]   2> 57617 INFO  (coreLoadExecutor-41-thread-1-processing-n:127.0.0.1:58867_dnxmb%2Fya) [n:127.0.0.1:58867_dnxmb%2Fya c:control_collection s:shard1 r:core_node1 x:collection1] o.a.s.r.ManagedResourceStorage No data found for znode /configs/conf1/_rest_managed.json
   [junit4]   2> 57617 INFO  (coreLoadExecutor-41-thread-1-processing-n:127.0.0.1:58867_dnxmb%2Fya) [n:127.0.0.1:58867_dnxmb%2Fya c:control_collection s:shard1 r:core_node1 x:collection1] o.a.s.r.ManagedResourceStorage Loaded null at path _rest_managed.json using ZooKeeperStorageIO:path=/configs/conf1
   [junit4]   2> 57617 INFO  (coreLoadExecutor-41-thread-1-processing-n:127.0.0.1:58867_dnxmb%2Fya) [n:127.0.0.1:58867_dnxmb%2Fya c:control_collection s:shard1 r:core_node1 x:collection1] o.a.s.r.RestManager Initializing 0 registered ManagedResources
   [junit4]   2> 57617 INFO  (coreLoadExecutor-41-thread-1-processing-n:127.0.0.1:58867_dnxmb%2Fya) [n:127.0.0.1:58867_dnxmb%2Fya c:control_collection s:shard1 r:core_node1 x:collection1] o.a.s.h.ReplicationHandler Commits will be reserved for  10000
   [junit4]   2> 57618 INFO  (searcherExecutor-42-thread-1-processing-n:127.0.0.1:58867_dnxmb%2Fya x:collection1 s:shard1 c:control_collection r:core_node1) [n:127.0.0.1:58867_dnxmb%2Fya c:control_collection s:shard1 r:core_node1 x:collection1] o.a.s.c.SolrCore [collection1] Registered new searcher Searcher@309cd765[collection1] main{ExitableDirectoryReader(UninvertingDirectoryReader())}
   [junit4]   2> 57618 INFO  (coreLoadExecutor-41-thread-1-processing-n:127.0.0.1:58867_dnxmb%2Fya) [n:127.0.0.1:58867_dnxmb%2Fya c:control_collection s:shard1 r:core_node1 x:collection1] o.a.s.u.UpdateLog Looking up max value of version field to seed version buckets
   [junit4]   2> 57618 INFO  (coreLoadExecutor-41-thread-1-processing-n:127.0.0.1:58867_dnxmb%2Fya) [n:127.0.0.1:58867_dnxmb%2Fya c:control_collection s:shard1 r:core_node1 x:collection1] o.a.s.u.VersionInfo Refreshing highest value of _version_ for 65536 version buckets from index
   [junit4]   2> 57618 INFO  (coreLoadExecutor-41-thread-1-processing-n:127.0.0.1:58867_dnxmb%2Fya) [n:127.0.0.1:58867_dnxmb%2Fya c:control_collection s:shard1 r:core_node1 x:collection1] o.a.s.u.VersionInfo No terms found for _version_, cannot seed version bucket highest value from index
   [junit4]   2> 57618 INFO  (coreLoadExecutor-41-thread-1-processing-n:127.0.0.1:58867_dnxmb%2Fya) [n:127.0.0.1:58867_dnxmb%2Fya c:control_collection s:shard1 r:core_node1 x:collection1] o.a.s.u.UpdateLog Could not find max version in index or recent updates, using new clock 1525169172797980672
   [junit4]   2> 57620 INFO  (coreLoadExecutor-41-thread-1-processing-n:127.0.0.1:58867_dnxmb%2Fya) [n:127.0.0.1:58867_dnxmb%2Fya c:control_collection s:shard1 r:core_node1 x:collection1] o.a.s.u.UpdateLog Took 1.0ms to seed version buckets with highest version 1525169172797980672
   [junit4]   2> 57622 INFO  (coreLoadExecutor-41-thread-1-processing-n:127.0.0.1:58867_dnxmb%2Fya) [n:127.0.0.1:58867_dnxmb%2Fya c:control_collection s:shard1 r:core_node1 x:collection1] o.a.s.c.ZkController watch zkdir /configs/conf1
   [junit4]   2> 57624 INFO  (coreLoadExecutor-41-thread-1-processing-n:127.0.0.1:58867_dnxmb%2Fya) [n:127.0.0.1:58867_dnxmb%2Fya c:control_collection s:shard1 r:core_node1 x:collection1] o.a.s.c.CoreContainer registering core: collection1
   [junit4]   2> 57626 INFO  (coreZkRegister-35-thread-1-processing-n:127.0.0.1:58867_dnxmb%2Fya x:collection1 s:shard1 c:control_collection r:core_node1) [n:127.0.0.1:58867_dnxmb%2Fya c:control_collection s:shard1 r:core_node1 x:collection1] o.a.s.c.ZkController Register replica - core:collection1 address:http://127.0.0.1:58867/dnxmb/ya collection:control_collection shard:shard1
   [junit4]   2> 57639 INFO  (coreZkRegister-35-thread-1-processing-n:127.0.0.1:58867_dnxmb%2Fya x:collection1 s:shard1 c:control_collection r:core_node1) [n:127.0.0.1:58867_dnxmb%2Fya c:control_collection s:shard1 r:core_node1 x:collection1] o.a.s.c.c.SolrZkClient makePath: /collections/control_collection/leader_elect/shard1/election
   [junit4]   2> 57646 INFO  (coreZkRegister-35-thread-1-processing-n:127.0.0.1:58867_dnxmb%2Fya x:collection1 s:shard1 c:control_collection r:core_node1) [n:127.0.0.1:58867_dnxmb%2Fya c:control_collection s:shard1 r:core_node1 x:collection1] o.a.s.c.LeaderElector Joined leadership election with path: /collections/control_collection/leader_elect/shard1/election/95323073171554308-core_node1-n_0000000000
   [junit4]   2> 57647 INFO  (coreZkRegister-35-thread-1-processing-n:127.0.0.1:58867_dnxmb%2Fya x:collection1 s:shard1 c:control_collection r:core_node1) [n:127.0.0.1:58867_dnxmb%2Fya c:control_collection s:shard1 r:core_node1 x:collection1] o.a.s.c.ShardLeaderElectionContext Running the leader process for shard=shard1 and weAreReplacement=false and leaderVoteWait=0
   [junit4]   2> 57651 INFO  (coreZkRegister-35-thread-1-processing-n:127.0.0.1:58867_dnxmb%2Fya x:collection1 s:shard1 c:control_collection r:core_node1) [n:127.0.0.1:58867_dnxmb%2Fya c:control_collection s:shard1 r:core_node1 x:collection1] o.a.s.c.ShardLeaderElectionContext Enough replicas found to continue.
   [junit4]   2> 57651 INFO  (coreZkRegister-35-thread-1-processing-n:127.0.0.1:58867_dnxmb%2Fya x:collection1 s:shard1 c:control_collection r:core_node1) [n:127.0.0.1:58867_dnxmb%2Fya c:control_collection s:shard1 r:core_node1 x:collection1] o.a.s.c.ShardLeaderElectionContext I may be the new leader - try and sync
   [junit4]   2> 57651 INFO  (OverseerStateUpdate-95323073171554308-127.0.0.1:58867_dnxmb%2Fya-n_0000000000) [n:127.0.0.1:58867_dnxmb%2Fya    ] o.a.s.c.Overseer processMessage: queueSize: 1, message = {
   [junit4]   2>   "operation":"leader",
   [junit4]   2>   "shard":"shard1",
   [junit4]   2>   "collection":"control_collection"} current state version: 1
   [junit4]   2> 57653 INFO  (coreZkRegister-35-thread-1-processing-n:127.0.0.1:58867_dnxmb%2Fya x:collection1 s:shard1 c:control_collection r:core_node1) [n:127.0.0.1:58867_dnxmb%2Fya c:control_collection s:shard1 r:core_node1 x:collection1] o.a.s.c.SyncStrategy Sync replicas to http://127.0.0.1:58867/dnxmb/ya/collection1/
   [junit4]   2> 57654 INFO  (coreZkRegister-35-thread-1-processing-n:127.0.0.1:58867_dnxmb%2Fya x:collection1 s:shard1 c:control_collection r:core_node1) [n:127.0.0.1:58867_dnxmb%2Fya c:control_collection s:shard1 r:core_node1 x:collection1] o.a.s.c.SyncStrategy Sync Success - now sync replicas to me
   [junit4]   2> 57654 INFO  (coreZkRegister-35-thread-1-processing-n:127.0.0.1:58867_dnxmb%2Fya x:collection1 s:shard1 c:control_collection r:core_node1) [n:127.0.0.1:58867_dnxmb%2Fya c:control_collection s:shard1 r:core_node1 x:collection1] o.a.s.c.SyncStrategy http://127.0.0.1:58867/dnxmb/ya/collection1/ has no replicas
   [junit4]   2> 57661 INFO  (coreZkRegister-35-thread-1-processing-n:127.0.0.1:58867_dnxmb%2Fya x:collection1 s:shard1 c:control_collection r:core_node1) [n:127.0.0.1:58867_dnxmb%2Fya c:control_collection s:shard1 r:core_node1 x:collection1] o.a.s.c.c.SolrZkClient makePath: /collections/control_collection/leaders/shard1
   [junit4]   2> 57673 INFO  (coreZkRegister-35-thread-1-processing-n:127.0.0.1:58867_dnxmb%2Fya x:collection1 s:shard1 c:control_collection r:core_node1) [n:127.0.0.1:58867_dnxmb%2Fya c:control_collection s:shard1 r:core_node1 x:collection1] o.a.s.c.ShardLeaderElectionContextBase Creating leader registration node
   [junit4]   2> 57693 INFO  (coreZkRegister-35-thread-1-processing-n:127.0.0.1:58867_dnxmb%2Fya x:collection1 s:shard1 c:control_collection r:core_node1) [n:127.0.0.1:58867_dnxmb%2Fya c:control_collection s:shard1 r:core_node1 x:collection1] o.a.s.c.ShardLeaderElectionContext I am the new leader: http://127.0.0.1:58867/dnxmb/ya/collection1/ shard1
   [junit4]   2> 57695 INFO  (OverseerStateUpdate-95323073171554308-127.0.0.1:58867_dnxmb%2Fya-n_0000000000) [n:127.0.0.1:58867_dnxmb%2Fya    ] o.a.s.c.Overseer processMessage: queueSize: 1, message = {
   [junit4]   2>   "operation":"leader",
   [junit4]   2>   "shard":"shard1",
   [junit4]   2>   "collection":"control_collection",
   [junit4]   2>   "base_url":"http://127.0.0.1:58867/dnxmb/ya",
   [junit4]   2>   "core":"collection1",
   [junit4]   2>   "state":"active"} current state version: 1
   [junit4]   2> 57803 INFO  (zkCallback-20-thread-1-processing-n:127.0.0.1:58867_dnxmb%2Fya) [n:127.0.0.1:58867_dnxmb%2Fya    ] o.a.s.c.c.ZkStateReader A cluster state change: [WatchedEvent state:SyncConnected type:NodeDataChanged path:/clusterstate.json], has occurred - updating... (live nodes size: [1])
   [junit4]   2> 57821 INFO  (TEST-CloudSolrClientTest.testWrongZkChrootTest-seed#[9A70BCBE321361B1]) [    ] o.a.s.c.c.SolrZkClient Using default ZkCredentialsProvider
   [junit4]   2> 57822 INFO  (TEST-CloudSolrClientTest.testWrongZkChrootTest-seed#[9A70BCBE321361B1]) [    ] o.a.s.c.c.ConnectionManager Waiting for client to connect to ZooKeeper
   [junit4]   2> 57831 INFO  (zkCallback-22-thread-1) [    ] o.a.s.c.c.ConnectionManager Watcher org.apache.solr.common.cloud.ConnectionManager@444d068f name:ZooKeeperConnection Watcher:127.0.0.1:58864/solr got event WatchedEvent state:SyncConnected type:None path:null path:null type:None
   [junit4]   2> 57832 INFO  (TEST-CloudSolrClientTest.testWrongZkChrootTest-seed#[9A70BCBE321361B1]) [    ] o.a.s.c.c.ConnectionManager Client is connected to ZooKeeper
   [junit4]   2> 57832 INFO  (TEST-CloudSolrClientTest.testWrongZkChrootTest-seed#[9A70BCBE321361B1]) [    ] o.a.s.c.c.SolrZkClient Using default ZkACLProvider
   [junit4]   2> 57832 INFO  (TEST-CloudSolrClientTest.testWrongZkChrootTest-seed#[9A70BCBE321361B1]) [    ] o.a.s.c.c.ZkStateReader Updating cluster state from ZooKeeper... 
   [junit4]   2> 57839 INFO  (TEST-CloudSolrClientTest.testWrongZkChrootTest-seed#[9A70BCBE321361B1]) [    ] o.a.s.c.ChaosMonkey monkey: init - expire sessions:false cause connection loss:false
   [junit4]   2> 57839 INFO  (TEST-CloudSolrClientTest.testWrongZkChrootTest-seed#[9A70BCBE321361B1]) [    ] o.a.s.c.AbstractFullDistribZkTestBase Creating collection1 with stateFormat=2
   [junit4]   2> 57839 INFO  (TEST-CloudSolrClientTest.testWrongZkChrootTest-seed#[9A70BCBE321361B1]) [    ] o.a.s.c.c.SolrZkClient Using default ZkCredentialsProvider
   [junit4]   2> 57840 INFO  (TEST-CloudSolrClientTest.testWrongZkChrootTest-seed#[9A70BCBE321361B1]) [    ] o.a.s.c.c.ConnectionManager Waiting for client to connect to ZooKeeper
   [junit4]   2> 57843 INFO  (zkCallback-23-thread-1) [    ] o.a.s.c.c.ConnectionManager Watcher org.apache.solr.common.cloud.ConnectionManager@296a2480 name:ZooKeeperConnection Watcher:127.0.0.1:58864/solr got event WatchedEvent state:SyncConnected type:None path:null path:null type:None
   [junit4]   2> 57844 INFO  (TEST-CloudSolrClientTest.testWrongZkChrootTest-seed#[9A70BCBE321361B1]) [    ] o.a.s.c.c.ConnectionManager Client is connected to ZooKeeper
   [junit4]   2> 57844 INFO  (TEST-CloudSolrClientTest.testWrongZkChrootTest-seed#[9A70BCBE321361B1]) [    ] o.a.s.c.c.SolrZkClient Using default ZkACLProvider
   [junit4]   2> 57851 INFO  (coreZkRegister-35-thread-1-processing-n:127.0.0.1:58867_dnxmb%2Fya x:collection1 s:shard1 c:control_collection r:core_node1) [n:127.0.0.1:58867_dnxmb%2Fya c:control_collection s:shard1 r:core_node1 x:collection1] o.a.s.c.ZkController We are http://127.0.0.1:58867/dnxmb/ya/collection1/ and leader is http://127.0.0.1:58867/dnxmb/ya/collection1/
   [junit4]   2> 57851 INFO  (coreZkRegister-35-thread-1-processing-n:127.0.0.1:58867_dnxmb%2Fya x:collection1 s:shard1 c:control_collection r:core_node1) [n:127.0.0.1:58867_dnxmb%2Fya c:control_collection s:shard1 r:core_node1 x:collection1] o.a.s.c.ZkController No LogReplay needed for core=collection1 baseURL=http://127.0.0.1:58867/dnxmb/ya
   [junit4]   2> 57851 INFO  (coreZkRegister-35-thread-1-processing-n:127.0.0.1:58867_dnxmb%2Fya x:collection1 s:shard1 c:control_collection r:core_node1) [n:127.0.0.1:58867_dnxmb%2Fya c:control_collection s:shard1 r:core_node1 x:collection1] o.a.s.c.ZkController I am the leader, no recovery necessary
   [junit4]   2> 57851 INFO  (coreZkRegister-35-thread-1-processing-n:127.0.0.1:58867_dnxmb%2Fya x:collection1 s:shard1 c:control_collection r:core_node1) [n:127.0.0.1:58867_dnxmb%2Fya c:control_collection s:shard1 r:core_node1 x:collection1] o.a.s.c.ZkController publishing state=active
   [junit4]   2> 57851 INFO  (coreZkRegister-35-thread-1-processing-n:127.0.0.1:58867_dnxmb%2Fya x:collection1 s:shard1 c:control_collection r:core_node1) [n:127.0.0.1:58867_dnxmb%2Fya c:control_collection s:shard1 r:core_node1 x:collection1] o.a.s.c.ZkController numShards not found on descriptor - reading it from system property
   [junit4]   2> 57861 INFO  (OverseerStateUpdate-95323073171554308-127.0.0.1:58867_dnxmb%2Fya-n_0000000000) [n:127.0.0.1:58867_dnxmb%2Fya    ] o.a.s.c.Overseer processMessage: queueSize: 1, message = {
   [junit4]   2>   "operation":"create",
   [junit4]   2>   "name":"collection1",
   [junit4]   2>   "numShards":"2",
   [junit4]   2>   "stateFormat":"2"} current state version: 2
   [junit4]   2> 57862 INFO  (OverseerStateUpdate-95323073171554308-127.0.0.1:58867_dnxmb%2Fya-n_0000000000) [n:127.0.0.1:58867_dnxmb%2Fya    ] o.a.s.c.o.ClusterStateMutator building a new cName: collection1
   [junit4]   2> 57878 INFO  (OverseerStateUpdate-95323073171554308-127.0.0.1:58867_dnxmb%2Fya-n_0000000000) [n:127.0.0.1:58867_dnxmb%2Fya    ] o.a.s.c.Overseer processMessage: queueSize: 1, message = {
   [junit4]   2>   "core":"collection1",
   [junit4]   2>   "core_node_name":"core_node1",
   [junit4]   2>   "roles":null,
   [junit4]   2>   "base_url":"http://127.0.0.1:58867/dnxmb/ya",
   [junit4]   2>   "node_name":"127.0.0.1:58867_dnxmb%2Fya",
   [junit4]   2>   "numShards":"2",
   [junit4]   2>   "state":"active",
   [junit4]   2>   "shard":"shard1",
   [junit4]   2>   "collection":"control_collection",
   [junit4]   2>   "operation":"state"} current state version: 2
   [junit4]   2> 57881 INFO  (OverseerStateUpdate-95323073171554308-127.0.0.1:58867_dnxmb%2Fya-n_0000000000) [n:127.0.0.1:58867_dnxmb%2Fya    ] o.a.s.c.o.ReplicaMutator Update state numShards=2 message={
   [junit4]   2>   "core":"collection1",
   [junit4]   2>   "core_node_name":"core_node1",
   [junit4]   2>   "roles":null,
   [junit4]   2>   "base_url":"http://127.0.0.1:58867/dnxmb/ya",
   [junit4]   2>   "node_name":"127.0.0.1:58867_dnxmb%2Fya",
   [junit4]   2>   "numShards":"2",
   [junit4]   2>   "state":"active",
   [junit4]   2>   "shard":"shard1",
   [junit4]   2>   "collection":"control_collection",
   [junit4]   2>   "operation":"state"}
   [junit4]   2> 57882 INFO  (OverseerStateUpdate-95323073171554308-127.0.0.1:58867_dnxmb%2Fya-n_0000000000) [n:127.0.0.1:58867_dnxmb%2Fya    ] o.a.s.c.o.ZkStateWriter going to create_collection /collections/collection1/state.json
   [junit4]   2> 58013 INFO  (TEST-CloudSolrClientTest.testWrongZkChrootTest-seed#[9A70BCBE321361B1]) [    ] o.a.s.SolrTestCaseJ4 Writing core.properties file to /Users/jenkins/workspace/Lucene-Solr-trunk-MacOSX/solr/build/solr-solrj/test/J1/temp/solr.client.solrj.impl.CloudSolrClientTest_9A70BCBE321361B1-001/shard-1-001/cores/collection1
   [junit4]   2> 58014 INFO  (TEST-CloudSolrClientTest.testWrongZkChrootTest-seed#[9A70BCBE321361B1]) [    ] o.a.s.c.AbstractFullDistribZkTestBase create jetty 1 in directory /Users/jenkins/workspace/Lucene-Solr-trunk-MacOSX/solr/build/solr-solrj/test/J1/temp/solr.client.solrj.impl.CloudSolrClientTest_9A70BCBE321361B1-001/shard-1-001
   [junit4]   2> 58015 INFO  (TEST-CloudSolrClientTest.testWrongZkChrootTest-seed#[9A70BCBE321361B1]) [    ] o.e.j.s.Server jetty-9.2.13.v20150730
   [junit4]   2> 58018 INFO  (TEST-CloudSolrClientTest.testWrongZkChrootTest-seed#[9A70BCBE321361B1]) [    ] o.e.j.s.h.ContextHandler Started o.e.j.s.ServletContextHandler@7f7075f0{/dnxmb/ya,null,AVAILABLE}
   [junit4]   2> 58018 INFO  (TEST-CloudSolrClientTest.testWrongZkChrootTest-seed#[9A70BCBE321361B1]) [    ] o.e.j.s.ServerConnector Started ServerConnector@3d067ef8{HTTP/1.1}{127.0.0.1:58873}
   [junit4]   2> 58018 INFO  (TEST-CloudSolrClientTest.testWrongZkChrootTest-seed#[9A70BCBE321361B1]) [    ] o.e.j.s.Server Started @63222ms
   [junit4]   2> 58018 INFO  (TEST-CloudSolrClientTest.testWrongZkChrootTest-seed#[9A70BCBE321361B1]) [    ] o.a.s.c.s.e.JettySolrRunner Jetty properties: {solr.data.dir=/Users/jenkins/workspace/Lucene-Solr-trunk-MacOSX/solr/build/solr-solrj/test/J1/temp/solr.client.solrj.impl.CloudSolrClientTest_9A70BCBE321361B1-001/tempDir-001/jetty1, solrconfig=solrconfig.xml, hostContext=/dnxmb/ya, hostPort=58873, coreRootDirectory=/Users/jenkins/workspace/Lucene-Solr-trunk-MacOSX/solr/build/solr-solrj/test/J1/temp/solr.client.solrj.impl.CloudSolrClientTest_9A70BCBE321361B1-001/shard-1-001/cores}
   [junit4]   2> 58019 INFO  (TEST-CloudSolrClientTest.testWrongZkChrootTest-seed#[9A70BCBE321361B1]) [    ] o.a.s.s.SolrDispatchFilter SolrDispatchFilter.init(): sun.misc.Launcher$AppClassLoader@1540e19d
   [junit4]   2> 58019 INFO  (TEST-CloudSolrClientTest.testWrongZkChrootTest-seed#[9A70BCBE321361B1]) [    ] o.a.s.c.SolrResourceLoader new SolrResourceLoader for directory: '/Users/jenkins/workspace/Lucene-Solr-trunk-MacOSX/solr/build/solr-solrj/test/J1/temp/solr.client.solrj.impl.CloudSolrClientTest_9A70BCBE321361B1-001/shard-1-001'
   [junit4]   2> 58019 INFO  (TEST-CloudSolrClientTest.testWrongZkChrootTest-seed#[9A70BCBE321361B1]) [    ] o.a.s.c.SolrResourceLoader JNDI not configured for solr (NoInitialContextEx)
   [junit4]   2> 58019 INFO  (TEST-CloudSolrClientTest.testWrongZkChrootTest-seed#[9A70BCBE321361B1]) [    ] o.a.s.c.SolrResourceLoader solr home defaulted to 'solr/' (could not find system property or JNDI)
   [junit4]   2> 58019 INFO  (TEST-CloudSolrClientTest.testWrongZkChrootTest-seed#[9A70BCBE321361B1]) [    ] o.a.s.c.c.SolrZkClient Using default ZkCredentialsProvider
   [junit4]   2> 58020 INFO  (TEST-CloudSolrClientTest.testWrongZkChrootTest-seed#[9A70BCBE321361B1]) [    ] o.a.s.c.c.ConnectionManager Waiting for client to connect to ZooKeeper
   [junit4]   2> 58024 INFO  (zkCallback-24-thread-1) [    ] o.a.s.c.c.ConnectionManager Watcher org.apache.solr.common.cloud.ConnectionManager@3653adce name:ZooKeeperConnection Watcher:127.0.0.1:58864/solr got event WatchedEvent state:SyncConnected type:None path:null path:null type:None
   [junit4]   2> 58024 INFO  (TEST-CloudSolrClientTest.testWrongZkChrootTest-seed#[9A70BCBE321361B1]) [    ] o.a.s.c.c.ConnectionManager Client is connected to ZooKeeper
   [junit4]   2> 58024 INFO  (TEST-CloudSolrClientTest.testWrongZkChrootTest-seed#[9A70BCBE321361B1]) [    ] o.a.s.c.c.SolrZkClient Using default ZkACLProvider
   [junit4]   2> 58028 INFO  (TEST-CloudSolrClientTest.testWrongZkChrootTest-seed#[9A70BCBE321361B1]) [    ] o.a.s.s.SolrDispatchFilter Loading solr.xml from SolrHome (not found in ZooKeeper)
   [junit4]   2> 58028 INFO  (TEST-CloudSolrClientTest.testWrongZkChrootTest-seed#[9A70BCBE321361B1]) [    ] o.a.s.c.SolrXmlConfig Loading container configuration from /Users/jenkins/workspace/Lucene-Solr-trunk-MacOSX/solr/build/solr-solrj/test/J1/temp/solr.client.solrj.impl.CloudSolrClientTest_9A70BCBE321361B1-001/shard-1-001/solr.xml
   [junit4]   2> 58042 INFO  (TEST-CloudSolrClientTest.testWrongZkChrootTest-seed#[9A70BCBE321361B1]) [    ] o.a.s.c.CorePropertiesLocator Config-defined core root directory: /Users/jenkins/workspace/Lucene-Solr-trunk-MacOSX/solr/build/solr-solrj/test/J1/temp/solr.client.solrj.impl.CloudSolrClientTest_9A70BCBE321361B1-001/shard-1-001/cores
   [junit4]   2> 58042 INFO  (TEST-CloudSolrClientTest.testWrongZkChrootTest-seed#[9A70BCBE321361B1]) [    ] o.a.s.c.CoreContainer New CoreContainer 1971578269
   [junit4]   2> 58042 INFO  (TEST-CloudSolrClientTest.testWrongZkChrootTest-seed#[9A70BCBE321361B1]) [    ] o.a.s.c.CoreContainer Loading cores into CoreContainer [instanceDir=/Users/jenkins/workspace/Lucene-Solr-trunk-MacOSX/solr/build/solr-solrj/test/J1/temp/solr.client.solrj.impl.CloudSolrClientTest_9A70BCBE321361B1-001/shard-1-001]
   [junit4]   2> 58042 WARN  (TEST-CloudSolrClientTest.testWrongZkChrootTest-seed#[9A70BCBE321361B1]) [    ] o.a.s.c.CoreContainer Couldn't add files from /Users/jenkins/workspace/Lucene-Solr-trunk-MacOSX/solr/build/solr-solrj/test/J1/temp/solr.client.solrj.impl.CloudSolrClientTest_9A70BCBE321361B1-001/shard-1-001/lib to classpath: /Users/jenkins/workspace/Lucene-Solr-trunk-MacOSX/solr/build/solr-solrj/test/J1/temp/solr.client.solrj.impl.CloudSolrClientTest_9A70BCBE321361B1-001/shard-1-001/lib
   [junit4]   2> 58042 INFO  (TEST-CloudSolrClientTest.testWrongZkChrootTest-seed#[9A70BCBE321361B1]) [    ] o.a.s.h.c.HttpShardHandlerFactory created with socketTimeout : 90000,urlScheme : ,connTimeout : 15000,maxConnectionsPerHost : 20,maxConnections : 10000,corePoolSize : 0,maximumPoolSize : 2147483647,maxThreadIdleTime : 5,sizeOfQueue : -1,fairnessPolicy : false,useRetries : false,
   [junit4]   2> 58043 INFO  (TEST-CloudSolrClientTest.testWrongZkChrootTest-seed#[9A70BCBE321361B1]) [    ] o.a.s.u.UpdateShardHandler Creating UpdateShardHandler HTTP client with params: socketTimeout=340000&connTimeout=45000&retry=true
   [junit4]   2> 58043 INFO  (TEST-CloudSolrClientTest.testWrongZkChrootTest-seed#[9A70BCBE321361B1]) [    ] o.a.s.l.LogWatcher SLF4J impl is org.slf4j.impl.Log4jLoggerFactory
   [junit4]   2> 58043 INFO  (TEST-CloudSolrClientTest.testWrongZkChrootTest-seed#[9A70BCBE321361B1]) [    ] o.a.s.l.LogWatcher Registering Log Listener [Log4j (org.slf4j.impl.Log4jLoggerFactory)]
   [junit4]   2> 58044 INFO  (TEST-CloudSolrClientTest.testWrongZkChrootTest-seed#[9A70BCBE321361B1]) [    ] o.a.s.c.ZkContainer Zookeeper client=127.0.0.1:58864/solr
   [junit4]   2> 58044 INFO  (TEST-CloudSolrClientTest.testWrongZkChrootTest-seed#[9A70BCBE321361B1]) [    ] o.a.s.c.ZkController zkHost includes chroot
   [junit4]   2> 58044 INFO  (TEST-CloudSolrClientTest.testWrongZkChrootTest-seed#[9A70BCBE321361B1]) [    ] o.a.s.c.c.SolrZkClient Using default ZkCredentialsProvider
   [junit4]   2> 58044 INFO  (TEST-CloudSolrClientTest.testWrongZkChrootTest-seed#[9A70BCBE321361B1]) [    ] o.a.s.c.c.ConnectionManager Waiting for client to connect to ZooKeeper
   [junit4]   2> 58048 INFO  (zkCallback-27-thread-1) [    ] o.a.s.c.c.ConnectionManager Watcher org.apache.solr.common.cloud.ConnectionManager@3774efc7 name:ZooKeeperConnection Watcher:127.0.0.1:58864 got event WatchedEvent state:SyncConnected type:None path:null path:null type:None
   [junit4]   2> 58049 INFO  (TEST-CloudSolrClientTest.testWrongZkChrootTest-seed#[9A70BCBE321361B1]) [    ] o.a.s.c.c.ConnectionManager Client is connected to ZooKeeper
   [junit4]   2> 58049 INFO  (TEST-CloudSolrClientTest.testWrongZkChrootTest-seed#[9A70BCBE321361B1]) [    ] o.a.s.c.c.SolrZkClient Using default ZkACLProvider
   [junit4]   2> 58053 INFO  (TEST-CloudSolrClientTest.testWrongZkChrootTest-seed#[9A70BCBE321361B1]) [n:127.0.0.1:58873_dnxmb%2Fya    ] o.a.s.c.c.ConnectionManager Waiting for client to connect to ZooKeeper
   [junit4]   2> 58055 INFO  (zkCallback-28-thread-1-processing-n:127.0.0.1:58873_dnxmb%2Fya) [n:127.0.0.1:58873_dnxmb%2Fya    ] o.a.s.c.c.ConnectionManager Watcher org.apache.solr.common.cloud.ConnectionManager@254140d7 name:ZooKeeperConnection Watcher:127.0.0.1:58864/solr got event WatchedEvent state:SyncConnected type:None path:null path:null type:None
   [junit4]   2> 58055 INFO  (TEST-CloudSolrClientTest.testWrongZkChrootTest-seed#[9A70BCBE321361B1]) [n:127.0.0.1:58873_dnxmb%2Fya    ] o.a.s.c.c.ConnectionManager Client is connected to ZooKeeper
   [junit4]   2> 58084 INFO  (TEST-CloudSolrClientTest.testWrongZkChrootTest-seed#[9A70BCBE321361B1]) [n:127.0.0.1:58873_dnxmb%2Fya    ] o.a.s.c.c.ZkStateReader Updating cluster state from ZooKeeper... 
   [junit4]   2> 58100 INFO  (zkCallback-28-thread-1-processing-n:127.0.0.1:58873_dnxmb%2Fya) [n:127.0.0.1:58873_dnxmb%2Fya    ] o.a.s.c.c.ZkStateReader A cluster state change: [WatchedEvent state:SyncConnected type:NodeDataChanged path:/clusterstate.json], has occurred - updating... (live nodes size: [1])
   [junit4]   2> 58100 INFO  (zkCallback-20-thread-1-processing-n:127.0.0.1:58867_dnxmb%2Fya) [n:127.0.0.1:58867_dnxmb%2Fya    ] o.a.s.c.c.ZkStateReader A cluster state change: [WatchedEvent state:SyncConnected type:NodeDataChanged path:/clusterstate.json], has occurred - updating... (live nodes size: [1])
   [junit4]   2> 58101 INFO  (zkCallback-22-thread-1) [    ] o.a.s.c.c.ZkStateReader A cluster state change: [WatchedEvent state:SyncConnected type:NodeDataChanged path:/clusterstate.json], has occurred - updating... (live nodes size: [1])
   [junit4]   2> 59121 INFO  (TEST-CloudSolrClientTest.testWrongZkChrootTest-seed#[9A70BCBE321361B1]) [n:127.0.0.1:58873_dnxmb%2Fya    ] o.a.s.c.ZkController Register node as live in ZooKeeper:/live_nodes/127.0.0.1:58873_dnxmb%2Fya
   [junit4]   2> 59122 INFO  (TEST-CloudSolrClientTest.testWrongZkChrootTest-seed#[9A70BCBE321361B1]) [n:127.0.0.1:58873_dnxmb%2Fya    ] o.a.s.c.c.SolrZkClient makePath: /live_nodes/127.0.0.1:58873_dnxmb%2Fya
   [junit4]   2> 59126 INFO  (zkCallback-20-thread-1-processing-n:127.0.0.1:58867_dnxmb%2Fya) [n:127.0.0.1:58867_dnxmb%2Fya    ] o.a.s.c.c.ZkStateReader A live node change: [WatchedEvent state:SyncConnected type:NodeChildrenChanged path:/live_nodes], has occurred - updating... (live nodes size: [1])
   [junit4]   2> 59126 INFO  (zkCallback-28-thread-1-processing-n:127.0.0.1:58873_dnxmb%2Fya) [n:127.0.0.1:58873_dnxmb%2Fya    ] o.a.s.c.c.ZkStateReader A live node change: [WatchedEvent state:SyncConnected type:NodeChildrenChanged path:/live_nodes], has occurred - updating... (live nodes size: [1])
   [junit4]   2> 59129 INFO  (TEST-CloudSolrClientTest.testWrongZkChrootTest-seed#[9A70BCBE321361B1]) [n:127.0.0.1:58873_dnxmb%2Fya    ] o.a.s.c.Overseer Overseer (id=null) closing
   [junit4]   2> 59130 INFO  (TEST-CloudSolrClientTest.testWrongZkChrootTest-seed#[9A70BCBE321361B1]) [n:127.0.0.1:58873_dnxmb%2Fya    ] o.a.s.c.LeaderElector Joined leadership election with path: /overseer_elect/election/95323073171554313-127.0.0.1:58873_dnxmb%2Fya-n_0000000001
   [junit4]   2> 59134 INFO  (zkCallback-22-thread-1) [    ] o.a.s.c.c.ZkStateReader A live node change: [WatchedEvent state:SyncConnected type:NodeChildrenChanged path:/live_nodes], has occurred - updating... (live nodes size: [1])
   [junit4]   2> 59137 INFO  (TEST-CloudSolrClientTest.testWrongZkChrootTest-seed#[9A70BCBE321361B1]) [n:127.0.0.1:58873_dnxmb%2Fya    ] o.a.s.c.LeaderElector Watching path /overseer_elect/election/95323073171554308-127.0.0.1:58867_dnxmb%2Fya-n_0000000000 to know if I could be the leader
   [junit4]   2> 59179 INFO  (TEST-CloudSolrClientTest.testWrongZkChrootTest-seed#[9A70BCBE321361B1]) [n:127.0.0.1:58873_dnxmb%2Fya    ] o.a.s.c.CoreContainer Security conf doesn't exist. Skipping setup for authorization module.
   [junit4]   2> 59179 INFO  (TEST-CloudSolrClientTest.testWrongZkChrootTest-seed#[9A70BCBE321361B1]) [n:127.0.0.1:58873_dnxmb%2Fya    ] o.a.s.c.CoreContainer No authentication plugin used.
   [junit4]   2> 59184 INFO  (TEST-CloudSolrClientTest.testWrongZkChrootTest-seed#[9A70BCBE321361B1]) [n:127.0.0.1:58873_dnxmb%2Fya    ] o.a.s.c.CoreProper

[...truncated too long message...]

olrQueryTest, ContentStreamTest, SolrZkClientTest, BasicHttpSolrClientTest, CloudSolrClientTest]
   [junit4]   2> NOTE: reproduce with: ant test  -Dtestcase=CloudSolrClientTest -Dtests.seed=9A70BCBE321361B1 -Dtests.slow=true -Dtests.locale=mk-MK -Dtests.timezone=Atlantic/Stanley -Dtests.asserts=true -Dtests.file.encoding=UTF-8
   [junit4] ERROR   0.00s J1 | CloudSolrClientTest (suite) <<<
   [junit4]    > Throwable #1: com.carrotsearch.randomizedtesting.ThreadLeakError: 5 threads leaked from SUITE scope at org.apache.solr.client.solrj.impl.CloudSolrClientTest: 
   [junit4]    >    1) Thread[id=682, name=zkCallback-106-thread-1, state=TIMED_WAITING, group=TGRP-CloudSolrClientTest]
   [junit4]    >         at sun.misc.Unsafe.park(Native Method)
   [junit4]    >         at java.util.concurrent.locks.LockSupport.parkNanos(LockSupport.java:215)
   [junit4]    >         at java.util.concurrent.SynchronousQueue$TransferStack.awaitFulfill(SynchronousQueue.java:460)
   [junit4]    >         at java.util.concurrent.SynchronousQueue$TransferStack.transfer(SynchronousQueue.java:362)
   [junit4]    >         at java.util.concurrent.SynchronousQueue.poll(SynchronousQueue.java:941)
   [junit4]    >         at java.util.concurrent.ThreadPoolExecutor.getTask(ThreadPoolExecutor.java:1066)
   [junit4]    >         at java.util.concurrent.ThreadPoolExecutor.runWorker(ThreadPoolExecutor.java:1127)
   [junit4]    >         at java.util.concurrent.ThreadPoolExecutor$Worker.run(ThreadPoolExecutor.java:617)
   [junit4]    >         at java.lang.Thread.run(Thread.java:745)
   [junit4]    >    2) Thread[id=705, name=zkCallback-106-thread-2, state=TIMED_WAITING, group=TGRP-CloudSolrClientTest]
   [junit4]    >         at sun.misc.Unsafe.park(Native Method)
   [junit4]    >         at java.util.concurrent.locks.LockSupport.parkNanos(LockSupport.java:215)
   [junit4]    >         at java.util.concurrent.SynchronousQueue$TransferStack.awaitFulfill(SynchronousQueue.java:460)
   [junit4]    >         at java.util.concurrent.SynchronousQueue$TransferStack.transfer(SynchronousQueue.java:362)
   [junit4]    >         at java.util.concurrent.SynchronousQueue.poll(SynchronousQueue.java:941)
   [junit4]    >         at java.util.concurrent.ThreadPoolExecutor.getTask(ThreadPoolExecutor.java:1066)
   [junit4]    >         at java.util.concurrent.ThreadPoolExecutor.runWorker(ThreadPoolExecutor.java:1127)
   [junit4]    >         at java.util.concurrent.ThreadPoolExecutor$Worker.run(ThreadPoolExecutor.java:617)
   [junit4]    >         at java.lang.Thread.run(Thread.java:745)
   [junit4]    >    3) Thread[id=680, name=TEST-CloudSolrClientTest.test-seed#[9A70BCBE321361B1]-SendThread(127.0.0.1:59058), state=TIMED_WAITING, group=TGRP-CloudSolrClientTest]
   [junit4]    >         at java.lang.Thread.sleep(Native Method)
   [junit4]    >         at org.apache.zookeeper.client.StaticHostProvider.next(StaticHostProvider.java:101)
   [junit4]    >         at org.apache.zookeeper.ClientCnxn$SendThread.startConnect(ClientCnxn.java:940)
   [junit4]    >         at org.apache.zookeeper.ClientCnxn$SendThread.run(ClientCnxn.java:1003)
   [junit4]    >    4) Thread[id=681, name=TEST-CloudSolrClientTest.test-seed#[9A70BCBE321361B1]-EventThread, state=WAITING, group=TGRP-CloudSolrClientTest]
   [junit4]    >         at sun.misc.Unsafe.park(Native Method)
   [junit4]    >         at java.util.concurrent.locks.LockSupport.park(LockSupport.java:175)
   [junit4]    >         at java.util.concurrent.locks.AbstractQueuedSynchronizer$ConditionObject.await(AbstractQueuedSynchronizer.java:2039)
   [junit4]    >         at java.util.concurrent.LinkedBlockingQueue.take(LinkedBlockingQueue.java:442)
   [junit4]    >         at org.apache.zookeeper.ClientCnxn$EventThread.run(ClientCnxn.java:494)
   [junit4]    >    5) Thread[id=706, name=zkCallback-106-thread-3, state=TIMED_WAITING, group=TGRP-CloudSolrClientTest]
   [junit4]    >         at sun.misc.Unsafe.park(Native Method)
   [junit4]    >         at java.util.concurrent.locks.LockSupport.parkNanos(LockSupport.java:215)
   [junit4]    >         at java.util.concurrent.SynchronousQueue$TransferStack.awaitFulfill(SynchronousQueue.java:460)
   [junit4]    >         at java.util.concurrent.SynchronousQueue$TransferStack.transfer(SynchronousQueue.java:362)
   [junit4]    >         at java.util.concurrent.SynchronousQueue.poll(SynchronousQueue.java:941)
   [junit4]    >         at java.util.concurrent.ThreadPoolExecutor.getTask(ThreadPoolExecutor.java:1066)
   [junit4]    >         at java.util.concurrent.ThreadPoolExecutor.runWorker(ThreadPoolExecutor.java:1127)
   [junit4]    >         at java.util.concurrent.ThreadPoolExecutor$Worker.run(ThreadPoolExecutor.java:617)
   [junit4]    >         at java.lang.Thread.run(Thread.java:745)
   [junit4]    > 	at __randomizedtesting.SeedInfo.seed([9A70BCBE321361B1]:0)Throwable #2: com.carrotsearch.randomizedtesting.ThreadLeakError: There are still zombie threads that couldn't be terminated:
   [junit4]    >    1) Thread[id=682, name=zkCallback-106-thread-1, state=TIMED_WAITING, group=TGRP-CloudSolrClientTest]
   [junit4]    >         at sun.misc.Unsafe.park(Native Method)
   [junit4]    >         at java.util.concurrent.locks.LockSupport.parkNanos(LockSupport.java:215)
   [junit4]    >         at java.util.concurrent.SynchronousQueue$TransferStack.awaitFulfill(SynchronousQueue.java:460)
   [junit4]    >         at java.util.concurrent.SynchronousQueue$TransferStack.transfer(SynchronousQueue.java:362)
   [junit4]    >         at java.util.concurrent.SynchronousQueue.poll(SynchronousQueue.java:941)
   [junit4]    >         at java.util.concurrent.ThreadPoolExecutor.getTask(ThreadPoolExecutor.java:1066)
   [junit4]    >         at java.util.concurrent.ThreadPoolExecutor.runWorker(ThreadPoolExecutor.java:1127)
   [junit4]    >         at java.util.concurrent.ThreadPoolExecutor$Worker.run(ThreadPoolExecutor.java:617)
   [junit4]    >         at java.lang.Thread.run(Thread.java:745)
   [junit4]    >    2) Thread[id=705, name=zkCallback-106-thread-2, state=TIMED_WAITING, group=TGRP-CloudSolrClientTest]
   [junit4]    >         at sun.misc.Unsafe.park(Native Method)
   [junit4]    >         at java.util.concurrent.locks.LockSupport.parkNanos(LockSupport.java:215)
   [junit4]    >         at java.util.concurrent.SynchronousQueue$TransferStack.awaitFulfill(SynchronousQueue.java:460)
   [junit4]    >         at java.util.concurrent.SynchronousQueue$TransferStack.transfer(SynchronousQueue.java:362)
   [junit4]    >         at java.util.concurrent.SynchronousQueue.poll(SynchronousQueue.java:941)
   [junit4]    >         at java.util.concurrent.ThreadPoolExecutor.getTask(ThreadPoolExecutor.java:1066)
   [junit4]    >         at java.util.concurrent.ThreadPoolExecutor.runWorker(ThreadPoolExecutor.java:1127)
   [junit4]    >         at java.util.concurrent.ThreadPoolExecutor$Worker.run(ThreadPoolExecutor.java:617)
   [junit4]    >         at java.lang.Thread.run(Thread.java:745)
   [junit4]    >    3) Thread[id=680, name=TEST-CloudSolrClientTest.test-seed#[9A70BCBE321361B1]-SendThread(127.0.0.1:59058), state=TIMED_WAITING, group=TGRP-CloudSolrClientTest]
   [junit4]    >         at java.lang.Thread.sleep(Native Method)
   [junit4]    >         at org.apache.zookeeper.client.StaticHostProvider.next(StaticHostProvider.java:101)
   [junit4]    >         at org.apache.zookeeper.ClientCnxn$SendThread.startConnect(ClientCnxn.java:940)
   [junit4]    >         at org.apache.zookeeper.ClientCnxn$SendThread.run(ClientCnxn.java:1003)
   [junit4]    >    4) Thread[id=706, name=zkCallback-106-thread-3, state=TIMED_WAITING, group=TGRP-CloudSolrClientTest]
   [junit4]    >         at sun.misc.Unsafe.park(Native Method)
   [junit4]    >         at java.util.concurrent.locks.LockSupport.parkNanos(LockSupport.java:215)
   [junit4]    >         at java.util.concurrent.SynchronousQueue$TransferStack.awaitFulfill(SynchronousQueue.java:460)
   [junit4]    >         at java.util.concurrent.SynchronousQueue$TransferStack.transfer(SynchronousQueue.java:362)
   [junit4]    >         at java.util.concurrent.SynchronousQueue.poll(SynchronousQueue.java:941)
   [junit4]    >         at java.util.concurrent.ThreadPoolExecutor.getTask(ThreadPoolExecutor.java:1066)
   [junit4]    >         at java.util.concurrent.ThreadPoolExecutor.runWorker(ThreadPoolExecutor.java:1127)
   [junit4]    >         at java.util.concurrent.ThreadPoolExecutor$Worker.run(ThreadPoolExecutor.java:617)
   [junit4]    >         at java.lang.Thread.run(Thread.java:745)
   [junit4]    > 	at __randomizedtesting.SeedInfo.seed([9A70BCBE321361B1]:0)
   [junit4] Completed [27/77 (1!)] on J1 in 107.55s, 3 tests, 3 errors <<< FAILURES!

[...truncated 161 lines...]
BUILD FAILED
/Users/jenkins/workspace/Lucene-Solr-trunk-MacOSX/build.xml:740: The following error occurred while executing this line:
/Users/jenkins/workspace/Lucene-Solr-trunk-MacOSX/build.xml:684: The following error occurred while executing this line:
/Users/jenkins/workspace/Lucene-Solr-trunk-MacOSX/build.xml:59: The following error occurred while executing this line:
/Users/jenkins/workspace/Lucene-Solr-trunk-MacOSX/solr/build.xml:246: The following error occurred while executing this line:
/Users/jenkins/workspace/Lucene-Solr-trunk-MacOSX/solr/common-build.xml:524: The following error occurred while executing this line:
/Users/jenkins/workspace/Lucene-Solr-trunk-MacOSX/lucene/common-build.xml:1457: The following error occurred while executing this line:
/Users/jenkins/workspace/Lucene-Solr-trunk-MacOSX/lucene/common-build.xml:1014: There were test failures: 77 suites, 522 tests, 2 suite-level errors, 1 error, 228 ignored [seed: 9A70BCBE321361B1]

Total time: 74 minutes 10 seconds
Build step 'Invoke Ant' marked build as failure
Archiving artifacts
[WARNINGS] Skipping publisher since build result is FAILURE
Recording test results
Email was triggered for: Failure - Any
Sending email for trigger: Failure - Any



Mime
View raw message