lucene-dev mailing list archives

Site index · List index
Message view « Date » · « Thread »
Top « Date » · « Thread »
From Policeman Jenkins Server <jenk...@thetaphi.de>
Subject [JENKINS] Lucene-Solr-5.5-Linux (32bit/jdk1.8.0_72) - Build # 122 - Failure!
Date Fri, 26 Feb 2016 04:25:38 GMT
Build: http://jenkins.thetaphi.de/job/Lucene-Solr-5.5-Linux/122/
Java: 32bit/jdk1.8.0_72 -server -XX:+UseG1GC

1 tests failed.
FAILED:  org.apache.solr.cloud.CollectionsAPIDistributedZkTest.test

Error Message:
Error from server at http://127.0.0.1:45142/ybwi/awholynewcollection_0: non ok status: 500, message:Server Error

Stack Trace:
org.apache.solr.client.solrj.impl.HttpSolrClient$RemoteSolrException: Error from server at http://127.0.0.1:45142/ybwi/awholynewcollection_0: non ok status: 500, message:Server Error
	at __randomizedtesting.SeedInfo.seed([1AA74E5DBA90B315:92F37187146CDEED]:0)
	at org.apache.solr.client.solrj.impl.HttpSolrClient.executeMethod(HttpSolrClient.java:511)
	at org.apache.solr.client.solrj.impl.HttpSolrClient.request(HttpSolrClient.java:240)
	at org.apache.solr.client.solrj.impl.HttpSolrClient.request(HttpSolrClient.java:229)
	at org.apache.solr.client.solrj.SolrRequest.process(SolrRequest.java:149)
	at org.apache.solr.client.solrj.SolrClient.query(SolrClient.java:942)
	at org.apache.solr.client.solrj.SolrClient.query(SolrClient.java:957)
	at org.apache.solr.cloud.AbstractFullDistribZkTestBase.waitForNon403or404or503(AbstractFullDistribZkTestBase.java:1753)
	at org.apache.solr.cloud.CollectionsAPIDistributedZkTest.testCollectionsAPI(CollectionsAPIDistributedZkTest.java:717)
	at org.apache.solr.cloud.CollectionsAPIDistributedZkTest.test(CollectionsAPIDistributedZkTest.java:160)
	at sun.reflect.NativeMethodAccessorImpl.invoke0(Native Method)
	at sun.reflect.NativeMethodAccessorImpl.invoke(NativeMethodAccessorImpl.java:62)
	at sun.reflect.DelegatingMethodAccessorImpl.invoke(DelegatingMethodAccessorImpl.java:43)
	at java.lang.reflect.Method.invoke(Method.java:498)
	at com.carrotsearch.randomizedtesting.RandomizedRunner.invoke(RandomizedRunner.java:1764)
	at com.carrotsearch.randomizedtesting.RandomizedRunner$8.evaluate(RandomizedRunner.java:871)
	at com.carrotsearch.randomizedtesting.RandomizedRunner$9.evaluate(RandomizedRunner.java:907)
	at com.carrotsearch.randomizedtesting.RandomizedRunner$10.evaluate(RandomizedRunner.java:921)
	at org.apache.solr.BaseDistributedSearchTestCase$ShardsRepeatRule$ShardsFixedStatement.callStatement(BaseDistributedSearchTestCase.java:964)
	at org.apache.solr.BaseDistributedSearchTestCase$ShardsRepeatRule$ShardsStatement.evaluate(BaseDistributedSearchTestCase.java:939)
	at com.carrotsearch.randomizedtesting.rules.SystemPropertiesRestoreRule$1.evaluate(SystemPropertiesRestoreRule.java:57)
	at org.apache.lucene.util.TestRuleSetupTeardownChained$1.evaluate(TestRuleSetupTeardownChained.java:49)
	at org.apache.lucene.util.AbstractBeforeAfterRule$1.evaluate(AbstractBeforeAfterRule.java:45)
	at org.apache.lucene.util.TestRuleThreadAndTestName$1.evaluate(TestRuleThreadAndTestName.java:48)
	at org.apache.lucene.util.TestRuleIgnoreAfterMaxFailures$1.evaluate(TestRuleIgnoreAfterMaxFailures.java:64)
	at org.apache.lucene.util.TestRuleMarkFailure$1.evaluate(TestRuleMarkFailure.java:47)
	at com.carrotsearch.randomizedtesting.rules.StatementAdapter.evaluate(StatementAdapter.java:36)
	at com.carrotsearch.randomizedtesting.ThreadLeakControl$StatementRunner.run(ThreadLeakControl.java:367)
	at com.carrotsearch.randomizedtesting.ThreadLeakControl.forkTimeoutingTask(ThreadLeakControl.java:809)
	at com.carrotsearch.randomizedtesting.ThreadLeakControl$3.evaluate(ThreadLeakControl.java:460)
	at com.carrotsearch.randomizedtesting.RandomizedRunner.runSingleTest(RandomizedRunner.java:880)
	at com.carrotsearch.randomizedtesting.RandomizedRunner$5.evaluate(RandomizedRunner.java:781)
	at com.carrotsearch.randomizedtesting.RandomizedRunner$6.evaluate(RandomizedRunner.java:816)
	at com.carrotsearch.randomizedtesting.RandomizedRunner$7.evaluate(RandomizedRunner.java:827)
	at com.carrotsearch.randomizedtesting.rules.StatementAdapter.evaluate(StatementAdapter.java:36)
	at com.carrotsearch.randomizedtesting.rules.SystemPropertiesRestoreRule$1.evaluate(SystemPropertiesRestoreRule.java:57)
	at org.apache.lucene.util.AbstractBeforeAfterRule$1.evaluate(AbstractBeforeAfterRule.java:45)
	at com.carrotsearch.randomizedtesting.rules.StatementAdapter.evaluate(StatementAdapter.java:36)
	at org.apache.lucene.util.TestRuleStoreClassName$1.evaluate(TestRuleStoreClassName.java:41)
	at com.carrotsearch.randomizedtesting.rules.NoShadowingOrOverridesOnMethodsRule$1.evaluate(NoShadowingOrOverridesOnMethodsRule.java:40)
	at com.carrotsearch.randomizedtesting.rules.NoShadowingOrOverridesOnMethodsRule$1.evaluate(NoShadowingOrOverridesOnMethodsRule.java:40)
	at com.carrotsearch.randomizedtesting.rules.StatementAdapter.evaluate(StatementAdapter.java:36)
	at com.carrotsearch.randomizedtesting.rules.StatementAdapter.evaluate(StatementAdapter.java:36)
	at com.carrotsearch.randomizedtesting.rules.StatementAdapter.evaluate(StatementAdapter.java:36)
	at org.apache.lucene.util.TestRuleAssertionsRequired$1.evaluate(TestRuleAssertionsRequired.java:53)
	at org.apache.lucene.util.TestRuleMarkFailure$1.evaluate(TestRuleMarkFailure.java:47)
	at org.apache.lucene.util.TestRuleIgnoreAfterMaxFailures$1.evaluate(TestRuleIgnoreAfterMaxFailures.java:64)
	at org.apache.lucene.util.TestRuleIgnoreTestSuites$1.evaluate(TestRuleIgnoreTestSuites.java:54)
	at com.carrotsearch.randomizedtesting.rules.StatementAdapter.evaluate(StatementAdapter.java:36)
	at com.carrotsearch.randomizedtesting.ThreadLeakControl$StatementRunner.run(ThreadLeakControl.java:367)
	at java.lang.Thread.run(Thread.java:745)




Build Log:
[...truncated 11304 lines...]
   [junit4] Suite: org.apache.solr.cloud.CollectionsAPIDistributedZkTest
   [junit4]   2> Creating dataDir: /home/jenkins/workspace/Lucene-Solr-5.5-Linux/solr/build/solr-core/test/J1/temp/solr.cloud.CollectionsAPIDistributedZkTest_1AA74E5DBA90B315-001/init-core-data-001
   [junit4]   2> 704747 INFO  (SUITE-CollectionsAPIDistributedZkTest-seed#[1AA74E5DBA90B315]-worker) [    ] o.a.s.SolrTestCaseJ4 Randomized ssl (false) and clientAuth (true)
   [junit4]   2> 704747 INFO  (SUITE-CollectionsAPIDistributedZkTest-seed#[1AA74E5DBA90B315]-worker) [    ] o.a.s.BaseDistributedSearchTestCase Setting hostContext system property: /ybwi/
   [junit4]   2> 704749 INFO  (TEST-CollectionsAPIDistributedZkTest.test-seed#[1AA74E5DBA90B315]) [    ] o.a.s.c.ZkTestServer STARTING ZK TEST SERVER
   [junit4]   2> 704750 INFO  (Thread-2103) [    ] o.a.s.c.ZkTestServer client port:0.0.0.0/0.0.0.0:0
   [junit4]   2> 704750 INFO  (Thread-2103) [    ] o.a.s.c.ZkTestServer Starting server
   [junit4]   2> 704850 INFO  (TEST-CollectionsAPIDistributedZkTest.test-seed#[1AA74E5DBA90B315]) [    ] o.a.s.c.ZkTestServer start zk server on port:58047
   [junit4]   2> 704850 INFO  (TEST-CollectionsAPIDistributedZkTest.test-seed#[1AA74E5DBA90B315]) [    ] o.a.s.c.c.SolrZkClient Using default ZkCredentialsProvider
   [junit4]   2> 704850 INFO  (TEST-CollectionsAPIDistributedZkTest.test-seed#[1AA74E5DBA90B315]) [    ] o.a.s.c.c.ConnectionManager Waiting for client to connect to ZooKeeper
   [junit4]   2> 704852 INFO  (zkCallback-780-thread-1) [    ] o.a.s.c.c.ConnectionManager Watcher org.apache.solr.common.cloud.ConnectionManager@1a82407 name:ZooKeeperConnection Watcher:127.0.0.1:58047 got event WatchedEvent state:SyncConnected type:None path:null path:null type:None
   [junit4]   2> 704852 INFO  (TEST-CollectionsAPIDistributedZkTest.test-seed#[1AA74E5DBA90B315]) [    ] o.a.s.c.c.ConnectionManager Client is connected to ZooKeeper
   [junit4]   2> 704853 INFO  (TEST-CollectionsAPIDistributedZkTest.test-seed#[1AA74E5DBA90B315]) [    ] o.a.s.c.c.SolrZkClient Using default ZkACLProvider
   [junit4]   2> 704853 INFO  (TEST-CollectionsAPIDistributedZkTest.test-seed#[1AA74E5DBA90B315]) [    ] o.a.s.c.c.SolrZkClient makePath: /solr
   [junit4]   2> 704854 INFO  (TEST-CollectionsAPIDistributedZkTest.test-seed#[1AA74E5DBA90B315]) [    ] o.a.s.c.c.SolrZkClient Using default ZkCredentialsProvider
   [junit4]   2> 704855 INFO  (TEST-CollectionsAPIDistributedZkTest.test-seed#[1AA74E5DBA90B315]) [    ] o.a.s.c.c.ConnectionManager Waiting for client to connect to ZooKeeper
   [junit4]   2> 704855 INFO  (zkCallback-781-thread-1) [    ] o.a.s.c.c.ConnectionManager Watcher org.apache.solr.common.cloud.ConnectionManager@9b0f48 name:ZooKeeperConnection Watcher:127.0.0.1:58047/solr got event WatchedEvent state:SyncConnected type:None path:null path:null type:None
   [junit4]   2> 704855 INFO  (TEST-CollectionsAPIDistributedZkTest.test-seed#[1AA74E5DBA90B315]) [    ] o.a.s.c.c.ConnectionManager Client is connected to ZooKeeper
   [junit4]   2> 704856 INFO  (TEST-CollectionsAPIDistributedZkTest.test-seed#[1AA74E5DBA90B315]) [    ] o.a.s.c.c.SolrZkClient Using default ZkACLProvider
   [junit4]   2> 704856 INFO  (TEST-CollectionsAPIDistributedZkTest.test-seed#[1AA74E5DBA90B315]) [    ] o.a.s.c.c.SolrZkClient makePath: /collections/collection1
   [junit4]   2> 704857 INFO  (TEST-CollectionsAPIDistributedZkTest.test-seed#[1AA74E5DBA90B315]) [    ] o.a.s.c.c.SolrZkClient makePath: /collections/collection1/shards
   [junit4]   2> 704857 INFO  (TEST-CollectionsAPIDistributedZkTest.test-seed#[1AA74E5DBA90B315]) [    ] o.a.s.c.c.SolrZkClient makePath: /collections/control_collection
   [junit4]   2> 704858 INFO  (TEST-CollectionsAPIDistributedZkTest.test-seed#[1AA74E5DBA90B315]) [    ] o.a.s.c.c.SolrZkClient makePath: /collections/control_collection/shards
   [junit4]   2> 704858 INFO  (TEST-CollectionsAPIDistributedZkTest.test-seed#[1AA74E5DBA90B315]) [    ] o.a.s.c.AbstractZkTestCase put /home/jenkins/workspace/Lucene-Solr-5.5-Linux/solr/core/src/test-files/solr/collection1/conf/solrconfig-tlog.xml to /configs/conf1/solrconfig.xml
   [junit4]   2> 704858 INFO  (TEST-CollectionsAPIDistributedZkTest.test-seed#[1AA74E5DBA90B315]) [    ] o.a.s.c.c.SolrZkClient makePath: /configs/conf1/solrconfig.xml
   [junit4]   2> 704859 INFO  (TEST-CollectionsAPIDistributedZkTest.test-seed#[1AA74E5DBA90B315]) [    ] o.a.s.c.AbstractZkTestCase put /home/jenkins/workspace/Lucene-Solr-5.5-Linux/solr/core/src/test-files/solr/collection1/conf/schema.xml to /configs/conf1/schema.xml
   [junit4]   2> 704859 INFO  (TEST-CollectionsAPIDistributedZkTest.test-seed#[1AA74E5DBA90B315]) [    ] o.a.s.c.c.SolrZkClient makePath: /configs/conf1/schema.xml
   [junit4]   2> 704860 INFO  (TEST-CollectionsAPIDistributedZkTest.test-seed#[1AA74E5DBA90B315]) [    ] o.a.s.c.AbstractZkTestCase put /home/jenkins/workspace/Lucene-Solr-5.5-Linux/solr/core/src/test-files/solr/collection1/conf/solrconfig.snippet.randomindexconfig.xml to /configs/conf1/solrconfig.snippet.randomindexconfig.xml
   [junit4]   2> 704860 INFO  (TEST-CollectionsAPIDistributedZkTest.test-seed#[1AA74E5DBA90B315]) [    ] o.a.s.c.c.SolrZkClient makePath: /configs/conf1/solrconfig.snippet.randomindexconfig.xml
   [junit4]   2> 704861 INFO  (TEST-CollectionsAPIDistributedZkTest.test-seed#[1AA74E5DBA90B315]) [    ] o.a.s.c.AbstractZkTestCase put /home/jenkins/workspace/Lucene-Solr-5.5-Linux/solr/core/src/test-files/solr/collection1/conf/stopwords.txt to /configs/conf1/stopwords.txt
   [junit4]   2> 704861 INFO  (TEST-CollectionsAPIDistributedZkTest.test-seed#[1AA74E5DBA90B315]) [    ] o.a.s.c.c.SolrZkClient makePath: /configs/conf1/stopwords.txt
   [junit4]   2> 704861 INFO  (TEST-CollectionsAPIDistributedZkTest.test-seed#[1AA74E5DBA90B315]) [    ] o.a.s.c.AbstractZkTestCase put /home/jenkins/workspace/Lucene-Solr-5.5-Linux/solr/core/src/test-files/solr/collection1/conf/protwords.txt to /configs/conf1/protwords.txt
   [junit4]   2> 704861 INFO  (TEST-CollectionsAPIDistributedZkTest.test-seed#[1AA74E5DBA90B315]) [    ] o.a.s.c.c.SolrZkClient makePath: /configs/conf1/protwords.txt
   [junit4]   2> 704862 INFO  (TEST-CollectionsAPIDistributedZkTest.test-seed#[1AA74E5DBA90B315]) [    ] o.a.s.c.AbstractZkTestCase put /home/jenkins/workspace/Lucene-Solr-5.5-Linux/solr/core/src/test-files/solr/collection1/conf/currency.xml to /configs/conf1/currency.xml
   [junit4]   2> 704862 INFO  (TEST-CollectionsAPIDistributedZkTest.test-seed#[1AA74E5DBA90B315]) [    ] o.a.s.c.c.SolrZkClient makePath: /configs/conf1/currency.xml
   [junit4]   2> 704862 INFO  (TEST-CollectionsAPIDistributedZkTest.test-seed#[1AA74E5DBA90B315]) [    ] o.a.s.c.AbstractZkTestCase put /home/jenkins/workspace/Lucene-Solr-5.5-Linux/solr/core/src/test-files/solr/collection1/conf/enumsConfig.xml to /configs/conf1/enumsConfig.xml
   [junit4]   2> 704863 INFO  (TEST-CollectionsAPIDistributedZkTest.test-seed#[1AA74E5DBA90B315]) [    ] o.a.s.c.c.SolrZkClient makePath: /configs/conf1/enumsConfig.xml
   [junit4]   2> 704863 INFO  (TEST-CollectionsAPIDistributedZkTest.test-seed#[1AA74E5DBA90B315]) [    ] o.a.s.c.AbstractZkTestCase put /home/jenkins/workspace/Lucene-Solr-5.5-Linux/solr/core/src/test-files/solr/collection1/conf/open-exchange-rates.json to /configs/conf1/open-exchange-rates.json
   [junit4]   2> 704863 INFO  (TEST-CollectionsAPIDistributedZkTest.test-seed#[1AA74E5DBA90B315]) [    ] o.a.s.c.c.SolrZkClient makePath: /configs/conf1/open-exchange-rates.json
   [junit4]   2> 704863 INFO  (TEST-CollectionsAPIDistributedZkTest.test-seed#[1AA74E5DBA90B315]) [    ] o.a.s.c.AbstractZkTestCase put /home/jenkins/workspace/Lucene-Solr-5.5-Linux/solr/core/src/test-files/solr/collection1/conf/mapping-ISOLatin1Accent.txt to /configs/conf1/mapping-ISOLatin1Accent.txt
   [junit4]   2> 704864 INFO  (TEST-CollectionsAPIDistributedZkTest.test-seed#[1AA74E5DBA90B315]) [    ] o.a.s.c.c.SolrZkClient makePath: /configs/conf1/mapping-ISOLatin1Accent.txt
   [junit4]   2> 704864 INFO  (TEST-CollectionsAPIDistributedZkTest.test-seed#[1AA74E5DBA90B315]) [    ] o.a.s.c.AbstractZkTestCase put /home/jenkins/workspace/Lucene-Solr-5.5-Linux/solr/core/src/test-files/solr/collection1/conf/old_synonyms.txt to /configs/conf1/old_synonyms.txt
   [junit4]   2> 704864 INFO  (TEST-CollectionsAPIDistributedZkTest.test-seed#[1AA74E5DBA90B315]) [    ] o.a.s.c.c.SolrZkClient makePath: /configs/conf1/old_synonyms.txt
   [junit4]   2> 704865 INFO  (TEST-CollectionsAPIDistributedZkTest.test-seed#[1AA74E5DBA90B315]) [    ] o.a.s.c.AbstractZkTestCase put /home/jenkins/workspace/Lucene-Solr-5.5-Linux/solr/core/src/test-files/solr/collection1/conf/synonyms.txt to /configs/conf1/synonyms.txt
   [junit4]   2> 704865 INFO  (TEST-CollectionsAPIDistributedZkTest.test-seed#[1AA74E5DBA90B315]) [    ] o.a.s.c.c.SolrZkClient makePath: /configs/conf1/synonyms.txt
   [junit4]   2> 704865 INFO  (TEST-CollectionsAPIDistributedZkTest.test-seed#[1AA74E5DBA90B315]) [    ] o.a.s.c.c.SolrZkClient Using default ZkCredentialsProvider
   [junit4]   2> 704866 INFO  (TEST-CollectionsAPIDistributedZkTest.test-seed#[1AA74E5DBA90B315]) [    ] o.a.s.c.c.ConnectionManager Waiting for client to connect to ZooKeeper
   [junit4]   2> 704867 INFO  (zkCallback-782-thread-1) [    ] o.a.s.c.c.ConnectionManager Watcher org.apache.solr.common.cloud.ConnectionManager@1bcc444 name:ZooKeeperConnection Watcher:127.0.0.1:58047 got event WatchedEvent state:SyncConnected type:None path:null path:null type:None
   [junit4]   2> 704867 INFO  (TEST-CollectionsAPIDistributedZkTest.test-seed#[1AA74E5DBA90B315]) [    ] o.a.s.c.c.ConnectionManager Client is connected to ZooKeeper
   [junit4]   2> 704867 INFO  (TEST-CollectionsAPIDistributedZkTest.test-seed#[1AA74E5DBA90B315]) [    ] o.a.s.c.c.SolrZkClient Using default ZkACLProvider
   [junit4]   2> 704867 INFO  (TEST-CollectionsAPIDistributedZkTest.test-seed#[1AA74E5DBA90B315]) [    ] o.a.s.c.c.SolrZkClient makePath: /solr
   [junit4]   2> 704868 INFO  (TEST-CollectionsAPIDistributedZkTest.test-seed#[1AA74E5DBA90B315]) [    ] o.a.s.c.c.SolrZkClient Using default ZkCredentialsProvider
   [junit4]   2> 704868 INFO  (TEST-CollectionsAPIDistributedZkTest.test-seed#[1AA74E5DBA90B315]) [    ] o.a.s.c.c.ConnectionManager Waiting for client to connect to ZooKeeper
   [junit4]   2> 704869 INFO  (zkCallback-783-thread-1) [    ] o.a.s.c.c.ConnectionManager Watcher org.apache.solr.common.cloud.ConnectionManager@184d227 name:ZooKeeperConnection Watcher:127.0.0.1:58047/solr got event WatchedEvent state:SyncConnected type:None path:null path:null type:None
   [junit4]   2> 704869 INFO  (TEST-CollectionsAPIDistributedZkTest.test-seed#[1AA74E5DBA90B315]) [    ] o.a.s.c.c.ConnectionManager Client is connected to ZooKeeper
   [junit4]   2> 704869 INFO  (TEST-CollectionsAPIDistributedZkTest.test-seed#[1AA74E5DBA90B315]) [    ] o.a.s.c.c.SolrZkClient Using default ZkACLProvider
   [junit4]   2> 704869 INFO  (TEST-CollectionsAPIDistributedZkTest.test-seed#[1AA74E5DBA90B315]) [    ] o.a.s.c.AbstractZkTestCase put /home/jenkins/workspace/Lucene-Solr-5.5-Linux/solr/core/src/test-files/solr/collection1/conf/solrconfig-tlog.xml to /configs/conf2/solrconfig.xml
   [junit4]   2> 704869 INFO  (TEST-CollectionsAPIDistributedZkTest.test-seed#[1AA74E5DBA90B315]) [    ] o.a.s.c.c.SolrZkClient makePath: /configs/conf2/solrconfig.xml
   [junit4]   2> 704870 INFO  (TEST-CollectionsAPIDistributedZkTest.test-seed#[1AA74E5DBA90B315]) [    ] o.a.s.c.AbstractZkTestCase put /home/jenkins/workspace/Lucene-Solr-5.5-Linux/solr/core/src/test-files/solr/collection1/conf/schema.xml to /configs/conf2/schema.xml
   [junit4]   2> 704871 INFO  (TEST-CollectionsAPIDistributedZkTest.test-seed#[1AA74E5DBA90B315]) [    ] o.a.s.c.c.SolrZkClient makePath: /configs/conf2/schema.xml
   [junit4]   2> 704871 INFO  (TEST-CollectionsAPIDistributedZkTest.test-seed#[1AA74E5DBA90B315]) [    ] o.a.s.c.AbstractZkTestCase put /home/jenkins/workspace/Lucene-Solr-5.5-Linux/solr/core/src/test-files/solr/collection1/conf/enumsConfig.xml to /configs/conf2/enumsConfig.xml
   [junit4]   2> 704871 INFO  (TEST-CollectionsAPIDistributedZkTest.test-seed#[1AA74E5DBA90B315]) [    ] o.a.s.c.c.SolrZkClient makePath: /configs/conf2/enumsConfig.xml
   [junit4]   2> 704872 INFO  (TEST-CollectionsAPIDistributedZkTest.test-seed#[1AA74E5DBA90B315]) [    ] o.a.s.c.AbstractZkTestCase put /home/jenkins/workspace/Lucene-Solr-5.5-Linux/solr/core/src/test-files/solr/collection1/conf/solrconfig.snippet.randomindexconfig.xml to /configs/conf2/solrconfig.snippet.randomindexconfig.xml
   [junit4]   2> 704872 INFO  (TEST-CollectionsAPIDistributedZkTest.test-seed#[1AA74E5DBA90B315]) [    ] o.a.s.c.c.SolrZkClient makePath: /configs/conf2/solrconfig.snippet.randomindexconfig.xml
   [junit4]   2> 704872 INFO  (TEST-CollectionsAPIDistributedZkTest.test-seed#[1AA74E5DBA90B315]) [    ] o.a.s.c.AbstractZkTestCase put /home/jenkins/workspace/Lucene-Solr-5.5-Linux/solr/core/src/test-files/solr/collection1/conf/stopwords.txt to /configs/conf2/stopwords.txt
   [junit4]   2> 704872 INFO  (TEST-CollectionsAPIDistributedZkTest.test-seed#[1AA74E5DBA90B315]) [    ] o.a.s.c.c.SolrZkClient makePath: /configs/conf2/stopwords.txt
   [junit4]   2> 704873 INFO  (TEST-CollectionsAPIDistributedZkTest.test-seed#[1AA74E5DBA90B315]) [    ] o.a.s.c.AbstractZkTestCase put /home/jenkins/workspace/Lucene-Solr-5.5-Linux/solr/core/src/test-files/solr/collection1/conf/protwords.txt to /configs/conf2/protwords.txt
   [junit4]   2> 704873 INFO  (TEST-CollectionsAPIDistributedZkTest.test-seed#[1AA74E5DBA90B315]) [    ] o.a.s.c.c.SolrZkClient makePath: /configs/conf2/protwords.txt
   [junit4]   2> 704873 INFO  (TEST-CollectionsAPIDistributedZkTest.test-seed#[1AA74E5DBA90B315]) [    ] o.a.s.c.AbstractZkTestCase put /home/jenkins/workspace/Lucene-Solr-5.5-Linux/solr/core/src/test-files/solr/collection1/conf/currency.xml to /configs/conf2/currency.xml
   [junit4]   2> 704873 INFO  (TEST-CollectionsAPIDistributedZkTest.test-seed#[1AA74E5DBA90B315]) [    ] o.a.s.c.c.SolrZkClient makePath: /configs/conf2/currency.xml
   [junit4]   2> 704874 INFO  (TEST-CollectionsAPIDistributedZkTest.test-seed#[1AA74E5DBA90B315]) [    ] o.a.s.c.AbstractZkTestCase put /home/jenkins/workspace/Lucene-Solr-5.5-Linux/solr/core/src/test-files/solr/collection1/conf/open-exchange-rates.json to /configs/conf2/open-exchange-rates.json
   [junit4]   2> 704874 INFO  (TEST-CollectionsAPIDistributedZkTest.test-seed#[1AA74E5DBA90B315]) [    ] o.a.s.c.c.SolrZkClient makePath: /configs/conf2/open-exchange-rates.json
   [junit4]   2> 704875 INFO  (TEST-CollectionsAPIDistributedZkTest.test-seed#[1AA74E5DBA90B315]) [    ] o.a.s.c.AbstractZkTestCase put /home/jenkins/workspace/Lucene-Solr-5.5-Linux/solr/core/src/test-files/solr/collection1/conf/mapping-ISOLatin1Accent.txt to /configs/conf2/mapping-ISOLatin1Accent.txt
   [junit4]   2> 704875 INFO  (TEST-CollectionsAPIDistributedZkTest.test-seed#[1AA74E5DBA90B315]) [    ] o.a.s.c.c.SolrZkClient makePath: /configs/conf2/mapping-ISOLatin1Accent.txt
   [junit4]   2> 704876 INFO  (TEST-CollectionsAPIDistributedZkTest.test-seed#[1AA74E5DBA90B315]) [    ] o.a.s.c.AbstractZkTestCase put /home/jenkins/workspace/Lucene-Solr-5.5-Linux/solr/core/src/test-files/solr/collection1/conf/old_synonyms.txt to /configs/conf2/old_synonyms.txt
   [junit4]   2> 704876 INFO  (TEST-CollectionsAPIDistributedZkTest.test-seed#[1AA74E5DBA90B315]) [    ] o.a.s.c.c.SolrZkClient makePath: /configs/conf2/old_synonyms.txt
   [junit4]   2> 704876 INFO  (TEST-CollectionsAPIDistributedZkTest.test-seed#[1AA74E5DBA90B315]) [    ] o.a.s.c.AbstractZkTestCase put /home/jenkins/workspace/Lucene-Solr-5.5-Linux/solr/core/src/test-files/solr/collection1/conf/synonyms.txt to /configs/conf2/synonyms.txt
   [junit4]   2> 704876 INFO  (TEST-CollectionsAPIDistributedZkTest.test-seed#[1AA74E5DBA90B315]) [    ] o.a.s.c.c.SolrZkClient makePath: /configs/conf2/synonyms.txt
   [junit4]   2> 704877 INFO  (TEST-CollectionsAPIDistributedZkTest.test-seed#[1AA74E5DBA90B315]) [    ] o.a.s.c.AbstractZkTestCase put /home/jenkins/workspace/Lucene-Solr-5.5-Linux/solr/core/src/test-files/solr/collection1/conf/elevate.xml to /configs/conf2/elevate.xml
   [junit4]   2> 704877 INFO  (TEST-CollectionsAPIDistributedZkTest.test-seed#[1AA74E5DBA90B315]) [    ] o.a.s.c.c.SolrZkClient makePath: /configs/conf2/elevate.xml
   [junit4]   2> 704955 INFO  (TEST-CollectionsAPIDistributedZkTest.test-seed#[1AA74E5DBA90B315]) [    ] o.a.s.SolrTestCaseJ4 Writing core.properties file to /home/jenkins/workspace/Lucene-Solr-5.5-Linux/solr/build/solr-core/test/J1/temp/solr.cloud.CollectionsAPIDistributedZkTest_1AA74E5DBA90B315-001/control-001/cores/collection1
   [junit4]   2> 704956 INFO  (TEST-CollectionsAPIDistributedZkTest.test-seed#[1AA74E5DBA90B315]) [    ] o.e.j.s.Server jetty-9.2.13.v20150730
   [junit4]   2> 704957 INFO  (TEST-CollectionsAPIDistributedZkTest.test-seed#[1AA74E5DBA90B315]) [    ] o.e.j.s.h.ContextHandler Started o.e.j.s.ServletContextHandler@216745{/ybwi,null,AVAILABLE}
   [junit4]   2> 704959 INFO  (TEST-CollectionsAPIDistributedZkTest.test-seed#[1AA74E5DBA90B315]) [    ] o.e.j.s.ServerConnector Started ServerConnector@a14d56{HTTP/1.1}{127.0.0.1:45142}
   [junit4]   2> 704959 INFO  (TEST-CollectionsAPIDistributedZkTest.test-seed#[1AA74E5DBA90B315]) [    ] o.e.j.s.Server Started @706576ms
   [junit4]   2> 704959 INFO  (TEST-CollectionsAPIDistributedZkTest.test-seed#[1AA74E5DBA90B315]) [    ] o.a.s.c.s.e.JettySolrRunner Jetty properties: {solr.data.dir=/home/jenkins/workspace/Lucene-Solr-5.5-Linux/solr/build/solr-core/test/J1/temp/solr.cloud.CollectionsAPIDistributedZkTest_1AA74E5DBA90B315-001/tempDir-001/control/data, hostContext=/ybwi, hostPort=45142, coreRootDirectory=/home/jenkins/workspace/Lucene-Solr-5.5-Linux/solr/build/solr-core/test/J1/../../../../../../../../../home/jenkins/workspace/Lucene-Solr-5.5-Linux/solr/build/solr-core/test/J1/temp/solr.cloud.CollectionsAPIDistributedZkTest_1AA74E5DBA90B315-001/control-001/cores}
   [junit4]   2> 704960 INFO  (TEST-CollectionsAPIDistributedZkTest.test-seed#[1AA74E5DBA90B315]) [    ] o.a.s.s.SolrDispatchFilter SolrDispatchFilter.init(): sun.misc.Launcher$AppClassLoader@1d16e93
   [junit4]   2> 704960 INFO  (TEST-CollectionsAPIDistributedZkTest.test-seed#[1AA74E5DBA90B315]) [    ] o.a.s.c.SolrResourceLoader new SolrResourceLoader for directory: '/home/jenkins/workspace/Lucene-Solr-5.5-Linux/solr/build/solr-core/test/J1/temp/solr.cloud.CollectionsAPIDistributedZkTest_1AA74E5DBA90B315-001/control-001'
   [junit4]   2> 704960 INFO  (TEST-CollectionsAPIDistributedZkTest.test-seed#[1AA74E5DBA90B315]) [    ] o.a.s.c.SolrResourceLoader JNDI not configured for solr (NoInitialContextEx)
   [junit4]   2> 704960 INFO  (TEST-CollectionsAPIDistributedZkTest.test-seed#[1AA74E5DBA90B315]) [    ] o.a.s.c.SolrResourceLoader solr home defaulted to 'solr/' (could not find system property or JNDI)
   [junit4]   2> 704960 INFO  (TEST-CollectionsAPIDistributedZkTest.test-seed#[1AA74E5DBA90B315]) [    ] o.a.s.c.c.SolrZkClient Using default ZkCredentialsProvider
   [junit4]   2> 704960 INFO  (TEST-CollectionsAPIDistributedZkTest.test-seed#[1AA74E5DBA90B315]) [    ] o.a.s.c.c.ConnectionManager Waiting for client to connect to ZooKeeper
   [junit4]   2> 704961 INFO  (zkCallback-784-thread-1) [    ] o.a.s.c.c.ConnectionManager Watcher org.apache.solr.common.cloud.ConnectionManager@b8f15d name:ZooKeeperConnection Watcher:127.0.0.1:58047/solr got event WatchedEvent state:SyncConnected type:None path:null path:null type:None
   [junit4]   2> 704962 INFO  (TEST-CollectionsAPIDistributedZkTest.test-seed#[1AA74E5DBA90B315]) [    ] o.a.s.c.c.ConnectionManager Client is connected to ZooKeeper
   [junit4]   2> 704962 INFO  (TEST-CollectionsAPIDistributedZkTest.test-seed#[1AA74E5DBA90B315]) [    ] o.a.s.c.c.SolrZkClient Using default ZkACLProvider
   [junit4]   2> 704963 INFO  (TEST-CollectionsAPIDistributedZkTest.test-seed#[1AA74E5DBA90B315]) [    ] o.a.s.s.SolrDispatchFilter Loading solr.xml from SolrHome (not found in ZooKeeper)
   [junit4]   2> 704963 INFO  (TEST-CollectionsAPIDistributedZkTest.test-seed#[1AA74E5DBA90B315]) [    ] o.a.s.c.SolrXmlConfig Loading container configuration from /home/jenkins/workspace/Lucene-Solr-5.5-Linux/solr/build/solr-core/test/J1/temp/solr.cloud.CollectionsAPIDistributedZkTest_1AA74E5DBA90B315-001/control-001/solr.xml
   [junit4]   2> 704967 INFO  (TEST-CollectionsAPIDistributedZkTest.test-seed#[1AA74E5DBA90B315]) [    ] o.a.s.c.CorePropertiesLocator Config-defined core root directory: /home/jenkins/workspace/Lucene-Solr-5.5-Linux/solr/build/solr-core/test/J1/../../../../../../../../../home/jenkins/workspace/Lucene-Solr-5.5-Linux/solr/build/solr-core/test/J1/temp/solr.cloud.CollectionsAPIDistributedZkTest_1AA74E5DBA90B315-001/control-001/cores
   [junit4]   2> 704967 INFO  (TEST-CollectionsAPIDistributedZkTest.test-seed#[1AA74E5DBA90B315]) [    ] o.a.s.c.CoreContainer New CoreContainer 7029939
   [junit4]   2> 704967 INFO  (TEST-CollectionsAPIDistributedZkTest.test-seed#[1AA74E5DBA90B315]) [    ] o.a.s.c.CoreContainer Loading cores into CoreContainer [instanceDir=/home/jenkins/workspace/Lucene-Solr-5.5-Linux/solr/build/solr-core/test/J1/temp/solr.cloud.CollectionsAPIDistributedZkTest_1AA74E5DBA90B315-001/control-001]
   [junit4]   2> 704967 WARN  (TEST-CollectionsAPIDistributedZkTest.test-seed#[1AA74E5DBA90B315]) [    ] o.a.s.c.CoreContainer Couldn't add files from /home/jenkins/workspace/Lucene-Solr-5.5-Linux/solr/build/solr-core/test/J1/temp/solr.cloud.CollectionsAPIDistributedZkTest_1AA74E5DBA90B315-001/control-001/lib to classpath: /home/jenkins/workspace/Lucene-Solr-5.5-Linux/solr/build/solr-core/test/J1/temp/solr.cloud.CollectionsAPIDistributedZkTest_1AA74E5DBA90B315-001/control-001/lib
   [junit4]   2> 704967 INFO  (TEST-CollectionsAPIDistributedZkTest.test-seed#[1AA74E5DBA90B315]) [    ] o.a.s.h.c.HttpShardHandlerFactory created with socketTimeout : 90000,urlScheme : ,connTimeout : 15000,maxConnectionsPerHost : 20,maxConnections : 10000,corePoolSize : 0,maximumPoolSize : 2147483647,maxThreadIdleTime : 5,sizeOfQueue : -1,fairnessPolicy : false,useRetries : false,
   [junit4]   2> 704968 INFO  (TEST-CollectionsAPIDistributedZkTest.test-seed#[1AA74E5DBA90B315]) [    ] o.a.s.u.UpdateShardHandler Creating UpdateShardHandler HTTP client with params: socketTimeout=340000&connTimeout=45000&retry=true
   [junit4]   2> 704968 INFO  (TEST-CollectionsAPIDistributedZkTest.test-seed#[1AA74E5DBA90B315]) [    ] o.a.s.l.LogWatcher SLF4J impl is org.slf4j.impl.Log4jLoggerFactory
   [junit4]   2> 704968 INFO  (TEST-CollectionsAPIDistributedZkTest.test-seed#[1AA74E5DBA90B315]) [    ] o.a.s.l.LogWatcher Registering Log Listener [Log4j (org.slf4j.impl.Log4jLoggerFactory)]
   [junit4]   2> 704968 INFO  (TEST-CollectionsAPIDistributedZkTest.test-seed#[1AA74E5DBA90B315]) [    ] o.a.s.c.ZkContainer Zookeeper client=127.0.0.1:58047/solr
   [junit4]   2> 704968 INFO  (TEST-CollectionsAPIDistributedZkTest.test-seed#[1AA74E5DBA90B315]) [    ] o.a.s.c.ZkController zkHost includes chroot
   [junit4]   2> 704968 INFO  (TEST-CollectionsAPIDistributedZkTest.test-seed#[1AA74E5DBA90B315]) [    ] o.a.s.c.c.SolrZkClient Using default ZkCredentialsProvider
   [junit4]   2> 704969 INFO  (TEST-CollectionsAPIDistributedZkTest.test-seed#[1AA74E5DBA90B315]) [    ] o.a.s.c.c.ConnectionManager Waiting for client to connect to ZooKeeper
   [junit4]   2> 704970 INFO  (zkCallback-787-thread-1) [    ] o.a.s.c.c.ConnectionManager Watcher org.apache.solr.common.cloud.ConnectionManager@fbb538 name:ZooKeeperConnection Watcher:127.0.0.1:58047 got event WatchedEvent state:SyncConnected type:None path:null path:null type:None
   [junit4]   2> 704971 INFO  (TEST-CollectionsAPIDistributedZkTest.test-seed#[1AA74E5DBA90B315]) [    ] o.a.s.c.c.ConnectionManager Client is connected to ZooKeeper
   [junit4]   2> 704971 INFO  (TEST-CollectionsAPIDistributedZkTest.test-seed#[1AA74E5DBA90B315]) [    ] o.a.s.c.c.SolrZkClient Using default ZkACLProvider
   [junit4]   2> 704972 INFO  (TEST-CollectionsAPIDistributedZkTest.test-seed#[1AA74E5DBA90B315]) [n:127.0.0.1:45142_ybwi    ] o.a.s.c.c.ConnectionManager Waiting for client to connect to ZooKeeper
   [junit4]   2> 704973 INFO  (zkCallback-788-thread-1-processing-n:127.0.0.1:45142_ybwi) [n:127.0.0.1:45142_ybwi    ] o.a.s.c.c.ConnectionManager Watcher org.apache.solr.common.cloud.ConnectionManager@87d504 name:ZooKeeperConnection Watcher:127.0.0.1:58047/solr got event WatchedEvent state:SyncConnected type:None path:null path:null type:None
   [junit4]   2> 704973 INFO  (TEST-CollectionsAPIDistributedZkTest.test-seed#[1AA74E5DBA90B315]) [n:127.0.0.1:45142_ybwi    ] o.a.s.c.c.ConnectionManager Client is connected to ZooKeeper
   [junit4]   2> 704974 INFO  (TEST-CollectionsAPIDistributedZkTest.test-seed#[1AA74E5DBA90B315]) [n:127.0.0.1:45142_ybwi    ] o.a.s.c.c.SolrZkClient makePath: /overseer/queue
   [junit4]   2> 704975 INFO  (TEST-CollectionsAPIDistributedZkTest.test-seed#[1AA74E5DBA90B315]) [n:127.0.0.1:45142_ybwi    ] o.a.s.c.c.SolrZkClient makePath: /overseer/collection-queue-work
   [junit4]   2> 704976 INFO  (TEST-CollectionsAPIDistributedZkTest.test-seed#[1AA74E5DBA90B315]) [n:127.0.0.1:45142_ybwi    ] o.a.s.c.c.SolrZkClient makePath: /overseer/collection-map-running
   [junit4]   2> 704976 INFO  (TEST-CollectionsAPIDistributedZkTest.test-seed#[1AA74E5DBA90B315]) [n:127.0.0.1:45142_ybwi    ] o.a.s.c.c.SolrZkClient makePath: /overseer/collection-map-completed
   [junit4]   2> 704977 INFO  (TEST-CollectionsAPIDistributedZkTest.test-seed#[1AA74E5DBA90B315]) [n:127.0.0.1:45142_ybwi    ] o.a.s.c.c.SolrZkClient makePath: /overseer/collection-map-failure
   [junit4]   2> 704977 INFO  (TEST-CollectionsAPIDistributedZkTest.test-seed#[1AA74E5DBA90B315]) [n:127.0.0.1:45142_ybwi    ] o.a.s.c.c.SolrZkClient makePath: /live_nodes
   [junit4]   2> 704978 INFO  (TEST-CollectionsAPIDistributedZkTest.test-seed#[1AA74E5DBA90B315]) [n:127.0.0.1:45142_ybwi    ] o.a.s.c.c.SolrZkClient makePath: /aliases.json
   [junit4]   2> 704978 INFO  (TEST-CollectionsAPIDistributedZkTest.test-seed#[1AA74E5DBA90B315]) [n:127.0.0.1:45142_ybwi    ] o.a.s.c.c.SolrZkClient makePath: /clusterstate.json
   [junit4]   2> 704979 INFO  (TEST-CollectionsAPIDistributedZkTest.test-seed#[1AA74E5DBA90B315]) [n:127.0.0.1:45142_ybwi    ] o.a.s.c.c.SolrZkClient makePath: /security.json
   [junit4]   2> 704979 INFO  (TEST-CollectionsAPIDistributedZkTest.test-seed#[1AA74E5DBA90B315]) [n:127.0.0.1:45142_ybwi    ] o.a.s.c.ZkController Register node as live in ZooKeeper:/live_nodes/127.0.0.1:45142_ybwi
   [junit4]   2> 704979 INFO  (TEST-CollectionsAPIDistributedZkTest.test-seed#[1AA74E5DBA90B315]) [n:127.0.0.1:45142_ybwi    ] o.a.s.c.c.SolrZkClient makePath: /live_nodes/127.0.0.1:45142_ybwi
   [junit4]   2> 704979 INFO  (TEST-CollectionsAPIDistributedZkTest.test-seed#[1AA74E5DBA90B315]) [n:127.0.0.1:45142_ybwi    ] o.a.s.c.c.SolrZkClient makePath: /overseer_elect
   [junit4]   2> 704980 INFO  (TEST-CollectionsAPIDistributedZkTest.test-seed#[1AA74E5DBA90B315]) [n:127.0.0.1:45142_ybwi    ] o.a.s.c.c.SolrZkClient makePath: /overseer_elect/election
   [junit4]   2> 704980 INFO  (TEST-CollectionsAPIDistributedZkTest.test-seed#[1AA74E5DBA90B315]) [n:127.0.0.1:45142_ybwi    ] o.a.s.c.Overseer Overseer (id=null) closing
   [junit4]   2> 704980 INFO  (TEST-CollectionsAPIDistributedZkTest.test-seed#[1AA74E5DBA90B315]) [n:127.0.0.1:45142_ybwi    ] o.a.s.c.LeaderElector Joined leadership election with path: /overseer_elect/election/95450543477227526-127.0.0.1:45142_ybwi-n_0000000000
   [junit4]   2> 704981 INFO  (TEST-CollectionsAPIDistributedZkTest.test-seed#[1AA74E5DBA90B315]) [n:127.0.0.1:45142_ybwi    ] o.a.s.c.OverseerElectionContext I am going to be the leader 127.0.0.1:45142_ybwi
   [junit4]   2> 704981 INFO  (TEST-CollectionsAPIDistributedZkTest.test-seed#[1AA74E5DBA90B315]) [n:127.0.0.1:45142_ybwi    ] o.a.s.c.c.SolrZkClient makePath: /overseer_elect/leader
   [junit4]   2> 704981 INFO  (TEST-CollectionsAPIDistributedZkTest.test-seed#[1AA74E5DBA90B315]) [n:127.0.0.1:45142_ybwi    ] o.a.s.c.Overseer Overseer (id=95450543477227526-127.0.0.1:45142_ybwi-n_0000000000) starting
   [junit4]   2> 704981 INFO  (TEST-CollectionsAPIDistributedZkTest.test-seed#[1AA74E5DBA90B315]) [n:127.0.0.1:45142_ybwi    ] o.a.s.c.c.SolrZkClient makePath: /overseer/queue-work
   [junit4]   2> 704984 INFO  (TEST-CollectionsAPIDistributedZkTest.test-seed#[1AA74E5DBA90B315]) [n:127.0.0.1:45142_ybwi    ] o.a.s.c.OverseerAutoReplicaFailoverThread Starting OverseerAutoReplicaFailoverThread autoReplicaFailoverWorkLoopDelay=10000 autoReplicaFailoverWaitAfterExpiration=10000 autoReplicaFailoverBadNodeExpiration=60000
   [junit4]   2> 704984 INFO  (OverseerCollectionConfigSetProcessor-95450543477227526-127.0.0.1:45142_ybwi-n_0000000000) [n:127.0.0.1:45142_ybwi    ] o.a.s.c.OverseerTaskProcessor Process current queue of overseer operations
   [junit4]   2> 704984 INFO  (TEST-CollectionsAPIDistributedZkTest.test-seed#[1AA74E5DBA90B315]) [n:127.0.0.1:45142_ybwi    ] o.a.s.c.c.ZkStateReader Updating cluster state from ZooKeeper... 
   [junit4]   2> 704984 INFO  (OverseerStateUpdate-95450543477227526-127.0.0.1:45142_ybwi-n_0000000000) [n:127.0.0.1:45142_ybwi    ] o.a.s.c.Overseer Starting to work on the main queue
   [junit4]   2> 704999 INFO  (TEST-CollectionsAPIDistributedZkTest.test-seed#[1AA74E5DBA90B315]) [n:127.0.0.1:45142_ybwi    ] o.a.s.c.CoreContainer Security conf doesn't exist. Skipping setup for authorization module.
   [junit4]   2> 704999 INFO  (TEST-CollectionsAPIDistributedZkTest.test-seed#[1AA74E5DBA90B315]) [n:127.0.0.1:45142_ybwi    ] o.a.s.c.CoreContainer No authentication plugin used.
   [junit4]   2> 704999 INFO  (TEST-CollectionsAPIDistributedZkTest.test-seed#[1AA74E5DBA90B315]) [n:127.0.0.1:45142_ybwi    ] o.a.s.c.CorePropertiesLocator Looking for core definitions underneath /home/jenkins/workspace/Lucene-Solr-5.5-Linux/solr/build/solr-core/test/J1/../../../../../../../../../home/jenkins/workspace/Lucene-Solr-5.5-Linux/solr/build/solr-core/test/J1/temp/solr.cloud.CollectionsAPIDistributedZkTest_1AA74E5DBA90B315-001/control-001/cores
   [junit4]   2> 705000 INFO  (TEST-CollectionsAPIDistributedZkTest.test-seed#[1AA74E5DBA90B315]) [n:127.0.0.1:45142_ybwi    ] o.a.s.c.CoreDescriptor Created CoreDescriptor: {name=collection1, config=solrconfig.xml, transient=false, schema=schema.xml, loadOnStartup=true, configSetProperties=configsetprops.json, collection=control_collection, coreNodeName=, dataDir=data/, shard=}
   [junit4]   2> 705000 INFO  (TEST-CollectionsAPIDistributedZkTest.test-seed#[1AA74E5DBA90B315]) [n:127.0.0.1:45142_ybwi    ] o.a.s.c.CorePropertiesLocator Found core collection1 in /home/jenkins/workspace/Lucene-Solr-5.5-Linux/solr/build/solr-core/test/J1/../../../../../../../../../home/jenkins/workspace/Lucene-Solr-5.5-Linux/solr/build/solr-core/test/J1/temp/solr.cloud.CollectionsAPIDistributedZkTest_1AA74E5DBA90B315-001/control-001/cores/collection1
   [junit4]   2> 705000 INFO  (TEST-CollectionsAPIDistributedZkTest.test-seed#[1AA74E5DBA90B315]) [n:127.0.0.1:45142_ybwi    ] o.a.s.c.CorePropertiesLocator Found 1 core definitions
   [junit4]   2> 705000 INFO  (TEST-CollectionsAPIDistributedZkTest.test-seed#[1AA74E5DBA90B315]) [n:127.0.0.1:45142_ybwi    ] o.a.s.s.SolrDispatchFilter user.dir=/home/jenkins/workspace/Lucene-Solr-5.5-Linux/solr/build/solr-core/test/J1
   [junit4]   2> 705000 INFO  (TEST-CollectionsAPIDistributedZkTest.test-seed#[1AA74E5DBA90B315]) [n:127.0.0.1:45142_ybwi    ] o.a.s.s.SolrDispatchFilter SolrDispatchFilter.init() done
   [junit4]   2> 705000 INFO  (coreLoadExecutor-2391-thread-1-processing-n:127.0.0.1:45142_ybwi) [n:127.0.0.1:45142_ybwi c:control_collection   x:collection1] o.a.s.c.ZkController publishing state=down
   [junit4]   2> 705001 INFO  (coreLoadExecutor-2391-thread-1-processing-n:127.0.0.1:45142_ybwi) [n:127.0.0.1:45142_ybwi c:control_collection   x:collection1] o.a.s.c.ZkController numShards not found on descriptor - reading it from system property
   [junit4]   2> 705001 INFO  (OverseerStateUpdate-95450543477227526-127.0.0.1:45142_ybwi-n_0000000000) [n:127.0.0.1:45142_ybwi    ] o.a.s.c.Overseer processMessage: queueSize: 1, message = {
   [junit4]   2>   "core":"collection1",
   [junit4]   2>   "roles":null,
   [junit4]   2>   "base_url":"http://127.0.0.1:45142/ybwi",
   [junit4]   2>   "node_name":"127.0.0.1:45142_ybwi",
   [junit4]   2>   "numShards":"1",
   [junit4]   2>   "state":"down",
   [junit4]   2>   "shard":null,
   [junit4]   2>   "collection":"control_collection",
   [junit4]   2>   "operation":"state"} current state version: 0
   [junit4]   2> 705001 INFO  (coreLoadExecutor-2391-thread-1-processing-n:127.0.0.1:45142_ybwi) [n:127.0.0.1:45142_ybwi c:control_collection   x:collection1] o.a.s.c.ZkController look for our core node name
   [junit4]   2> 705001 INFO  (OverseerStateUpdate-95450543477227526-127.0.0.1:45142_ybwi-n_0000000000) [n:127.0.0.1:45142_ybwi    ] o.a.s.c.o.ReplicaMutator Update state numShards=1 message={
   [junit4]   2>   "core":"collection1",
   [junit4]   2>   "roles":null,
   [junit4]   2>   "base_url":"http://127.0.0.1:45142/ybwi",
   [junit4]   2>   "node_name":"127.0.0.1:45142_ybwi",
   [junit4]   2>   "numShards":"1",
   [junit4]   2>   "state":"down",
   [junit4]   2>   "shard":null,
   [junit4]   2>   "collection":"control_collection",
   [junit4]   2>   "operation":"state"}
   [junit4]   2> 705002 INFO  (OverseerStateUpdate-95450543477227526-127.0.0.1:45142_ybwi-n_0000000000) [n:127.0.0.1:45142_ybwi    ] o.a.s.c.o.ClusterStateMutator building a new cName: control_collection
   [junit4]   2> 705002 INFO  (OverseerStateUpdate-95450543477227526-127.0.0.1:45142_ybwi-n_0000000000) [n:127.0.0.1:45142_ybwi    ] o.a.s.c.o.ReplicaMutator Assigning new node to shard shard=shard1
   [junit4]   2> 705002 INFO  (zkCallback-788-thread-1-processing-n:127.0.0.1:45142_ybwi) [n:127.0.0.1:45142_ybwi    ] o.a.s.c.c.ZkStateReader A cluster state change: [WatchedEvent state:SyncConnected type:NodeDataChanged path:/clusterstate.json], has occurred - updating... (live nodes size: [1])
   [junit4]   2> 706001 INFO  (coreLoadExecutor-2391-thread-1-processing-n:127.0.0.1:45142_ybwi) [n:127.0.0.1:45142_ybwi c:control_collection   x:collection1] o.a.s.c.ZkController waiting to find shard id in clusterstate for collection1
   [junit4]   2> 706002 INFO  (coreLoadExecutor-2391-thread-1-processing-n:127.0.0.1:45142_ybwi) [n:127.0.0.1:45142_ybwi c:control_collection   x:collection1] o.a.s.c.ZkController Check for collection zkNode:control_collection
   [junit4]   2> 706002 INFO  (coreLoadExecutor-2391-thread-1-processing-n:127.0.0.1:45142_ybwi) [n:127.0.0.1:45142_ybwi c:control_collection   x:collection1] o.a.s.c.ZkController Collection zkNode exists
   [junit4]   2> 706002 INFO  (coreLoadExecutor-2391-thread-1-processing-n:127.0.0.1:45142_ybwi) [n:127.0.0.1:45142_ybwi c:control_collection   x:collection1] o.a.s.c.c.ZkStateReader Load collection config from: [/collections/control_collection]
   [junit4]   2> 706002 INFO  (coreLoadExecutor-2391-thread-1-processing-n:127.0.0.1:45142_ybwi) [n:127.0.0.1:45142_ybwi c:control_collection   x:collection1] o.a.s.c.c.ZkStateReader path=[/collections/control_collection] [configName]=[conf1] specified config exists in ZooKeeper
   [junit4]   2> 706002 INFO  (coreLoadExecutor-2391-thread-1-processing-n:127.0.0.1:45142_ybwi) [n:127.0.0.1:45142_ybwi c:control_collection   x:collection1] o.a.s.c.SolrResourceLoader new SolrResourceLoader for directory: '/home/jenkins/workspace/Lucene-Solr-5.5-Linux/solr/build/solr-core/test/J1/temp/solr.cloud.CollectionsAPIDistributedZkTest_1AA74E5DBA90B315-001/control-001/cores/collection1'
   [junit4]   2> 706002 INFO  (coreLoadExecutor-2391-thread-1-processing-n:127.0.0.1:45142_ybwi) [n:127.0.0.1:45142_ybwi c:control_collection   x:collection1] o.a.s.c.SolrResourceLoader JNDI not configured for solr (NoInitialContextEx)
   [junit4]   2> 706002 INFO  (coreLoadExecutor-2391-thread-1-processing-n:127.0.0.1:45142_ybwi) [n:127.0.0.1:45142_ybwi c:control_collection   x:collection1] o.a.s.c.SolrResourceLoader solr home defaulted to 'solr/' (could not find system property or JNDI)
   [junit4]   2> 706003 INFO  (coreLoadExecutor-2391-thread-1-processing-n:127.0.0.1:45142_ybwi) [n:127.0.0.1:45142_ybwi c:control_collection   x:collection1] o.a.s.c.Config loaded config solrconfig.xml with version 0 
   [junit4]   2> 706010 INFO  (coreLoadExecutor-2391-thread-1-processing-n:127.0.0.1:45142_ybwi) [n:127.0.0.1:45142_ybwi c:control_collection   x:collection1] o.a.s.c.SolrConfig current version of requestparams : -1
   [junit4]   2> 706012 INFO  (coreLoadExecutor-2391-thread-1-processing-n:127.0.0.1:45142_ybwi) [n:127.0.0.1:45142_ybwi c:control_collection   x:collection1] o.a.s.c.SolrConfig Using Lucene MatchVersion: 5.5.0
   [junit4]   2> 706018 INFO  (coreLoadExecutor-2391-thread-1-processing-n:127.0.0.1:45142_ybwi) [n:127.0.0.1:45142_ybwi c:control_collection   x:collection1] o.a.s.c.SolrConfig Loaded SolrConfig: solrconfig.xml
   [junit4]   2> 706022 INFO  (coreLoadExecutor-2391-thread-1-processing-n:127.0.0.1:45142_ybwi) [n:127.0.0.1:45142_ybwi c:control_collection   x:collection1] o.a.s.s.IndexSchema [collection1] Schema name=test
   [junit4]   2> 706085 INFO  (coreLoadExecutor-2391-thread-1-processing-n:127.0.0.1:45142_ybwi) [n:127.0.0.1:45142_ybwi c:control_collection   x:collection1] o.a.s.s.OpenExchangeRatesOrgProvider Initialized with rates=open-exchange-rates.json, refreshInterval=1440.
   [junit4]   2> 706090 INFO  (coreLoadExecutor-2391-thread-1-processing-n:127.0.0.1:45142_ybwi) [n:127.0.0.1:45142_ybwi c:control_collection   x:collection1] o.a.s.s.IndexSchema default search field in schema is text
   [junit4]   2> 706090 INFO  (coreLoadExecutor-2391-thread-1-processing-n:127.0.0.1:45142_ybwi) [n:127.0.0.1:45142_ybwi c:control_collection   x:collection1] o.a.s.s.IndexSchema unique key field: id
   [junit4]   2> 706095 INFO  (coreLoadExecutor-2391-thread-1-processing-n:127.0.0.1:45142_ybwi) [n:127.0.0.1:45142_ybwi c:control_collection   x:collection1] o.a.s.s.FileExchangeRateProvider Reloading exchange rates from file currency.xml
   [junit4]   2> 706096 INFO  (coreLoadExecutor-2391-thread-1-processing-n:127.0.0.1:45142_ybwi) [n:127.0.0.1:45142_ybwi c:control_collection   x:collection1] o.a.s.s.FileExchangeRateProvider Reloading exchange rates from file currency.xml
   [junit4]   2> 706097 INFO  (coreLoadExecutor-2391-thread-1-processing-n:127.0.0.1:45142_ybwi) [n:127.0.0.1:45142_ybwi c:control_collection   x:collection1] o.a.s.s.OpenExchangeRatesOrgProvider Reloading exchange rates from open-exchange-rates.json
   [junit4]   2> 706097 INFO  (coreLoadExecutor-2391-thread-1-processing-n:127.0.0.1:45142_ybwi) [n:127.0.0.1:45142_ybwi c:control_collection   x:collection1] o.a.s.s.OpenExchangeRatesOrgProvider Reloading exchange rates from open-exchange-rates.json
   [junit4]   2> 706099 INFO  (coreLoadExecutor-2391-thread-1-processing-n:127.0.0.1:45142_ybwi) [n:127.0.0.1:45142_ybwi c:control_collection   x:collection1] o.a.s.c.ConfigSetProperties Did not find ConfigSet properties, assuming default properties: Can't find resource 'configsetprops.json' in classpath or '/configs/conf1', cwd=/home/jenkins/workspace/Lucene-Solr-5.5-Linux/solr/build/solr-core/test/J1
   [junit4]   2> 706099 INFO  (coreLoadExecutor-2391-thread-1-processing-n:127.0.0.1:45142_ybwi) [n:127.0.0.1:45142_ybwi c:control_collection   x:collection1] o.a.s.c.CoreContainer Creating SolrCore 'collection1' using configuration from collection control_collection
   [junit4]   2> 706099 INFO  (coreLoadExecutor-2391-thread-1-processing-n:127.0.0.1:45142_ybwi) [n:127.0.0.1:45142_ybwi c:control_collection s:shard1 r:core_node1 x:collection1] o.a.s.c.SolrCore org.apache.solr.core.MockDirectoryFactory
   [junit4]   2> 706099 INFO  (coreLoadExecutor-2391-thread-1-processing-n:127.0.0.1:45142_ybwi) [n:127.0.0.1:45142_ybwi c:control_collection s:shard1 r:core_node1 x:collection1] o.a.s.c.SolrCore [[collection1] ] Opening new SolrCore at [/home/jenkins/workspace/Lucene-Solr-5.5-Linux/solr/build/solr-core/test/J1/temp/solr.cloud.CollectionsAPIDistributedZkTest_1AA74E5DBA90B315-001/control-001/cores/collection1], dataDir=[/home/jenkins/workspace/Lucene-Solr-5.5-Linux/solr/build/solr-core/test/J1/../../../../../../../../../home/jenkins/workspace/Lucene-Solr-5.5-Linux/solr/build/solr-core/test/J1/temp/solr.cloud.CollectionsAPIDistributedZkTest_1AA74E5DBA90B315-001/control-001/cores/collection1/data/]
   [junit4]   2> 706099 INFO  (coreLoadExecutor-2391-thread-1-processing-n:127.0.0.1:45142_ybwi) [n:127.0.0.1:45142_ybwi c:control_collection s:shard1 r:core_node1 x:collection1] o.a.s.c.JmxMonitoredMap JMX monitoring is enabled. Adding Solr mbeans to JMX Server: com.sun.jmx.mbeanserver.JmxMBeanServer@79a3a5
   [junit4]   2> 706100 INFO  (coreLoadExecutor-2391-thread-1-processing-n:127.0.0.1:45142_ybwi) [n:127.0.0.1:45142_ybwi c:control_collection s:shard1 r:core_node1 x:collection1] o.a.s.c.CachingDirectoryFactory return new directory for /home/jenkins/workspace/Lucene-Solr-5.5-Linux/solr/build/solr-core/test/J1/../../../../../../../../../home/jenkins/workspace/Lucene-Solr-5.5-Linux/solr/build/solr-core/test/J1/temp/solr.cloud.CollectionsAPIDistributedZkTest_1AA74E5DBA90B315-001/control-001/cores/collection1/data
   [junit4]   2> 706100 INFO  (coreLoadExecutor-2391-thread-1-processing-n:127.0.0.1:45142_ybwi) [n:127.0.0.1:45142_ybwi c:control_collection s:shard1 r:core_node1 x:collection1] o.a.s.c.SolrCore New index directory detected: old=null new=/home/jenkins/workspace/Lucene-Solr-5.5-Linux/solr/build/solr-core/test/J1/../../../../../../../../../home/jenkins/workspace/Lucene-Solr-5.5-Linux/solr/build/solr-core/test/J1/temp/solr.cloud.CollectionsAPIDistributedZkTest_1AA74E5DBA90B315-001/control-001/cores/collection1/data/index/
   [junit4]   2> 706100 WARN  (coreLoadExecutor-2391-thread-1-processing-n:127.0.0.1:45142_ybwi) [n:127.0.0.1:45142_ybwi c:control_collection s:shard1 r:core_node1 x:collection1] o.a.s.c.SolrCore [collection1] Solr index directory '/home/jenkins/workspace/Lucene-Solr-5.5-Linux/solr/build/solr-core/test/J1/../../../../../../../../../home/jenkins/workspace/Lucene-Solr-5.5-Linux/solr/build/solr-core/test/J1/temp/solr.cloud.CollectionsAPIDistributedZkTest_1AA74E5DBA90B315-001/control-001/cores/collection1/data/index' doesn't exist. Creating new index...
   [junit4]   2> 706100 INFO  (coreLoadExecutor-2391-thread-1-processing-n:127.0.0.1:45142_ybwi) [n:127.0.0.1:45142_ybwi c:control_collection s:shard1 r:core_node1 x:collection1] o.a.s.c.CachingDirectoryFactory return new directory for /home/jenkins/workspace/Lucene-Solr-5.5-Linux/solr/build/solr-core/test/J1/../../../../../../../../../home/jenkins/workspace/Lucene-Solr-5.5-Linux/solr/build/solr-core/test/J1/temp/solr.cloud.CollectionsAPIDistributedZkTest_1AA74E5DBA90B315-001/control-001/cores/collection1/data/index
   [junit4]   2> 706100 INFO  (coreLoadExecutor-2391-thread-1-processing-n:127.0.0.1:45142_ybwi) [n:127.0.0.1:45142_ybwi c:control_collection s:shard1 r:core_node1 x:collection1] o.a.s.u.RandomMergePolicy RandomMergePolicy wrapping class org.apache.lucene.index.TieredMergePolicy: [TieredMergePolicy: maxMergeAtOnce=47, maxMergeAtOnceExplicit=11, maxMergedSegmentMB=46.94140625, floorSegmentMB=0.5791015625, forceMergeDeletesPctAllowed=19.452023167722498, segmentsPerTier=32.0, maxCFSSegmentSizeMB=8.796093022207999E12, noCFSRatio=0.22377405377885778
   [junit4]   2> 706101 INFO  (coreLoadExecutor-2391-thread-1-processing-n:127.0.0.1:45142_ybwi) [n:127.0.0.1:45142_ybwi c:control_collection s:shard1 r:core_node1 x:collection1] o.a.s.c.SolrDeletionPolicy SolrDeletionPolicy.onCommit: commits: num=1
   [junit4]   2> 	commit{dir=MockDirectoryWrapper(RAMDirectory@7ae1d0 lockFactory=org.apache.lucene.store.SingleInstanceLockFactory@11a9cd1),segFN=segments_1,generation=1}
   [junit4]   2> 706101 INFO  (coreLoadExecutor-2391-thread-1-processing-n:127.0.0.1:45142_ybwi) [n:127.0.0.1:45142_ybwi c:control_collection s:shard1 r:core_node1 x:collection1] o.a.s.c.SolrDeletionPolicy newest commit generation = 1
   [junit4]   2> 706101 INFO  (OldIndexDirectoryCleanupThreadForCore-collection1) [n:127.0.0.1:45142_ybwi c:control_collection s:shard1 r:core_node1 x:collection1] o.a.s.c.SolrCore Looking for old index directories to cleanup for core collection1 in /home/jenkins/workspace/Lucene-Solr-5.5-Linux/solr/build/solr-core/test/J1/../../../../../../../../../home/jenkins/workspace/Lucene-Solr-5.5-Linux/solr/build/solr-core/test/J1/temp/solr.cloud.CollectionsAPIDistributedZkTest_1AA74E5DBA90B315-001/control-001/cores/collection1/data/
   [junit4]   2> 706101 WARN  (OldIndexDirectoryCleanupThreadForCore-collection1) [n:127.0.0.1:45142_ybwi c:control_collection s:shard1 r:core_node1 x:collection1] o.a.s.c.DirectoryFactory /home/jenkins/workspace/Lucene-Solr-5.5-Linux/solr/build/solr-core/test/J1/../../../../../../../../../home/jenkins/workspace/Lucene-Solr-5.5-Linux/solr/build/solr-core/test/J1/temp/solr.cloud.CollectionsAPIDistributedZkTest_1AA74E5DBA90B315-001/control-001/cores/collection1/data/ does not point to a valid data directory; skipping clean-up of old index directories.
   [junit4]   2> 706103 INFO  (coreLoadExecutor-2391-thread-1-processing-n:127.0.0.1:45142_ybwi) [n:127.0.0.1:45142_ybwi c:control_collection s:shard1 r:core_node1 x:collection1] o.a.s.u.p.UpdateRequestProcessorChain creating updateRequestProcessorChain "nodistrib"
   [junit4]   2> 706103 INFO  (coreLoadExecutor-2391-thread-1-processing-n:127.0.0.1:45142_ybwi) [n:127.0.0.1:45142_ybwi c:control_collection s:shard1 r:core_node1 x:collection1] o.a.s.u.p.UpdateRequestProcessorChain creating updateRequestProcessorChain "dedupe"
   [junit4]   2> 706103 INFO  (coreLoadExecutor-2391-thread-1-processing-n:127.0.0.1:45142_ybwi) [n:127.0.0.1:45142_ybwi c:control_collection s:shard1 r:core_node1 x:collection1] o.a.s.u.p.UpdateRequestProcessorChain inserting DistributedUpdateProcessorFactory into updateRequestProcessorChain "dedupe"
   [junit4]   2> 706103 INFO  (coreLoadExecutor-2391-thread-1-processing-n:127.0.0.1:45142_ybwi) [n:127.0.0.1:45142_ybwi c:control_collection s:shard1 r:core_node1 x:collection1] o.a.s.u.p.UpdateRequestProcessorChain creating updateRequestProcessorChain "stored_sig"
   [junit4]   2> 706103 INFO  (coreLoadExecutor-2391-thread-1-processing-n:127.0.0.1:45142_ybwi) [n:127.0.0.1:45142_ybwi c:control_collection s:shard1 r:core_node1 x:collection1] o.a.s.u.p.UpdateRequestProcessorChain inserting DistributedUpdateProcessorFactory into updateRequestProcessorChain "stored_sig"
   [junit4]   2> 706103 INFO  (coreLoadExecutor-2391-thread-1-processing-n:127.0.0.1:45142_ybwi) [n:127.0.0.1:45142_ybwi c:control_collection s:shard1 r:core_node1 x:collection1] o.a.s.u.p.UpdateRequestProcessorChain creating updateRequestProcessorChain "distrib-dup-test-chain-explicit"
   [junit4]   2> 706104 INFO  (coreLoadExecutor-2391-thread-1-processing-n:127.0.0.1:45142_ybwi) [n:127.0.0.1:45142_ybwi c:control_collection s:shard1 r:core_node1 x:collection1] o.a.s.u.p.UpdateRequestProcessorChain creating updateRequestProcessorChain "distrib-dup-test-chain-implicit"
   [junit4]   2> 706104 INFO  (coreLoadExecutor-2391-thread-1-processing-n:127.0.0.1:45142_ybwi) [n:127.0.0.1:45142_ybwi c:control_collection s:shard1 r:core_node1 x:collection1] o.a.s.u.p.UpdateRequestProcessorChain inserting DistributedUpdateProcessorFactory into updateRequestProcessorChain "distrib-dup-test-chain-implicit"
   [junit4]   2> 706104 INFO  (coreLoadExecutor-2391-thread-1-processing-n:127.0.0.1:45142_ybwi) [n:127.0.0.1:45142_ybwi c:control_collection s:shard1 r:core_node1 x:collection1] o.a.s.c.SolrCore no updateRequestProcessorChain defined as default, creating implicit default
   [junit4]   2> 706104 WARN  (coreLoadExecutor-2391-thread-1-processing-n:127.0.0.1:45142_ybwi) [n:127.0.0.1:45142_ybwi c:control_collection s:shard1 r:core_node1 x:collection1] o.a.s.c.RequestHandlers INVALID paramSet a in requestHandler {type = requestHandler,name = /dump,class = DumpRequestHandler,args = {defaults={a=A,b=B}}}
   [junit4]   2> 706105 INFO  (coreLoadExecutor-2391-thread-1-processing-n:127.0.0.1:45142_ybwi) [n:127.0.0.1:45142_ybwi c:control_collection s:shard1 r:core_node1 x:collection1] o.a.s.h.l.XMLLoader xsltCacheLifetimeSeconds=60
   [junit4]   2> 706106 INFO  (coreLoadExecutor-2391-thread-1-processing-n:127.0.0.1:45142_ybwi) [n:127.0.0.1:45142_ybwi c:control_collection s:shard1 r:core_node1 x:collection1] o.a.s.h.l.XMLLoader xsltCacheLifetimeSeconds=60
   [junit4]   2> 706107 INFO  (coreLoadExecutor-2391-thread-1-processing-n:127.0.0.1:45142_ybwi) [n:127.0.0.1:45142_ybwi c:control_collection s:shard1 r:core_node1 x:collection1] o.a.s.h.l.XMLLoader xsltCacheLifetimeSeconds=60
   [junit4]   2> 706107 INFO  (coreLoadExecutor-2391-thread-1-processing-n:127.0.0.1:45142_ybwi) [n:127.0.0.1:45142_ybwi c:control_collection s:shard1 r:core_node1 x:collection1] o.a.s.h.l.XMLLoader xsltCacheLifetimeSeconds=60
   [junit4]   2> 706109 INFO  (coreLoadExecutor-2391-thread-1-processing-n:127.0.0.1:45142_ybwi) [n:127.0.0.1:45142_ybwi c:control_collection s:shard1 r:core_node1 x:collection1] o.a.s.c.RequestHandlers Registered paths: /admin/mbeans,standard,/dump,/update/csv,/update/json/docs,/admin/luke,/admin/segments,/get,/admin/system,/replication,/admin/properties,/config,/schema,/admin/plugins,/admin/logging,/update/json,/admin/threads,/admin/ping,/update,/admin/file
   [junit4]   2> 706110 INFO  (coreLoadExecutor-2391-thread-1-processing-n:127.0.0.1:45142_ybwi) [n:127.0.0.1:45142_ybwi c:control_collection s:shard1 r:core_node1 x:collection1] o.a.s.c.SolrCore Using default statsCache cache: org.apache.solr.search.stats.LocalStatsCache
   [junit4]   2> 706110 INFO  (coreLoadExecutor-2391-thread-1-processing-n:127.0.0.1:45142_ybwi) [n:127.0.0.1:45142_ybwi c:control_collection s:shard1 r:core_node1 x:collection1] o.a.s.u.UpdateHandler Using UpdateLog implementation: org.apache.solr.update.UpdateLog
   [junit4]   2> 706110 INFO  (coreLoadExecutor-2391-thread-1-processing-n:127.0.0.1:45142_ybwi) [n:127.0.0.1:45142_ybwi c:control_collection s:shard1 r:core_node1 x:collection1] o.a.s.u.UpdateLog Initializing UpdateLog: dataDir= defaultSyncLevel=FLUSH numRecordsToKeep=100 maxNumLogsToKeep=10 numVersionBuckets=65536
   [junit4]   2> 706111 INFO  (coreLoadExecutor-2391-thread-1-processing-n:127.0.0.1:45142_ybwi) [n:127.0.0.1:45142_ybwi c:control_collection s:shard1 r:core_node1 x:collection1] o.a.s.u.CommitTracker Hard AutoCommit: disabled
   [junit4]   2> 706111 INFO  (coreLoadExecutor-2391-thread-1-processing-n:127.0.0.1:45142_ybwi) [n:127.0.0.1:45142_ybwi c:control_collection s:shard1 r:core_node1 x:collection1] o.a.s.u.CommitTracker Soft AutoCommit: disabled
   [junit4]   2> 706111 INFO  (coreLoadExecutor-2391-thread-1-processing-n:127.0.0.1:45142_ybwi) [n:127.0.0.1:45142_ybwi c:control_collection s:shard1 r:core_node1 x:collection1] o.a.s.u.RandomMergePolicy RandomMergePolicy wrapping class org.apache.lucene.index.LogDocMergePolicy: [LogDocMergePolicy: minMergeSize=1000, mergeFactor=32, maxMergeSize=9223372036854775807, maxMergeSizeForForcedMerge=9223372036854775807, calibrateSizeByDeletes=false, maxMergeDocs=2147483647, maxCFSSegmentSizeMB=8.796093022207999E12, noCFSRatio=0.16982381947996894]
   [junit4]   2> 706112 INFO  (coreLoadExecutor-2391-thread-1-processing-n:127.0.0.1:45142_ybwi) [n:127.0.0.1:45142_ybwi c:control_collection s:shard1 r:core_node1 x:collection1] o.a.s.c.SolrDeletionPolicy SolrDeletionPolicy.onInit: commits: num=1
   [junit4]   2> 	commit{dir=MockDirectoryWrapper(RAMDirectory@7ae1d0 lockFactory=org.apache.lucene.store.SingleInstanceLockFactory@11a9cd1),segFN=segments_1,generation=1}
   [junit4]   2> 706112 INFO  (coreLoadExecutor-2391-thread-1-processing-n:127.0.0.1:45142_ybwi) [n:127.0.0.1:45142_ybwi c:control_collection s:shard1 r:core_node1 x:collection1] o.a.s.c.SolrDeletionPolicy newest commit generation = 1
   [junit4]   2> 706112 INFO  (coreLoadExecutor-2391-thread-1-processing-n:127.0.0.1:45142_ybwi) [n:127.0.0.1:45142_ybwi c:control_collection s:shard1 r:core_node1 x:collection1] o.a.s.s.SolrIndexSearcher Opening Searcher@1b4ba32[collection1] main
   [junit4]   2> 706112 INFO  (coreLoadExecutor-2391-thread-1-processing-n:127.0.0.1:45142_ybwi) [n:127.0.0.1:45142_ybwi c:control_collection s:shard1 r:core_node1 x:collection1] o.a.s.c.c.ZkStateReader Load collection config from: [/collections/control_collection]
   [junit4]   2> 706112 INFO  (coreLoadExecutor-2391-thread-1-processing-n:127.0.0.1:45142_ybwi) [n:127.0.0.1:45142_ybwi c:control_collection s:shard1 r:core_node1 x:collection1] o.a.s.c.c.ZkStateReader path=[/collections/control_collection] [configName]=[conf1] specified config exists in ZooKeeper
   [junit4]   2> 706112 INFO  (coreLoadExecutor-2391-thread-1-processing-n:127.0.0.1:45142_ybwi) [n:127.0.0.1:45142_ybwi c:control_collection s:shard1 r:core_node1 x:collection1] o.a.s.r.ManagedResourceStorage Setting up ZooKeeper-based storage for the RestManager with znodeBase: /configs/conf1
   [junit4]   2> 706112 INFO  (coreLoadExecutor-2391-thread-1-processing-n:127.0.0.1:45142_ybwi) [n:127.0.0.1:45142_ybwi c:control_collection s:shard1 r:core_node1 x:collection1] o.a.s.r.ManagedResourceStorage Configured ZooKeeperStorageIO with znodeBase: /configs/conf1
   [junit4]   2> 706112 INFO  (coreLoadExecutor-2391-thread-1-processing-n:127.0.0.1:45142_ybwi) [n:127.0.0.1:45142_ybwi c:control_collection s:shard1 r:core_node1 x:collection1] o.a.s.r.RestManager Initializing RestManager with initArgs: {}
   [junit4]   2> 706113 INFO  (coreLoadExecutor-2391-thread-1-processing-n:127.0.0.1:45142_ybwi) [n:127.0.0.1:45142_ybwi c:control_collection s:shard1 r:core_node1 x:collection1] o.a.s.r.ManagedResourceStorage Reading _rest_managed.json using ZooKeeperStorageIO:path=/configs/conf1
   [junit4]   2> 706113 INFO  (coreLoadExecutor-2391-thread-1-processing-n:127.0.0.1:45142_ybwi) [n:127.0.0.1:45142_ybwi c:control_collection s:shard1 r:core_node1 x:collection1] o.a.s.r.ManagedResourceStorage No data found for znode /configs/conf1/_rest_managed.json
   [junit4]   2> 706113 INFO  (coreLoadExecutor-2391-thread-1-processing-n:127.0.0.1:45142_ybwi) [n:127.0.0.1:45142_ybwi c:control_collection s:shard1 r:core_node1 x:collection1] o.a.s.r.ManagedResourceStorage Loaded null at path _rest_managed.json using ZooKeeperStorageIO:path=/configs/conf1
   [junit4]   2> 706113 INFO  (coreLoadExecutor-2391-thread-1-processing-n:127.0.0.1:45142_ybwi) [n:127.0.0.1:45142_ybwi c:control_collection s:shard1 r:core_node1 x:collection1] o.a.s.r.RestManager Initializing 0 registered ManagedResources
   [junit4]   2> 706113 INFO  (coreLoadExecutor-2391-thread-1-processing-n:127.0.0.1:45142_ybwi) [n:127.0.0.1:45142_ybwi c:control_collection s:shard1 r:core_node1 x:collection1] o.a.s.h.ReplicationHandler Commits will be reserved for  10000
   [junit4]   2> 706114 INFO  (searcherExecutor-2392-thread-1-processing-n:127.0.0.1:45142_ybwi x:collection1 s:shard1 c:control_collection r:core_node1) [n:127.0.0.1:45142_ybwi c:control_collection s:shard1 r:core_node1 x:collection1] o.a.s.c.SolrCore [collection1] Registered new searcher Searcher@1b4ba32[collection1] main{ExitableDirectoryReader(UninvertingDirectoryReader())}
   [junit4]   2> 706114 INFO  (coreLoadExecutor-2391-thread-1-processing-n:127.0.0.1:45142_ybwi) [n:127.0.0.1:45142_ybwi c:control_collection s:shard1 r:core_node1 x:collection1] o.a.s.u.UpdateLog Looking up max value of version field to seed version buckets
   [junit4]   2> 706114 INFO  (coreLoadExecutor-2391-thread-1-processing-n:127.0.0.1:45142_ybwi) [n:127.0.0.1:45142_ybwi c:control_collection s:shard1 r:core_node1 x:collection1] o.a.s.u.VersionInfo Refreshing highest value of _version_ for 65536 version buckets from index
   [junit4]   2> 706114 INFO  (coreLoadExecutor-2391-thread-1-processing-n:127.0.0.1:45142_ybwi) [n:127.0.0.1:45142_ybwi c:control_collection s:shard1 r:core_node1 x:collection1] o.a.s.u.VersionInfo No terms found for _version_, cannot seed version bucket highest value from index
   [junit4]   2> 706114 INFO  (coreLoadExecutor-2391-thread-1-processing-n:127.0.0.1:45142_ybwi) [n:127.0.0.1:45142_ybwi c:control_collection s:shard1 r:core_node1 x:collection1] o.a.s.u.UpdateLog Could not find max version in index or recent updates, using new clock 1527208697064849408
   [junit4]   2> 706116 INFO  (coreLoadExecutor-2391-thread-1-processing-n:127.0.0.1:45142_ybwi) [n:127.0.0.1:45142_ybwi c:control_collection s:shard1 r:core_node1 x:collection1] o.a.s.u.UpdateLog Took 1.0ms to seed version buckets with highest version 1527208697064849408
   [junit4]   2> 706116 INFO  (coreLoadExecutor-2391-thread-1-processing-n:127.0.0.1:45142_ybwi) [n:127.0.0.1:45142_ybwi c:control_collection s:shard1 r:core_node1 x:collection1] o.a.s.c.ZkController watch zkdir /configs/conf1
   [junit4]   2> 706116 INFO  (coreLoadExecutor-2391-thread-1-processing-n:127.0.0.1:45142_ybwi) [n:127.0.0.1:45142_ybwi c:control_collection s:shard1 r:core_node1 x:collection1] o.a.s.c.CoreContainer registering core: collection1
   [junit4]   2> 706116 INFO  (coreZkRegister-2385-thread-1-processing-n:127.0.0.1:45142_ybwi x:collection1 s:shard1 c:control_collection r:core_node1) [n:127.0.0.1:45142_ybwi c:control_collection s:shard1 r:core_node1 x:collection1] o.a.s.c.ZkController Register replica - core:collection1 address:http://127.0.0.1:45142/ybwi collection:control_collection shard:shard1
   [junit4]   2> 706117 INFO  (coreZkRegister-2385-thread-1-processing-n:127.0.0.1:45142_ybwi x:collection1 s:shard1 c:control_collection r:core_node1) [n:127.0.0.1:45142_ybwi c:control_collection s:shard1 r:core_node1 x:collection1] o.a.s.c.c.SolrZkClient makePath: /collections/control_collection/leader_elect/shard1/election
   [junit4]   2> 706118 INFO  (coreZkRegister-2385-thread-1-processing-n:127.0.0.1:45142_ybwi x:collection1 s:shard1 c:control_collection r:core_node1) [n:127.0.0.1:45142_ybwi c:control_collection s:shard1 r:core_node1 x:collection1] o.a.s.c.LeaderElector Joined leadership election with path: /collections/control_collection/leader_elect/shard1/election/95450543477227526-core_node1-n_0000000000
   [junit4]   2> 706118 INFO  (coreZkRegister-2385-thread-1-processing-n:127.0.0.1:45142_ybwi x:collection1 s:shard1 c:control_collection r:core_node1) [n:127.0.0.1:45142_ybwi c:control_collection s:shard1 r:core_node1 x:collection1] o.a.s.c.ShardLeaderElectionContext Running the leader process for shard=shard1 and weAreReplacement=false and leaderVoteWait=180000
   [junit4]   2> 706119 INFO  (coreZkRegister-2385-thread-1-processing-n:127.0.0.1:45142_ybwi x:collection1 s:shard1 c:control_collection r:core_node1) [n:127.0.0.1:45142_ybwi c:control_collection s:shard1 r:core_node1 x:collection1] o.a.s.c.ShardLeaderElectionContext Enough replicas found to continue.
   [junit4]   2> 706119 INFO  (coreZkRegister-2385-thread-1-processing-n:127.0.0.1:45142_ybwi x:collection1 s:shard1 c:control_collection r:core_node1) [n:127.0.0.1:45142_ybwi c:control_collection s:shard1 r:core_node1 x:collection1] o.a.s.c.ShardLeaderElectionContext I may be the new leader - try and sync
   [junit4]   2> 706119 INFO  (coreZkRegister-2385-thread-1-processing-n:127.0.0.1:45142_ybwi x:collection1 s:shard1 c:control_collection r:core_node1) [n:127.0.0.1:45142_ybwi c:control_collection s:shard1 r:core_node1 x:collection1] o.a.s.c.SyncStrategy Sync replicas to http://127.0.0.1:45142/ybwi/collection1/
   [junit4]   2> 706119 INFO  (OverseerStateUpdate-95450543477227526-127.0.0.1:45142_ybwi-n_0000000000) [n:127.0.0.1:45142_ybwi    ] o.a.s.c.Overseer processMessage: queueSize: 1, message = {
   [junit4]   2>   "operation":"leader",
   [junit4]   2>   "shard":"shard1",
   [junit4]   2>   "collection":"control_collection"} current state version: 1
   [junit4]   2> 706119 INFO  (coreZkRegister-2385-thread-1-processing-n:127.0.0.1:45142_ybwi x:collection1 s:shard1 c:control_collection r:core_node1) [n:127.0.0.1:45142_ybwi c:control_collection s:shard1 r:core_node1 x:collection1] o.a.s.c.SyncStrategy Sync Success - now sync replicas to me
   [junit4]   2> 706119 INFO  (coreZkRegister-2385-thread-1-processing-n:127.0.0.1:45142_ybwi x:collection1 s:shard1 c:control_collection r:core_node1) [n:127.0.0.1:45142_ybwi c:control_collection s:shard1 r:core_node1 x:collection1] o.a.s.c.SyncStrategy http://127.0.0.1:45142/ybwi/collection1/ has no replicas
   [junit4]   2> 706119 INFO  (coreZkRegister-2385-thread-1-processing-n:127.0.0.1:45142_ybwi x:collection1 s:shard1 c:control_collection r:core_node1) [n:127.0.0.1:45142_ybwi c:control_collection s:shard1 r:core_node1 x:collection1] o.a.s.c.c.SolrZkClient makePath: /collections/control_collection/leaders/shard1
   [junit4]   2> 706120 INFO  (coreZkRegister-2385-thread-1-processing-n:127.0.0.1:45142_ybwi x:collection1 s:shard1 c:control_collection r:core_node1) [n:127.0.0.1:45142_ybwi c:control_collection s:shard1 r:core_node1 x:collection1] o.a.s.c.ShardLeaderElectionContextBase Creating leader registration node
   [junit4]   2> 706121 INFO  (coreZkRegister-2385-thread-1-processing-n:127.0.0.1:45142_ybwi x:collection1 s:shard1 c:control_collection r:core_node1) [n:127.0.0.1:45142_ybwi c:control_collection s:shard1 r:core_node1 x:collection1] o.a.s.c.ShardLeaderElectionContext I am the new leader: http://127.0.0.1:45142/ybwi/collection1/ shard1
   [junit4]   2> 706121 INFO  (OverseerStateUpdate-95450543477227526-127.0.0.1:45142_ybwi-n_0000000000) [n:127.0.0.1:45142_ybwi    ] o.a.s.c.Overseer processMessage: queueSize: 1, message = {
   [junit4]   2>   "operation":"leader",
   [junit4]   2>   "shard":"shard1",
   [junit4]   2>   "collection":"control_collection",
   [junit4]   2>   "base_url":"http://127.0.0.1:45142/ybwi",
   [junit4]   2>   "core":"collection1",
   [junit4]   2>   "state":"active"} current state version: 1
   [junit4]   2> 706223 INFO  (zkCallback-788-thread-1-processing-n:127.0.0.1:45142_ybwi) [n:127.0.0.1:45142_ybwi    ] o.a.s.c.c.ZkStateReader A cluster state change: [WatchedEvent state:SyncConnected type:NodeDataChanged path:/clusterstate.json], has occurred - updating... (live nodes size: [1])
   [junit4]   2> 706272 INFO  (coreZkRegister-2385-thread-1-processing-n:127.0.0.1:45142_ybwi x:collection1 s:shard1 c:control_collection r:core_node1) [n:127.0.0.1:45142_ybwi c:control_collection s:shard1 r:core_node1 x:collection1] o.a.s.c.ZkController We are http://127.0.0.1:45142/ybwi/collection1/ and leader is http://127.0.0.1:45142/ybwi/collection1/
   [junit4]   2> 706272 INFO  (coreZkRegister-2385-thread-1-processing-n:127.0.0.1:45142_ybwi x:collection1 s:shard1 c:control_collection r:core_node1) [n:127.0.0.1:45142_ybwi c:control_collection s:shard1 r:core_node1 x:collection1] o.a.s.c.ZkController No LogReplay needed for core=collection1 baseURL=http://127.0.0.1:45142/ybwi
   [junit4]   2> 706272 INFO  (coreZkRegister-2385-thread-1-processing-n:127.0.0.1:45142_ybwi x:collection1 s:shard1 c:control_collection r:core_node1) [n:127.0.0.1:45142_ybwi c:control_collection s:shard1 r:core_node1 x:collection1] o.a.s.c.ZkController I am the leader, no recovery necessary
   [junit4]   2> 706272 INFO  (coreZkRegister-2385-thread-1-processing-n:127.0.0.1:45142_ybwi x:collection1 s:shard1 c:control_collection r:core_node1) [n:127.0.0.1:45142_ybwi c:control_collection s:shard1 r:core_node1 x:collection1] o.a.s.c.ZkController publishing state=active
   [junit4]   2> 706272 INFO  (coreZkRegister-2385-thread-1-processing-n:127.0.0.1:45142_ybwi x:collection1 s:shard1 c:control_collection r:core_node1) [n:127.0.0.1:45142_ybwi c:control_collection s:shard1 r:core_node1 x:collection1] o.a.s.c.ZkController numShards not found on descriptor - reading it from system property
   [junit4]   2> 706273 INFO  (OverseerStateUpdate-95450543477227526-127.0.0.1:45142_ybwi-n_0000000000) [n:127.0.0.1:45142_ybwi    ] o.a.s.c.Overseer processMessage: queueSize: 1, message = {
   [junit4]   2>   "core":"collection1",
   [junit4]   2>   "core_node_name":"core_node1",
   [junit4]   2>   "roles":null,
   [junit4]   2>   "base_url":"http://127.0.0.1:45142/ybwi",
   [junit4]   2>   "node_name":"127.0.0.1:45142_ybwi",
   [junit4]   2>   "numShards":"1",
   [junit4]   2>   "state":"active",
   [junit4]   2>   "shard":"shard1",
   [junit4]   2>   "collection":"control_collection",
   [junit4]   2>   "operation":"state"} current state version: 2
   [junit4]   2> 706273 INFO  (OverseerStateUpdate-95450543477227526-127.0.0.1:45142_ybwi-n_0000000000) [n:127.0.0.1:45142_ybwi    ] o.a.s.c.o.ReplicaMutator Update state numShards=1 message={
   [junit4]   2>   "core":"collection1",
   [junit4]   2>   "core_node_name":"core_node1",
   [junit4]   2>   "roles":null,
   [junit4]   2>   "base_url":"http://127.0.0.1:45142/ybwi",
   [junit4]   2>   "node_name":"127.0.0.1:45142_ybwi",
   [junit4]   2>   "numShards":"1",
   [junit4]   2>   "state":"active",
   [junit4]   2>   "shard":"shard1",
   [junit4]   2>   "collection":"control_collection",
   [junit4]   2>   "operation":"state"}
   [junit4]   2> 706374 INFO  (zkCallback-788-thread-2-processing-n:127.0.0.1:45142_ybwi) [n:127.0.0.1:45142_ybwi    ] o.a.s.c.c.ZkStateReader A cluster state change: [WatchedEvent state:SyncConnected type:NodeDataChanged path:/clusterstate.json], has occurred - updating... (live nodes size: [1])
   [junit4]   2> 706501 INFO  (TEST-CollectionsAPIDistributedZkTest.test-seed#[1AA74E5DBA90B315]) [    ] o.a.s.c.c.SolrZkClient Using default ZkCredentialsProvider
   [junit4]   2> 706502 INFO  (TEST-CollectionsAPIDistributedZkTest.test-seed#[1AA74E5DBA90B315]) [    ] o.a.s.c.c.ConnectionManager Waiting for client to connect to ZooKeeper
   [junit4]   2> 706503 INFO  (zkCallback-790-thread-1) [    ] o.a.s.c.c.ConnectionManager Watcher org.apache.solr.common.cloud.ConnectionManager@664fc name:ZooKeeperConnection Watcher:127.0.0.1:58047/solr got event WatchedEvent state:SyncConnected type:None path:null path:null type:None
   [junit4]   2> 706503 INFO  (TEST-CollectionsAPIDistributedZkTest.test-seed#[1AA74E5DBA90B315]) [    ] o.a.s.c.c.ConnectionManager Client is connected to ZooKeeper
   [junit4]   2> 706504 INFO  (TEST-CollectionsAPIDistributedZkTest.test-seed#[1AA74E5DBA90B315]) [    ] o.a.s.c.c.SolrZkClient Using default ZkACLProvider
   [junit4]   2> 706504 INFO  (TEST-CollectionsAPIDistributedZkTest.test-seed#[1AA74E5DBA90B315]) [    ] o.a.s.c.c.ZkStateReader Updating cluster state from ZooKeeper... 
   [junit4]   2> 706505 INFO  (TEST-CollectionsAPIDistributedZkTest.test-seed#[1AA74E5DBA90B315]) [    ] o.a.s.c.ChaosMonkey monkey: init - expire sessions:false cause connection loss:false
   [junit4]   2> 706505 INFO  (TEST-CollectionsAPIDistributedZkTest.test-seed#[1AA74E5DBA90B315]) [    ] o.a.s.c.AbstractFullDistribZkTestBase Creating collection1 with stateFormat=2
   [junit4]   2> 706505 INFO  (TEST-CollectionsAPIDistributedZkTest.test-seed#[1AA74E5DBA90B315]) [    ] o.a.s.c.c.SolrZkClient Using default ZkCredentialsProvider
   [junit4]   2> 706505 INFO  (TEST-CollectionsAPIDistributedZkTest.test-seed#[1AA74E5DBA90B315]) [    ] o.a.s.c.c.ConnectionManager Waiting for client to connect to ZooKeeper
   [junit4]   2> 706506 INFO  (zkCallback-791-thread-1) [    ] o.a.s.c.c.ConnectionManager Watcher org.apache.solr.common.cloud.ConnectionManager@b0326 name:ZooKeeperConnection Watcher:127.0.0.1:58047/solr got event WatchedEvent state:SyncConnected type:None path:null path:null type:None
   [junit4]   2> 706506 INFO  (TEST-CollectionsAPIDistributedZkTest.test-seed#[1AA74E5DBA90B315]) [    ] o.a.s.c.c.ConnectionManager Client is connected to ZooKeeper
   [junit4]   2> 706507 INFO  (TEST-CollectionsAPIDistributedZkTest.test-seed#[1AA74E5DBA90B315]) [    ] o.a.s.c.c.SolrZkClient Using default ZkACLProvider
   [junit4]   2> 706508 INFO  (OverseerStateUpdate-95450543477227526-127.0.0.1:45142_ybwi-n_0000000000) [n:127.0.0.1:45142_ybwi    ] o.a.s.c.Overseer processMessage: queueSize: 1, message = {
   [junit4]   2>   "operation":"create",
   [junit4]   2>   "name":"collection1",
   [junit4]   2>   "numShards":"2",
   [junit4]   2>   "stateFormat":"2"} current state version: 3
   [junit4]   2> 706508 INFO  (OverseerStateUpdate-95450543477227526-127.0.0.1:45142_ybwi-n_0000000000) [n:127.0.0.1:45142_ybwi    ] o.a.s.c.o.ClusterStateMutator building a new cName: collection1
   [junit4]   2> 706562 INFO  (TEST-CollectionsAPIDistributedZkTest.test-seed#[1AA74E5DBA90B315]) [    ] o.a.s.SolrTestCaseJ4 Writing core.properties file to /home/jenkins/workspace/Lucene-Solr-5.5-Linux/solr/build/solr-core/test/J1/temp/solr.cloud.CollectionsAPIDistributedZkTest_1AA74E5DBA90B315-001/shard-1-001/cores/collection1
   [junit4]   2> 706562 INFO  (TEST-CollectionsAPIDistributedZkTest.test-seed#[1AA74E5DBA90B315]) [    ] o.a.s.c.AbstractFullDistribZkTestBase create jetty 1 in directory /home/jenkins/workspace/Lucene-Solr-5.5-Linux/solr/build/solr-core/test/J1/temp/solr.cloud.CollectionsAPIDistributedZkTest_1AA74E5DBA90B315-001/shard-1-001
   [junit4]   2> 706563 INFO  (TEST-CollectionsAPIDistributedZkTest.test-seed#[1AA74E5DBA90B315]) [    ] o.e.j.s.Server jetty-9.2.13.v20150730
   [junit4]   2> 706563 INFO  (TEST-CollectionsAPIDistributedZkTest.test-seed#[1AA74E5DBA90B315]) [    ] o.e.j.s.h.ContextHandler Started o.e.j.s.ServletContextHandler@80294d{/ybwi,null,AVAILABLE}
   [junit4]   2> 706564 INFO  (TEST-CollectionsAPIDistributedZkTest.test-seed#[1AA74E5DBA90B315]) [    ] o.e.j.s.ServerConnector Started ServerConnector@1be2d01{HTTP/1.1}{127.0.0.1:34038}
   [junit4]   2> 706564 INFO  (TEST-CollectionsAPIDistributedZkTest.test-seed#[1AA74E5DBA90B315]) [    ] o.e.j.s.Server Started @708180ms
   [junit4]   2> 706564 INFO  (TEST-CollectionsAPIDistributedZkTest.test-seed#[1AA74E5DBA90B315]) [    ] o.a.s.c.s.e.JettySolrRunner Jetty properties: {solr.data.dir=/home/jenkins/workspace/Lucene-Solr-5.5-Linux/solr/build/solr-core/test/J1/temp/solr.cloud.CollectionsAPIDistributedZkTest_1AA74E5DBA90B315-001/tempDir-001/jetty1, solrconfig=solrconfig.xml, hostContext=/ybwi, hostPort=34038, coreRootDirectory=/home/jenkins/workspace/Lucene-Solr-5.5-Linux/solr/build/solr-core/test/J1/../../../../../../../../../home/jenkins/workspace/Lucene-Solr-5.5-Linux/solr/build/solr-core/test/J1/temp/solr.cloud.CollectionsAPIDistributedZkTest_1AA74E5DBA90B315-001/shard-1-001/cores}
   [junit4]   2> 706564 INFO  (TEST-CollectionsAPIDistributedZkTest.test-seed#[1AA74E5DBA90B315]) [    ] o.a.s.s.SolrDispatchFilter SolrDispatchFilter.init(): sun.misc.Launcher$AppClassLoader@1d16e93
   [junit4]   2> 706564 INFO  (TEST-CollectionsAPIDistributedZkTest.test-seed#[1AA74E5DBA90B315]) [    ] o.a.s.c.SolrResourceLoader new SolrResourceLoader for directory: '/home/jenkins/workspace/Lucene-Solr-5.5-Linux/solr/build/solr-core/test/J1/temp/solr.cloud.CollectionsAPIDistributedZkTest_1AA74E5DBA90B315-001/shard-1-001'
   [junit4]   2> 706564 INFO  (TEST-CollectionsAPIDistributedZkTest.test-seed#[1AA74E5DBA90B315]) [    ] o.a.s.c.SolrResourceLoader JNDI not configured for solr (NoInitialContextEx)
   [junit4]   2> 706564 INFO  (TEST-CollectionsAPIDistributedZkTest.test-seed#[1AA74E5DBA90B315]) [    ] o.a.s.c.SolrResourceLoader solr home defaulted to 'solr/' (could not find system property or JNDI)
   [junit4]   2> 706564 INFO  (TEST-CollectionsAPIDistributedZkTest.test-seed#[1AA74E5DBA90B315]) [    ] o.a.s.c.c.SolrZkClient Using default ZkCredentialsProvider
   [junit4]   2> 706565 INFO  (TEST-CollectionsAPIDistributedZkTest.test-seed#[1AA74E5DBA90B315]) [    ] o.a.s.c.c.ConnectionManager Waiting for client to connect to ZooKeeper
   [junit4]   2> 706566 INFO  (zkCallback-792-thread-1) [    ] o.a.s.c.c.ConnectionManager Watcher org.apache.solr.common.cloud.ConnectionManager@159f2f name:ZooKeeperConnection Watcher:127.0.0.1:58047/solr got event WatchedEvent state:SyncConnected type:None path:null path:null type:None
   [junit4]   2> 706566 INFO  (TEST-CollectionsAPIDistributedZkTest.test-seed#[1AA74E5DBA90B315]) [    ] o.a.s.c.c.ConnectionManager Client is connected to ZooKeeper
   [junit4]   2> 706566 INFO  (TEST-CollectionsAPIDistributedZkTest.test-seed#[1AA74E5DBA90B315]) [    ] o.a.s.c.c.SolrZkClient Using default ZkACLProvider
   [junit4]   2> 706567 INFO  (TEST-CollectionsAPIDistributedZkTest.test-seed#[1AA74E5DBA90B315]) [    ] o.a.s.s.SolrDispatchFilter Loading solr.xml from SolrHome (not found in ZooKeeper)
   [junit4]   2> 706567 INFO  (TEST-CollectionsAPIDistributedZkTest.test-seed#[1AA74E5DBA90B315]) [    ] o.a.s.c.SolrXmlConfig Loading container configuration from /home/jenkins/workspace/Lucene-Solr-5.5-Linux/solr/build/solr-core/test/J1/temp/solr.cloud.CollectionsAPIDistributedZkTest_1AA74E5DBA90B315-001/shard-1-001/solr.xml
   [junit4]   2> 706571 INFO  (TEST-CollectionsAPIDistributedZkTest.test-seed#[1AA74E5DBA90B315]) [    ] o.a.s.c.CorePropertiesLocator Config-defined core root directory: /home/jenkins/workspace/Lucene-Solr-5.5-Linux/solr/build/solr-core/test/J1/../../../../../../../../../home/jenkins/workspace/Lucene-Solr-5.5-Linux/solr/build/solr-core/test/J1/temp/solr.cloud.CollectionsAPIDistributedZkTest_1AA74E5DBA90B315-001/shard-1-001/cores
   [junit4]   2> 706571 INFO  (TEST-CollectionsAPIDistributedZkTest.test-seed#[1AA74E5DBA90B315]) [    ] o.a.s.c.CoreContainer New CoreContainer 17005299
   [junit4]   2> 706571 INFO  (TEST-CollectionsAPIDistributedZkTest.test-seed#[1AA74E5DBA90B315]) [    ] o.a.s.c.CoreContainer Loading cores into CoreContainer [instanceDir=/home/jenkins/workspace/Lucene-Solr-5.5-Linux/solr/build/solr-core/test/J1/temp/solr.cloud.CollectionsAPIDistributedZkTest_1AA74E5DBA90B315-001/shard-1-001]
   [junit4]   2> 706571 WARN  (TEST-CollectionsAPIDistributedZkTest.test-seed#[1AA74E5DBA90B315]) [    ] o.a.s.c.CoreContainer Couldn't add files from /home/jenkins/workspace/Lucene-Solr-5.5-Linux/solr/build/solr-core/test/J1/temp/solr.cloud.CollectionsAPIDistributedZkTest_1AA74E5DBA90B315-001/shard-1-001/lib to classpath: /home/jenkins/workspace/Lucene-Solr-5.5-Linux/solr/build/solr-core/test/J1/temp/solr.cloud.CollectionsAPIDistributedZkTest_1AA74E5DBA90B315-001/shard-1-001/lib
   [junit4]   2> 706571 INFO  (TEST-CollectionsAPIDistributedZkTest.test-seed#[1AA74E5DBA90B315]) [    ] o.a.s.h.c.HttpShardHandlerFactory created with socketTimeout : 90000,urlScheme : ,connTimeout : 15000,maxConnectionsPerHost : 20,maxConnections : 10000,corePoolSize : 0,maximumPoolSize : 2147483647,maxThreadIdleTime : 5,sizeOfQueue : -1,fairnessPolicy : false,useRetries : false,
   [junit4]   2> 706572 INFO  (TEST-CollectionsAPIDistributedZkTest.test-seed#[1AA74E5DBA90B315]) [    ] o.a.s.u.UpdateShardHandler Creating UpdateShardHandler HTTP client with params: socketTimeout=340000&connTimeout=45000&retry=true
   [junit4]   2> 706572 INFO  (TEST-CollectionsAPIDistributedZkTest.test-seed#[1AA74E5DBA90B315]) [    ] o.a.s.l.LogWatcher SLF4J impl is org.slf4j.impl.Log4jLoggerFactory
   [junit4]   2> 706572 INFO  (TEST-CollectionsAPIDistributedZkTest.test-seed#[1AA74E5DBA90B315]) [    ] o.a.s.l.LogWatcher Registering Log Listener [Log4j (org.slf4j.impl.Log4jLoggerFactory)]
   [junit4]   2> 706572 INFO  (TEST-CollectionsAPIDistributedZkTest.test-seed#[1AA74E5DBA90B315]) [    ] o.a.s.c.ZkContainer Zookeeper client=127.0.0.1:58047/solr
   [junit4]   2> 706572 INFO  (TEST-CollectionsAPIDistributedZkTest.test-seed#[1AA74E5DBA90B315]) [    ] o.a.s.c.ZkController zkHost includes chroot
   [junit4]   2> 706572 INFO  (TEST-CollectionsAPIDistributedZkTest.test-seed#[1AA74E5DBA90B315]) [    ] o.a.s.c.c.SolrZkClient Using default ZkCredentialsProvider
   [junit4]   2> 706572 INFO  (TEST-CollectionsAPIDistributedZkTest.test-seed#[1AA74E5DBA90B315]) [    ] o.a.s.c.c.ConnectionManager Waiting for client to connect to ZooKeeper
   [junit4]   2> 706574 INFO  (zkCallback-795-thread-1) [    ] o.a.s.c.c.ConnectionManager Watcher org.apache.solr.common.cloud.ConnectionManager@11b9283 name:ZooKeeperConnection Watcher:127.0.0.1:58047 got event WatchedEvent state:SyncConnected type:None path:null path:null type:None
   [junit4]   2> 706574 INFO  (TEST-CollectionsAPIDistributedZkTest.test-seed#[1AA74E5DBA90B315]) [    ] o.a.s.c.c.ConnectionManager Client is connected to ZooKeeper
   [junit4]   2> 706575 INFO  (TEST-CollectionsAPIDistributedZkTest.test-seed#[1AA74E5DBA90B315]) [    ] o.a.s.c.c.SolrZkClient Using default ZkACLProvider
   [junit4]   2> 706576 INFO  (TEST-CollectionsAPIDistributedZkTest.test-seed#[1AA74E5DBA90B315]) [n:127.0.0.1:34038_ybwi    ] o.a.s.c.c.ConnectionManager Waiting for client to connect to ZooKeeper
   [junit4]   2> 706577 INFO  (zkCallback-796-thread-1-processing-n:127.0.0.1:34038_ybwi) [n:127.0.0.1:34038_ybwi    ] o.a.s.c.c.ConnectionManager Watcher org.apache.solr.common.cloud.ConnectionManager@c9a511 name:ZooKeeperConnection Watcher:127.0.0.1:58047/solr got event WatchedEvent state:SyncConnected type:None path:null path:null type:None
   [junit4]   2> 706577 INFO  (TEST-CollectionsAPIDistributedZkTest.test-seed#[1AA74E5DBA90B315]) [n:127.0.0.1:34038_ybwi    ] o.a.s.c.c.ConnectionManager Client is connected to ZooKeeper
   [junit4]   2> 706579 INFO  (TEST-CollectionsAPIDistributedZkTest.test-seed#[1AA74E5DBA90B315]) [n:127.0.0.1:34038_ybwi    ] o.a.s.c.c.ZkStateReader Updating cluster state from ZooKeeper... 
   [junit4]   2> 706609 INFO  (OverseerStateUpdate-95450543477227526-127.0.0.1:45142_ybwi-n_0000000000) [n:127.0.0.1:45142_ybwi    ] o.a.s.c.o.ZkStateWriter going to create_collection /collections/collection1/state.json
   [junit4]   2> 707581 INFO  (TEST-CollectionsAPIDistributedZkTest.test-seed#[1AA74E5DBA90B315]) [n:127.0.0.1:34038_ybwi    ] o.a.s.c.ZkController Register node as live in ZooKeeper:/live_nodes/127.0.0.1:34038_ybwi
   [junit4]   2> 707581 INFO  (TEST-CollectionsAPIDistributedZkTest.test-seed#[1AA74E5DBA90B315]) [n:127.0.0.1:34038_ybwi    ] o.a.s.c.c.SolrZkClient makePath: /live_nodes/127.0.0.1:34038_ybwi
   [junit4]   2> 707582 INFO  (zkCallback-796-thread-1-processing-n:127.0.0.1:34038_ybwi) [n:127.0.0.1:34038_ybwi    ] o.a.s.c.c.ZkStateReader A live node change: [WatchedEvent state:SyncConnected type:NodeChildrenChanged path:/live_nodes], has occurred - updating... (live nodes size: [1])
   [junit4]   2> 707582 INFO  (zkCallback-788-thread-2-processing-n:127.0.0.1:45142_ybwi) [n:127.0.0.1:45142_ybwi    ] o.a.s.c.c.ZkStateReader A live node change: [WatchedEvent state:SyncConnected type:NodeChildrenChanged path:/live_nodes], has occurred - updating... (live nodes size: [1])
   [junit4]   2> 707582 INFO  (zkCallback-790-thread-1) [    ] o.a.s.c.c.ZkStateReader A live node change: [WatchedEvent state:SyncConnected type:NodeChildrenChanged path:/live_nodes], has occurred - updating... (live nodes size: [1])
   [junit4]   2> 707584 INFO  (TEST-CollectionsAPIDistributedZkTest.test-seed#[1AA74E5DBA90B315]) [n:127.0.0.1:34038_ybwi    ] o.a.s.c.Overseer Overseer (id=null) closing
   [junit4]   2> 707584 INFO  (TEST-CollectionsAPIDistributedZkTest.test-seed#[1AA74E5DBA90B315]) [n:127.0.0.1:34038_ybwi    ] o.a.s.c.LeaderElector Joined leadership election with path: /overseer_elect/election/95450543477227531-127.0.0.1:34038_ybwi-n_0000000001
   [junit4]   2> 707584 INFO  (TEST-CollectionsAPIDistributedZkTest.test-seed#[1AA74E5DBA90B315]) [n:127.0.0.1:34038_ybwi    ] o.a.s.c.LeaderElector Watching path /overseer_elect/election/95450543477227526-127.0.0.1:45142_ybwi-n_0000000000 to know if I could be the leader
   [junit4]   2> 707619 INFO  (TEST-CollectionsAPIDistributedZkTest.test-seed#[1AA74E5DBA90B315]) [n:127.0.0.1:34038_ybwi    ] o.a.s.c.CoreContainer Security conf doesn't exist. Skipping setup for authorization module.
   [junit4]   2> 707619 INFO  (TEST-CollectionsAPIDistributedZkTest.test-seed#[1AA74E5DBA90B315]) [n:127.0.0.1:34038_ybwi    ] o.a.s.c.CoreContainer No authentication plugin used.
   [junit4]   2> 707619 INFO  (TEST-CollectionsAPIDistributedZkTest.test-seed#[1AA74E5DBA90B315]) [n:127.0.0.1:34038_ybwi    ] o.a.s.c.CorePropertiesLocator Looking for core definitions underneath /home/jenkins/workspace/Lucene-Solr-5.5-Linux/solr/build/solr-core/test/J1/../../../../../../../../../home/jenkins/workspace/Lucene-Solr-5.5-Linux/solr/build/solr-core/test/J1/temp/solr.cloud.CollectionsAPIDistributedZkTest_1AA74E5DBA90B315-001/shard-1-001/cores
   [junit4]   2> 707620 INFO  (TEST-CollectionsAPIDistributedZkTest.test-seed#[1AA74E5DBA90B315]) [n:127.0.0.1:34038_ybwi    ] o.a.s.c.CoreDescriptor Created CoreDescriptor: {name=collection1, config=solrconfig.xml, transient=false, schema=schema.xml, loadOnStartup=true, configSetProperties=configsetprops.json, collection=collection1, coreNodeName=, dataDir=data/, shard=}
   [junit4]   2> 707620 INFO  (TEST-CollectionsAPIDistributedZkTest.test-seed#[1AA74E5DBA90B315]) [n:127.0.0.1:34038_ybwi    ] o.a.s.c.CorePropertiesLocator Found core collection1 in /home/jenkins/workspace/Lucene-Solr-5.5-Linux/solr/build/solr-core/test/J1/../../../../../../../../../home/jenkins/workspace/Lucene-Solr-5.5-Linux/solr/build/solr-core/test/J1/temp/solr.cloud.CollectionsAPIDistributedZkTest_1AA74E5DBA90B315-001/shard-1-001/cores/collection1
   [junit4]   2> 707620 INFO  (TEST-CollectionsAPIDistributedZkTest.test-seed#[1AA74E5DBA90B315]) [n:127.0.0.1:34038_ybwi    ] o.a.s.c.CorePropertiesLocator Found 1 core definitions
   [junit4]   2> 707620 INFO  (TEST-CollectionsAPIDistributedZkTest.test-seed#[1AA74E5DBA90B315]) [n:127.0.0.1:34038_ybwi    ] o.a.s.s.SolrDispatchFilter user.dir=/home/jenkins/workspace/Lucene-Solr-5.5-Linux/solr/build/solr-core/test/J1
   [junit4]   2> 707620 INFO  (TEST-CollectionsAPIDistributedZkTest.test-seed#[1AA74E5DBA90B315]) [n:127.0.0.1:34038_ybwi    ] o.a.s.s.SolrDispatchFilter SolrDispatchFilter.init() done
   [junit4]   2> 707620 INFO  (coreLoadExecutor-2402-thread-1-processing-n:127.0.0.1:34038_ybwi) [n:127.0.0.1:34038_ybwi c:collection1   x:collection1] o.a.s.c.ZkController publishing state=down
   [junit4]   2> 707620 INFO  (coreLoadExecutor-2402-thread-1-processing-n:127.0.0.1:34038_ybwi) [n:127.0.0.1:34038_ybwi c:collection1   x:collection1] o.a.s.c.ZkController numShards not found on descriptor - reading it from system property
   [junit4]   2> 707621 INFO  (coreLoadExecutor-2402-thread-1-processing-n:127.0.0.1:34038_ybwi) [n:127.0.0.1:34038_ybwi c:collection1   x:collection1] o.a.s.c.ZkController Registering watch for collection collection1
   [junit4]   2> 707621 INFO  (coreLoadExecutor-2402-thread-1-processing-n:127.0.0.1:34038_ybwi) [n:127.0.0.1:34038_ybwi c:collection1   x:collection1] o.a.s.c.c.ZkStateReader addZkWatch [collection1]
   [junit4]   2> 707621 INFO  (OverseerStateUpdate-95450543477227526-127.0.0.1:45142_ybwi-n_0000000000) [n:127.0.0.1:45142_ybwi    ] o.a.s.c.Overseer processMessage: queueSize: 1, message = {
   [junit4]   2>   "core":"collection1",
   [junit4]   2>   "roles":null,
   [junit4]   2>   "base_url":"http://127.0.0.1:34038/ybwi",
   [junit4]   2>   "node_name":"127.0.0.1:34038_ybwi",
   [junit4]   2>   "numShards":"2",
   [junit4]   2>   "state":"down",
   [junit4]   2>   "shard":null,
   [junit4]   2>   "collection":"collection1",
   [junit4]   2>   "operation":"state"} current state version: 3
   [junit4]   2> 707621 INFO  (coreLoadExecutor-2402-thread-1-processing-n:127.0.0.1:34038_ybwi) [n:127.0.0.1:34038_ybwi c:collection1   x:collection1] o.a.s.c.c.ZkStateReader Add data for [collection1] ver [0]
   [junit4]   2> 707621 INFO  (coreLoadExecutor-2402-thread-1-processing-n:127.0.0.1:34038_ybwi) [n:127.0.0.1:34038_ybwi c:collection1   x:collection1] o.a.s.c.ZkController look for our core node name
   [junit4]   2> 707621 INFO  (OverseerStateUpdate-95450543477227526-127.0.0.1:45142_ybwi-n_0000000000) [n:127.0.0.1:45142_ybwi    ] o.a.s.c.o.ReplicaMutator Update state numShards=2 message={
   [junit4]   2>   "core":"collection1",
   [junit4]   2>   "roles":null,
   [junit4]   2>   "base_url":"http://127.0.0.1:34038/ybwi",
   [junit4]   2>   "node_name":"127.0.0.1:34038_ybwi",
   [junit4]   2>   "numShards":"2",
   [junit4]   2>   "state":"down",
   [junit4]   2>   "shard":null,
   [junit4]   2>   "collection":"collection1",
   [junit4]   2>   "operation":"

[...truncated too long message...]

a.s.c.LeaderElector 
   [junit4]   2> org.apache.zookeeper.KeeperException$SessionExpiredException: KeeperErrorCode = Session expired for /collections/collection1/leader_elect/shard1/election/95450543477227540-core_node4-n_0000000001
   [junit4]   2> 	at org.apache.zookeeper.KeeperException.create(KeeperException.java:127)
   [junit4]   2> 	at org.apache.zookeeper.KeeperException.create(KeeperException.java:51)
   [junit4]   2> 	at org.apache.zookeeper.ZooKeeper.delete(ZooKeeper.java:873)
   [junit4]   2> 	at org.apache.solr.common.cloud.SolrZkClient$2.execute(SolrZkClient.java:244)
   [junit4]   2> 	at org.apache.solr.common.cloud.SolrZkClient$2.execute(SolrZkClient.java:241)
   [junit4]   2> 	at org.apache.solr.common.cloud.ZkCmdExecutor.retryOperation(ZkCmdExecutor.java:60)
   [junit4]   2> 	at org.apache.solr.common.cloud.SolrZkClient.delete(SolrZkClient.java:241)
   [junit4]   2> 	at org.apache.solr.cloud.ElectionContext.cancelElection(ElectionContext.java:86)
   [junit4]   2> 	at org.apache.solr.cloud.ShardLeaderElectionContextBase.cancelElection(ElectionContext.java:166)
   [junit4]   2> 	at org.apache.solr.cloud.ShardLeaderElectionContext.cancelElection(ElectionContext.java:268)
   [junit4]   2> 	at org.apache.solr.cloud.ShardLeaderElectionContext.runLeaderProcess(ElectionContext.java:444)
   [junit4]   2> 	at org.apache.solr.cloud.LeaderElector.runIamLeaderProcess(LeaderElector.java:197)
   [junit4]   2> 	at org.apache.solr.cloud.LeaderElector.checkIfIamLeader(LeaderElector.java:157)
   [junit4]   2> 	at org.apache.solr.cloud.LeaderElector.access$200(LeaderElector.java:58)
   [junit4]   2> 	at org.apache.solr.cloud.LeaderElector$ElectionWatcher.process(LeaderElector.java:388)
   [junit4]   2> 	at org.apache.solr.common.cloud.SolrZkClient$3$1.run(SolrZkClient.java:264)
   [junit4]   2> 	at java.util.concurrent.Executors$RunnableAdapter.call(Executors.java:511)
   [junit4]   2> 	at java.util.concurrent.FutureTask.run(FutureTask.java:266)
   [junit4]   2> 	at org.apache.solr.common.util.ExecutorUtil$MDCAwareThreadPoolExecutor$1.run(ExecutorUtil.java:231)
   [junit4]   2> 	at java.util.concurrent.ThreadPoolExecutor.runWorker(ThreadPoolExecutor.java:1142)
   [junit4]   2> 	at java.util.concurrent.ThreadPoolExecutor$Worker.run(ThreadPoolExecutor.java:617)
   [junit4]   2> 	at java.lang.Thread.run(Thread.java:745)
   [junit4]   2> 730040 INFO  (TEST-CollectionsAPIDistributedZkTest.test-seed#[1AA74E5DBA90B315]) [    ] o.e.j.s.ServerConnector Stopped ServerConnector@e5a8ae{HTTP/1.1}{127.0.0.1:0}
   [junit4]   2> 730040 INFO  (TEST-CollectionsAPIDistributedZkTest.test-seed#[1AA74E5DBA90B315]) [    ] o.e.j.s.h.ContextHandler Stopped o.e.j.s.ServletContextHandler@150b200{/ybwi,null,UNAVAILABLE}
   [junit4]   2> 730041 INFO  (TEST-CollectionsAPIDistributedZkTest.test-seed#[1AA74E5DBA90B315]) [    ] o.a.s.c.ZkTestServer connecting to 127.0.0.1:58047 58047
   [junit4]   2> 735057 INFO  (Thread-2103) [    ] o.a.s.c.ZkTestServer connecting to 127.0.0.1:58047 58047
   [junit4]   2> 735058 WARN  (Thread-2103) [    ] o.a.s.c.ZkTestServer Watch limit violations: 
   [junit4]   2> Maximum concurrent create/delete watches above limit:
   [junit4]   2> 
   [junit4]   2> 	8	/solr/aliases.json
   [junit4]   2> 	5	/solr/security.json
   [junit4]   2> 	5	/solr/configs/conf1
   [junit4]   2> 	4	/solr/configs/conf2
   [junit4]   2> 
   [junit4]   2> Maximum concurrent data watches above limit:
   [junit4]   2> 
   [junit4]   2> 	8	/solr/clusterstate.json
   [junit4]   2> 	4	/solr/collections/nodes_used_collection/state.json
   [junit4]   2> 	4	/solr/collections/collection1/state.json
   [junit4]   2> 	4	/solr/collections/awholynewcollection_0/state.json
   [junit4]   2> 
   [junit4]   2> Maximum concurrent children watches above limit:
   [junit4]   2> 
   [junit4]   2> 	8	/solr/live_nodes
   [junit4]   2> 	8	/solr/collections
   [junit4]   2> 	5	/solr/overseer/queue
   [junit4]   2> 	5	/solr/overseer/collection-queue-work
   [junit4]   2> 	2	/solr/overseer/queue-work
   [junit4]   2> 
   [junit4]   2> NOTE: reproduce with: ant test  -Dtestcase=CollectionsAPIDistributedZkTest -Dtests.method=test -Dtests.seed=1AA74E5DBA90B315 -Dtests.multiplier=3 -Dtests.slow=true -Dtests.locale=es-US -Dtests.timezone=Asia/Nicosia -Dtests.asserts=true -Dtests.file.encoding=UTF-8
   [junit4] ERROR   30.3s J1 | CollectionsAPIDistributedZkTest.test <<<
   [junit4]    > Throwable #1: org.apache.solr.client.solrj.impl.HttpSolrClient$RemoteSolrException: Error from server at http://127.0.0.1:45142/ybwi/awholynewcollection_0: non ok status: 500, message:Server Error
   [junit4]    > 	at __randomizedtesting.SeedInfo.seed([1AA74E5DBA90B315:92F37187146CDEED]:0)
   [junit4]    > 	at org.apache.solr.client.solrj.impl.HttpSolrClient.executeMethod(HttpSolrClient.java:511)
   [junit4]    > 	at org.apache.solr.client.solrj.impl.HttpSolrClient.request(HttpSolrClient.java:240)
   [junit4]    > 	at org.apache.solr.client.solrj.impl.HttpSolrClient.request(HttpSolrClient.java:229)
   [junit4]    > 	at org.apache.solr.client.solrj.SolrRequest.process(SolrRequest.java:149)
   [junit4]    > 	at org.apache.solr.client.solrj.SolrClient.query(SolrClient.java:942)
   [junit4]    > 	at org.apache.solr.client.solrj.SolrClient.query(SolrClient.java:957)
   [junit4]    > 	at org.apache.solr.cloud.AbstractFullDistribZkTestBase.waitForNon403or404or503(AbstractFullDistribZkTestBase.java:1753)
   [junit4]    > 	at org.apache.solr.cloud.CollectionsAPIDistributedZkTest.testCollectionsAPI(CollectionsAPIDistributedZkTest.java:717)
   [junit4]    > 	at org.apache.solr.cloud.CollectionsAPIDistributedZkTest.test(CollectionsAPIDistributedZkTest.java:160)
   [junit4]    > 	at org.apache.solr.BaseDistributedSearchTestCase$ShardsRepeatRule$ShardsFixedStatement.callStatement(BaseDistributedSearchTestCase.java:964)
   [junit4]    > 	at org.apache.solr.BaseDistributedSearchTestCase$ShardsRepeatRule$ShardsStatement.evaluate(BaseDistributedSearchTestCase.java:939)
   [junit4]    > 	at java.lang.Thread.run(Thread.java:745)
   [junit4]   2> 735061 INFO  (SUITE-CollectionsAPIDistributedZkTest-seed#[1AA74E5DBA90B315]-worker) [    ] o.a.s.SolrTestCaseJ4 ###deleteCore
   [junit4]   2> NOTE: leaving temporary files on disk at: /home/jenkins/workspace/Lucene-Solr-5.5-Linux/solr/build/solr-core/test/J1/temp/solr.cloud.CollectionsAPIDistributedZkTest_1AA74E5DBA90B315-001
   [junit4]   2> NOTE: test params are: codec=Asserting(Lucene54): {}, docValues:{}, sim=DefaultSimilarity, locale=es-US, timezone=Asia/Nicosia
   [junit4]   2> NOTE: Linux 3.19.0-47-generic i386/Oracle Corporation 1.8.0_72 (32-bit)/cpus=12,threads=1,free=376586544,total=536870912
   [junit4]   2> NOTE: All tests run in this JVM: [TestFileDictionaryLookup, OverseerStatusTest, WordBreakSolrSpellCheckerTest, BigEndianAscendingWordSerializerTest, TestNonDefinedSimilarityFactory, TestFiltering, ChaosMonkeyNothingIsSafeTest, DistribDocExpirationUpdateProcessorTest, SpellingQueryConverterTest, MinimalSchemaTest, DistributedFacetPivotLongTailTest, SolrPluginUtilsTest, TestDynamicLoading, TestShardHandlerFactory, TestUpdate, TestSchemaSimilarityResource, CloudExitableDirectoryReaderTest, TestManagedSchemaDynamicFieldResource, TestFieldResource, ZkControllerTest, TestRebalanceLeaders, TestRemoveLastDynamicCopyField, DocExpirationUpdateProcessorFactoryTest, RankQueryTest, DeleteShardTest, TestBM25SimilarityFactory, SimplePostToolTest, DOMUtilTest, TestLMJelinekMercerSimilarityFactory, HdfsRecoveryZkTest, TestDocumentBuilder, TestQuerySenderListener, TermsComponentTest, TestSolrXml, TestEmbeddedSolrServerConstructors, DistributedVersionInfoTest, TestSolrCLIRunExample, DistributedFacetPivotWhiteBoxTest, TestClassNameShortening, CheckHdfsIndexTest, PKIAuthenticationIntegrationTest, HdfsBasicDistributedZkTest, DistributedMLTComponentTest, ShardRoutingCustomTest, DistributedIntervalFacetingTest, ChaosMonkeySafeLeaderTest, SpellCheckComponentTest, TestSmileRequest, TestManagedResourceStorage, CoreAdminCreateDiscoverTest, TestConfigSetImmutable, AnalyticsQueryTest, DocumentBuilderTest, CSVRequestHandlerTest, EnumFieldTest, TestSystemIdResolver, TestDefaultStatsCache, FullHLLTest, TestTrie, TestWordDelimiterFilterFactory, TestSortByMinMaxFunction, TestBinaryResponseWriter, FileUtilsTest, SortByFunctionTest, CollectionTooManyReplicasTest, SolrIndexSplitterTest, ClusterStateUpdateTest, TriLevelCompositeIdRoutingTest, HdfsCollectionsAPIDistributedZkTest, TestSurroundQueryParser, TestRestoreCore, ConvertedLegacyTest, AsyncMigrateRouteKeyTest, TestCursorMarkWithoutUniqueKey, TestDFRSimilarityFactory, TestInitParams, MultiTermTest, CollectionsAPIDistributedZkTest]
   [junit4] Completed [225/566 (1!)] on J1 in 30.33s, 1 test, 1 error <<< FAILURES!

[...truncated 1088 lines...]
BUILD FAILED
/home/jenkins/workspace/Lucene-Solr-5.5-Linux/build.xml:750: The following error occurred while executing this line:
/home/jenkins/workspace/Lucene-Solr-5.5-Linux/build.xml:694: The following error occurred while executing this line:
/home/jenkins/workspace/Lucene-Solr-5.5-Linux/build.xml:59: The following error occurred while executing this line:
/home/jenkins/workspace/Lucene-Solr-5.5-Linux/solr/build.xml:233: The following error occurred while executing this line:
/home/jenkins/workspace/Lucene-Solr-5.5-Linux/solr/common-build.xml:534: The following error occurred while executing this line:
/home/jenkins/workspace/Lucene-Solr-5.5-Linux/lucene/common-build.xml:1477: The following error occurred while executing this line:
/home/jenkins/workspace/Lucene-Solr-5.5-Linux/lucene/common-build.xml:1033: There were test failures: 566 suites (7 ignored), 2275 tests, 1 error, 84 ignored (39 assumptions) [seed: 1AA74E5DBA90B315]

Total time: 53 minutes 4 seconds
Build step 'Invoke Ant' marked build as failure
Archiving artifacts
[WARNINGS] Skipping publisher since build result is FAILURE
Recording test results
Email was triggered for: Failure - Any
Sending email for trigger: Failure - Any



Mime
View raw message