lucene-dev mailing list archives

Site index · List index
Message view « Date » · « Thread »
Top « Date » · « Thread »
From Policeman Jenkins Server <jenk...@thetaphi.de>
Subject [JENKINS] Lucene-Solr-5.5-Linux (64bit/jdk1.7.0_80) - Build # 127 - Failure!
Date Fri, 26 Feb 2016 13:30:58 GMT
Build: http://jenkins.thetaphi.de/job/Lucene-Solr-5.5-Linux/127/
Java: 64bit/jdk1.7.0_80 -XX:+UseCompressedOops -XX:+UseG1GC

1 tests failed.
FAILED:  org.apache.solr.core.TestNRTOpen.testSharedCores

Error Message:
expected:<3> but was:<1>

Stack Trace:
java.lang.AssertionError: expected:<3> but was:<1>
	at __randomizedtesting.SeedInfo.seed([52E8CCD11BF78518:B4EB869E9301A817]:0)
	at org.junit.Assert.fail(Assert.java:93)
	at org.junit.Assert.failNotEquals(Assert.java:647)
	at org.junit.Assert.assertEquals(Assert.java:128)
	at org.junit.Assert.assertEquals(Assert.java:472)
	at org.junit.Assert.assertEquals(Assert.java:456)
	at org.apache.solr.core.TestNRTOpen.testSharedCores(TestNRTOpen.java:116)
	at sun.reflect.NativeMethodAccessorImpl.invoke0(Native Method)
	at sun.reflect.NativeMethodAccessorImpl.invoke(NativeMethodAccessorImpl.java:57)
	at sun.reflect.DelegatingMethodAccessorImpl.invoke(DelegatingMethodAccessorImpl.java:43)
	at java.lang.reflect.Method.invoke(Method.java:606)
	at com.carrotsearch.randomizedtesting.RandomizedRunner.invoke(RandomizedRunner.java:1764)
	at com.carrotsearch.randomizedtesting.RandomizedRunner$8.evaluate(RandomizedRunner.java:871)
	at com.carrotsearch.randomizedtesting.RandomizedRunner$9.evaluate(RandomizedRunner.java:907)
	at com.carrotsearch.randomizedtesting.RandomizedRunner$10.evaluate(RandomizedRunner.java:921)
	at com.carrotsearch.randomizedtesting.rules.SystemPropertiesRestoreRule$1.evaluate(SystemPropertiesRestoreRule.java:57)
	at org.apache.lucene.util.TestRuleSetupTeardownChained$1.evaluate(TestRuleSetupTeardownChained.java:49)
	at org.apache.lucene.util.AbstractBeforeAfterRule$1.evaluate(AbstractBeforeAfterRule.java:45)
	at org.apache.lucene.util.TestRuleThreadAndTestName$1.evaluate(TestRuleThreadAndTestName.java:48)
	at org.apache.lucene.util.TestRuleIgnoreAfterMaxFailures$1.evaluate(TestRuleIgnoreAfterMaxFailures.java:64)
	at org.apache.lucene.util.TestRuleMarkFailure$1.evaluate(TestRuleMarkFailure.java:47)
	at com.carrotsearch.randomizedtesting.rules.StatementAdapter.evaluate(StatementAdapter.java:36)
	at com.carrotsearch.randomizedtesting.ThreadLeakControl$StatementRunner.run(ThreadLeakControl.java:367)
	at com.carrotsearch.randomizedtesting.ThreadLeakControl.forkTimeoutingTask(ThreadLeakControl.java:809)
	at com.carrotsearch.randomizedtesting.ThreadLeakControl$3.evaluate(ThreadLeakControl.java:460)
	at com.carrotsearch.randomizedtesting.RandomizedRunner.runSingleTest(RandomizedRunner.java:880)
	at com.carrotsearch.randomizedtesting.RandomizedRunner$5.evaluate(RandomizedRunner.java:781)
	at com.carrotsearch.randomizedtesting.RandomizedRunner$6.evaluate(RandomizedRunner.java:816)
	at com.carrotsearch.randomizedtesting.RandomizedRunner$7.evaluate(RandomizedRunner.java:827)
	at com.carrotsearch.randomizedtesting.rules.StatementAdapter.evaluate(StatementAdapter.java:36)
	at com.carrotsearch.randomizedtesting.rules.SystemPropertiesRestoreRule$1.evaluate(SystemPropertiesRestoreRule.java:57)
	at org.apache.lucene.util.AbstractBeforeAfterRule$1.evaluate(AbstractBeforeAfterRule.java:45)
	at com.carrotsearch.randomizedtesting.rules.StatementAdapter.evaluate(StatementAdapter.java:36)
	at org.apache.lucene.util.TestRuleStoreClassName$1.evaluate(TestRuleStoreClassName.java:41)
	at com.carrotsearch.randomizedtesting.rules.NoShadowingOrOverridesOnMethodsRule$1.evaluate(NoShadowingOrOverridesOnMethodsRule.java:40)
	at com.carrotsearch.randomizedtesting.rules.NoShadowingOrOverridesOnMethodsRule$1.evaluate(NoShadowingOrOverridesOnMethodsRule.java:40)
	at com.carrotsearch.randomizedtesting.rules.StatementAdapter.evaluate(StatementAdapter.java:36)
	at com.carrotsearch.randomizedtesting.rules.StatementAdapter.evaluate(StatementAdapter.java:36)
	at com.carrotsearch.randomizedtesting.rules.StatementAdapter.evaluate(StatementAdapter.java:36)
	at org.apache.lucene.util.TestRuleAssertionsRequired$1.evaluate(TestRuleAssertionsRequired.java:53)
	at org.apache.lucene.util.TestRuleMarkFailure$1.evaluate(TestRuleMarkFailure.java:47)
	at org.apache.lucene.util.TestRuleIgnoreAfterMaxFailures$1.evaluate(TestRuleIgnoreAfterMaxFailures.java:64)
	at org.apache.lucene.util.TestRuleIgnoreTestSuites$1.evaluate(TestRuleIgnoreTestSuites.java:54)
	at com.carrotsearch.randomizedtesting.rules.StatementAdapter.evaluate(StatementAdapter.java:36)
	at com.carrotsearch.randomizedtesting.ThreadLeakControl$StatementRunner.run(ThreadLeakControl.java:367)
	at java.lang.Thread.run(Thread.java:745)




Build Log:
[...truncated 11043 lines...]
   [junit4] Suite: org.apache.solr.core.TestNRTOpen
   [junit4]   2> Creating dataDir: /home/jenkins/workspace/Lucene-Solr-5.5-Linux/solr/build/solr-core/test/J2/temp/solr.core.TestNRTOpen_52E8CCD11BF78518-001/init-core-data-001
   [junit4]   2> 632973 INFO  (SUITE-TestNRTOpen-seed#[52E8CCD11BF78518]-worker) [    ] o.a.s.SolrTestCaseJ4 Randomized ssl (true) and clientAuth (false)
   [junit4]   2> 632973 INFO  (SUITE-TestNRTOpen-seed#[52E8CCD11BF78518]-worker) [    ] o.a.s.SolrTestCaseJ4 ####initCore
   [junit4]   2> 632973 INFO  (SUITE-TestNRTOpen-seed#[52E8CCD11BF78518]-worker) [    ] o.a.s.c.SolrResourceLoader new SolrResourceLoader for directory: '/home/jenkins/workspace/Lucene-Solr-5.5-Linux/solr/core/src/test-files/solr/collection1'
   [junit4]   2> 632973 INFO  (SUITE-TestNRTOpen-seed#[52E8CCD11BF78518]-worker) [    ] o.a.s.c.SolrResourceLoader JNDI not configured for solr (NoInitialContextEx)
   [junit4]   2> 632973 INFO  (SUITE-TestNRTOpen-seed#[52E8CCD11BF78518]-worker) [    ] o.a.s.c.SolrResourceLoader using system property solr.solr.home: /home/jenkins/workspace/Lucene-Solr-5.5-Linux/solr/core/src/test-files/solr
   [junit4]   2> 632974 INFO  (SUITE-TestNRTOpen-seed#[52E8CCD11BF78518]-worker) [    ] o.a.s.c.SolrResourceLoader Adding 'file:/home/jenkins/workspace/Lucene-Solr-5.5-Linux/solr/core/src/test-files/solr/collection1/lib/classes/' to classloader
   [junit4]   2> 632974 INFO  (SUITE-TestNRTOpen-seed#[52E8CCD11BF78518]-worker) [    ] o.a.s.c.SolrResourceLoader Adding 'file:/home/jenkins/workspace/Lucene-Solr-5.5-Linux/solr/core/src/test-files/solr/collection1/lib/README' to classloader
   [junit4]   2> 632992 INFO  (SUITE-TestNRTOpen-seed#[52E8CCD11BF78518]-worker) [    ] o.a.s.c.SolrConfig current version of requestparams : -1
   [junit4]   2> 633001 INFO  (SUITE-TestNRTOpen-seed#[52E8CCD11BF78518]-worker) [    ] o.a.s.c.SolrConfig Using Lucene MatchVersion: 5.5.0
   [junit4]   2> 633016 INFO  (SUITE-TestNRTOpen-seed#[52E8CCD11BF78518]-worker) [    ] o.a.s.c.SolrConfig Loaded SolrConfig: solrconfig-basic.xml
   [junit4]   2> 633019 INFO  (SUITE-TestNRTOpen-seed#[52E8CCD11BF78518]-worker) [    ] o.a.s.s.IndexSchema [null] Schema name=minimal
   [junit4]   2> 633022 WARN  (SUITE-TestNRTOpen-seed#[52E8CCD11BF78518]-worker) [    ] o.a.s.s.IndexSchema no uniqueKey specified in schema.
   [junit4]   2> 633023 INFO  (SUITE-TestNRTOpen-seed#[52E8CCD11BF78518]-worker) [    ] o.a.s.c.SolrResourceLoader JNDI not configured for solr (NoInitialContextEx)
   [junit4]   2> 633023 INFO  (SUITE-TestNRTOpen-seed#[52E8CCD11BF78518]-worker) [    ] o.a.s.c.SolrResourceLoader using system property solr.solr.home: /home/jenkins/workspace/Lucene-Solr-5.5-Linux/solr/core/src/test-files/solr
   [junit4]   2> 633023 INFO  (SUITE-TestNRTOpen-seed#[52E8CCD11BF78518]-worker) [    ] o.a.s.c.SolrResourceLoader new SolrResourceLoader for directory: '/home/jenkins/workspace/Lucene-Solr-5.5-Linux/solr/core/src/test-files/solr'
   [junit4]   2> 633023 INFO  (SUITE-TestNRTOpen-seed#[52E8CCD11BF78518]-worker) [    ] o.a.s.c.SolrResourceLoader JNDI not configured for solr (NoInitialContextEx)
   [junit4]   2> 633023 INFO  (SUITE-TestNRTOpen-seed#[52E8CCD11BF78518]-worker) [    ] o.a.s.c.SolrResourceLoader using system property solr.solr.home: /home/jenkins/workspace/Lucene-Solr-5.5-Linux/solr/core/src/test-files/solr
   [junit4]   2> 633023 INFO  (SUITE-TestNRTOpen-seed#[52E8CCD11BF78518]-worker) [    ] o.a.s.c.CoreContainer New CoreContainer 613299086
   [junit4]   2> 633023 INFO  (SUITE-TestNRTOpen-seed#[52E8CCD11BF78518]-worker) [    ] o.a.s.c.CoreContainer Loading cores into CoreContainer [instanceDir=/home/jenkins/workspace/Lucene-Solr-5.5-Linux/solr/core/src/test-files/solr]
   [junit4]   2> 633023 WARN  (SUITE-TestNRTOpen-seed#[52E8CCD11BF78518]-worker) [    ] o.a.s.c.CoreContainer Couldn't add files from /home/jenkins/workspace/Lucene-Solr-5.5-Linux/solr/core/src/test-files/solr/lib to classpath: /home/jenkins/workspace/Lucene-Solr-5.5-Linux/solr/core/src/test-files/solr/lib
   [junit4]   2> 633024 INFO  (SUITE-TestNRTOpen-seed#[52E8CCD11BF78518]-worker) [    ] o.a.s.h.c.HttpShardHandlerFactory created with socketTimeout : 600000,connTimeout : 60000,maxConnectionsPerHost : 20,maxConnections : 10000,corePoolSize : 0,maximumPoolSize : 2147483647,maxThreadIdleTime : 5,sizeOfQueue : -1,fairnessPolicy : false,useRetries : false,
   [junit4]   2> 633026 INFO  (SUITE-TestNRTOpen-seed#[52E8CCD11BF78518]-worker) [    ] o.a.s.u.UpdateShardHandler Creating UpdateShardHandler HTTP client with params: socketTimeout=30000&connTimeout=30000&retry=true
   [junit4]   2> 633027 INFO  (SUITE-TestNRTOpen-seed#[52E8CCD11BF78518]-worker) [    ] o.a.s.l.LogWatcher SLF4J impl is org.slf4j.impl.Log4jLoggerFactory
   [junit4]   2> 633027 INFO  (SUITE-TestNRTOpen-seed#[52E8CCD11BF78518]-worker) [    ] o.a.s.l.LogWatcher Registering Log Listener [Log4j (org.slf4j.impl.Log4jLoggerFactory)]
   [junit4]   2> 633027 INFO  (SUITE-TestNRTOpen-seed#[52E8CCD11BF78518]-worker) [    ] o.a.s.c.CoreContainer Security conf doesn't exist. Skipping setup for authorization module.
   [junit4]   2> 633027 INFO  (SUITE-TestNRTOpen-seed#[52E8CCD11BF78518]-worker) [    ] o.a.s.c.CoreContainer No authentication plugin used.
   [junit4]   2> 633028 INFO  (SUITE-TestNRTOpen-seed#[52E8CCD11BF78518]-worker) [    ] o.a.s.c.CoreDescriptor Created CoreDescriptor: {dataDir=/home/jenkins/workspace/Lucene-Solr-5.5-Linux/solr/build/solr-core/test/J2/temp/solr.core.TestNRTOpen_52E8CCD11BF78518-001/init-core-data-001, shard=shard1, schema=schema-minimal.xml, loadOnStartup=true, config=solrconfig-basic.xml, configSetProperties=configsetprops.json, name=collection1, transient=false, collection=collection1}
   [junit4]   2> 633028 INFO  (coreLoadExecutor-2361-thread-1) [    ] o.a.s.c.SolrResourceLoader new SolrResourceLoader for directory: '/home/jenkins/workspace/Lucene-Solr-5.5-Linux/solr/core/src/test-files/solr/collection1'
   [junit4]   2> 633028 INFO  (coreLoadExecutor-2361-thread-1) [    ] o.a.s.c.SolrResourceLoader JNDI not configured for solr (NoInitialContextEx)
   [junit4]   2> 633028 INFO  (coreLoadExecutor-2361-thread-1) [    ] o.a.s.c.SolrResourceLoader using system property solr.solr.home: /home/jenkins/workspace/Lucene-Solr-5.5-Linux/solr/core/src/test-files/solr
   [junit4]   2> 633028 INFO  (coreLoadExecutor-2361-thread-1) [    ] o.a.s.c.SolrResourceLoader Adding 'file:/home/jenkins/workspace/Lucene-Solr-5.5-Linux/solr/core/src/test-files/solr/collection1/lib/classes/' to classloader
   [junit4]   2> 633028 INFO  (coreLoadExecutor-2361-thread-1) [    ] o.a.s.c.SolrResourceLoader Adding 'file:/home/jenkins/workspace/Lucene-Solr-5.5-Linux/solr/core/src/test-files/solr/collection1/lib/README' to classloader
   [junit4]   2> 633053 INFO  (coreLoadExecutor-2361-thread-1) [    ] o.a.s.c.SolrConfig current version of requestparams : -1
   [junit4]   2> 633065 INFO  (coreLoadExecutor-2361-thread-1) [    ] o.a.s.c.SolrConfig Using Lucene MatchVersion: 5.5.0
   [junit4]   2> 633087 INFO  (coreLoadExecutor-2361-thread-1) [    ] o.a.s.c.SolrConfig Loaded SolrConfig: solrconfig-basic.xml
   [junit4]   2> 633091 INFO  (coreLoadExecutor-2361-thread-1) [    ] o.a.s.s.IndexSchema [collection1] Schema name=minimal
   [junit4]   2> 633096 WARN  (coreLoadExecutor-2361-thread-1) [    ] o.a.s.s.IndexSchema no uniqueKey specified in schema.
   [junit4]   2> 633098 INFO  (coreLoadExecutor-2361-thread-1) [    ] o.a.s.c.ConfigSetProperties Did not find ConfigSet properties, assuming default properties: Can't find resource 'configsetprops.json' in classpath or '/home/jenkins/workspace/Lucene-Solr-5.5-Linux/solr/core/src/test-files/solr/collection1'
   [junit4]   2> 633098 INFO  (coreLoadExecutor-2361-thread-1) [    ] o.a.s.c.CoreContainer Creating SolrCore 'collection1' using configuration from instancedir /home/jenkins/workspace/Lucene-Solr-5.5-Linux/solr/core/src/test-files/solr/collection1
   [junit4]   2> 633098 INFO  (coreLoadExecutor-2361-thread-1) [    x:collection1] o.a.s.c.SolrCore solr.StandardDirectoryFactory
   [junit4]   2> 633099 INFO  (coreLoadExecutor-2361-thread-1) [    x:collection1] o.a.s.c.SolrCore [[collection1] ] Opening new SolrCore at [/home/jenkins/workspace/Lucene-Solr-5.5-Linux/solr/core/src/test-files/solr/collection1], dataDir=[/home/jenkins/workspace/Lucene-Solr-5.5-Linux/solr/build/solr-core/test/J2/temp/solr.core.TestNRTOpen_52E8CCD11BF78518-001/init-core-data-001/]
   [junit4]   2> 633099 INFO  (coreLoadExecutor-2361-thread-1) [    x:collection1] o.a.s.c.SolrCore JMX monitoring not detected for core: collection1
   [junit4]   2> 633099 INFO  (coreLoadExecutor-2361-thread-1) [    x:collection1] o.a.s.c.CachingDirectoryFactory return new directory for /home/jenkins/workspace/Lucene-Solr-5.5-Linux/solr/build/solr-core/test/J2/temp/solr.core.TestNRTOpen_52E8CCD11BF78518-001/init-core-data-001
   [junit4]   2> 633099 INFO  (coreLoadExecutor-2361-thread-1) [    x:collection1] o.a.s.c.SolrCore New index directory detected: old=null new=/home/jenkins/workspace/Lucene-Solr-5.5-Linux/solr/build/solr-core/test/J2/temp/solr.core.TestNRTOpen_52E8CCD11BF78518-001/init-core-data-001/index/
   [junit4]   2> 633099 WARN  (coreLoadExecutor-2361-thread-1) [    x:collection1] o.a.s.c.SolrCore [collection1] Solr index directory '/home/jenkins/workspace/Lucene-Solr-5.5-Linux/solr/build/solr-core/test/J2/temp/solr.core.TestNRTOpen_52E8CCD11BF78518-001/init-core-data-001/index' doesn't exist. Creating new index...
   [junit4]   2> 633099 INFO  (coreLoadExecutor-2361-thread-1) [    x:collection1] o.a.s.c.CachingDirectoryFactory return new directory for /home/jenkins/workspace/Lucene-Solr-5.5-Linux/solr/build/solr-core/test/J2/temp/solr.core.TestNRTOpen_52E8CCD11BF78518-001/init-core-data-001/index
   [junit4]   2> 633100 INFO  (coreLoadExecutor-2361-thread-1) [    x:collection1] o.a.s.u.RandomMergePolicy RandomMergePolicy wrapping class org.apache.lucene.index.TieredMergePolicy: [TieredMergePolicy: maxMergeAtOnce=29, maxMergeAtOnceExplicit=27, maxMergedSegmentMB=35.033203125, floorSegmentMB=0.44921875, forceMergeDeletesPctAllowed=0.5475455963236031, segmentsPerTier=23.0, maxCFSSegmentSizeMB=8.796093022207999E12, noCFSRatio=0.7318619817163515
   [junit4]   2> 633133 INFO  (coreLoadExecutor-2361-thread-1) [    x:collection1] o.a.s.c.SolrDeletionPolicy SolrDeletionPolicy.onCommit: commits: num=1
   [junit4]   2> 	commit{dir=/home/jenkins/workspace/Lucene-Solr-5.5-Linux/solr/build/solr-core/test/J2/temp/solr.core.TestNRTOpen_52E8CCD11BF78518-001/init-core-data-001/index,segFN=segments_1,generation=1}
   [junit4]   2> 633134 INFO  (coreLoadExecutor-2361-thread-1) [    x:collection1] o.a.s.c.SolrDeletionPolicy newest commit generation = 1
   [junit4]   2> 633134 INFO  (OldIndexDirectoryCleanupThreadForCore-collection1) [    x:collection1] o.a.s.c.SolrCore Looking for old index directories to cleanup for core collection1 in /home/jenkins/workspace/Lucene-Solr-5.5-Linux/solr/build/solr-core/test/J2/temp/solr.core.TestNRTOpen_52E8CCD11BF78518-001/init-core-data-001/
   [junit4]   2> 633135 INFO  (coreLoadExecutor-2361-thread-1) [    x:collection1] o.a.s.c.SolrCore no updateRequestProcessorChain defined as default, creating implicit default
   [junit4]   2> 633137 INFO  (coreLoadExecutor-2361-thread-1) [    x:collection1] o.a.s.h.l.XMLLoader xsltCacheLifetimeSeconds=60
   [junit4]   2> 633138 INFO  (coreLoadExecutor-2361-thread-1) [    x:collection1] o.a.s.h.l.XMLLoader xsltCacheLifetimeSeconds=60
   [junit4]   2> 633139 INFO  (coreLoadExecutor-2361-thread-1) [    x:collection1] o.a.s.h.l.XMLLoader xsltCacheLifetimeSeconds=60
   [junit4]   2> 633140 INFO  (coreLoadExecutor-2361-thread-1) [    x:collection1] o.a.s.h.l.XMLLoader xsltCacheLifetimeSeconds=60
   [junit4]   2> 633141 INFO  (coreLoadExecutor-2361-thread-1) [    x:collection1] o.a.s.c.RequestHandlers Registered paths: /update,/admin/mbeans,/admin/threads,/admin/system,/update/csv,/admin/file,/get,/replication,/admin/logging,/admin/luke,/schema,standard,/update/json,/admin/ping,/admin/segments,/admin/properties,/config,/admin/plugins,/update/json/docs
   [junit4]   2> 633141 INFO  (coreLoadExecutor-2361-thread-1) [    x:collection1] o.a.s.c.SolrCore Using default statsCache cache: org.apache.solr.search.stats.LocalStatsCache
   [junit4]   2> 633142 INFO  (coreLoadExecutor-2361-thread-1) [    x:collection1] o.a.s.u.CommitTracker Hard AutoCommit: disabled
   [junit4]   2> 633142 INFO  (coreLoadExecutor-2361-thread-1) [    x:collection1] o.a.s.u.CommitTracker Soft AutoCommit: disabled
   [junit4]   2> 633142 INFO  (coreLoadExecutor-2361-thread-1) [    x:collection1] o.a.s.u.RandomMergePolicy RandomMergePolicy wrapping class org.apache.lucene.index.LogByteSizeMergePolicy: [LogByteSizeMergePolicy: minMergeSize=1677721, mergeFactor=25, maxMergeSize=2147483648, maxMergeSizeForForcedMerge=9223372036854775807, calibrateSizeByDeletes=true, maxMergeDocs=2147483647, maxCFSSegmentSizeMB=8.796093022207999E12, noCFSRatio=0.37704982241332385]
   [junit4]   2> 633142 INFO  (coreLoadExecutor-2361-thread-1) [    x:collection1] o.a.s.c.SolrDeletionPolicy SolrDeletionPolicy.onInit: commits: num=1
   [junit4]   2> 	commit{dir=/home/jenkins/workspace/Lucene-Solr-5.5-Linux/solr/build/solr-core/test/J2/temp/solr.core.TestNRTOpen_52E8CCD11BF78518-001/init-core-data-001/index,segFN=segments_1,generation=1}
   [junit4]   2> 633143 INFO  (coreLoadExecutor-2361-thread-1) [    x:collection1] o.a.s.c.SolrDeletionPolicy newest commit generation = 1
   [junit4]   2> 633143 INFO  (coreLoadExecutor-2361-thread-1) [    x:collection1] o.a.s.s.SolrIndexSearcher Opening Searcher@256200f1[collection1] main
   [junit4]   2> 633143 WARN  (coreLoadExecutor-2361-thread-1) [    x:collection1] o.a.s.r.ManagedResourceStorage Cannot write to config directory /home/jenkins/workspace/Lucene-Solr-5.5-Linux/solr/core/src/test-files/solr/collection1/conf; switching to use InMemory storage instead.
   [junit4]   2> 633143 INFO  (coreLoadExecutor-2361-thread-1) [    x:collection1] o.a.s.r.RestManager Initializing RestManager with initArgs: {}
   [junit4]   2> 633143 INFO  (coreLoadExecutor-2361-thread-1) [    x:collection1] o.a.s.r.ManagedResourceStorage Reading _rest_managed.json using InMemoryStorage
   [junit4]   2> 633143 INFO  (coreLoadExecutor-2361-thread-1) [    x:collection1] o.a.s.r.RestManager Initializing 0 registered ManagedResources
   [junit4]   2> 633143 INFO  (coreLoadExecutor-2361-thread-1) [    x:collection1] o.a.s.h.ReplicationHandler Commits will be reserved for  10000
   [junit4]   2> 633143 INFO  (searcherExecutor-2362-thread-1-processing-x:collection1) [    x:collection1] o.a.s.c.SolrCore [collection1] Registered new searcher Searcher@256200f1[collection1] main{ExitableDirectoryReader(UninvertingDirectoryReader())}
   [junit4]   2> 633143 INFO  (coreLoadExecutor-2361-thread-1) [    x:collection1] o.a.s.c.CoreContainer registering core: collection1
   [junit4]   2> 633144 INFO  (SUITE-TestNRTOpen-seed#[52E8CCD11BF78518]-worker) [    ] o.a.s.SolrTestCaseJ4 ####initCore end
   [junit4]   2> 633145 INFO  (SUITE-TestNRTOpen-seed#[52E8CCD11BF78518]-worker) [    ] o.a.s.u.p.LogUpdateProcessorFactory [collection1]  webapp=null path=null params={}{add=[(null)]} 0 1
   [junit4]   2> 633147 INFO  (SUITE-TestNRTOpen-seed#[52E8CCD11BF78518]-worker) [    ] o.a.s.u.DirectUpdateHandler2 start commit{,optimize=false,openSearcher=true,waitSearcher=true,expungeDeletes=false,softCommit=false,prepareCommit=false}
   [junit4]   2> 633238 INFO  (SUITE-TestNRTOpen-seed#[52E8CCD11BF78518]-worker) [    ] o.a.s.c.SolrDeletionPolicy SolrDeletionPolicy.onCommit: commits: num=2
   [junit4]   2> 	commit{dir=/home/jenkins/workspace/Lucene-Solr-5.5-Linux/solr/build/solr-core/test/J2/temp/solr.core.TestNRTOpen_52E8CCD11BF78518-001/init-core-data-001/index,segFN=segments_1,generation=1}
   [junit4]   2> 	commit{dir=/home/jenkins/workspace/Lucene-Solr-5.5-Linux/solr/build/solr-core/test/J2/temp/solr.core.TestNRTOpen_52E8CCD11BF78518-001/init-core-data-001/index,segFN=segments_2,generation=2}
   [junit4]   2> 633239 INFO  (SUITE-TestNRTOpen-seed#[52E8CCD11BF78518]-worker) [    ] o.a.s.c.SolrDeletionPolicy newest commit generation = 2
   [junit4]   2> 633241 INFO  (SUITE-TestNRTOpen-seed#[52E8CCD11BF78518]-worker) [    ] o.a.s.s.SolrIndexSearcher Opening Searcher@56d114b5[collection1] main
   [junit4]   2> 633242 INFO  (SUITE-TestNRTOpen-seed#[52E8CCD11BF78518]-worker) [    ] o.a.s.u.DirectUpdateHandler2 end_commit_flush
   [junit4]   2> 633242 INFO  (searcherExecutor-2362-thread-1) [    ] o.a.s.c.SolrCore [collection1] Registered new searcher Searcher@56d114b5[collection1] main{ExitableDirectoryReader(UninvertingDirectoryReader(Uninverting(_0(5.5.0):c1)))}
   [junit4]   2> 633242 INFO  (SUITE-TestNRTOpen-seed#[52E8CCD11BF78518]-worker) [    ] o.a.s.u.p.LogUpdateProcessorFactory [collection1]  webapp=null path=null params={}{commit=} 0 94
   [junit4]   2> 633242 INFO  (SUITE-TestNRTOpen-seed#[52E8CCD11BF78518]-worker) [    ] o.a.s.SolrTestCaseJ4 ###deleteCore
   [junit4]   2> 633243 INFO  (SUITE-TestNRTOpen-seed#[52E8CCD11BF78518]-worker) [    ] o.a.s.c.CoreContainer Shutting down CoreContainer instance=613299086
   [junit4]   2> 633243 INFO  (coreCloseExecutor-2366-thread-1) [    x:collection1] o.a.s.c.SolrCore [collection1]  CLOSING SolrCore org.apache.solr.core.SolrCore@43da4e0f
   [junit4]   2> 633243 INFO  (coreCloseExecutor-2366-thread-1) [    x:collection1] o.a.s.u.DirectUpdateHandler2 closing DirectUpdateHandler2{commits=1,autocommits=0,soft autocommits=0,optimizes=0,rollbacks=0,expungeDeletes=0,docsPending=0,adds=0,deletesById=0,deletesByQuery=0,errors=0,cumulative_adds=1,cumulative_deletesById=0,cumulative_deletesByQuery=0,cumulative_errors=0}
   [junit4]   2> 633244 INFO  (coreCloseExecutor-2366-thread-1) [    x:collection1] o.a.s.u.SolrCoreState Closing SolrCoreState
   [junit4]   2> 633244 INFO  (coreCloseExecutor-2366-thread-1) [    x:collection1] o.a.s.u.DefaultSolrCoreState SolrCoreState ref count has reached 0 - closing IndexWriter
   [junit4]   2> 633244 INFO  (coreCloseExecutor-2366-thread-1) [    x:collection1] o.a.s.u.DefaultSolrCoreState closing IndexWriter with IndexWriterCloser
   [junit4]   2> 633245 INFO  (coreCloseExecutor-2366-thread-1) [    x:collection1] o.a.s.c.SolrCore [collection1] Closing main searcher on request.
   [junit4]   2> 633245 INFO  (coreCloseExecutor-2366-thread-1) [    x:collection1] o.a.s.c.CachingDirectoryFactory Closing StandardDirectoryFactory - 2 directories currently being tracked
   [junit4]   2> 633245 INFO  (coreCloseExecutor-2366-thread-1) [    x:collection1] o.a.s.c.CachingDirectoryFactory looking to close /home/jenkins/workspace/Lucene-Solr-5.5-Linux/solr/build/solr-core/test/J2/temp/solr.core.TestNRTOpen_52E8CCD11BF78518-001/init-core-data-001/index [CachedDir<<refCount=0;path=/home/jenkins/workspace/Lucene-Solr-5.5-Linux/solr/build/solr-core/test/J2/temp/solr.core.TestNRTOpen_52E8CCD11BF78518-001/init-core-data-001/index;done=false>>]
   [junit4]   2> 633246 INFO  (coreCloseExecutor-2366-thread-1) [    x:collection1] o.a.s.c.CachingDirectoryFactory Closing directory: /home/jenkins/workspace/Lucene-Solr-5.5-Linux/solr/build/solr-core/test/J2/temp/solr.core.TestNRTOpen_52E8CCD11BF78518-001/init-core-data-001/index
   [junit4]   2> 633246 INFO  (coreCloseExecutor-2366-thread-1) [    x:collection1] o.a.s.c.CachingDirectoryFactory looking to close /home/jenkins/workspace/Lucene-Solr-5.5-Linux/solr/build/solr-core/test/J2/temp/solr.core.TestNRTOpen_52E8CCD11BF78518-001/init-core-data-001 [CachedDir<<refCount=0;path=/home/jenkins/workspace/Lucene-Solr-5.5-Linux/solr/build/solr-core/test/J2/temp/solr.core.TestNRTOpen_52E8CCD11BF78518-001/init-core-data-001;done=false>>]
   [junit4]   2> 633246 INFO  (coreCloseExecutor-2366-thread-1) [    x:collection1] o.a.s.c.CachingDirectoryFactory Closing directory: /home/jenkins/workspace/Lucene-Solr-5.5-Linux/solr/build/solr-core/test/J2/temp/solr.core.TestNRTOpen_52E8CCD11BF78518-001/init-core-data-001
   [junit4]   2> 633246 INFO  (SUITE-TestNRTOpen-seed#[52E8CCD11BF78518]-worker) [    ] o.a.s.SolrTestCaseJ4 ####initCore
   [junit4]   2> 633247 INFO  (SUITE-TestNRTOpen-seed#[52E8CCD11BF78518]-worker) [    ] o.a.s.c.SolrResourceLoader new SolrResourceLoader for directory: '/home/jenkins/workspace/Lucene-Solr-5.5-Linux/solr/core/src/test-files/solr/collection1'
   [junit4]   2> 633247 INFO  (SUITE-TestNRTOpen-seed#[52E8CCD11BF78518]-worker) [    ] o.a.s.c.SolrResourceLoader JNDI not configured for solr (NoInitialContextEx)
   [junit4]   2> 633247 INFO  (SUITE-TestNRTOpen-seed#[52E8CCD11BF78518]-worker) [    ] o.a.s.c.SolrResourceLoader using system property solr.solr.home: /home/jenkins/workspace/Lucene-Solr-5.5-Linux/solr/core/src/test-files/solr
   [junit4]   2> 633247 INFO  (SUITE-TestNRTOpen-seed#[52E8CCD11BF78518]-worker) [    ] o.a.s.c.SolrResourceLoader Adding 'file:/home/jenkins/workspace/Lucene-Solr-5.5-Linux/solr/core/src/test-files/solr/collection1/lib/classes/' to classloader
   [junit4]   2> 633247 INFO  (SUITE-TestNRTOpen-seed#[52E8CCD11BF78518]-worker) [    ] o.a.s.c.SolrResourceLoader Adding 'file:/home/jenkins/workspace/Lucene-Solr-5.5-Linux/solr/core/src/test-files/solr/collection1/lib/README' to classloader
   [junit4]   2> 633274 INFO  (SUITE-TestNRTOpen-seed#[52E8CCD11BF78518]-worker) [    ] o.a.s.c.SolrConfig current version of requestparams : -1
   [junit4]   2> 633285 INFO  (SUITE-TestNRTOpen-seed#[52E8CCD11BF78518]-worker) [    ] o.a.s.c.SolrConfig Using Lucene MatchVersion: 5.5.0
   [junit4]   2> 633306 INFO  (SUITE-TestNRTOpen-seed#[52E8CCD11BF78518]-worker) [    ] o.a.s.c.SolrConfig Loaded SolrConfig: solrconfig-basic.xml
   [junit4]   2> 633310 INFO  (SUITE-TestNRTOpen-seed#[52E8CCD11BF78518]-worker) [    ] o.a.s.s.IndexSchema [null] Schema name=minimal
   [junit4]   2> 633316 WARN  (SUITE-TestNRTOpen-seed#[52E8CCD11BF78518]-worker) [    ] o.a.s.s.IndexSchema no uniqueKey specified in schema.
   [junit4]   2> 633316 INFO  (SUITE-TestNRTOpen-seed#[52E8CCD11BF78518]-worker) [    ] o.a.s.c.SolrResourceLoader JNDI not configured for solr (NoInitialContextEx)
   [junit4]   2> 633316 INFO  (SUITE-TestNRTOpen-seed#[52E8CCD11BF78518]-worker) [    ] o.a.s.c.SolrResourceLoader using system property solr.solr.home: /home/jenkins/workspace/Lucene-Solr-5.5-Linux/solr/core/src/test-files/solr
   [junit4]   2> 633316 INFO  (SUITE-TestNRTOpen-seed#[52E8CCD11BF78518]-worker) [    ] o.a.s.c.SolrResourceLoader new SolrResourceLoader for directory: '/home/jenkins/workspace/Lucene-Solr-5.5-Linux/solr/core/src/test-files/solr'
   [junit4]   2> 633316 INFO  (SUITE-TestNRTOpen-seed#[52E8CCD11BF78518]-worker) [    ] o.a.s.c.SolrResourceLoader JNDI not configured for solr (NoInitialContextEx)
   [junit4]   2> 633316 INFO  (SUITE-TestNRTOpen-seed#[52E8CCD11BF78518]-worker) [    ] o.a.s.c.SolrResourceLoader using system property solr.solr.home: /home/jenkins/workspace/Lucene-Solr-5.5-Linux/solr/core/src/test-files/solr
   [junit4]   2> 633317 INFO  (SUITE-TestNRTOpen-seed#[52E8CCD11BF78518]-worker) [    ] o.a.s.c.CoreContainer New CoreContainer 1753478359
   [junit4]   2> 633317 INFO  (SUITE-TestNRTOpen-seed#[52E8CCD11BF78518]-worker) [    ] o.a.s.c.CoreContainer Loading cores into CoreContainer [instanceDir=/home/jenkins/workspace/Lucene-Solr-5.5-Linux/solr/core/src/test-files/solr]
   [junit4]   2> 633317 WARN  (SUITE-TestNRTOpen-seed#[52E8CCD11BF78518]-worker) [    ] o.a.s.c.CoreContainer Couldn't add files from /home/jenkins/workspace/Lucene-Solr-5.5-Linux/solr/core/src/test-files/solr/lib to classpath: /home/jenkins/workspace/Lucene-Solr-5.5-Linux/solr/core/src/test-files/solr/lib
   [junit4]   2> 633317 INFO  (SUITE-TestNRTOpen-seed#[52E8CCD11BF78518]-worker) [    ] o.a.s.h.c.HttpShardHandlerFactory created with socketTimeout : 600000,connTimeout : 60000,maxConnectionsPerHost : 20,maxConnections : 10000,corePoolSize : 0,maximumPoolSize : 2147483647,maxThreadIdleTime : 5,sizeOfQueue : -1,fairnessPolicy : false,useRetries : false,
   [junit4]   2> 633320 INFO  (SUITE-TestNRTOpen-seed#[52E8CCD11BF78518]-worker) [    ] o.a.s.u.UpdateShardHandler Creating UpdateShardHandler HTTP client with params: socketTimeout=30000&connTimeout=30000&retry=true
   [junit4]   2> 633321 INFO  (SUITE-TestNRTOpen-seed#[52E8CCD11BF78518]-worker) [    ] o.a.s.l.LogWatcher SLF4J impl is org.slf4j.impl.Log4jLoggerFactory
   [junit4]   2> 633321 INFO  (SUITE-TestNRTOpen-seed#[52E8CCD11BF78518]-worker) [    ] o.a.s.l.LogWatcher Registering Log Listener [Log4j (org.slf4j.impl.Log4jLoggerFactory)]
   [junit4]   2> 633321 INFO  (SUITE-TestNRTOpen-seed#[52E8CCD11BF78518]-worker) [    ] o.a.s.c.CoreContainer Security conf doesn't exist. Skipping setup for authorization module.
   [junit4]   2> 633321 INFO  (SUITE-TestNRTOpen-seed#[52E8CCD11BF78518]-worker) [    ] o.a.s.c.CoreContainer No authentication plugin used.
   [junit4]   2> 633322 INFO  (SUITE-TestNRTOpen-seed#[52E8CCD11BF78518]-worker) [    ] o.a.s.c.CoreDescriptor Created CoreDescriptor: {shard=shard1, configSetProperties=configsetprops.json, transient=false, schema=schema-minimal.xml, dataDir=/home/jenkins/workspace/Lucene-Solr-5.5-Linux/solr/build/solr-core/test/J2/temp/solr.core.TestNRTOpen_52E8CCD11BF78518-001/init-core-data-001, name=collection1, config=solrconfig-basic.xml, loadOnStartup=true, collection=collection1}
   [junit4]   2> 633322 INFO  (coreLoadExecutor-2372-thread-1) [    ] o.a.s.c.SolrResourceLoader new SolrResourceLoader for directory: '/home/jenkins/workspace/Lucene-Solr-5.5-Linux/solr/core/src/test-files/solr/collection1'
   [junit4]   2> 633322 INFO  (coreLoadExecutor-2372-thread-1) [    ] o.a.s.c.SolrResourceLoader JNDI not configured for solr (NoInitialContextEx)
   [junit4]   2> 633322 INFO  (coreLoadExecutor-2372-thread-1) [    ] o.a.s.c.SolrResourceLoader using system property solr.solr.home: /home/jenkins/workspace/Lucene-Solr-5.5-Linux/solr/core/src/test-files/solr
   [junit4]   2> 633323 INFO  (coreLoadExecutor-2372-thread-1) [    ] o.a.s.c.SolrResourceLoader Adding 'file:/home/jenkins/workspace/Lucene-Solr-5.5-Linux/solr/core/src/test-files/solr/collection1/lib/classes/' to classloader
   [junit4]   2> 633323 INFO  (coreLoadExecutor-2372-thread-1) [    ] o.a.s.c.SolrResourceLoader Adding 'file:/home/jenkins/workspace/Lucene-Solr-5.5-Linux/solr/core/src/test-files/solr/collection1/lib/README' to classloader
   [junit4]   2> 633341 INFO  (coreLoadExecutor-2372-thread-1) [    ] o.a.s.c.SolrConfig current version of requestparams : -1
   [junit4]   2> 633348 INFO  (coreLoadExecutor-2372-thread-1) [    ] o.a.s.c.SolrConfig Using Lucene MatchVersion: 5.5.0
   [junit4]   2> 633362 INFO  (coreLoadExecutor-2372-thread-1) [    ] o.a.s.c.SolrConfig Loaded SolrConfig: solrconfig-basic.xml
   [junit4]   2> 633365 INFO  (coreLoadExecutor-2372-thread-1) [    ] o.a.s.s.IndexSchema [collection1] Schema name=minimal
   [junit4]   2> 633368 WARN  (coreLoadExecutor-2372-thread-1) [    ] o.a.s.s.IndexSchema no uniqueKey specified in schema.
   [junit4]   2> 633369 INFO  (coreLoadExecutor-2372-thread-1) [    ] o.a.s.c.ConfigSetProperties Did not find ConfigSet properties, assuming default properties: Can't find resource 'configsetprops.json' in classpath or '/home/jenkins/workspace/Lucene-Solr-5.5-Linux/solr/core/src/test-files/solr/collection1'
   [junit4]   2> 633369 INFO  (coreLoadExecutor-2372-thread-1) [    ] o.a.s.c.CoreContainer Creating SolrCore 'collection1' using configuration from instancedir /home/jenkins/workspace/Lucene-Solr-5.5-Linux/solr/core/src/test-files/solr/collection1
   [junit4]   2> 633370 INFO  (coreLoadExecutor-2372-thread-1) [    x:collection1] o.a.s.c.SolrCore solr.StandardDirectoryFactory
   [junit4]   2> 633370 INFO  (coreLoadExecutor-2372-thread-1) [    x:collection1] o.a.s.c.SolrCore [[collection1] ] Opening new SolrCore at [/home/jenkins/workspace/Lucene-Solr-5.5-Linux/solr/core/src/test-files/solr/collection1], dataDir=[/home/jenkins/workspace/Lucene-Solr-5.5-Linux/solr/build/solr-core/test/J2/temp/solr.core.TestNRTOpen_52E8CCD11BF78518-001/init-core-data-001/]
   [junit4]   2> 633370 INFO  (coreLoadExecutor-2372-thread-1) [    x:collection1] o.a.s.c.SolrCore JMX monitoring not detected for core: collection1
   [junit4]   2> 633370 INFO  (coreLoadExecutor-2372-thread-1) [    x:collection1] o.a.s.c.CachingDirectoryFactory return new directory for /home/jenkins/workspace/Lucene-Solr-5.5-Linux/solr/build/solr-core/test/J2/temp/solr.core.TestNRTOpen_52E8CCD11BF78518-001/init-core-data-001
   [junit4]   2> 633370 INFO  (coreLoadExecutor-2372-thread-1) [    x:collection1] o.a.s.c.SolrCore New index directory detected: old=null new=/home/jenkins/workspace/Lucene-Solr-5.5-Linux/solr/build/solr-core/test/J2/temp/solr.core.TestNRTOpen_52E8CCD11BF78518-001/init-core-data-001/index/
   [junit4]   2> 633370 INFO  (OldIndexDirectoryCleanupThreadForCore-collection1) [    x:collection1] o.a.s.c.SolrCore Looking for old index directories to cleanup for core collection1 in /home/jenkins/workspace/Lucene-Solr-5.5-Linux/solr/build/solr-core/test/J2/temp/solr.core.TestNRTOpen_52E8CCD11BF78518-001/init-core-data-001/
   [junit4]   2> 633372 INFO  (coreLoadExecutor-2372-thread-1) [    x:collection1] o.a.s.c.SolrCore no updateRequestProcessorChain defined as default, creating implicit default
   [junit4]   2> 633373 INFO  (coreLoadExecutor-2372-thread-1) [    x:collection1] o.a.s.h.l.XMLLoader xsltCacheLifetimeSeconds=60
   [junit4]   2> 633374 INFO  (coreLoadExecutor-2372-thread-1) [    x:collection1] o.a.s.h.l.XMLLoader xsltCacheLifetimeSeconds=60
   [junit4]   2> 633375 INFO  (coreLoadExecutor-2372-thread-1) [    x:collection1] o.a.s.h.l.XMLLoader xsltCacheLifetimeSeconds=60
   [junit4]   2> 633376 INFO  (coreLoadExecutor-2372-thread-1) [    x:collection1] o.a.s.h.l.XMLLoader xsltCacheLifetimeSeconds=60
   [junit4]   2> 633376 INFO  (coreLoadExecutor-2372-thread-1) [    x:collection1] o.a.s.c.RequestHandlers Registered paths: /update,/admin/mbeans,/admin/threads,/admin/system,/update/csv,/admin/file,/get,/replication,/admin/logging,/admin/luke,/schema,standard,/update/json,/admin/ping,/admin/segments,/admin/properties,/config,/admin/plugins,/update/json/docs
   [junit4]   2> 633377 INFO  (coreLoadExecutor-2372-thread-1) [    x:collection1] o.a.s.c.SolrCore Using default statsCache cache: org.apache.solr.search.stats.LocalStatsCache
   [junit4]   2> 633377 INFO  (coreLoadExecutor-2372-thread-1) [    x:collection1] o.a.s.u.CommitTracker Hard AutoCommit: disabled
   [junit4]   2> 633377 INFO  (coreLoadExecutor-2372-thread-1) [    x:collection1] o.a.s.u.CommitTracker Soft AutoCommit: disabled
   [junit4]   2> 633377 INFO  (coreLoadExecutor-2372-thread-1) [    x:collection1] o.a.s.c.CachingDirectoryFactory return new directory for /home/jenkins/workspace/Lucene-Solr-5.5-Linux/solr/build/solr-core/test/J2/temp/solr.core.TestNRTOpen_52E8CCD11BF78518-001/init-core-data-001/index
   [junit4]   2> 633378 INFO  (coreLoadExecutor-2372-thread-1) [    x:collection1] o.a.s.u.RandomMergePolicy RandomMergePolicy wrapping class org.apache.lucene.index.TieredMergePolicy: [TieredMergePolicy: maxMergeAtOnce=29, maxMergeAtOnceExplicit=27, maxMergedSegmentMB=35.033203125, floorSegmentMB=0.44921875, forceMergeDeletesPctAllowed=0.5475455963236031, segmentsPerTier=23.0, maxCFSSegmentSizeMB=8.796093022207999E12, noCFSRatio=0.7318619817163515
   [junit4]   2> 633379 INFO  (coreLoadExecutor-2372-thread-1) [    x:collection1] o.a.s.c.SolrDeletionPolicy SolrDeletionPolicy.onInit: commits: num=1
   [junit4]   2> 	commit{dir=/home/jenkins/workspace/Lucene-Solr-5.5-Linux/solr/build/solr-core/test/J2/temp/solr.core.TestNRTOpen_52E8CCD11BF78518-001/init-core-data-001/index,segFN=segments_2,generation=2}
   [junit4]   2> 633379 INFO  (coreLoadExecutor-2372-thread-1) [    x:collection1] o.a.s.c.SolrDeletionPolicy newest commit generation = 2
   [junit4]   2> 633380 INFO  (coreLoadExecutor-2372-thread-1) [    x:collection1] o.a.s.s.SolrIndexSearcher Opening Searcher@4f568105[collection1] main
   [junit4]   2> 633380 WARN  (coreLoadExecutor-2372-thread-1) [    x:collection1] o.a.s.r.ManagedResourceStorage Cannot write to config directory /home/jenkins/workspace/Lucene-Solr-5.5-Linux/solr/core/src/test-files/solr/collection1/conf; switching to use InMemory storage instead.
   [junit4]   2> 633380 INFO  (coreLoadExecutor-2372-thread-1) [    x:collection1] o.a.s.r.RestManager Initializing RestManager with initArgs: {}
   [junit4]   2> 633380 INFO  (coreLoadExecutor-2372-thread-1) [    x:collection1] o.a.s.r.ManagedResourceStorage Reading _rest_managed.json using InMemoryStorage
   [junit4]   2> 633380 INFO  (coreLoadExecutor-2372-thread-1) [    x:collection1] o.a.s.r.RestManager Initializing 0 registered ManagedResources
   [junit4]   2> 633380 INFO  (coreLoadExecutor-2372-thread-1) [    x:collection1] o.a.s.h.ReplicationHandler Commits will be reserved for  10000
   [junit4]   2> 633380 INFO  (searcherExecutor-2373-thread-1-processing-x:collection1) [    x:collection1] o.a.s.c.SolrCore [collection1] Registered new searcher Searcher@4f568105[collection1] main{ExitableDirectoryReader(UninvertingDirectoryReader(Uninverting(_0(5.5.0):c1)))}
   [junit4]   2> 633380 INFO  (coreLoadExecutor-2372-thread-1) [    x:collection1] o.a.s.c.CoreContainer registering core: collection1
   [junit4]   2> 633381 INFO  (SUITE-TestNRTOpen-seed#[52E8CCD11BF78518]-worker) [    ] o.a.s.SolrTestCaseJ4 ####initCore end
   [junit4]   2> 633385 INFO  (TEST-TestNRTOpen.testReaderIsNRT-seed#[52E8CCD11BF78518]) [    ] o.a.s.SolrTestCaseJ4 ###Starting testReaderIsNRT
   [junit4]   2> 633386 INFO  (TEST-TestNRTOpen.testReaderIsNRT-seed#[52E8CCD11BF78518]) [    ] o.a.s.u.DirectUpdateHandler2 [collection1] REMOVING ALL DOCUMENTS FROM INDEX
   [junit4]   2> 633387 INFO  (TEST-TestNRTOpen.testReaderIsNRT-seed#[52E8CCD11BF78518]) [    ] o.a.s.u.p.LogUpdateProcessorFactory [collection1]  webapp=null path=null params={}{deleteByQuery=*:*} 0 1
   [junit4]   2> 633388 INFO  (TEST-TestNRTOpen.testReaderIsNRT-seed#[52E8CCD11BF78518]) [    ] o.a.s.u.p.LogUpdateProcessorFactory [collection1]  webapp=null path=null params={}{add=[(null)]} 0 0
   [junit4]   2> 633389 INFO  (TEST-TestNRTOpen.testReaderIsNRT-seed#[52E8CCD11BF78518]) [    ] o.a.s.u.DirectUpdateHandler2 start commit{,optimize=false,openSearcher=true,waitSearcher=true,expungeDeletes=false,softCommit=false,prepareCommit=false}
   [junit4]   2> 633475 INFO  (TEST-TestNRTOpen.testReaderIsNRT-seed#[52E8CCD11BF78518]) [    ] o.a.s.c.SolrDeletionPolicy SolrDeletionPolicy.onCommit: commits: num=2
   [junit4]   2> 	commit{dir=/home/jenkins/workspace/Lucene-Solr-5.5-Linux/solr/build/solr-core/test/J2/temp/solr.core.TestNRTOpen_52E8CCD11BF78518-001/init-core-data-001/index,segFN=segments_2,generation=2}
   [junit4]   2> 	commit{dir=/home/jenkins/workspace/Lucene-Solr-5.5-Linux/solr/build/solr-core/test/J2/temp/solr.core.TestNRTOpen_52E8CCD11BF78518-001/init-core-data-001/index,segFN=segments_3,generation=3}
   [junit4]   2> 633476 INFO  (TEST-TestNRTOpen.testReaderIsNRT-seed#[52E8CCD11BF78518]) [    ] o.a.s.c.SolrDeletionPolicy newest commit generation = 3
   [junit4]   2> 633478 INFO  (TEST-TestNRTOpen.testReaderIsNRT-seed#[52E8CCD11BF78518]) [    ] o.a.s.s.SolrIndexSearcher Opening Searcher@11540e77[collection1] main
   [junit4]   2> 633478 INFO  (TEST-TestNRTOpen.testReaderIsNRT-seed#[52E8CCD11BF78518]) [    ] o.a.s.u.DirectUpdateHandler2 end_commit_flush
   [junit4]   2> 633478 INFO  (searcherExecutor-2373-thread-1) [    ] o.a.s.c.SolrCore [collection1] Registered new searcher Searcher@11540e77[collection1] main{ExitableDirectoryReader(UninvertingDirectoryReader(Uninverting(_1(5.5.0):c1)))}
   [junit4]   2> 633479 INFO  (TEST-TestNRTOpen.testReaderIsNRT-seed#[52E8CCD11BF78518]) [    ] o.a.s.u.p.LogUpdateProcessorFactory [collection1]  webapp=null path=null params={}{commit=} 0 90
   [junit4]   2> 633480 INFO  (TEST-TestNRTOpen.testReaderIsNRT-seed#[52E8CCD11BF78518]) [    ] o.a.s.c.SolrResourceLoader new SolrResourceLoader for directory: '/home/jenkins/workspace/Lucene-Solr-5.5-Linux/solr/core/src/test-files/solr/collection1'
   [junit4]   2> 633480 INFO  (TEST-TestNRTOpen.testReaderIsNRT-seed#[52E8CCD11BF78518]) [    ] o.a.s.c.SolrResourceLoader JNDI not configured for solr (NoInitialContextEx)
   [junit4]   2> 633480 INFO  (TEST-TestNRTOpen.testReaderIsNRT-seed#[52E8CCD11BF78518]) [    ] o.a.s.c.SolrResourceLoader using system property solr.solr.home: /home/jenkins/workspace/Lucene-Solr-5.5-Linux/solr/core/src/test-files/solr
   [junit4]   2> 633480 INFO  (TEST-TestNRTOpen.testReaderIsNRT-seed#[52E8CCD11BF78518]) [    ] o.a.s.c.SolrResourceLoader Adding 'file:/home/jenkins/workspace/Lucene-Solr-5.5-Linux/solr/core/src/test-files/solr/collection1/lib/classes/' to classloader
   [junit4]   2> 633480 INFO  (TEST-TestNRTOpen.testReaderIsNRT-seed#[52E8CCD11BF78518]) [    ] o.a.s.c.SolrResourceLoader Adding 'file:/home/jenkins/workspace/Lucene-Solr-5.5-Linux/solr/core/src/test-files/solr/collection1/lib/README' to classloader
   [junit4]   2> 633500 INFO  (TEST-TestNRTOpen.testReaderIsNRT-seed#[52E8CCD11BF78518]) [    ] o.a.s.c.SolrConfig current version of requestparams : -1
   [junit4]   2> 633507 INFO  (TEST-TestNRTOpen.testReaderIsNRT-seed#[52E8CCD11BF78518]) [    ] o.a.s.c.SolrConfig Using Lucene MatchVersion: 5.5.0
   [junit4]   2> 633521 INFO  (TEST-TestNRTOpen.testReaderIsNRT-seed#[52E8CCD11BF78518]) [    ] o.a.s.c.SolrConfig Loaded SolrConfig: solrconfig-basic.xml
   [junit4]   2> 633524 INFO  (TEST-TestNRTOpen.testReaderIsNRT-seed#[52E8CCD11BF78518]) [    ] o.a.s.s.IndexSchema [collection1] Schema name=minimal
   [junit4]   2> 633527 WARN  (TEST-TestNRTOpen.testReaderIsNRT-seed#[52E8CCD11BF78518]) [    ] o.a.s.s.IndexSchema no uniqueKey specified in schema.
   [junit4]   2> 633542 INFO  (TEST-TestNRTOpen.testReaderIsNRT-seed#[52E8CCD11BF78518]) [    ] o.a.s.c.ConfigSetProperties Did not find ConfigSet properties, assuming default properties: Can't find resource 'configsetprops.json' in classpath or '/home/jenkins/workspace/Lucene-Solr-5.5-Linux/solr/core/src/test-files/solr/collection1'
   [junit4]   2> 633542 INFO  (TEST-TestNRTOpen.testReaderIsNRT-seed#[52E8CCD11BF78518]) [    ] o.a.s.c.CoreContainer Reloading SolrCore 'collection1' using configuration from instancedir /home/jenkins/workspace/Lucene-Solr-5.5-Linux/solr/core/src/test-files/solr/collection1
   [junit4]   2> 633543 INFO  (TEST-TestNRTOpen.testReaderIsNRT-seed#[52E8CCD11BF78518]) [    x:collection1] o.a.s.c.SolrCore [[collection1] ] Opening new SolrCore at [/home/jenkins/workspace/Lucene-Solr-5.5-Linux/solr/core/src/test-files/solr/collection1], dataDir=[/home/jenkins/workspace/Lucene-Solr-5.5-Linux/solr/build/solr-core/test/J2/temp/solr.core.TestNRTOpen_52E8CCD11BF78518-001/init-core-data-001/]
   [junit4]   2> 633543 INFO  (TEST-TestNRTOpen.testReaderIsNRT-seed#[52E8CCD11BF78518]) [    x:collection1] o.a.s.c.SolrCore JMX monitoring not detected for core: collection1
   [junit4]   2> 633543 INFO  (TEST-TestNRTOpen.testReaderIsNRT-seed#[52E8CCD11BF78518]) [    x:collection1] o.a.s.c.SolrCore New index directory detected: old=null new=/home/jenkins/workspace/Lucene-Solr-5.5-Linux/solr/build/solr-core/test/J2/temp/solr.core.TestNRTOpen_52E8CCD11BF78518-001/init-core-data-001/index/
   [junit4]   2> 633543 INFO  (OldIndexDirectoryCleanupThreadForCore-collection1) [    x:collection1] o.a.s.c.SolrCore Looking for old index directories to cleanup for core collection1 in /home/jenkins/workspace/Lucene-Solr-5.5-Linux/solr/build/solr-core/test/J2/temp/solr.core.TestNRTOpen_52E8CCD11BF78518-001/init-core-data-001/
   [junit4]   2> 633544 INFO  (TEST-TestNRTOpen.testReaderIsNRT-seed#[52E8CCD11BF78518]) [    x:collection1] o.a.s.c.SolrCore no updateRequestProcessorChain defined as default, creating implicit default
   [junit4]   2> 633546 INFO  (TEST-TestNRTOpen.testReaderIsNRT-seed#[52E8CCD11BF78518]) [    x:collection1] o.a.s.h.l.XMLLoader xsltCacheLifetimeSeconds=60
   [junit4]   2> 633547 INFO  (TEST-TestNRTOpen.testReaderIsNRT-seed#[52E8CCD11BF78518]) [    x:collection1] o.a.s.h.l.XMLLoader xsltCacheLifetimeSeconds=60
   [junit4]   2> 633548 INFO  (TEST-TestNRTOpen.testReaderIsNRT-seed#[52E8CCD11BF78518]) [    x:collection1] o.a.s.h.l.XMLLoader xsltCacheLifetimeSeconds=60
   [junit4]   2> 633548 INFO  (TEST-TestNRTOpen.testReaderIsNRT-seed#[52E8CCD11BF78518]) [    x:collection1] o.a.s.h.l.XMLLoader xsltCacheLifetimeSeconds=60
   [junit4]   2> 633549 INFO  (TEST-TestNRTOpen.testReaderIsNRT-seed#[52E8CCD11BF78518]) [    x:collection1] o.a.s.c.RequestHandlers Registered paths: /update,/admin/mbeans,/admin/threads,/admin/system,/update/csv,/admin/file,/get,/replication,/admin/logging,/admin/luke,/schema,standard,/update/json,/admin/ping,/admin/segments,/admin/properties,/config,/admin/plugins,/update/json/docs
   [junit4]   2> 633550 INFO  (TEST-TestNRTOpen.testReaderIsNRT-seed#[52E8CCD11BF78518]) [    x:collection1] o.a.s.c.SolrCore Using default statsCache cache: org.apache.solr.search.stats.LocalStatsCache
   [junit4]   2> 633550 INFO  (TEST-TestNRTOpen.testReaderIsNRT-seed#[52E8CCD11BF78518]) [    x:collection1] o.a.s.u.CommitTracker Hard AutoCommit: disabled
   [junit4]   2> 633550 INFO  (TEST-TestNRTOpen.testReaderIsNRT-seed#[52E8CCD11BF78518]) [    x:collection1] o.a.s.u.CommitTracker Soft AutoCommit: disabled
   [junit4]   2> 633550 INFO  (TEST-TestNRTOpen.testReaderIsNRT-seed#[52E8CCD11BF78518]) [    x:collection1] o.a.s.s.SolrIndexSearcher Opening Searcher@14f260b8[collection1] main
   [junit4]   2> 633550 WARN  (TEST-TestNRTOpen.testReaderIsNRT-seed#[52E8CCD11BF78518]) [    x:collection1] o.a.s.r.ManagedResourceStorage Cannot write to config directory /home/jenkins/workspace/Lucene-Solr-5.5-Linux/solr/core/src/test-files/solr/collection1/conf; switching to use InMemory storage instead.
   [junit4]   2> 633550 INFO  (TEST-TestNRTOpen.testReaderIsNRT-seed#[52E8CCD11BF78518]) [    x:collection1] o.a.s.r.RestManager Initializing RestManager with initArgs: {}
   [junit4]   2> 633550 INFO  (TEST-TestNRTOpen.testReaderIsNRT-seed#[52E8CCD11BF78518]) [    x:collection1] o.a.s.r.ManagedResourceStorage Reading _rest_managed.json using InMemoryStorage
   [junit4]   2> 633550 INFO  (TEST-TestNRTOpen.testReaderIsNRT-seed#[52E8CCD11BF78518]) [    x:collection1] o.a.s.r.RestManager Initializing 0 registered ManagedResources
   [junit4]   2> 633551 INFO  (TEST-TestNRTOpen.testReaderIsNRT-seed#[52E8CCD11BF78518]) [    x:collection1] o.a.s.h.ReplicationHandler Commits will be reserved for  10000
   [junit4]   2> 633551 INFO  (searcherExecutor-2377-thread-1-processing-x:collection1) [    x:collection1] o.a.s.c.SolrCore [collection1] Registered new searcher Searcher@14f260b8[collection1] main{ExitableDirectoryReader(UninvertingDirectoryReader(Uninverting(_1(5.5.0):c1)))}
   [junit4]   2> 633551 INFO  (TEST-TestNRTOpen.testReaderIsNRT-seed#[52E8CCD11BF78518]) [    x:collection1] o.a.s.u.DefaultSolrCoreState Closing old IndexWriter... core=collection1
   [junit4]   2> 633551 INFO  (TEST-TestNRTOpen.testReaderIsNRT-seed#[52E8CCD11BF78518]) [    x:collection1] o.a.s.u.RandomMergePolicy RandomMergePolicy wrapping class org.apache.lucene.index.MockRandomMergePolicy: org.apache.lucene.index.MockRandomMergePolicy@4dcb7351
   [junit4]   2> 633552 INFO  (TEST-TestNRTOpen.testReaderIsNRT-seed#[52E8CCD11BF78518]) [    x:collection1] o.a.s.c.SolrDeletionPolicy SolrDeletionPolicy.onInit: commits: num=1
   [junit4]   2> 	commit{dir=/home/jenkins/workspace/Lucene-Solr-5.5-Linux/solr/build/solr-core/test/J2/temp/solr.core.TestNRTOpen_52E8CCD11BF78518-001/init-core-data-001/index,segFN=segments_3,generation=3}
   [junit4]   2> 633552 INFO  (TEST-TestNRTOpen.testReaderIsNRT-seed#[52E8CCD11BF78518]) [    x:collection1] o.a.s.c.SolrDeletionPolicy newest commit generation = 3
   [junit4]   2> 633553 INFO  (TEST-TestNRTOpen.testReaderIsNRT-seed#[52E8CCD11BF78518]) [    x:collection1] o.a.s.u.DefaultSolrCoreState New IndexWriter is ready to be used.
   [junit4]   2> 633553 INFO  (TEST-TestNRTOpen.testReaderIsNRT-seed#[52E8CCD11BF78518]) [    x:collection1] o.a.s.s.SolrIndexSearcher Opening Searcher@2cfbba90[collection1] main
   [junit4]   2> 633553 INFO  (TEST-TestNRTOpen.testReaderIsNRT-seed#[52E8CCD11BF78518]) [    x:collection1] o.a.s.c.CoreContainer replacing core: collection1
   [junit4]   2> 633553 INFO  (TEST-TestNRTOpen.testReaderIsNRT-seed#[52E8CCD11BF78518]) [    x:collection1] o.a.s.c.SolrCore [collection1]  CLOSING SolrCore org.apache.solr.core.SolrCore@7e4830fd
   [junit4]   2> 633554 INFO  (searcherExecutor-2377-thread-1-processing-x:collection1) [    x:collection1] o.a.s.c.SolrCore [collection1] Registered new searcher Searcher@2cfbba90[collection1] main{ExitableDirectoryReader(UninvertingDirectoryReader(Uninverting(_1(5.5.0):c1)))}
   [junit4]   2> 633554 INFO  (TEST-TestNRTOpen.testReaderIsNRT-seed#[52E8CCD11BF78518]) [    x:collection1] o.a.s.u.DirectUpdateHandler2 closing DirectUpdateHandler2{commits=1,autocommits=0,soft autocommits=0,optimizes=0,rollbacks=0,expungeDeletes=0,docsPending=0,adds=0,deletesById=0,deletesByQuery=0,errors=0,cumulative_adds=1,cumulative_deletesById=0,cumulative_deletesByQuery=1,cumulative_errors=0}
   [junit4]   2> 633554 INFO  (TEST-TestNRTOpen.testReaderIsNRT-seed#[52E8CCD11BF78518]) [    x:collection1] o.a.s.c.SolrCore [collection1] Closing main searcher on request.
   [junit4]   2> 633555 INFO  (TEST-TestNRTOpen.testReaderIsNRT-seed#[52E8CCD11BF78518]) [    x:collection1] o.a.s.u.p.LogUpdateProcessorFactory [collection1]  webapp=null path=null params={}{add=[(null)]} 0 0
   [junit4]   2> 633555 INFO  (TEST-TestNRTOpen.testReaderIsNRT-seed#[52E8CCD11BF78518]) [    x:collection1] o.a.s.u.DirectUpdateHandler2 start commit{,optimize=false,openSearcher=true,waitSearcher=true,expungeDeletes=false,softCommit=true,prepareCommit=false}
   [junit4]   2> 633558 INFO  (TEST-TestNRTOpen.testReaderIsNRT-seed#[52E8CCD11BF78518]) [    x:collection1] o.a.s.s.SolrIndexSearcher Opening Searcher@57005155[collection1] main
   [junit4]   2> 633559 INFO  (TEST-TestNRTOpen.testReaderIsNRT-seed#[52E8CCD11BF78518]) [    x:collection1] o.a.s.u.DirectUpdateHandler2 end_commit_flush
   [junit4]   2> 633559 INFO  (searcherExecutor-2377-thread-1-processing-x:collection1) [    x:collection1] o.a.s.c.SolrCore [collection1] Registered new searcher Searcher@57005155[collection1] main{ExitableDirectoryReader(UninvertingDirectoryReader(Uninverting(_1(5.5.0):c1) Uninverting(_2(5.5.0):c1)))}
   [junit4]   2> 633559 INFO  (TEST-TestNRTOpen.testReaderIsNRT-seed#[52E8CCD11BF78518]) [    x:collection1] o.a.s.u.p.LogUpdateProcessorFactory [collection1]  webapp=null path=null params={}{commit=} 0 3
   [junit4]   2> 633560 INFO  (TEST-TestNRTOpen.testReaderIsNRT-seed#[52E8CCD11BF78518]) [    x:collection1] o.a.s.u.p.LogUpdateProcessorFactory [collection1]  webapp=null path=null params={}{add=[(null)]} 0 0
   [junit4]   2> 633560 INFO  (TEST-TestNRTOpen.testReaderIsNRT-seed#[52E8CCD11BF78518]) [    x:collection1] o.a.s.u.DirectUpdateHandler2 start commit{,optimize=false,openSearcher=true,waitSearcher=true,expungeDeletes=false,softCommit=false,prepareCommit=false}
   [junit4]   2> 633646 INFO  (TEST-TestNRTOpen.testReaderIsNRT-seed#[52E8CCD11BF78518]) [    x:collection1] o.a.s.c.SolrDeletionPolicy SolrDeletionPolicy.onCommit: commits: num=2
   [junit4]   2> 	commit{dir=/home/jenkins/workspace/Lucene-Solr-5.5-Linux/solr/build/solr-core/test/J2/temp/solr.core.TestNRTOpen_52E8CCD11BF78518-001/init-core-data-001/index,segFN=segments_3,generation=3}
   [junit4]   2> 	commit{dir=/home/jenkins/workspace/Lucene-Solr-5.5-Linux/solr/build/solr-core/test/J2/temp/solr.core.TestNRTOpen_52E8CCD11BF78518-001/init-core-data-001/index,segFN=segments_4,generation=4}
   [junit4]   2> 633646 INFO  (TEST-TestNRTOpen.testReaderIsNRT-seed#[52E8CCD11BF78518]) [    x:collection1] o.a.s.c.SolrDeletionPolicy newest commit generation = 4
   [junit4]   2> 633648 INFO  (TEST-TestNRTOpen.testReaderIsNRT-seed#[52E8CCD11BF78518]) [    x:collection1] o.a.s.s.SolrIndexSearcher Opening Searcher@76f02d6[collection1] main
   [junit4]   2> 633648 INFO  (TEST-TestNRTOpen.testReaderIsNRT-seed#[52E8CCD11BF78518]) [    x:collection1] o.a.s.u.DirectUpdateHandler2 end_commit_flush
   [junit4]   2> 633648 INFO  (searcherExecutor-2377-thread-1-processing-x:collection1) [    x:collection1] o.a.s.c.SolrCore [collection1] Registered new searcher Searcher@76f02d6[collection1] main{ExitableDirectoryReader(UninvertingDirectoryReader(Uninverting(_1(5.5.0):c1) Uninverting(_2(5.5.0):c1) Uninverting(_3(5.5.0):c1)))}
   [junit4]   2> 633648 INFO  (TEST-TestNRTOpen.testReaderIsNRT-seed#[52E8CCD11BF78518]) [    x:collection1] o.a.s.u.p.LogUpdateProcessorFactory [collection1]  webapp=null path=null params={}{commit=} 0 87
   [junit4]   2> 633649 INFO  (TEST-TestNRTOpen.testReaderIsNRT-seed#[52E8CCD11BF78518]) [    x:collection1] o.a.s.u.p.LogUpdateProcessorFactory [collection1]  webapp=null path=null params={}{add=[(null)]} 0 0
   [junit4]   2> 633650 INFO  (TEST-TestNRTOpen.testReaderIsNRT-seed#[52E8CCD11BF78518]) [    x:collection1] o.a.s.c.SolrResourceLoader new SolrResourceLoader for directory: '/home/jenkins/workspace/Lucene-Solr-5.5-Linux/solr/core/src/test-files/solr/collection1'
   [junit4]   2> 633650 INFO  (TEST-TestNRTOpen.testReaderIsNRT-seed#[52E8CCD11BF78518]) [    x:collection1] o.a.s.c.SolrResourceLoader JNDI not configured for solr (NoInitialContextEx)
   [junit4]   2> 633650 INFO  (TEST-TestNRTOpen.testReaderIsNRT-seed#[52E8CCD11BF78518]) [    x:collection1] o.a.s.c.SolrResourceLoader using system property solr.solr.home: /home/jenkins/workspace/Lucene-Solr-5.5-Linux/solr/core/src/test-files/solr
   [junit4]   2> 633650 INFO  (TEST-TestNRTOpen.testReaderIsNRT-seed#[52E8CCD11BF78518]) [    x:collection1] o.a.s.c.SolrResourceLoader Adding 'file:/home/jenkins/workspace/Lucene-Solr-5.5-Linux/solr/core/src/test-files/solr/collection1/lib/classes/' to classloader
   [junit4]   2> 633650 INFO  (TEST-TestNRTOpen.testReaderIsNRT-seed#[52E8CCD11BF78518]) [    x:collection1] o.a.s.c.SolrResourceLoader Adding 'file:/home/jenkins/workspace/Lucene-Solr-5.5-Linux/solr/core/src/test-files/solr/collection1/lib/README' to classloader
   [junit4]   2> 633672 INFO  (TEST-TestNRTOpen.testReaderIsNRT-seed#[52E8CCD11BF78518]) [    x:collection1] o.a.s.c.SolrConfig current version of requestparams : -1
   [junit4]   2> 633680 INFO  (TEST-TestNRTOpen.testReaderIsNRT-seed#[52E8CCD11BF78518]) [    x:collection1] o.a.s.c.SolrConfig Using Lucene MatchVersion: 5.5.0
   [junit4]   2> 633695 INFO  (TEST-TestNRTOpen.testReaderIsNRT-seed#[52E8CCD11BF78518]) [    x:collection1] o.a.s.c.SolrConfig Loaded SolrConfig: solrconfig-basic.xml
   [junit4]   2> 633698 INFO  (TEST-TestNRTOpen.testReaderIsNRT-seed#[52E8CCD11BF78518]) [    x:collection1] o.a.s.s.IndexSchema [collection1] Schema name=minimal
   [junit4]   2> 633702 WARN  (TEST-TestNRTOpen.testReaderIsNRT-seed#[52E8CCD11BF78518]) [    x:collection1] o.a.s.s.IndexSchema no uniqueKey specified in schema.
   [junit4]   2> 633704 INFO  (TEST-TestNRTOpen.testReaderIsNRT-seed#[52E8CCD11BF78518]) [    x:collection1] o.a.s.c.ConfigSetProperties Did not find ConfigSet properties, assuming default properties: Can't find resource 'configsetprops.json' in classpath or '/home/jenkins/workspace/Lucene-Solr-5.5-Linux/solr/core/src/test-files/solr/collection1'
   [junit4]   2> 633704 INFO  (TEST-TestNRTOpen.testReaderIsNRT-seed#[52E8CCD11BF78518]) [    x:collection1] o.a.s.c.CoreContainer Reloading SolrCore 'collection1' using configuration from instancedir /home/jenkins/workspace/Lucene-Solr-5.5-Linux/solr/core/src/test-files/solr/collection1
   [junit4]   2> 633705 INFO  (TEST-TestNRTOpen.testReaderIsNRT-seed#[52E8CCD11BF78518]) [    x:collection1] o.a.s.c.SolrCore [[collection1] ] Opening new SolrCore at [/home/jenkins/workspace/Lucene-Solr-5.5-Linux/solr/core/src/test-files/solr/collection1], dataDir=[/home/jenkins/workspace/Lucene-Solr-5.5-Linux/solr/build/solr-core/test/J2/temp/solr.core.TestNRTOpen_52E8CCD11BF78518-001/init-core-data-001/]
   [junit4]   2> 633705 INFO  (TEST-TestNRTOpen.testReaderIsNRT-seed#[52E8CCD11BF78518]) [    x:collection1] o.a.s.c.SolrCore JMX monitoring not detected for core: collection1
   [junit4]   2> 633705 INFO  (TEST-TestNRTOpen.testReaderIsNRT-seed#[52E8CCD11BF78518]) [    x:collection1] o.a.s.c.SolrCore New index directory detected: old=null new=/home/jenkins/workspace/Lucene-Solr-5.5-Linux/solr/build/solr-core/test/J2/temp/solr.core.TestNRTOpen_52E8CCD11BF78518-001/init-core-data-001/index/
   [junit4]   2> 633705 INFO  (OldIndexDirectoryCleanupThreadForCore-collection1) [    x:collection1] o.a.s.c.SolrCore Looking for old index directories to cleanup for core collection1 in /home/jenkins/workspace/Lucene-Solr-5.5-Linux/solr/build/solr-core/test/J2/temp/solr.core.TestNRTOpen_52E8CCD11BF78518-001/init-core-data-001/
   [junit4]   2> 633707 INFO  (TEST-TestNRTOpen.testReaderIsNRT-seed#[52E8CCD11BF78518]) [    x:collection1] o.a.s.c.SolrCore no updateRequestProcessorChain defined as default, creating implicit default
   [junit4]   2> 633709 INFO  (TEST-TestNRTOpen.testReaderIsNRT-seed#[52E8CCD11BF78518]) [    x:collection1] o.a.s.h.l.XMLLoader xsltCacheLifetimeSeconds=60
   [junit4]   2> 633710 INFO  (TEST-TestNRTOpen.testReaderIsNRT-seed#[52E8CCD11BF78518]) [    x:collection1] o.a.s.h.l.XMLLoader xsltCacheLifetimeSeconds=60
   [junit4]   2> 633710 INFO  (TEST-TestNRTOpen.testReaderIsNRT-seed#[52E8CCD11BF78518]) [    x:collection1] o.a.s.h.l.XMLLoader xsltCacheLifetimeSeconds=60
   [junit4]   2> 633711 INFO  (TEST-TestNRTOpen.testReaderIsNRT-seed#[52E8CCD11BF78518]) [    x:collection1] o.a.s.h.l.XMLLoader xsltCacheLifetimeSeconds=60
   [junit4]   2> 633712 INFO  (TEST-TestNRTOpen.testReaderIsNRT-seed#[52E8CCD11BF78518]) [    x:collection1] o.a.s.c.RequestHandlers Registered paths: /update,/admin/mbeans,/admin/threads,/admin/system,/update/csv,/admin/file,/get,/replication,/admin/logging,/admin/luke,/schema,standard,/update/json,/admin/ping,/admin/segments,/admin/properties,/config,/admin/plugins,/update/json/docs
   [junit4]   2> 633713 INFO  (TEST-TestNRTOpen.testReaderIsNRT-seed#[52E8CCD11BF78518]) [    x:collection1] o.a.s.c.SolrCore Using default statsCache cache: org.apache.solr.search.stats.LocalStatsCache
   [junit4]   2> 633713 INFO  (TEST-TestNRTOpen.testReaderIsNRT-seed#[52E8CCD11BF78518]) [    x:collection1] o.a.s.u.CommitTracker Hard AutoCommit: disabled
   [junit4]   2> 633713 INFO  (TEST-TestNRTOpen.testReaderIsNRT-seed#[52E8CCD11BF78518]) [    x:collection1] o.a.s.u.CommitTracker Soft AutoCommit: disabled
   [junit4]   2> 633717 INFO  (TEST-TestNRTOpen.testReaderIsNRT-seed#[52E8CCD11BF78518]) [    x:collection1] o.a.s.s.SolrIndexSearcher Opening Searcher@424e66e6[collection1] main
   [junit4]   2> 633717 WARN  (TEST-TestNRTOpen.testReaderIsNRT-seed#[52E8CCD11BF78518]) [    x:collection1] o.a.s.r.ManagedResourceStorage Cannot write to config directory /home/jenkins/workspace/Lucene-Solr-5.5-Linux/solr/core/src/test-files/solr/collection1/conf; switching to use InMemory storage instead.
   [junit4]   2> 633717 INFO  (TEST-TestNRTOpen.testReaderIsNRT-seed#[52E8CCD11BF78518]) [    x:collection1] o.a.s.r.RestManager Initializing RestManager with initArgs: {}
   [junit4]   2> 633717 INFO  (TEST-TestNRTOpen.testReaderIsNRT-seed#[52E8CCD11BF78518]) [    x:collection1] o.a.s.r.ManagedResourceStorage Reading _rest_managed.json using InMemoryStorage
   [junit4]   2> 633717 INFO  (TEST-TestNRTOpen.testReaderIsNRT-seed#[52E8CCD11BF78518]) [    x:collection1] o.a.s.r.RestManager Initializing 0 registered ManagedResources
   [junit4]   2> 633718 INFO  (TEST-TestNRTOpen.testReaderIsNRT-seed#[52E8CCD11BF78518]) [    x:collection1] o.a.s.h.ReplicationHandler Commits will be reserved for  10000
   [junit4]   2> 633718 INFO  (searcherExecutor-2381-thread-1-processing-x:collection1) [    x:collection1] o.a.s.c.SolrCore [collection1] Registered new searcher Searcher@424e66e6[collection1] main{ExitableDirectoryReader(UninvertingDirectoryReader(Uninverting(_1(5.5.0):c1) Uninverting(_2(5.5.0):c1) Uninverting(_3(5.5.0):c1) Uninverting(_4(5.5.0):c1)))}
   [junit4]   2> 633718 INFO  (TEST-TestNRTOpen.testReaderIsNRT-seed#[52E8CCD11BF78518]) [    x:collection1] o.a.s.u.DefaultSolrCoreState Closing old IndexWriter... core=collection1
   [junit4]   2> 633809 INFO  (TEST-TestNRTOpen.testReaderIsNRT-seed#[52E8CCD11BF78518]) [    x:collection1] o.a.s.c.SolrDeletionPolicy SolrDeletionPolicy.onCommit: commits: num=2
   [junit4]   2> 	commit{dir=/home/jenkins/workspace/Lucene-Solr-5.5-Linux/solr/build/solr-core/test/J2/temp/solr.core.TestNRTOpen_52E8CCD11BF78518-001/init-core-data-001/index,segFN=segments_4,generation=4}
   [junit4]   2> 	commit{dir=/home/jenkins/workspace/Lucene-Solr-5.5-Linux/solr/build/solr-core/test/J2/temp/solr.core.TestNRTOpen_52E8CCD11BF78518-001/init-core-data-001/index,segFN=segments_5,generation=5}
   [junit4]   2> 633809 INFO  (TEST-TestNRTOpen.testReaderIsNRT-seed#[52E8CCD11BF78518]) [    x:collection1] o.a.s.c.SolrDeletionPolicy newest commit generation = 5
   [junit4]   2> 633810 INFO  (TEST-TestNRTOpen.testReaderIsNRT-seed#[52E8CCD11BF78518]) [    x:collection1] o.a.s.u.RandomMergePolicy RandomMergePolicy wrapping class org.apache.lucene.index.TieredMergePolicy: [TieredMergePolicy: maxMergeAtOnce=2, maxMergeAtOnceExplicit=5, maxMergedSegmentMB=99.69921875, floorSegmentMB=0.6220703125, forceMergeDeletesPctAllowed=9.290529543095639, segmentsPerTier=11.0, maxCFSSegmentSizeMB=8.796093022207999E12, noCFSRatio=1.0
   [junit4]   2> 633812 INFO  (TEST-TestNRTOpen.testReaderIsNRT-seed#[52E8CCD11BF78518]) [    x:collection1] o.a.s.c.SolrDeletionPolicy SolrDeletionPolicy.onInit: commits: num=1
   [junit4]   2> 	commit{dir=/home/jenkins/workspace/Lucene-Solr-5.5-Linux/solr/build/solr-core/test/J2/temp/solr.core.TestNRTOpen_52E8CCD11BF78518-001/init-core-data-001/index,segFN=segments_5,generation=5}
   [junit4]   2> 633812 INFO  (TEST-TestNRTOpen.testReaderIsNRT-seed#[52E8CCD11BF78518]) [    x:collection1] o.a.s.c.SolrDeletionPolicy newest commit generation = 5
   [junit4]   2> 633813 INFO  (TEST-TestNRTOpen.testReaderIsNRT-seed#[52E8CCD11BF78518]) [    x:collection1] o.a.s.u.DefaultSolrCoreState New IndexWriter is ready to be used.
   [junit4]   2> 633816 INFO  (TEST-TestNRTOpen.testReaderIsNRT-seed#[52E8CCD11BF78518]) [    x:collection1] o.a.s.s.SolrIndexSearcher Opening Searcher@50930e64[collection1] main
   [junit4]   2> 633816 INFO  (TEST-TestNRTOpen.testReaderIsNRT-seed#[52E8CCD11BF78518]) [    x:collection1] o.a.s.c.CoreContainer replacing core: collection1
   [junit4]   2> 633816 INFO  (TEST-TestNRTOpen.testReaderIsNRT-seed#[52E8CCD11BF78518]) [    x:collection1] o.a.s.c.SolrCore [collection1]  CLOSING SolrCore org.apache.solr.core.SolrCore@7ea8182d
   [junit4]   2> 633816 INFO  (searcherExecutor-2381-thread-1-processing-x:collection1) [    x:collection1] o.a.s.c.SolrCore [collection1] Registered new searcher Searcher@50930e64[collection1] main{ExitableDirectoryReader(UninvertingDirectoryReader(Uninverting(_1(5.5.0):c1) Uninverting(_2(5.5.0):c1) Uninverting(_3(5.5.0):c1) Uninverting(_4(5.5.0):c1)))}
   [junit4]   2> 633816 INFO  (TEST-TestNRTOpen.testReaderIsNRT-seed#[52E8CCD11BF78518]) [    x:collection1] o.a.s.u.DirectUpdateHandler2 closing DirectUpdateHandler2{commits=2,autocommits=0,soft autocommits=0,optimizes=0,rollbacks=0,expungeDeletes=0,docsPending=1,adds=1,deletesById=0,deletesByQuery=0,errors=0,cumulative_adds=3,cumulative_deletesById=0,cumulative_deletesByQuery=0,cumulative_errors=0}
   [junit4]   2> 633816 INFO  (TEST-TestNRTOpen.testReaderIsNRT-seed#[52E8CCD11BF78518]) [    x:collection1] o.a.s.c.SolrCore [collection1] Closing main searcher on request.
   [junit4]   2> 633817 INFO  (TEST-TestNRTOpen.testReaderIsNRT-seed#[52E8CCD11BF78518]) [    x:collection1] o.a.s.SolrTestCaseJ4 ###Ending testReaderIsNRT
   [junit4]   2> 633821 INFO  (TEST-TestNRTOpen.testSharedCores-seed#[52E8CCD11BF78518]) [    x:collection1] o.a.s.SolrTestCaseJ4 ###Starting testSharedCores
   [junit4]   2> 633821 INFO  (TEST-TestNRTOpen.testSharedCores-seed#[52E8CCD11BF78518]) [    x:collection1] o.a.s.u.DirectUpdateHandler2 [collection1] REMOVING ALL DOCUMENTS FROM INDEX
   [junit4]   2> 633821 INFO  (TEST-TestNRTOpen.testSharedCores-seed#[52E8CCD11BF78518]) [    x:collection1] o.a.s.u.p.LogUpdateProcessorFactory [collection1]  webapp=null path=null params={}{deleteByQuery=*:*} 0 0
   [junit4]   2> 633823 INFO  (TEST-TestNRTOpen.testSharedCores-seed#[52E8CCD11BF78518]) [    x:collection1] o.a.s.u.p.LogUpdateProcessorFactory [collection1]  webapp=null path=null params={}{add=[(null)]} 0 0
   [junit4]   2> 633823 INFO  (TEST-TestNRTOpen.testSharedCores-seed#[52E8CCD11BF78518]) [    x:collection1] o.a.s.u.DirectUpdateHandler2 start commit{,optimize=false,openSearcher=true,waitSearcher=true,expungeDeletes=false,softCommit=false,prepareCommit=false}
   [junit4]   2> 633922 INFO  (TEST-TestNRTOpen.testSharedCores-seed#[52E8CCD11BF78518]) [    x:collection1] o.a.s.c.SolrDeletionPolicy SolrDeletionPolicy.onCommit: commits: num=2
   [junit4]   2> 	commit{dir=/home/jenkins/workspace/Lucene-Solr-5.5-Linux/solr/build/solr-core/test/J2/temp/solr.core.TestNRTOpen_52E8CCD11BF78518-001/init-core-data-001/index,segFN=segments_5,generation=5}
   [junit4]   2> 	commit{dir=/home/jenkins/workspace/Lucene-Solr-5.5-Linux/solr/build/solr-core/test/J2/temp/solr.core.TestNRTOpen_52E8CCD11BF78518-001/init-core-data-001/index,segFN=segments_6,generation=6}
   [junit4]   2> 633922 INFO  (TEST-TestNRTOpen.testSharedCores-seed#[52E8CCD11BF78518]) [    x:collection1] o.a.s.c.SolrDeletionPolicy newest commit generation = 6
   [junit4]   2> 633923 INFO  (TEST-TestNRTOpen.testSharedCores-seed#[52E8CCD11BF78518]) [    x:collection1] o.a.s.s.SolrIndexSearcher Opening Searcher@31d23f2[collection1] main
   [junit4]   2> 633924 INFO  (TEST-TestNRTOpen.testSharedCores-seed#[52E8CCD11BF78518]) [    x:collection1] o.a.s.u.DirectUpdateHandler2 end_commit_flush
   [junit4]   2> 633924 INFO  (searcherExecutor-2381-thread-1-processing-x:collection1) [    x:collection1] o.a.s.c.SolrCore [collection1] Registered new searcher Searcher@31d23f2[collection1] main{ExitableDirectoryReader(UninvertingDirectoryReader(Uninverting(_5(5.5.0):c1)))}
   [junit4]   2> 633925 INFO  (TEST-TestNRTOpen.testSharedCores-seed#[52E8CCD11BF78518]) [    x:collection1] o.a.s.u.p.LogUpdateProcessorFactory [collection1]  webapp=null path=null params={}{commit=} 0 101
   [junit4]   2> 633926 INFO  (TEST-TestNRTOpen.testSharedCores-seed#[52E8CCD11BF78518]) [    x:collection1] o.a.s.u.DirectUpdateHandler2 start commit{,optimize=true,openSearcher=true,waitSearcher=true,expungeDeletes=false,softCommit=false,prepareCommit=false}
   [junit4]   2> 633926 WARN  (TEST-TestNRTOpen.testSharedCores-seed#[52E8CCD11BF78518]) [    x:collection1] o.a.s.u.DirectUpdateHandler2 Starting optimize... Reading and rewriting the entire index! Use with care.
   [junit4]   2> 633926 INFO  (TEST-TestNRTOpen.testSharedCores-seed#[52E8CCD11BF78518]) [    x:collection1] o.a.s.u.DirectUpdateHandler2 No uncommitted changes. Skipping IW.commit.
   [junit4]   2> 633926 INFO  (TEST-TestNRTOpen.testSharedCores-seed#[52E8CCD11BF78518]) [    x:collection1] o.a.s.c.SolrCore SolrIndexSearcher has not changed - not re-opening: org.apache.solr.search.SolrIndexSearcher
   [junit4]   2> 633926 INFO  (TEST-TestNRTOpen.testSharedCores-seed#[52E8CCD11BF78518]) [    x:collection1] o.a.s.u.DirectUpdateHandler2 end_commit_flush
   [junit4]   2> 633926 INFO  (TEST-TestNRTOpen.testSharedCores-seed#[52E8CCD11BF78518]) [    x:collection1] o.a.s.u.p.LogUpdateProcessorFactory [collection1]  webapp=null path=null params={}{optimize=} 0 0
   [junit4]   2> 633928 INFO  (TEST-TestNRTOpen.testSharedCores-seed#[52E8CCD11BF78518]) [    x:collection1] o.a.s.u.p.LogUpdateProcessorFactory [collection1]  webapp=null path=null params={}{add=[(null)]} 0 0
   [junit4]   2> 633928 INFO  (TEST-TestNRTOpen.testSharedCores-seed#[52E8CCD11BF78518]) [    x:collection1] o.a.s.u.DirectUpdateHandler2 start commit{,optimize=false,openSearcher=true,waitSearcher=true,expungeDeletes=false,softCommit=true,prepareCommit=false}
   [junit4]   2> 633940 INFO  (TEST-TestNRTOpen.testSharedCores-seed#[52E8CCD11BF78518]) [    x:collection1] o.a.s.s.SolrIndexSearcher Opening Searcher@2a9d5f0d[collection1] main
   [junit4]   2> 633940 INFO  (TEST-TestNRTOpen.testSharedCores-seed#[52E8CCD11BF78518]) [    x:collection1] o.a.s.u.DirectUpdateHandler2 end_commit_flush
   [junit4]   2> 633940 INFO  (searcherExecutor-2381-thread-1-processing-x:collection1) [    x:collection1] o.a.s.c.SolrCore [collection1] Registered new searcher Searcher@2a9d5f0d[collection1] main{ExitableDirectoryReader(UninvertingDirectoryReader(Uninverting(_5(5.5.0):c1) Uninverting(_6(5.5.0):c1)))}
   [junit4]   2> 633940 INFO  (TEST-TestNRTOpen.testSharedCores-seed#[52E8CCD11BF78518]) [    x:collection1] o.a.s.u.p.LogUpdateProcessorFactory [collection1]  webapp=null path=null params={}{commit=} 0 11
   [junit4]   2> 633944 INFO  (TEST-TestNRTOpen.testSharedCores-seed#[52E8CCD11BF78518]) [    x:collection1] o.a.s.u.p.LogUpdateProcessorFactory [collection1]  webapp=null path=null params={}{add=[(null)]} 0 0
   [junit4]   2> 633945 INFO  (TEST-TestNRTOpen.testSharedCores-seed#[52E8CCD11BF78518]) [    x:collection1] o.a.s.u.p.LogUpdateProcessorFactory [collection1]  webapp=null path=null params={}{add=[(null)]} 0 0
   [junit4]   2> 633945 INFO  (TEST-TestNRTOpen.testSharedCores-seed#[52E8CCD11BF78518]) [    x:collection1] o.a.s.u.DirectUpdateHandler2 start commit{,optimize=false,openSearcher=true,waitSearcher=true,expungeDeletes=false,softCommit=false,prepareCommit=false}
   [junit4]   2> 634091 INFO  (TEST-TestNRTOpen.testSharedCores-seed#[52E8CCD11BF78518]) [    x:collection1] o.a.s.c.SolrDeletionPolicy SolrDeletionPolicy.onCommit: commits: num=2
   [junit4]   2> 	commit{dir=/home/jenkins/workspace/Lucene-Solr-5.5-Linux/solr/build/solr-core/test/J2/temp/solr.core.TestNRTOpen_52E8CCD11BF78518-001/init-core-data-001/index,segFN=segments_6,generation=6}
   [junit4]   2> 	commit{dir=/home/jenkins/workspace/Lucene-Solr-5.5-Linux/solr/build/solr-core/test/J2/temp/solr.core.TestNRTOpen_52E8CCD11BF78518-001/init-core-data-001/index,segFN=segments_7,generation=7}
   [junit4]   2> 634091 INFO  (TEST-TestNRTOpen.testSharedCores-seed#[52E8CCD11BF78518]) [    x:collection1] o.a.s.c.SolrDeletionPolicy newest commit generation = 7
   [junit4]   2> 634101 INFO  (TEST-TestNRTOpen.testSharedCores-seed#[52E8CCD11BF78518]) [    x:collection1] o.a.s.s.SolrIndexSearcher Opening Searcher@68444f2d[collection1] main
   [junit4]   2> 634101 INFO  (TEST-TestNRTOpen.testSharedCores-seed#[52E8CCD11BF78518]) [    x:collection1] o.a.s.u.DirectUpdateHandler2 end_commit_flush
   [junit4]   2> 634101 INFO  (searcherExecutor-2381-thread-1-processing-x:collection1) [    x:collection1] o.a.s.c.SolrCore [collection1] Registered new searcher Searcher@68444f2d[collection1] main{ExitableDirectoryReader(UninvertingDirectoryReader(Uninverting(_9(5.5.0):c4)))}
   [junit4]   2> 634102 INFO  (TEST-TestNRTOpen.testSharedCores-seed#[52E8CCD11BF78518]) [    x:collection1] o.a.s.u.p.LogUpdateProcessorFactory [collection1]  webapp=null path=null params={}{commit=} 0 156
   [junit4]   2> 634103 INFO  (TEST-TestNRTOpen.testSharedCores-seed#[52E8CCD11BF78518]) [    x:collection1] o.a.s.SolrTestCaseJ4 ###Ending testSharedCores
   [junit4]   2> NOTE: reproduce with: ant test  -Dtestcase=TestNRTOpen -Dtests.method=testSharedCores -Dtests.seed=52E8CCD11BF78518 -Dtests.multiplier=3 -Dtests.slow=true -Dtests.locale=sr-Latn-BA -Dtests.timezone=SystemV/MST7 -Dtests.asserts=true -Dtests.file.encoding=ISO-8859-1
   [junit4] FAILURE 0.29s J2 | TestNRTOpen.testSharedCores <<<
   [junit4]    > Throwable #1: java.lang.AssertionError: expected:<3> but was:<1>
   [junit4]    > 	at __randomizedtesting.SeedInfo.seed([52E8CCD11BF78518:B4EB869E9301A817]:0)
   [junit4]    > 	at org.apache.solr.core.TestNRTOpen.testSharedCores(TestNRTOpen.java:116)
   [junit4]    > 	at java.lang.Thread.run(Thread.java:745)
   [junit4]   2> 634104 INFO  (SUITE-TestNRTOpen-seed#[52E8CCD11BF78518]-worker) [    x:collection1] o.a.s.SolrTestCaseJ4 ###deleteCore
   [junit4]   2> 634104 INFO  (SUITE-TestNRTOpen-seed#[52E8CCD11BF78518]-worker) [    x:collection1] o.a.s.c.CoreContainer Shutting down CoreContainer instance=1753478359
   [junit4]   2> 634105 INFO  (coreCloseExecutor-2385-thread-1-processing-x:collection1) [    x:collection1] o.a.s.c.SolrCore [collection1]  CLOSING SolrCore org.apache.solr.core.SolrCore@1c1bc0ff
   [junit4]   2> 634105 INFO  (coreCloseExecutor-2385-thread-1-processing-x:collection1) [    x:collection1] o.a.s.u.DirectUpdateHandler2 closing DirectUpdateHandler2{commits=3,autocommits=0,soft autocommits=0,optimizes=1,rollbacks=0,expungeDeletes=0,docsPending=0,adds=0,deletesById=0,deletesByQuery=0,errors=0,cumulative_adds=4,cumulative_deletesById=0,cumulative_deletesByQuery=1,cumulative_errors=0}
   [junit4]   2> 634106 INFO  (coreCloseExecutor-2385-thread-1-processing-x:collection1) [    x:collection1] o.a.s.u.SolrCoreState Closing SolrCoreState
   [junit4]   2> 634106 INFO  (coreCloseExecutor-2385-thread-1-processing-x:collection1) [    x:collection1] o.a.s.u.DefaultSolrCoreState SolrCoreState ref count has reached 0 - closing IndexWriter
   [junit4]   2> 634106 INFO  (coreCloseExecutor-2385-thread-1-processing-x:collection1) [    x:collection1] o.a.s.u.DefaultSolrCoreState closing IndexWriter with IndexWriterCloser
   [junit4]   2> 634191 INFO  (coreCloseExecutor-2385-thread-1-processing-x:collection1) [    x:collection1] o.a.s.c.SolrDeletionPolicy SolrDeletionPolicy.onCommit: commits: num=2
   [junit4]   2> 	commit{dir=/home/jenkins/workspace/Lucene-Solr-5.5-Linux/solr/build/solr-core/test/J2/temp/solr.core.TestNRTOpen_52E8CCD11BF78518-001/init-core-data-001/index,segFN=segments_7,generation=7}
   [junit4]   2> 	commit{dir=/home/jenkins/workspace/Lucene-Solr-5.5-Linux/solr/build/solr-core/test/J2/temp/solr.core.TestNRTOpen_52E8CCD11BF78518-001/init-core-data-001/index,segFN=segments_8,generation=8}
   [junit4]   2> 634191 INFO  (coreCloseExecutor-2385-thread-1-processing-x:collection1) [    x:collection1] o.a.s.c.SolrDeletionPolicy newest commit generation = 8
   [junit4]   2> 634191 INFO  (coreCloseExecutor-2385-thread-1-processing-x:collection1) [    x:collection1] o.a.s.c.SolrCore [collection1] Closing main searcher on request.
   [junit4]   2> 634192 INFO  (coreCloseExecutor-2385-thread-1-processing-x:collection1) [    x:collection1] o.a.s.c.CachingDirectoryFactory Closing StandardDirectoryFactory - 2 directories currently being tracked
   [junit4]   2> 634192 INFO  (coreCloseExecutor-2385-thread-1-processing-x:collection1) [    x:collection1] o.a.s.c.CachingDirectoryFactory looking to close /home/jenkins/workspace/Lucene-Solr-5.5-Linux/solr/build/solr-core/test/J2/temp/solr.core.TestNRTOpen_52E8CCD11BF78518-001/init-core-data-001 [CachedDir<<refCount=0;path=/home/jenkins/workspace/Lucene-Solr-5.5-Linux/solr/build/solr-core/test/J2/temp/solr.core.TestNRTOpen_52E8CCD11BF78518-001/init-core-data-001;done=false>>]
   [junit4]   2> 634192 INFO  (coreCloseExecutor-2385-thread-1-processing-x:collection1) [    x:collection1] o.a.s.c.CachingDirectoryFactory Closing directory: /home/jenkins/workspace/Lucene-Solr-5.5-Linux/solr/build/solr-core/test/J2/temp/solr.core.TestNRTOpen_52E8CCD11BF78518-001/init-core-data-001
   [junit4]   2> 634192 INFO  (coreCloseExecutor-2385-thread-1-processing-x:collection1) [    x:collection1] o.a.s.c.CachingDirectoryFactory looking to close /home/jenkins/workspace/Lucene-Solr-5.5-Linux/solr/build/solr-core/test/J2/temp/solr.core.TestNRTOpen_52E8CCD11BF78518-001/init-core-data-001/index [CachedDir<<refCount=0;path=/home/jenkins/workspace/Lucene-Solr-5.5-Linux/solr/build/solr-core/test/J2/temp/solr.core.TestNRTOpen_52E8CCD11BF78518-001/init-core-data-001/index;done=false>>]
   [junit4]   2> 634192 INFO  (coreCloseExecutor-2385-thread-1-processing-x:collection1) [    x:collection1] o.a.s.c.CachingDirectoryFactory Closing directory: /home/jenkins/workspace/Lucene-Solr-5.5-Linux/solr/build/solr-core/test/J2/temp/solr.core.TestNRTOpen_52E8CCD11BF78518-001/init-core-data-001/index
   [junit4]   2> NOTE: leaving temporary files on disk at: /home/jenkins/workspace/Lucene-Solr-5.5-Linux/solr/build/solr-core/test/J2/temp/solr.core.TestNRTOpen_52E8CCD11BF78518-001
   [junit4]   2> NOTE: test params are: codec=Asserting(Lucene54): {bazz=BlockTreeOrds(blocksize=128), foo2=PostingsFormat(name=Memory doPackFST= false), bazzz=BlockTreeOrds(blocksize=128), foo=FSTOrd50, baz=BlockTreeOrds(blocksize=128)}, docValues:{}, sim=DefaultSimilarity, locale=sr-Latn-BA, timezone=SystemV/MST7
   [junit4]   2> NOTE: Linux 3.19.0-47-generic amd64/Oracle Corporation 1.7.0_80 (64-bit)/cpus=12,threads=1,free=304811144,total=536870912
   [junit4]   2> NOTE: All tests run in this JVM: [CoreAdminRequestStatusTest, TestXIncludeConfig, DistributedFacetPivotSmallAdvancedTest, TestMaxScoreQueryParser, TestOverriddenPrefixQueryForCustomFieldType, BJQParserTest, HdfsLockFactoryTest, CollectionsAPIAsyncDistributedZkTest, ScriptEngineTest, TestFuzzyAnalyzedSuggestions, TestManagedSynonymFilterFactory, SpatialRPTFieldTypeTest, DateMathParserTest, NoCacheHeaderTest, TestCloudManagedSchemaConcurrent, TestPostingsSolrHighlighter, BlockJoinFacetSimpleTest, TestElisionMultitermQuery, TestCryptoKeys, TestReRankQParserPlugin, FullSolrCloudDistribCmdsTest, OverseerCollectionConfigSetProcessorTest, AtomicUpdatesTest, TestSearcherReuse, TestStressRecovery, MultiThreadedOCPTest, LeaderInitiatedRecoveryOnCommitTest, TestJmxMonitoredMap, TestExclusionRuleCollectionAccess, BlockDirectoryTest, CurrencyFieldXmlFileTest, DistributedExpandComponentTest, TestMiniSolrCloudCluster, TestAuthorizationFramework, TestSha256AuthenticationProvider, TestUseDocValuesAsStored2, TestManagedSchemaFieldResource, TestFreeTextSuggestions, TestTrieFacet, SortSpecParsingTest, TestConfigSetProperties, PrimitiveFieldTypeTest, TestStressReorder, TestSolr4Spatial2, TestNRTOpen]
   [junit4] Completed [149/566 (1!)] on J2 in 1.24s, 2 tests, 1 failure <<< FAILURES!

[...truncated 1322 lines...]
BUILD FAILED
/home/jenkins/workspace/Lucene-Solr-5.5-Linux/build.xml:750: The following error occurred while executing this line:
/home/jenkins/workspace/Lucene-Solr-5.5-Linux/build.xml:694: The following error occurred while executing this line:
/home/jenkins/workspace/Lucene-Solr-5.5-Linux/build.xml:59: The following error occurred while executing this line:
/home/jenkins/workspace/Lucene-Solr-5.5-Linux/solr/build.xml:233: The following error occurred while executing this line:
/home/jenkins/workspace/Lucene-Solr-5.5-Linux/solr/common-build.xml:534: The following error occurred while executing this line:
/home/jenkins/workspace/Lucene-Solr-5.5-Linux/lucene/common-build.xml:1477: The following error occurred while executing this line:
/home/jenkins/workspace/Lucene-Solr-5.5-Linux/lucene/common-build.xml:1033: There were test failures: 566 suites (7 ignored), 2275 tests, 1 failure, 84 ignored (39 assumptions) [seed: 52E8CCD11BF78518]

Total time: 55 minutes 42 seconds
Build step 'Invoke Ant' marked build as failure
Archiving artifacts
[WARNINGS] Skipping publisher since build result is FAILURE
Recording test results
Email was triggered for: Failure - Any
Sending email for trigger: Failure - Any



Mime
View raw message