lucene-dev mailing list archives

Site index · List index
Message view « Date » · « Thread »
Top « Date » · « Thread »
From Policeman Jenkins Server <jenk...@thetaphi.de>
Subject [JENKINS] Lucene-Solr-5.5-Windows (32bit/jdk1.7.0_80) - Build # 7 - Still Failing!
Date Tue, 16 Feb 2016 20:16:13 GMT
Build: http://jenkins.thetaphi.de/job/Lucene-Solr-5.5-Windows/7/
Java: 32bit/jdk1.7.0_80 -server -XX:+UseParallelGC

1 tests failed.
FAILED:  org.apache.solr.cloud.ChaosMonkeyNothingIsSafeTest.test

Error Message:
Could not find a healthy node to handle the request.

Stack Trace:
org.apache.solr.common.SolrException: Could not find a healthy node to handle the request.
	at __randomizedtesting.SeedInfo.seed([CBE1609917253D16:43B55F43B9D950EE]:0)
	at org.apache.solr.client.solrj.impl.CloudSolrClient.sendRequest(CloudSolrClient.java:1084)
	at org.apache.solr.client.solrj.impl.CloudSolrClient.requestWithRetryOnStaleState(CloudSolrClient.java:870)
	at org.apache.solr.client.solrj.impl.CloudSolrClient.request(CloudSolrClient.java:806)
	at org.apache.solr.client.solrj.SolrRequest.process(SolrRequest.java:149)
	at org.apache.solr.client.solrj.SolrClient.commit(SolrClient.java:482)
	at org.apache.solr.client.solrj.SolrClient.commit(SolrClient.java:463)
	at org.apache.solr.cloud.AbstractFullDistribZkTestBase.commit(AbstractFullDistribZkTestBase.java:1504)
	at org.apache.solr.cloud.ChaosMonkeyNothingIsSafeTest.test(ChaosMonkeyNothingIsSafeTest.java:214)
	at sun.reflect.NativeMethodAccessorImpl.invoke0(Native Method)
	at sun.reflect.NativeMethodAccessorImpl.invoke(NativeMethodAccessorImpl.java:57)
	at sun.reflect.DelegatingMethodAccessorImpl.invoke(DelegatingMethodAccessorImpl.java:43)
	at java.lang.reflect.Method.invoke(Method.java:606)
	at com.carrotsearch.randomizedtesting.RandomizedRunner.invoke(RandomizedRunner.java:1764)
	at com.carrotsearch.randomizedtesting.RandomizedRunner$8.evaluate(RandomizedRunner.java:871)
	at com.carrotsearch.randomizedtesting.RandomizedRunner$9.evaluate(RandomizedRunner.java:907)
	at com.carrotsearch.randomizedtesting.RandomizedRunner$10.evaluate(RandomizedRunner.java:921)
	at org.apache.solr.BaseDistributedSearchTestCase$ShardsRepeatRule$ShardsFixedStatement.callStatement(BaseDistributedSearchTestCase.java:964)
	at org.apache.solr.BaseDistributedSearchTestCase$ShardsRepeatRule$ShardsStatement.evaluate(BaseDistributedSearchTestCase.java:939)
	at com.carrotsearch.randomizedtesting.rules.SystemPropertiesRestoreRule$1.evaluate(SystemPropertiesRestoreRule.java:57)
	at org.apache.lucene.util.TestRuleSetupTeardownChained$1.evaluate(TestRuleSetupTeardownChained.java:49)
	at org.apache.lucene.util.AbstractBeforeAfterRule$1.evaluate(AbstractBeforeAfterRule.java:45)
	at org.apache.lucene.util.TestRuleThreadAndTestName$1.evaluate(TestRuleThreadAndTestName.java:48)
	at org.apache.lucene.util.TestRuleIgnoreAfterMaxFailures$1.evaluate(TestRuleIgnoreAfterMaxFailures.java:64)
	at org.apache.lucene.util.TestRuleMarkFailure$1.evaluate(TestRuleMarkFailure.java:47)
	at com.carrotsearch.randomizedtesting.rules.StatementAdapter.evaluate(StatementAdapter.java:36)
	at com.carrotsearch.randomizedtesting.ThreadLeakControl$StatementRunner.run(ThreadLeakControl.java:367)
	at com.carrotsearch.randomizedtesting.ThreadLeakControl.forkTimeoutingTask(ThreadLeakControl.java:809)
	at com.carrotsearch.randomizedtesting.ThreadLeakControl$3.evaluate(ThreadLeakControl.java:460)
	at com.carrotsearch.randomizedtesting.RandomizedRunner.runSingleTest(RandomizedRunner.java:880)
	at com.carrotsearch.randomizedtesting.RandomizedRunner$5.evaluate(RandomizedRunner.java:781)
	at com.carrotsearch.randomizedtesting.RandomizedRunner$6.evaluate(RandomizedRunner.java:816)
	at com.carrotsearch.randomizedtesting.RandomizedRunner$7.evaluate(RandomizedRunner.java:827)
	at com.carrotsearch.randomizedtesting.rules.StatementAdapter.evaluate(StatementAdapter.java:36)
	at com.carrotsearch.randomizedtesting.rules.SystemPropertiesRestoreRule$1.evaluate(SystemPropertiesRestoreRule.java:57)
	at org.apache.lucene.util.AbstractBeforeAfterRule$1.evaluate(AbstractBeforeAfterRule.java:45)
	at com.carrotsearch.randomizedtesting.rules.StatementAdapter.evaluate(StatementAdapter.java:36)
	at org.apache.lucene.util.TestRuleStoreClassName$1.evaluate(TestRuleStoreClassName.java:41)
	at com.carrotsearch.randomizedtesting.rules.NoShadowingOrOverridesOnMethodsRule$1.evaluate(NoShadowingOrOverridesOnMethodsRule.java:40)
	at com.carrotsearch.randomizedtesting.rules.NoShadowingOrOverridesOnMethodsRule$1.evaluate(NoShadowingOrOverridesOnMethodsRule.java:40)
	at com.carrotsearch.randomizedtesting.rules.StatementAdapter.evaluate(StatementAdapter.java:36)
	at com.carrotsearch.randomizedtesting.rules.StatementAdapter.evaluate(StatementAdapter.java:36)
	at com.carrotsearch.randomizedtesting.rules.StatementAdapter.evaluate(StatementAdapter.java:36)
	at org.apache.lucene.util.TestRuleAssertionsRequired$1.evaluate(TestRuleAssertionsRequired.java:53)
	at org.apache.lucene.util.TestRuleMarkFailure$1.evaluate(TestRuleMarkFailure.java:47)
	at org.apache.lucene.util.TestRuleIgnoreAfterMaxFailures$1.evaluate(TestRuleIgnoreAfterMaxFailures.java:64)
	at org.apache.lucene.util.TestRuleIgnoreTestSuites$1.evaluate(TestRuleIgnoreTestSuites.java:54)
	at com.carrotsearch.randomizedtesting.rules.StatementAdapter.evaluate(StatementAdapter.java:36)
	at com.carrotsearch.randomizedtesting.ThreadLeakControl$StatementRunner.run(ThreadLeakControl.java:367)
	at java.lang.Thread.run(Thread.java:745)




Build Log:
[...truncated 11890 lines...]
   [junit4] Suite: org.apache.solr.cloud.ChaosMonkeyNothingIsSafeTest
   [junit4]   2> Creating dataDir: C:\Users\JenkinsSlave\workspace\Lucene-Solr-5.5-Windows\solr\build\solr-core\test\J0\temp\solr.cloud.ChaosMonkeyNothingIsSafeTest_CBE1609917253D16-001\init-core-data-001
   [junit4]   2> 2610769 INFO  (SUITE-ChaosMonkeyNothingIsSafeTest-seed#[CBE1609917253D16]-worker) [    ] o.a.s.BaseDistributedSearchTestCase Setting hostContext system property: /
   [junit4]   2> 2610773 INFO  (TEST-ChaosMonkeyNothingIsSafeTest.test-seed#[CBE1609917253D16]) [    ] o.a.s.c.ZkTestServer STARTING ZK TEST SERVER
   [junit4]   2> 2610773 INFO  (Thread-5385) [    ] o.a.s.c.ZkTestServer client port:0.0.0.0/0.0.0.0:0
   [junit4]   2> 2610773 INFO  (Thread-5385) [    ] o.a.s.c.ZkTestServer Starting server
   [junit4]   2> 2610852 INFO  (TEST-ChaosMonkeyNothingIsSafeTest.test-seed#[CBE1609917253D16]) [    ] o.a.s.c.ZkTestServer start zk server on port:58478
   [junit4]   2> 2610852 INFO  (TEST-ChaosMonkeyNothingIsSafeTest.test-seed#[CBE1609917253D16]) [    ] o.a.s.c.c.SolrZkClient Using default ZkCredentialsProvider
   [junit4]   2> 2610852 INFO  (TEST-ChaosMonkeyNothingIsSafeTest.test-seed#[CBE1609917253D16]) [    ] o.a.s.c.c.ConnectionManager Waiting for client to connect to ZooKeeper
   [junit4]   2> 2610855 INFO  (zkCallback-3520-thread-1) [    ] o.a.s.c.c.ConnectionManager Watcher org.apache.solr.common.cloud.ConnectionManager@280df8 name:ZooKeeperConnection Watcher:127.0.0.1:58478 got event WatchedEvent state:SyncConnected type:None path:null path:null type:None
   [junit4]   2> 2610855 INFO  (TEST-ChaosMonkeyNothingIsSafeTest.test-seed#[CBE1609917253D16]) [    ] o.a.s.c.c.ConnectionManager Client is connected to ZooKeeper
   [junit4]   2> 2610855 INFO  (TEST-ChaosMonkeyNothingIsSafeTest.test-seed#[CBE1609917253D16]) [    ] o.a.s.c.c.SolrZkClient Using default ZkACLProvider
   [junit4]   2> 2610855 INFO  (TEST-ChaosMonkeyNothingIsSafeTest.test-seed#[CBE1609917253D16]) [    ] o.a.s.c.c.SolrZkClient makePath: /solr
   [junit4]   2> 2610858 INFO  (TEST-ChaosMonkeyNothingIsSafeTest.test-seed#[CBE1609917253D16]) [    ] o.a.s.c.c.SolrZkClient Using default ZkCredentialsProvider
   [junit4]   2> 2610858 INFO  (TEST-ChaosMonkeyNothingIsSafeTest.test-seed#[CBE1609917253D16]) [    ] o.a.s.c.c.ConnectionManager Waiting for client to connect to ZooKeeper
   [junit4]   2> 2610859 INFO  (zkCallback-3521-thread-1) [    ] o.a.s.c.c.ConnectionManager Watcher org.apache.solr.common.cloud.ConnectionManager@b4aa81 name:ZooKeeperConnection Watcher:127.0.0.1:58478/solr got event WatchedEvent state:SyncConnected type:None path:null path:null type:None
   [junit4]   2> 2610859 INFO  (TEST-ChaosMonkeyNothingIsSafeTest.test-seed#[CBE1609917253D16]) [    ] o.a.s.c.c.ConnectionManager Client is connected to ZooKeeper
   [junit4]   2> 2610860 INFO  (TEST-ChaosMonkeyNothingIsSafeTest.test-seed#[CBE1609917253D16]) [    ] o.a.s.c.c.SolrZkClient Using default ZkACLProvider
   [junit4]   2> 2610860 INFO  (TEST-ChaosMonkeyNothingIsSafeTest.test-seed#[CBE1609917253D16]) [    ] o.a.s.c.c.SolrZkClient makePath: /collections/collection1
   [junit4]   2> 2610861 INFO  (TEST-ChaosMonkeyNothingIsSafeTest.test-seed#[CBE1609917253D16]) [    ] o.a.s.c.c.SolrZkClient makePath: /collections/collection1/shards
   [junit4]   2> 2610862 INFO  (TEST-ChaosMonkeyNothingIsSafeTest.test-seed#[CBE1609917253D16]) [    ] o.a.s.c.c.SolrZkClient makePath: /collections/control_collection
   [junit4]   2> 2610864 INFO  (TEST-ChaosMonkeyNothingIsSafeTest.test-seed#[CBE1609917253D16]) [    ] o.a.s.c.c.SolrZkClient makePath: /collections/control_collection/shards
   [junit4]   2> 2610865 INFO  (TEST-ChaosMonkeyNothingIsSafeTest.test-seed#[CBE1609917253D16]) [    ] o.a.s.c.AbstractZkTestCase put C:\Users\JenkinsSlave\workspace\Lucene-Solr-5.5-Windows\solr\core\src\test-files\solr\collection1\conf\solrconfig-tlog.xml to /configs/conf1/solrconfig.xml
   [junit4]   2> 2610865 INFO  (TEST-ChaosMonkeyNothingIsSafeTest.test-seed#[CBE1609917253D16]) [    ] o.a.s.c.c.SolrZkClient makePath: /configs/conf1/solrconfig.xml
   [junit4]   2> 2610867 INFO  (TEST-ChaosMonkeyNothingIsSafeTest.test-seed#[CBE1609917253D16]) [    ] o.a.s.c.AbstractZkTestCase put C:\Users\JenkinsSlave\workspace\Lucene-Solr-5.5-Windows\solr\core\src\test-files\solr\collection1\conf\schema15.xml to /configs/conf1/schema.xml
   [junit4]   2> 2610867 INFO  (TEST-ChaosMonkeyNothingIsSafeTest.test-seed#[CBE1609917253D16]) [    ] o.a.s.c.c.SolrZkClient makePath: /configs/conf1/schema.xml
   [junit4]   2> 2610869 INFO  (TEST-ChaosMonkeyNothingIsSafeTest.test-seed#[CBE1609917253D16]) [    ] o.a.s.c.AbstractZkTestCase put C:\Users\JenkinsSlave\workspace\Lucene-Solr-5.5-Windows\solr\core\src\test-files\solr\collection1\conf\solrconfig.snippet.randomindexconfig.xml to /configs/conf1/solrconfig.snippet.randomindexconfig.xml
   [junit4]   2> 2610869 INFO  (TEST-ChaosMonkeyNothingIsSafeTest.test-seed#[CBE1609917253D16]) [    ] o.a.s.c.c.SolrZkClient makePath: /configs/conf1/solrconfig.snippet.randomindexconfig.xml
   [junit4]   2> 2610871 INFO  (TEST-ChaosMonkeyNothingIsSafeTest.test-seed#[CBE1609917253D16]) [    ] o.a.s.c.AbstractZkTestCase put C:\Users\JenkinsSlave\workspace\Lucene-Solr-5.5-Windows\solr\core\src\test-files\solr\collection1\conf\stopwords.txt to /configs/conf1/stopwords.txt
   [junit4]   2> 2610871 INFO  (TEST-ChaosMonkeyNothingIsSafeTest.test-seed#[CBE1609917253D16]) [    ] o.a.s.c.c.SolrZkClient makePath: /configs/conf1/stopwords.txt
   [junit4]   2> 2610872 INFO  (TEST-ChaosMonkeyNothingIsSafeTest.test-seed#[CBE1609917253D16]) [    ] o.a.s.c.AbstractZkTestCase put C:\Users\JenkinsSlave\workspace\Lucene-Solr-5.5-Windows\solr\core\src\test-files\solr\collection1\conf\protwords.txt to /configs/conf1/protwords.txt
   [junit4]   2> 2610872 INFO  (TEST-ChaosMonkeyNothingIsSafeTest.test-seed#[CBE1609917253D16]) [    ] o.a.s.c.c.SolrZkClient makePath: /configs/conf1/protwords.txt
   [junit4]   2> 2610874 INFO  (TEST-ChaosMonkeyNothingIsSafeTest.test-seed#[CBE1609917253D16]) [    ] o.a.s.c.AbstractZkTestCase put C:\Users\JenkinsSlave\workspace\Lucene-Solr-5.5-Windows\solr\core\src\test-files\solr\collection1\conf\currency.xml to /configs/conf1/currency.xml
   [junit4]   2> 2610874 INFO  (TEST-ChaosMonkeyNothingIsSafeTest.test-seed#[CBE1609917253D16]) [    ] o.a.s.c.c.SolrZkClient makePath: /configs/conf1/currency.xml
   [junit4]   2> 2610876 INFO  (TEST-ChaosMonkeyNothingIsSafeTest.test-seed#[CBE1609917253D16]) [    ] o.a.s.c.AbstractZkTestCase put C:\Users\JenkinsSlave\workspace\Lucene-Solr-5.5-Windows\solr\core\src\test-files\solr\collection1\conf\enumsConfig.xml to /configs/conf1/enumsConfig.xml
   [junit4]   2> 2610876 INFO  (TEST-ChaosMonkeyNothingIsSafeTest.test-seed#[CBE1609917253D16]) [    ] o.a.s.c.c.SolrZkClient makePath: /configs/conf1/enumsConfig.xml
   [junit4]   2> 2610878 INFO  (TEST-ChaosMonkeyNothingIsSafeTest.test-seed#[CBE1609917253D16]) [    ] o.a.s.c.AbstractZkTestCase put C:\Users\JenkinsSlave\workspace\Lucene-Solr-5.5-Windows\solr\core\src\test-files\solr\collection1\conf\open-exchange-rates.json to /configs/conf1/open-exchange-rates.json
   [junit4]   2> 2610878 INFO  (TEST-ChaosMonkeyNothingIsSafeTest.test-seed#[CBE1609917253D16]) [    ] o.a.s.c.c.SolrZkClient makePath: /configs/conf1/open-exchange-rates.json
   [junit4]   2> 2610880 INFO  (TEST-ChaosMonkeyNothingIsSafeTest.test-seed#[CBE1609917253D16]) [    ] o.a.s.c.AbstractZkTestCase put C:\Users\JenkinsSlave\workspace\Lucene-Solr-5.5-Windows\solr\core\src\test-files\solr\collection1\conf\mapping-ISOLatin1Accent.txt to /configs/conf1/mapping-ISOLatin1Accent.txt
   [junit4]   2> 2610880 INFO  (TEST-ChaosMonkeyNothingIsSafeTest.test-seed#[CBE1609917253D16]) [    ] o.a.s.c.c.SolrZkClient makePath: /configs/conf1/mapping-ISOLatin1Accent.txt
   [junit4]   2> 2610882 INFO  (TEST-ChaosMonkeyNothingIsSafeTest.test-seed#[CBE1609917253D16]) [    ] o.a.s.c.AbstractZkTestCase put C:\Users\JenkinsSlave\workspace\Lucene-Solr-5.5-Windows\solr\core\src\test-files\solr\collection1\conf\old_synonyms.txt to /configs/conf1/old_synonyms.txt
   [junit4]   2> 2610882 INFO  (TEST-ChaosMonkeyNothingIsSafeTest.test-seed#[CBE1609917253D16]) [    ] o.a.s.c.c.SolrZkClient makePath: /configs/conf1/old_synonyms.txt
   [junit4]   2> 2610883 INFO  (TEST-ChaosMonkeyNothingIsSafeTest.test-seed#[CBE1609917253D16]) [    ] o.a.s.c.AbstractZkTestCase put C:\Users\JenkinsSlave\workspace\Lucene-Solr-5.5-Windows\solr\core\src\test-files\solr\collection1\conf\synonyms.txt to /configs/conf1/synonyms.txt
   [junit4]   2> 2610883 INFO  (TEST-ChaosMonkeyNothingIsSafeTest.test-seed#[CBE1609917253D16]) [    ] o.a.s.c.c.SolrZkClient makePath: /configs/conf1/synonyms.txt
   [junit4]   2> 2611321 INFO  (TEST-ChaosMonkeyNothingIsSafeTest.test-seed#[CBE1609917253D16]) [    ] o.a.s.SolrTestCaseJ4 Writing core.properties file to C:\Users\JenkinsSlave\workspace\Lucene-Solr-5.5-Windows\solr\build\solr-core\test\J0\temp\solr.cloud.ChaosMonkeyNothingIsSafeTest_CBE1609917253D16-001\control-001\cores\collection1
   [junit4]   2> 2611323 INFO  (TEST-ChaosMonkeyNothingIsSafeTest.test-seed#[CBE1609917253D16]) [    ] o.e.j.s.Server jetty-9.2.13.v20150730
   [junit4]   2> 2611326 INFO  (TEST-ChaosMonkeyNothingIsSafeTest.test-seed#[CBE1609917253D16]) [    ] o.e.j.s.h.ContextHandler Started o.e.j.s.ServletContextHandler@1456670{/,null,AVAILABLE}
   [junit4]   2> 2611327 INFO  (TEST-ChaosMonkeyNothingIsSafeTest.test-seed#[CBE1609917253D16]) [    ] o.e.j.s.ServerConnector Started ServerConnector@1487701{HTTP/1.1}{127.0.0.1:58485}
   [junit4]   2> 2611327 INFO  (TEST-ChaosMonkeyNothingIsSafeTest.test-seed#[CBE1609917253D16]) [    ] o.e.j.s.Server Started @2615540ms
   [junit4]   2> 2611327 INFO  (TEST-ChaosMonkeyNothingIsSafeTest.test-seed#[CBE1609917253D16]) [    ] o.a.s.c.s.e.JettySolrRunner Jetty properties: {solr.data.dir=C:\Users\JenkinsSlave\workspace\Lucene-Solr-5.5-Windows\solr\build\solr-core\test\J0\temp\solr.cloud.ChaosMonkeyNothingIsSafeTest_CBE1609917253D16-001\tempDir-001/control/data, hostContext=/, coreRootDirectory=C:\Users\JenkinsSlave\workspace\Lucene-Solr-5.5-Windows\solr\build\solr-core\test\J0\temp\solr.cloud.ChaosMonkeyNothingIsSafeTest_CBE1609917253D16-001\control-001\cores, hostPort=58485}
   [junit4]   2> 2611328 INFO  (TEST-ChaosMonkeyNothingIsSafeTest.test-seed#[CBE1609917253D16]) [    ] o.a.s.s.SolrDispatchFilter SolrDispatchFilter.init(): sun.misc.Launcher$AppClassLoader@1756db3
   [junit4]   2> 2611328 INFO  (TEST-ChaosMonkeyNothingIsSafeTest.test-seed#[CBE1609917253D16]) [    ] o.a.s.c.SolrResourceLoader new SolrResourceLoader for directory: 'C:\Users\JenkinsSlave\workspace\Lucene-Solr-5.5-Windows\solr\build\solr-core\test\J0\temp\solr.cloud.ChaosMonkeyNothingIsSafeTest_CBE1609917253D16-001\control-001'
   [junit4]   2> 2611328 INFO  (TEST-ChaosMonkeyNothingIsSafeTest.test-seed#[CBE1609917253D16]) [    ] o.a.s.c.SolrResourceLoader JNDI not configured for solr (NoInitialContextEx)
   [junit4]   2> 2611329 INFO  (TEST-ChaosMonkeyNothingIsSafeTest.test-seed#[CBE1609917253D16]) [    ] o.a.s.c.SolrResourceLoader solr home defaulted to 'solr/' (could not find system property or JNDI)
   [junit4]   2> 2611329 INFO  (TEST-ChaosMonkeyNothingIsSafeTest.test-seed#[CBE1609917253D16]) [    ] o.a.s.c.c.SolrZkClient Using default ZkCredentialsProvider
   [junit4]   2> 2611330 INFO  (TEST-ChaosMonkeyNothingIsSafeTest.test-seed#[CBE1609917253D16]) [    ] o.a.s.c.c.ConnectionManager Waiting for client to connect to ZooKeeper
   [junit4]   2> 2611331 INFO  (zkCallback-3522-thread-1) [    ] o.a.s.c.c.ConnectionManager Watcher org.apache.solr.common.cloud.ConnectionManager@70f777 name:ZooKeeperConnection Watcher:127.0.0.1:58478/solr got event WatchedEvent state:SyncConnected type:None path:null path:null type:None
   [junit4]   2> 2611331 INFO  (TEST-ChaosMonkeyNothingIsSafeTest.test-seed#[CBE1609917253D16]) [    ] o.a.s.c.c.ConnectionManager Client is connected to ZooKeeper
   [junit4]   2> 2611331 INFO  (TEST-ChaosMonkeyNothingIsSafeTest.test-seed#[CBE1609917253D16]) [    ] o.a.s.c.c.SolrZkClient Using default ZkACLProvider
   [junit4]   2> 2611332 INFO  (TEST-ChaosMonkeyNothingIsSafeTest.test-seed#[CBE1609917253D16]) [    ] o.a.s.s.SolrDispatchFilter Loading solr.xml from SolrHome (not found in ZooKeeper)
   [junit4]   2> 2611332 INFO  (TEST-ChaosMonkeyNothingIsSafeTest.test-seed#[CBE1609917253D16]) [    ] o.a.s.c.SolrXmlConfig Loading container configuration from C:\Users\JenkinsSlave\workspace\Lucene-Solr-5.5-Windows\solr\build\solr-core\test\J0\temp\solr.cloud.ChaosMonkeyNothingIsSafeTest_CBE1609917253D16-001\control-001\solr.xml
   [junit4]   2> 2611354 INFO  (TEST-ChaosMonkeyNothingIsSafeTest.test-seed#[CBE1609917253D16]) [    ] o.a.s.c.CorePropertiesLocator Config-defined core root directory: C:\Users\JenkinsSlave\workspace\Lucene-Solr-5.5-Windows\solr\build\solr-core\test\J0\temp\solr.cloud.ChaosMonkeyNothingIsSafeTest_CBE1609917253D16-001\control-001\cores
   [junit4]   2> 2611354 INFO  (TEST-ChaosMonkeyNothingIsSafeTest.test-seed#[CBE1609917253D16]) [    ] o.a.s.c.CoreContainer New CoreContainer 11223904
   [junit4]   2> 2611354 INFO  (TEST-ChaosMonkeyNothingIsSafeTest.test-seed#[CBE1609917253D16]) [    ] o.a.s.c.CoreContainer Loading cores into CoreContainer [instanceDir=C:\Users\JenkinsSlave\workspace\Lucene-Solr-5.5-Windows\solr\build\solr-core\test\J0\temp\solr.cloud.ChaosMonkeyNothingIsSafeTest_CBE1609917253D16-001\control-001]
   [junit4]   2> 2611354 WARN  (TEST-ChaosMonkeyNothingIsSafeTest.test-seed#[CBE1609917253D16]) [    ] o.a.s.c.CoreContainer Couldn't add files from C:\Users\JenkinsSlave\workspace\Lucene-Solr-5.5-Windows\solr\build\solr-core\test\J0\temp\solr.cloud.ChaosMonkeyNothingIsSafeTest_CBE1609917253D16-001\control-001\lib to classpath: C:\Users\JenkinsSlave\workspace\Lucene-Solr-5.5-Windows\solr\build\solr-core\test\J0\temp\solr.cloud.ChaosMonkeyNothingIsSafeTest_CBE1609917253D16-001\control-001\lib
   [junit4]   2> 2611354 INFO  (TEST-ChaosMonkeyNothingIsSafeTest.test-seed#[CBE1609917253D16]) [    ] o.a.s.h.c.HttpShardHandlerFactory created with socketTimeout : 90000,urlScheme : ,connTimeout : 15000,maxConnectionsPerHost : 20,maxConnections : 10000,corePoolSize : 0,maximumPoolSize : 2147483647,maxThreadIdleTime : 5,sizeOfQueue : -1,fairnessPolicy : false,useRetries : false,
   [junit4]   2> 2611356 INFO  (TEST-ChaosMonkeyNothingIsSafeTest.test-seed#[CBE1609917253D16]) [    ] o.a.s.u.UpdateShardHandler Creating UpdateShardHandler HTTP client with params: socketTimeout=340000&connTimeout=45000&retry=true
   [junit4]   2> 2611356 INFO  (TEST-ChaosMonkeyNothingIsSafeTest.test-seed#[CBE1609917253D16]) [    ] o.a.s.l.LogWatcher SLF4J impl is org.slf4j.impl.Log4jLoggerFactory
   [junit4]   2> 2611356 INFO  (TEST-ChaosMonkeyNothingIsSafeTest.test-seed#[CBE1609917253D16]) [    ] o.a.s.l.LogWatcher Registering Log Listener [Log4j (org.slf4j.impl.Log4jLoggerFactory)]
   [junit4]   2> 2611357 INFO  (TEST-ChaosMonkeyNothingIsSafeTest.test-seed#[CBE1609917253D16]) [    ] o.a.s.c.ZkContainer Zookeeper client=127.0.0.1:58478/solr
   [junit4]   2> 2611357 INFO  (TEST-ChaosMonkeyNothingIsSafeTest.test-seed#[CBE1609917253D16]) [    ] o.a.s.c.ZkController zkHost includes chroot
   [junit4]   2> 2611357 INFO  (TEST-ChaosMonkeyNothingIsSafeTest.test-seed#[CBE1609917253D16]) [    ] o.a.s.c.c.SolrZkClient Using default ZkCredentialsProvider
   [junit4]   2> 2611358 INFO  (TEST-ChaosMonkeyNothingIsSafeTest.test-seed#[CBE1609917253D16]) [    ] o.a.s.c.c.ConnectionManager Waiting for client to connect to ZooKeeper
   [junit4]   2> 2611358 INFO  (zkCallback-3525-thread-1) [    ] o.a.s.c.c.ConnectionManager Watcher org.apache.solr.common.cloud.ConnectionManager@db4cf8 name:ZooKeeperConnection Watcher:127.0.0.1:58478 got event WatchedEvent state:SyncConnected type:None path:null path:null type:None
   [junit4]   2> 2611358 INFO  (TEST-ChaosMonkeyNothingIsSafeTest.test-seed#[CBE1609917253D16]) [    ] o.a.s.c.c.ConnectionManager Client is connected to ZooKeeper
   [junit4]   2> 2611359 INFO  (TEST-ChaosMonkeyNothingIsSafeTest.test-seed#[CBE1609917253D16]) [    ] o.a.s.c.c.SolrZkClient Using default ZkACLProvider
   [junit4]   2> 2611361 INFO  (TEST-ChaosMonkeyNothingIsSafeTest.test-seed#[CBE1609917253D16]) [n:127.0.0.1:58485_    ] o.a.s.c.c.ConnectionManager Waiting for client to connect to ZooKeeper
   [junit4]   2> 2611361 INFO  (zkCallback-3526-thread-1-processing-n:127.0.0.1:58485_) [n:127.0.0.1:58485_    ] o.a.s.c.c.ConnectionManager Watcher org.apache.solr.common.cloud.ConnectionManager@15b925c name:ZooKeeperConnection Watcher:127.0.0.1:58478/solr got event WatchedEvent state:SyncConnected type:None path:null path:null type:None
   [junit4]   2> 2611361 INFO  (TEST-ChaosMonkeyNothingIsSafeTest.test-seed#[CBE1609917253D16]) [n:127.0.0.1:58485_    ] o.a.s.c.c.ConnectionManager Client is connected to ZooKeeper
   [junit4]   2> 2611363 INFO  (TEST-ChaosMonkeyNothingIsSafeTest.test-seed#[CBE1609917253D16]) [n:127.0.0.1:58485_    ] o.a.s.c.c.SolrZkClient makePath: /overseer/queue
   [junit4]   2> 2611364 INFO  (TEST-ChaosMonkeyNothingIsSafeTest.test-seed#[CBE1609917253D16]) [n:127.0.0.1:58485_    ] o.a.s.c.c.SolrZkClient makePath: /overseer/collection-queue-work
   [junit4]   2> 2611367 INFO  (TEST-ChaosMonkeyNothingIsSafeTest.test-seed#[CBE1609917253D16]) [n:127.0.0.1:58485_    ] o.a.s.c.c.SolrZkClient makePath: /overseer/collection-map-running
   [junit4]   2> 2611368 INFO  (TEST-ChaosMonkeyNothingIsSafeTest.test-seed#[CBE1609917253D16]) [n:127.0.0.1:58485_    ] o.a.s.c.c.SolrZkClient makePath: /overseer/collection-map-completed
   [junit4]   2> 2611370 INFO  (TEST-ChaosMonkeyNothingIsSafeTest.test-seed#[CBE1609917253D16]) [n:127.0.0.1:58485_    ] o.a.s.c.c.SolrZkClient makePath: /overseer/collection-map-failure
   [junit4]   2> 2611371 INFO  (TEST-ChaosMonkeyNothingIsSafeTest.test-seed#[CBE1609917253D16]) [n:127.0.0.1:58485_    ] o.a.s.c.c.SolrZkClient makePath: /live_nodes
   [junit4]   2> 2611373 INFO  (TEST-ChaosMonkeyNothingIsSafeTest.test-seed#[CBE1609917253D16]) [n:127.0.0.1:58485_    ] o.a.s.c.c.SolrZkClient makePath: /aliases.json
   [junit4]   2> 2611374 INFO  (TEST-ChaosMonkeyNothingIsSafeTest.test-seed#[CBE1609917253D16]) [n:127.0.0.1:58485_    ] o.a.s.c.c.SolrZkClient makePath: /clusterstate.json
   [junit4]   2> 2611374 INFO  (TEST-ChaosMonkeyNothingIsSafeTest.test-seed#[CBE1609917253D16]) [n:127.0.0.1:58485_    ] o.a.s.c.c.SolrZkClient makePath: /security.json
   [junit4]   2> 2611375 INFO  (TEST-ChaosMonkeyNothingIsSafeTest.test-seed#[CBE1609917253D16]) [n:127.0.0.1:58485_    ] o.a.s.c.ZkController Register node as live in ZooKeeper:/live_nodes/127.0.0.1:58485_
   [junit4]   2> 2611376 INFO  (TEST-ChaosMonkeyNothingIsSafeTest.test-seed#[CBE1609917253D16]) [n:127.0.0.1:58485_    ] o.a.s.c.c.SolrZkClient makePath: /live_nodes/127.0.0.1:58485_
   [junit4]   2> 2611377 INFO  (TEST-ChaosMonkeyNothingIsSafeTest.test-seed#[CBE1609917253D16]) [n:127.0.0.1:58485_    ] o.a.s.c.c.SolrZkClient makePath: /overseer_elect
   [junit4]   2> 2611378 INFO  (TEST-ChaosMonkeyNothingIsSafeTest.test-seed#[CBE1609917253D16]) [n:127.0.0.1:58485_    ] o.a.s.c.c.SolrZkClient makePath: /overseer_elect/election
   [junit4]   2> 2611379 INFO  (TEST-ChaosMonkeyNothingIsSafeTest.test-seed#[CBE1609917253D16]) [n:127.0.0.1:58485_    ] o.a.s.c.Overseer Overseer (id=null) closing
   [junit4]   2> 2611380 INFO  (TEST-ChaosMonkeyNothingIsSafeTest.test-seed#[CBE1609917253D16]) [n:127.0.0.1:58485_    ] o.a.s.c.LeaderElector Joined leadership election with path: /overseer_elect/election/95397660305326084-127.0.0.1:58485_-n_0000000000
   [junit4]   2> 2611380 INFO  (TEST-ChaosMonkeyNothingIsSafeTest.test-seed#[CBE1609917253D16]) [n:127.0.0.1:58485_    ] o.a.s.c.OverseerElectionContext I am going to be the leader 127.0.0.1:58485_
   [junit4]   2> 2611380 INFO  (TEST-ChaosMonkeyNothingIsSafeTest.test-seed#[CBE1609917253D16]) [n:127.0.0.1:58485_    ] o.a.s.c.c.SolrZkClient makePath: /overseer_elect/leader
   [junit4]   2> 2611381 INFO  (TEST-ChaosMonkeyNothingIsSafeTest.test-seed#[CBE1609917253D16]) [n:127.0.0.1:58485_    ] o.a.s.c.Overseer Overseer (id=95397660305326084-127.0.0.1:58485_-n_0000000000) starting
   [junit4]   2> 2611383 INFO  (TEST-ChaosMonkeyNothingIsSafeTest.test-seed#[CBE1609917253D16]) [n:127.0.0.1:58485_    ] o.a.s.c.c.SolrZkClient makePath: /overseer/queue-work
   [junit4]   2> 2611390 INFO  (TEST-ChaosMonkeyNothingIsSafeTest.test-seed#[CBE1609917253D16]) [n:127.0.0.1:58485_    ] o.a.s.c.OverseerAutoReplicaFailoverThread Starting OverseerAutoReplicaFailoverThread autoReplicaFailoverWorkLoopDelay=10000 autoReplicaFailoverWaitAfterExpiration=30000 autoReplicaFailoverBadNodeExpiration=60000
   [junit4]   2> 2611390 INFO  (OverseerCollectionConfigSetProcessor-95397660305326084-127.0.0.1:58485_-n_0000000000) [n:127.0.0.1:58485_    ] o.a.s.c.OverseerTaskProcessor Process current queue of overseer operations
   [junit4]   2> 2611390 INFO  (TEST-ChaosMonkeyNothingIsSafeTest.test-seed#[CBE1609917253D16]) [n:127.0.0.1:58485_    ] o.a.s.c.c.ZkStateReader Updating cluster state from ZooKeeper... 
   [junit4]   2> 2611390 INFO  (OverseerStateUpdate-95397660305326084-127.0.0.1:58485_-n_0000000000) [n:127.0.0.1:58485_    ] o.a.s.c.Overseer Starting to work on the main queue
   [junit4]   2> 2611434 INFO  (TEST-ChaosMonkeyNothingIsSafeTest.test-seed#[CBE1609917253D16]) [n:127.0.0.1:58485_    ] o.a.s.c.CoreContainer Security conf doesn't exist. Skipping setup for authorization module.
   [junit4]   2> 2611434 INFO  (TEST-ChaosMonkeyNothingIsSafeTest.test-seed#[CBE1609917253D16]) [n:127.0.0.1:58485_    ] o.a.s.c.CoreContainer No authentication plugin used.
   [junit4]   2> 2611434 INFO  (TEST-ChaosMonkeyNothingIsSafeTest.test-seed#[CBE1609917253D16]) [n:127.0.0.1:58485_    ] o.a.s.c.CorePropertiesLocator Looking for core definitions underneath C:\Users\JenkinsSlave\workspace\Lucene-Solr-5.5-Windows\solr\build\solr-core\test\J0\temp\solr.cloud.ChaosMonkeyNothingIsSafeTest_CBE1609917253D16-001\control-001\cores
   [junit4]   2> 2611436 INFO  (TEST-ChaosMonkeyNothingIsSafeTest.test-seed#[CBE1609917253D16]) [n:127.0.0.1:58485_    ] o.a.s.c.CoreDescriptor Created CoreDescriptor: {schema=schema.xml, config=solrconfig.xml, dataDir=data\, transient=false, configSetProperties=configsetprops.json, collection=control_collection, coreNodeName=, name=collection1, shard=, loadOnStartup=true}
   [junit4]   2> 2611436 INFO  (TEST-ChaosMonkeyNothingIsSafeTest.test-seed#[CBE1609917253D16]) [n:127.0.0.1:58485_    ] o.a.s.c.CorePropertiesLocator Found core collection1 in C:\Users\JenkinsSlave\workspace\Lucene-Solr-5.5-Windows\solr\build\solr-core\test\J0\temp\solr.cloud.ChaosMonkeyNothingIsSafeTest_CBE1609917253D16-001\control-001\cores\collection1
   [junit4]   2> 2611436 INFO  (TEST-ChaosMonkeyNothingIsSafeTest.test-seed#[CBE1609917253D16]) [n:127.0.0.1:58485_    ] o.a.s.c.CorePropertiesLocator Found 1 core definitions
   [junit4]   2> 2611437 INFO  (TEST-ChaosMonkeyNothingIsSafeTest.test-seed#[CBE1609917253D16]) [n:127.0.0.1:58485_    ] o.a.s.s.SolrDispatchFilter user.dir=C:\Users\JenkinsSlave\workspace\Lucene-Solr-5.5-Windows\solr\build\solr-core\test\J0
   [junit4]   2> 2611437 INFO  (TEST-ChaosMonkeyNothingIsSafeTest.test-seed#[CBE1609917253D16]) [n:127.0.0.1:58485_    ] o.a.s.s.SolrDispatchFilter SolrDispatchFilter.init() done
   [junit4]   2> 2611437 INFO  (coreLoadExecutor-7240-thread-1-processing-n:127.0.0.1:58485_) [n:127.0.0.1:58485_ c:control_collection   x:collection1] o.a.s.c.ZkController publishing state=down
   [junit4]   2> 2611437 INFO  (coreLoadExecutor-7240-thread-1-processing-n:127.0.0.1:58485_) [n:127.0.0.1:58485_ c:control_collection   x:collection1] o.a.s.c.ZkController numShards not found on descriptor - reading it from system property
   [junit4]   2> 2611439 INFO  (OverseerStateUpdate-95397660305326084-127.0.0.1:58485_-n_0000000000) [n:127.0.0.1:58485_    ] o.a.s.c.Overseer processMessage: queueSize: 1, message = {
   [junit4]   2>   "node_name":"127.0.0.1:58485_",
   [junit4]   2>   "core":"collection1",
   [junit4]   2>   "state":"down",
   [junit4]   2>   "roles":null,
   [junit4]   2>   "collection":"control_collection",
   [junit4]   2>   "base_url":"http://127.0.0.1:58485",
   [junit4]   2>   "numShards":"1",
   [junit4]   2>   "shard":null,
   [junit4]   2>   "operation":"state"} current state version: 0
   [junit4]   2> 2611440 INFO  (coreLoadExecutor-7240-thread-1-processing-n:127.0.0.1:58485_) [n:127.0.0.1:58485_ c:control_collection   x:collection1] o.a.s.c.ZkController look for our core node name
   [junit4]   2> 2611440 INFO  (OverseerStateUpdate-95397660305326084-127.0.0.1:58485_-n_0000000000) [n:127.0.0.1:58485_    ] o.a.s.c.o.ReplicaMutator Update state numShards=1 message={
   [junit4]   2>   "node_name":"127.0.0.1:58485_",
   [junit4]   2>   "core":"collection1",
   [junit4]   2>   "state":"down",
   [junit4]   2>   "roles":null,
   [junit4]   2>   "collection":"control_collection",
   [junit4]   2>   "base_url":"http://127.0.0.1:58485",
   [junit4]   2>   "numShards":"1",
   [junit4]   2>   "shard":null,
   [junit4]   2>   "operation":"state"}
   [junit4]   2> 2611440 INFO  (OverseerStateUpdate-95397660305326084-127.0.0.1:58485_-n_0000000000) [n:127.0.0.1:58485_    ] o.a.s.c.o.ClusterStateMutator building a new cName: control_collection
   [junit4]   2> 2611440 INFO  (OverseerStateUpdate-95397660305326084-127.0.0.1:58485_-n_0000000000) [n:127.0.0.1:58485_    ] o.a.s.c.o.ReplicaMutator Assigning new node to shard shard=shard1
   [junit4]   2> 2611441 INFO  (zkCallback-3526-thread-1-processing-n:127.0.0.1:58485_) [n:127.0.0.1:58485_    ] o.a.s.c.c.ZkStateReader A cluster state change: [WatchedEvent state:SyncConnected type:NodeDataChanged path:/clusterstate.json], has occurred - updating... (live nodes size: [1])
   [junit4]   2> 2612270 INFO  (coreLoadExecutor-7240-thread-1-processing-n:127.0.0.1:58485_) [n:127.0.0.1:58485_ c:control_collection   x:collection1] o.a.s.c.ZkController waiting to find shard id in clusterstate for collection1
   [junit4]   2> 2612270 INFO  (coreLoadExecutor-7240-thread-1-processing-n:127.0.0.1:58485_) [n:127.0.0.1:58485_ c:control_collection   x:collection1] o.a.s.c.ZkController Check for collection zkNode:control_collection
   [junit4]   2> 2612270 INFO  (coreLoadExecutor-7240-thread-1-processing-n:127.0.0.1:58485_) [n:127.0.0.1:58485_ c:control_collection   x:collection1] o.a.s.c.ZkController Collection zkNode exists
   [junit4]   2> 2612270 INFO  (coreLoadExecutor-7240-thread-1-processing-n:127.0.0.1:58485_) [n:127.0.0.1:58485_ c:control_collection   x:collection1] o.a.s.c.c.ZkStateReader Load collection config from: [/collections/control_collection]
   [junit4]   2> 2612271 INFO  (coreLoadExecutor-7240-thread-1-processing-n:127.0.0.1:58485_) [n:127.0.0.1:58485_ c:control_collection   x:collection1] o.a.s.c.c.ZkStateReader path=[/collections/control_collection] [configName]=[conf1] specified config exists in ZooKeeper
   [junit4]   2> 2612271 INFO  (coreLoadExecutor-7240-thread-1-processing-n:127.0.0.1:58485_) [n:127.0.0.1:58485_ c:control_collection   x:collection1] o.a.s.c.SolrResourceLoader new SolrResourceLoader for directory: 'C:\Users\JenkinsSlave\workspace\Lucene-Solr-5.5-Windows\solr\build\solr-core\test\J0\temp\solr.cloud.ChaosMonkeyNothingIsSafeTest_CBE1609917253D16-001\control-001\cores\collection1'
   [junit4]   2> 2612271 INFO  (coreLoadExecutor-7240-thread-1-processing-n:127.0.0.1:58485_) [n:127.0.0.1:58485_ c:control_collection   x:collection1] o.a.s.c.SolrResourceLoader JNDI not configured for solr (NoInitialContextEx)
   [junit4]   2> 2612271 INFO  (coreLoadExecutor-7240-thread-1-processing-n:127.0.0.1:58485_) [n:127.0.0.1:58485_ c:control_collection   x:collection1] o.a.s.c.SolrResourceLoader solr home defaulted to 'solr/' (could not find system property or JNDI)
   [junit4]   2> 2612274 INFO  (coreLoadExecutor-7240-thread-1-processing-n:127.0.0.1:58485_) [n:127.0.0.1:58485_ c:control_collection   x:collection1] o.a.s.c.Config loaded config solrconfig.xml with version 0 
   [junit4]   2> 2612295 INFO  (coreLoadExecutor-7240-thread-1-processing-n:127.0.0.1:58485_) [n:127.0.0.1:58485_ c:control_collection   x:collection1] o.a.s.c.SolrConfig current version of requestparams : -1
   [junit4]   2> 2612313 INFO  (coreLoadExecutor-7240-thread-1-processing-n:127.0.0.1:58485_) [n:127.0.0.1:58485_ c:control_collection   x:collection1] o.a.s.c.SolrConfig Using Lucene MatchVersion: 5.5.0
   [junit4]   2> 2612343 INFO  (coreLoadExecutor-7240-thread-1-processing-n:127.0.0.1:58485_) [n:127.0.0.1:58485_ c:control_collection   x:collection1] o.a.s.c.SolrConfig Loaded SolrConfig: solrconfig.xml
   [junit4]   2> 2612353 INFO  (coreLoadExecutor-7240-thread-1-processing-n:127.0.0.1:58485_) [n:127.0.0.1:58485_ c:control_collection   x:collection1] o.a.s.s.IndexSchema [collection1] Schema name=test
   [junit4]   2> 2612564 INFO  (coreLoadExecutor-7240-thread-1-processing-n:127.0.0.1:58485_) [n:127.0.0.1:58485_ c:control_collection   x:collection1] o.a.s.s.IndexSchema default search field in schema is text
   [junit4]   2> 2612565 INFO  (coreLoadExecutor-7240-thread-1-processing-n:127.0.0.1:58485_) [n:127.0.0.1:58485_ c:control_collection   x:collection1] o.a.s.s.IndexSchema unique key field: id
   [junit4]   2> 2612566 INFO  (coreLoadExecutor-7240-thread-1-processing-n:127.0.0.1:58485_) [n:127.0.0.1:58485_ c:control_collection   x:collection1] o.a.s.s.FileExchangeRateProvider Reloading exchange rates from file currency.xml
   [junit4]   2> 2612570 INFO  (coreLoadExecutor-7240-thread-1-processing-n:127.0.0.1:58485_) [n:127.0.0.1:58485_ c:control_collection   x:collection1] o.a.s.s.FileExchangeRateProvider Reloading exchange rates from file currency.xml
   [junit4]   2> 2612590 INFO  (coreLoadExecutor-7240-thread-1-processing-n:127.0.0.1:58485_) [n:127.0.0.1:58485_ c:control_collection   x:collection1] o.a.s.c.ConfigSetProperties Did not find ConfigSet properties, assuming default properties: Can't find resource 'configsetprops.json' in classpath or '/configs/conf1', cwd=C:\Users\JenkinsSlave\workspace\Lucene-Solr-5.5-Windows\solr\build\solr-core\test\J0
   [junit4]   2> 2612591 INFO  (coreLoadExecutor-7240-thread-1-processing-n:127.0.0.1:58485_) [n:127.0.0.1:58485_ c:control_collection   x:collection1] o.a.s.c.CoreContainer Creating SolrCore 'collection1' using configuration from collection control_collection
   [junit4]   2> 2612591 INFO  (coreLoadExecutor-7240-thread-1-processing-n:127.0.0.1:58485_) [n:127.0.0.1:58485_ c:control_collection s:shard1 r:core_node1 x:collection1] o.a.s.c.SolrCore solr.StandardDirectoryFactory
   [junit4]   2> 2612591 INFO  (coreLoadExecutor-7240-thread-1-processing-n:127.0.0.1:58485_) [n:127.0.0.1:58485_ c:control_collection s:shard1 r:core_node1 x:collection1] o.a.s.c.SolrCore [[collection1] ] Opening new SolrCore at [C:\Users\JenkinsSlave\workspace\Lucene-Solr-5.5-Windows\solr\build\solr-core\test\J0\temp\solr.cloud.ChaosMonkeyNothingIsSafeTest_CBE1609917253D16-001\control-001\cores\collection1], dataDir=[C:\Users\JenkinsSlave\workspace\Lucene-Solr-5.5-Windows\solr\build\solr-core\test\J0\temp\solr.cloud.ChaosMonkeyNothingIsSafeTest_CBE1609917253D16-001\control-001\cores\collection1\data\]
   [junit4]   2> 2612591 INFO  (coreLoadExecutor-7240-thread-1-processing-n:127.0.0.1:58485_) [n:127.0.0.1:58485_ c:control_collection s:shard1 r:core_node1 x:collection1] o.a.s.c.JmxMonitoredMap JMX monitoring is enabled. Adding Solr mbeans to JMX Server: com.sun.jmx.mbeanserver.JmxMBeanServer@116d3cf
   [junit4]   2> 2612651 INFO  (coreLoadExecutor-7240-thread-1-processing-n:127.0.0.1:58485_) [n:127.0.0.1:58485_ c:control_collection s:shard1 r:core_node1 x:collection1] o.a.s.c.CachingDirectoryFactory return new directory for C:\Users\JenkinsSlave\workspace\Lucene-Solr-5.5-Windows\solr\build\solr-core\test\J0\temp\solr.cloud.ChaosMonkeyNothingIsSafeTest_CBE1609917253D16-001\control-001\cores\collection1\data
   [junit4]   2> 2612652 INFO  (coreLoadExecutor-7240-thread-1-processing-n:127.0.0.1:58485_) [n:127.0.0.1:58485_ c:control_collection s:shard1 r:core_node1 x:collection1] o.a.s.c.SolrCore New index directory detected: old=null new=C:\Users\JenkinsSlave\workspace\Lucene-Solr-5.5-Windows\solr\build\solr-core\test\J0\temp\solr.cloud.ChaosMonkeyNothingIsSafeTest_CBE1609917253D16-001\control-001\cores\collection1\data\index/
   [junit4]   2> 2612653 WARN  (coreLoadExecutor-7240-thread-1-processing-n:127.0.0.1:58485_) [n:127.0.0.1:58485_ c:control_collection s:shard1 r:core_node1 x:collection1] o.a.s.c.SolrCore [collection1] Solr index directory 'C:\Users\JenkinsSlave\workspace\Lucene-Solr-5.5-Windows\solr\build\solr-core\test\J0\temp\solr.cloud.ChaosMonkeyNothingIsSafeTest_CBE1609917253D16-001\control-001\cores\collection1\data\index' doesn't exist. Creating new index...
   [junit4]   2> 2612654 INFO  (coreLoadExecutor-7240-thread-1-processing-n:127.0.0.1:58485_) [n:127.0.0.1:58485_ c:control_collection s:shard1 r:core_node1 x:collection1] o.a.s.c.CachingDirectoryFactory return new directory for C:\Users\JenkinsSlave\workspace\Lucene-Solr-5.5-Windows\solr\build\solr-core\test\J0\temp\solr.cloud.ChaosMonkeyNothingIsSafeTest_CBE1609917253D16-001\control-001\cores\collection1\data\index
   [junit4]   2> 2612655 INFO  (coreLoadExecutor-7240-thread-1-processing-n:127.0.0.1:58485_) [n:127.0.0.1:58485_ c:control_collection s:shard1 r:core_node1 x:collection1] o.a.s.u.RandomMergePolicy RandomMergePolicy wrapping class org.apache.lucene.index.LogByteSizeMergePolicy: [LogByteSizeMergePolicy: minMergeSize=1677721, mergeFactor=31, maxMergeSize=2147483648, maxMergeSizeForForcedMerge=9223372036854775807, calibrateSizeByDeletes=true, maxMergeDocs=2147483647, maxCFSSegmentSizeMB=8.796093022207999E12, noCFSRatio=1.0]
   [junit4]   2> 2612675 INFO  (coreLoadExecutor-7240-thread-1-processing-n:127.0.0.1:58485_) [n:127.0.0.1:58485_ c:control_collection s:shard1 r:core_node1 x:collection1] o.a.s.c.SolrDeletionPolicy SolrDeletionPolicy.onCommit: commits: num=1
   [junit4]   2> 	commit{dir=C:\Users\JenkinsSlave\workspace\Lucene-Solr-5.5-Windows\solr\build\solr-core\test\J0\temp\solr.cloud.ChaosMonkeyNothingIsSafeTest_CBE1609917253D16-001\control-001\cores\collection1\data\index,segFN=segments_1,generation=1}
   [junit4]   2> 2612675 INFO  (coreLoadExecutor-7240-thread-1-processing-n:127.0.0.1:58485_) [n:127.0.0.1:58485_ c:control_collection s:shard1 r:core_node1 x:collection1] o.a.s.c.SolrDeletionPolicy newest commit generation = 1
   [junit4]   2> 2612676 INFO  (OldIndexDirectoryCleanupThreadForCore-collection1) [n:127.0.0.1:58485_ c:control_collection s:shard1 r:core_node1 x:collection1] o.a.s.c.SolrCore Looking for old index directories to cleanup for core collection1 in C:\Users\JenkinsSlave\workspace\Lucene-Solr-5.5-Windows\solr\build\solr-core\test\J0\temp\solr.cloud.ChaosMonkeyNothingIsSafeTest_CBE1609917253D16-001\control-001\cores\collection1\data\
   [junit4]   2> 2612678 INFO  (coreLoadExecutor-7240-thread-1-processing-n:127.0.0.1:58485_) [n:127.0.0.1:58485_ c:control_collection s:shard1 r:core_node1 x:collection1] o.a.s.u.p.UpdateRequestProcessorChain creating updateRequestProcessorChain "nodistrib"
   [junit4]   2> 2612678 INFO  (coreLoadExecutor-7240-thread-1-processing-n:127.0.0.1:58485_) [n:127.0.0.1:58485_ c:control_collection s:shard1 r:core_node1 x:collection1] o.a.s.u.p.UpdateRequestProcessorChain creating updateRequestProcessorChain "dedupe"
   [junit4]   2> 2612678 INFO  (coreLoadExecutor-7240-thread-1-processing-n:127.0.0.1:58485_) [n:127.0.0.1:58485_ c:control_collection s:shard1 r:core_node1 x:collection1] o.a.s.u.p.UpdateRequestProcessorChain inserting DistributedUpdateProcessorFactory into updateRequestProcessorChain "dedupe"
   [junit4]   2> 2612679 INFO  (coreLoadExecutor-7240-thread-1-processing-n:127.0.0.1:58485_) [n:127.0.0.1:58485_ c:control_collection s:shard1 r:core_node1 x:collection1] o.a.s.u.p.UpdateRequestProcessorChain creating updateRequestProcessorChain "stored_sig"
   [junit4]   2> 2612679 INFO  (coreLoadExecutor-7240-thread-1-processing-n:127.0.0.1:58485_) [n:127.0.0.1:58485_ c:control_collection s:shard1 r:core_node1 x:collection1] o.a.s.u.p.UpdateRequestProcessorChain inserting DistributedUpdateProcessorFactory into updateRequestProcessorChain "stored_sig"
   [junit4]   2> 2612679 INFO  (coreLoadExecutor-7240-thread-1-processing-n:127.0.0.1:58485_) [n:127.0.0.1:58485_ c:control_collection s:shard1 r:core_node1 x:collection1] o.a.s.u.p.UpdateRequestProcessorChain creating updateRequestProcessorChain "distrib-dup-test-chain-explicit"
   [junit4]   2> 2612680 INFO  (coreLoadExecutor-7240-thread-1-processing-n:127.0.0.1:58485_) [n:127.0.0.1:58485_ c:control_collection s:shard1 r:core_node1 x:collection1] o.a.s.u.p.UpdateRequestProcessorChain creating updateRequestProcessorChain "distrib-dup-test-chain-implicit"
   [junit4]   2> 2612680 INFO  (coreLoadExecutor-7240-thread-1-processing-n:127.0.0.1:58485_) [n:127.0.0.1:58485_ c:control_collection s:shard1 r:core_node1 x:collection1] o.a.s.u.p.UpdateRequestProcessorChain inserting DistributedUpdateProcessorFactory into updateRequestProcessorChain "distrib-dup-test-chain-implicit"
   [junit4]   2> 2612680 INFO  (coreLoadExecutor-7240-thread-1-processing-n:127.0.0.1:58485_) [n:127.0.0.1:58485_ c:control_collection s:shard1 r:core_node1 x:collection1] o.a.s.c.SolrCore no updateRequestProcessorChain defined as default, creating implicit default
   [junit4]   2> 2612680 WARN  (coreLoadExecutor-7240-thread-1-processing-n:127.0.0.1:58485_) [n:127.0.0.1:58485_ c:control_collection s:shard1 r:core_node1 x:collection1] o.a.s.c.RequestHandlers INVALID paramSet a in requestHandler {type = requestHandler,name = /dump,class = DumpRequestHandler,args = {defaults={a=A,b=B}}}
   [junit4]   2> 2612688 INFO  (coreLoadExecutor-7240-thread-1-processing-n:127.0.0.1:58485_) [n:127.0.0.1:58485_ c:control_collection s:shard1 r:core_node1 x:collection1] o.a.s.h.l.XMLLoader xsltCacheLifetimeSeconds=60
   [junit4]   2> 2612691 INFO  (coreLoadExecutor-7240-thread-1-processing-n:127.0.0.1:58485_) [n:127.0.0.1:58485_ c:control_collection s:shard1 r:core_node1 x:collection1] o.a.s.h.l.XMLLoader xsltCacheLifetimeSeconds=60
   [junit4]   2> 2612692 INFO  (coreLoadExecutor-7240-thread-1-processing-n:127.0.0.1:58485_) [n:127.0.0.1:58485_ c:control_collection s:shard1 r:core_node1 x:collection1] o.a.s.h.l.XMLLoader xsltCacheLifetimeSeconds=60
   [junit4]   2> 2612695 INFO  (coreLoadExecutor-7240-thread-1-processing-n:127.0.0.1:58485_) [n:127.0.0.1:58485_ c:control_collection s:shard1 r:core_node1 x:collection1] o.a.s.h.l.XMLLoader xsltCacheLifetimeSeconds=60
   [junit4]   2> 2612698 INFO  (coreLoadExecutor-7240-thread-1-processing-n:127.0.0.1:58485_) [n:127.0.0.1:58485_ c:control_collection s:shard1 r:core_node1 x:collection1] o.a.s.c.RequestHandlers Registered paths: /update/json,/admin/file,/admin/mbeans,/admin/luke,/admin/ping,/admin/system,/config,/admin/plugins,/replication,/update/csv,/admin/segments,/update,/admin/properties,/get,/update/json/docs,/schema,/admin/logging,standard,/admin/threads,/dump
   [junit4]   2> 2612700 INFO  (coreLoadExecutor-7240-thread-1-processing-n:127.0.0.1:58485_) [n:127.0.0.1:58485_ c:control_collection s:shard1 r:core_node1 x:collection1] o.a.s.c.SolrCore Using default statsCache cache: org.apache.solr.search.stats.LocalStatsCache
   [junit4]   2> 2612700 INFO  (coreLoadExecutor-7240-thread-1-processing-n:127.0.0.1:58485_) [n:127.0.0.1:58485_ c:control_collection s:shard1 r:core_node1 x:collection1] o.a.s.u.UpdateHandler Using UpdateLog implementation: org.apache.solr.update.UpdateLog
   [junit4]   2> 2612701 INFO  (coreLoadExecutor-7240-thread-1-processing-n:127.0.0.1:58485_) [n:127.0.0.1:58485_ c:control_collection s:shard1 r:core_node1 x:collection1] o.a.s.u.UpdateLog Initializing UpdateLog: dataDir= defaultSyncLevel=FLUSH numRecordsToKeep=100 maxNumLogsToKeep=10 numVersionBuckets=65536
   [junit4]   2> 2612702 INFO  (coreLoadExecutor-7240-thread-1-processing-n:127.0.0.1:58485_) [n:127.0.0.1:58485_ c:control_collection s:shard1 r:core_node1 x:collection1] o.a.s.u.CommitTracker Hard AutoCommit: if uncommited for 15000ms; 
   [junit4]   2> 2612702 INFO  (coreLoadExecutor-7240-thread-1-processing-n:127.0.0.1:58485_) [n:127.0.0.1:58485_ c:control_collection s:shard1 r:core_node1 x:collection1] o.a.s.u.CommitTracker Soft AutoCommit: disabled
   [junit4]   2> 2612702 INFO  (coreLoadExecutor-7240-thread-1-processing-n:127.0.0.1:58485_) [n:127.0.0.1:58485_ c:control_collection s:shard1 r:core_node1 x:collection1] o.a.s.u.RandomMergePolicy RandomMergePolicy wrapping class org.apache.lucene.index.AlcoholicMergePolicy: [AlcoholicMergePolicy: minMergeSize=0, mergeFactor=10, maxMergeSize=202922803, maxMergeSizeForForcedMerge=9223372036854775807, calibrateSizeByDeletes=true, maxMergeDocs=2147483647, maxCFSSegmentSizeMB=8.796093022207999E12, noCFSRatio=0.1]
   [junit4]   2> 2612702 INFO  (coreLoadExecutor-7240-thread-1-processing-n:127.0.0.1:58485_) [n:127.0.0.1:58485_ c:control_collection s:shard1 r:core_node1 x:collection1] o.a.s.c.SolrDeletionPolicy SolrDeletionPolicy.onInit: commits: num=1
   [junit4]   2> 	commit{dir=C:\Users\JenkinsSlave\workspace\Lucene-Solr-5.5-Windows\solr\build\solr-core\test\J0\temp\solr.cloud.ChaosMonkeyNothingIsSafeTest_CBE1609917253D16-001\control-001\cores\collection1\data\index,segFN=segments_1,generation=1}
   [junit4]   2> 2612702 INFO  (coreLoadExecutor-7240-thread-1-processing-n:127.0.0.1:58485_) [n:127.0.0.1:58485_ c:control_collection s:shard1 r:core_node1 x:collection1] o.a.s.c.SolrDeletionPolicy newest commit generation = 1
   [junit4]   2> 2612702 INFO  (coreLoadExecutor-7240-thread-1-processing-n:127.0.0.1:58485_) [n:127.0.0.1:58485_ c:control_collection s:shard1 r:core_node1 x:collection1] o.a.s.s.SolrIndexSearcher Opening Searcher@93911b[collection1] main
   [junit4]   2> 2612702 INFO  (coreLoadExecutor-7240-thread-1-processing-n:127.0.0.1:58485_) [n:127.0.0.1:58485_ c:control_collection s:shard1 r:core_node1 x:collection1] o.a.s.c.c.ZkStateReader Load collection config from: [/collections/control_collection]
   [junit4]   2> 2612704 INFO  (coreLoadExecutor-7240-thread-1-processing-n:127.0.0.1:58485_) [n:127.0.0.1:58485_ c:control_collection s:shard1 r:core_node1 x:collection1] o.a.s.c.c.ZkStateReader path=[/collections/control_collection] [configName]=[conf1] specified config exists in ZooKeeper
   [junit4]   2> 2612704 INFO  (coreLoadExecutor-7240-thread-1-processing-n:127.0.0.1:58485_) [n:127.0.0.1:58485_ c:control_collection s:shard1 r:core_node1 x:collection1] o.a.s.r.ManagedResourceStorage Setting up ZooKeeper-based storage for the RestManager with znodeBase: /configs/conf1
   [junit4]   2> 2612705 INFO  (coreLoadExecutor-7240-thread-1-processing-n:127.0.0.1:58485_) [n:127.0.0.1:58485_ c:control_collection s:shard1 r:core_node1 x:collection1] o.a.s.r.ManagedResourceStorage Configured ZooKeeperStorageIO with znodeBase: /configs/conf1
   [junit4]   2> 2612705 INFO  (coreLoadExecutor-7240-thread-1-processing-n:127.0.0.1:58485_) [n:127.0.0.1:58485_ c:control_collection s:shard1 r:core_node1 x:collection1] o.a.s.r.RestManager Initializing RestManager with initArgs: {}
   [junit4]   2> 2612705 INFO  (coreLoadExecutor-7240-thread-1-processing-n:127.0.0.1:58485_) [n:127.0.0.1:58485_ c:control_collection s:shard1 r:core_node1 x:collection1] o.a.s.r.ManagedResourceStorage Reading _rest_managed.json using ZooKeeperStorageIO:path=/configs/conf1
   [junit4]   2> 2612706 INFO  (coreLoadExecutor-7240-thread-1-processing-n:127.0.0.1:58485_) [n:127.0.0.1:58485_ c:control_collection s:shard1 r:core_node1 x:collection1] o.a.s.r.ManagedResourceStorage No data found for znode /configs/conf1/_rest_managed.json
   [junit4]   2> 2612706 INFO  (coreLoadExecutor-7240-thread-1-processing-n:127.0.0.1:58485_) [n:127.0.0.1:58485_ c:control_collection s:shard1 r:core_node1 x:collection1] o.a.s.r.ManagedResourceStorage Loaded null at path _rest_managed.json using ZooKeeperStorageIO:path=/configs/conf1
   [junit4]   2> 2612706 INFO  (coreLoadExecutor-7240-thread-1-processing-n:127.0.0.1:58485_) [n:127.0.0.1:58485_ c:control_collection s:shard1 r:core_node1 x:collection1] o.a.s.r.RestManager Initializing 0 registered ManagedResources
   [junit4]   2> 2612706 INFO  (coreLoadExecutor-7240-thread-1-processing-n:127.0.0.1:58485_) [n:127.0.0.1:58485_ c:control_collection s:shard1 r:core_node1 x:collection1] o.a.s.h.ReplicationHandler Commits will be reserved for  10000
   [junit4]   2> 2612707 INFO  (searcherExecutor-7241-thread-1-processing-n:127.0.0.1:58485_ x:collection1 r:core_node1 c:control_collection s:shard1) [n:127.0.0.1:58485_ c:control_collection s:shard1 r:core_node1 x:collection1] o.a.s.c.SolrCore [collection1] Registered new searcher Searcher@93911b[collection1] main{ExitableDirectoryReader(UninvertingDirectoryReader())}
   [junit4]   2> 2612707 INFO  (coreLoadExecutor-7240-thread-1-processing-n:127.0.0.1:58485_) [n:127.0.0.1:58485_ c:control_collection s:shard1 r:core_node1 x:collection1] o.a.s.u.UpdateLog Looking up max value of version field to seed version buckets
   [junit4]   2> 2612707 INFO  (coreLoadExecutor-7240-thread-1-processing-n:127.0.0.1:58485_) [n:127.0.0.1:58485_ c:control_collection s:shard1 r:core_node1 x:collection1] o.a.s.u.VersionInfo Refreshing highest value of _version_ for 65536 version buckets from index
   [junit4]   2> 2612707 INFO  (coreLoadExecutor-7240-thread-1-processing-n:127.0.0.1:58485_) [n:127.0.0.1:58485_ c:control_collection s:shard1 r:core_node1 x:collection1] o.a.s.u.VersionInfo No terms found for _version_, cannot seed version bucket highest value from index
   [junit4]   2> 2612707 INFO  (coreLoadExecutor-7240-thread-1-processing-n:127.0.0.1:58485_) [n:127.0.0.1:58485_ c:control_collection s:shard1 r:core_node1 x:collection1] o.a.s.u.UpdateLog Could not find max version in index or recent updates, using new clock 1526362566910017536
   [junit4]   2> 2612709 INFO  (coreLoadExecutor-7240-thread-1-processing-n:127.0.0.1:58485_) [n:127.0.0.1:58485_ c:control_collection s:shard1 r:core_node1 x:collection1] o.a.s.u.UpdateLog Took 2.0ms to seed version buckets with highest version 1526362566910017536
   [junit4]   2> 2612709 INFO  (coreLoadExecutor-7240-thread-1-processing-n:127.0.0.1:58485_) [n:127.0.0.1:58485_ c:control_collection s:shard1 r:core_node1 x:collection1] o.a.s.c.ZkController watch zkdir /configs/conf1
   [junit4]   2> 2612710 INFO  (coreLoadExecutor-7240-thread-1-processing-n:127.0.0.1:58485_) [n:127.0.0.1:58485_ c:control_collection s:shard1 r:core_node1 x:collection1] o.a.s.c.CoreContainer registering core: collection1
   [junit4]   2> 2612711 INFO  (coreZkRegister-7234-thread-1-processing-n:127.0.0.1:58485_ x:collection1 r:core_node1 c:control_collection s:shard1) [n:127.0.0.1:58485_ c:control_collection s:shard1 r:core_node1 x:collection1] o.a.s.c.ZkController Register replica - core:collection1 address:http://127.0.0.1:58485 collection:control_collection shard:shard1
   [junit4]   2> 2612712 INFO  (coreZkRegister-7234-thread-1-processing-n:127.0.0.1:58485_ x:collection1 r:core_node1 c:control_collection s:shard1) [n:127.0.0.1:58485_ c:control_collection s:shard1 r:core_node1 x:collection1] o.a.s.c.c.SolrZkClient makePath: /collections/control_collection/leader_elect/shard1/election
   [junit4]   2> 2612716 INFO  (coreZkRegister-7234-thread-1-processing-n:127.0.0.1:58485_ x:collection1 r:core_node1 c:control_collection s:shard1) [n:127.0.0.1:58485_ c:control_collection s:shard1 r:core_node1 x:collection1] o.a.s.c.LeaderElector Joined leadership election with path: /collections/control_collection/leader_elect/shard1/election/95397660305326084-core_node1-n_0000000000
   [junit4]   2> 2612717 INFO  (coreZkRegister-7234-thread-1-processing-n:127.0.0.1:58485_ x:collection1 r:core_node1 c:control_collection s:shard1) [n:127.0.0.1:58485_ c:control_collection s:shard1 r:core_node1 x:collection1] o.a.s.c.ShardLeaderElectionContext Running the leader process for shard=shard1 and weAreReplacement=false and leaderVoteWait=10000
   [junit4]   2> 2612719 INFO  (coreZkRegister-7234-thread-1-processing-n:127.0.0.1:58485_ x:collection1 r:core_node1 c:control_collection s:shard1) [n:127.0.0.1:58485_ c:control_collection s:shard1 r:core_node1 x:collection1] o.a.s.c.ShardLeaderElectionContext Enough replicas found to continue.
   [junit4]   2> 2612719 INFO  (coreZkRegister-7234-thread-1-processing-n:127.0.0.1:58485_ x:collection1 r:core_node1 c:control_collection s:shard1) [n:127.0.0.1:58485_ c:control_collection s:shard1 r:core_node1 x:collection1] o.a.s.c.ShardLeaderElectionContext I may be the new leader - try and sync
   [junit4]   2> 2612719 INFO  (coreZkRegister-7234-thread-1-processing-n:127.0.0.1:58485_ x:collection1 r:core_node1 c:control_collection s:shard1) [n:127.0.0.1:58485_ c:control_collection s:shard1 r:core_node1 x:collection1] o.a.s.c.SyncStrategy Sync replicas to http://127.0.0.1:58485/collection1/
   [junit4]   2> 2612719 INFO  (coreZkRegister-7234-thread-1-processing-n:127.0.0.1:58485_ x:collection1 r:core_node1 c:control_collection s:shard1) [n:127.0.0.1:58485_ c:control_collection s:shard1 r:core_node1 x:collection1] o.a.s.c.SyncStrategy Sync Success - now sync replicas to me
   [junit4]   2> 2612719 INFO  (coreZkRegister-7234-thread-1-processing-n:127.0.0.1:58485_ x:collection1 r:core_node1 c:control_collection s:shard1) [n:127.0.0.1:58485_ c:control_collection s:shard1 r:core_node1 x:collection1] o.a.s.c.SyncStrategy http://127.0.0.1:58485/collection1/ has no replicas
   [junit4]   2> 2612719 INFO  (OverseerStateUpdate-95397660305326084-127.0.0.1:58485_-n_0000000000) [n:127.0.0.1:58485_    ] o.a.s.c.Overseer processMessage: queueSize: 1, message = {
   [junit4]   2>   "operation":"leader",
   [junit4]   2>   "shard":"shard1",
   [junit4]   2>   "collection":"control_collection"} current state version: 1
   [junit4]   2> 2612720 INFO  (coreZkRegister-7234-thread-1-processing-n:127.0.0.1:58485_ x:collection1 r:core_node1 c:control_collection s:shard1) [n:127.0.0.1:58485_ c:control_collection s:shard1 r:core_node1 x:collection1] o.a.s.c.c.SolrZkClient makePath: /collections/control_collection/leaders/shard1
   [junit4]   2> 2612720 INFO  (zkCallback-3526-thread-1-processing-n:127.0.0.1:58485_) [n:127.0.0.1:58485_    ] o.a.s.c.c.ZkStateReader A cluster state change: [WatchedEvent state:SyncConnected type:NodeDataChanged path:/clusterstate.json], has occurred - updating... (live nodes size: [1])
   [junit4]   2> 2612723 INFO  (coreZkRegister-7234-thread-1-processing-n:127.0.0.1:58485_ x:collection1 r:core_node1 c:control_collection s:shard1) [n:127.0.0.1:58485_ c:control_collection s:shard1 r:core_node1 x:collection1] o.a.s.c.ShardLeaderElectionContextBase Creating leader registration node
   [junit4]   2> 2612725 INFO  (coreZkRegister-7234-thread-1-processing-n:127.0.0.1:58485_ x:collection1 r:core_node1 c:control_collection s:shard1) [n:127.0.0.1:58485_ c:control_collection s:shard1 r:core_node1 x:collection1] o.a.s.c.ShardLeaderElectionContext I am the new leader: http://127.0.0.1:58485/collection1/ shard1
   [junit4]   2> 2612726 INFO  (OverseerStateUpdate-95397660305326084-127.0.0.1:58485_-n_0000000000) [n:127.0.0.1:58485_    ] o.a.s.c.Overseer processMessage: queueSize: 1, message = {
   [junit4]   2>   "operation":"leader",
   [junit4]   2>   "shard":"shard1",
   [junit4]   2>   "collection":"control_collection",
   [junit4]   2>   "base_url":"http://127.0.0.1:58485",
   [junit4]   2>   "core":"collection1",
   [junit4]   2>   "state":"active"} current state version: 2
   [junit4]   2> 2612814 INFO  (zkCallback-3526-thread-2-processing-n:127.0.0.1:58485_) [n:127.0.0.1:58485_    ] o.a.s.c.c.ZkStateReader A cluster state change: [WatchedEvent state:SyncConnected type:NodeDataChanged path:/clusterstate.json], has occurred - updating... (live nodes size: [1])
   [junit4]   2> 2612856 INFO  (coreZkRegister-7234-thread-1-processing-n:127.0.0.1:58485_ x:collection1 r:core_node1 c:control_collection s:shard1) [n:127.0.0.1:58485_ c:control_collection s:shard1 r:core_node1 x:collection1] o.a.s.c.ZkController We are http://127.0.0.1:58485/collection1/ and leader is http://127.0.0.1:58485/collection1/
   [junit4]   2> 2612856 INFO  (coreZkRegister-7234-thread-1-processing-n:127.0.0.1:58485_ x:collection1 r:core_node1 c:control_collection s:shard1) [n:127.0.0.1:58485_ c:control_collection s:shard1 r:core_node1 x:collection1] o.a.s.c.ZkController No LogReplay needed for core=collection1 baseURL=http://127.0.0.1:58485
   [junit4]   2> 2612856 INFO  (coreZkRegister-7234-thread-1-processing-n:127.0.0.1:58485_ x:collection1 r:core_node1 c:control_collection s:shard1) [n:127.0.0.1:58485_ c:control_collection s:shard1 r:core_node1 x:collection1] o.a.s.c.ZkController I am the leader, no recovery necessary
   [junit4]   2> 2612856 INFO  (coreZkRegister-7234-thread-1-processing-n:127.0.0.1:58485_ x:collection1 r:core_node1 c:control_collection s:shard1) [n:127.0.0.1:58485_ c:control_collection s:shard1 r:core_node1 x:collection1] o.a.s.c.ZkController publishing state=active
   [junit4]   2> 2612856 INFO  (coreZkRegister-7234-thread-1-processing-n:127.0.0.1:58485_ x:collection1 r:core_node1 c:control_collection s:shard1) [n:127.0.0.1:58485_ c:control_collection s:shard1 r:core_node1 x:collection1] o.a.s.c.ZkController numShards not found on descriptor - reading it from system property
   [junit4]   2> 2612859 INFO  (OverseerStateUpdate-95397660305326084-127.0.0.1:58485_-n_0000000000) [n:127.0.0.1:58485_    ] o.a.s.c.Overseer processMessage: queueSize: 1, message = {
   [junit4]   2>   "node_name":"127.0.0.1:58485_",
   [junit4]   2>   "core":"collection1",
   [junit4]   2>   "state":"active",
   [junit4]   2>   "roles":null,
   [junit4]   2>   "collection":"control_collection",
   [junit4]   2>   "base_url":"http://127.0.0.1:58485",
   [junit4]   2>   "core_node_name":"core_node1",
   [junit4]   2>   "numShards":"1",
   [junit4]   2>   "shard":"shard1",
   [junit4]   2>   "operation":"state"} current state version: 3
   [junit4]   2> 2612859 INFO  (OverseerStateUpdate-95397660305326084-127.0.0.1:58485_-n_0000000000) [n:127.0.0.1:58485_    ] o.a.s.c.o.ReplicaMutator Update state numShards=1 message={
   [junit4]   2>   "node_name":"127.0.0.1:58485_",
   [junit4]   2>   "core":"collection1",
   [junit4]   2>   "state":"active",
   [junit4]   2>   "roles":null,
   [junit4]   2>   "collection":"control_collection",
   [junit4]   2>   "base_url":"http://127.0.0.1:58485",
   [junit4]   2>   "core_node_name":"core_node1",
   [junit4]   2>   "numShards":"1",
   [junit4]   2>   "shard":"shard1",
   [junit4]   2>   "operation":"state"}
   [junit4]   2> 2612950 INFO  (zkCallback-3526-thread-2-processing-n:127.0.0.1:58485_) [n:127.0.0.1:58485_    ] o.a.s.c.c.ZkStateReader A cluster state change: [WatchedEvent state:SyncConnected type:NodeDataChanged path:/clusterstate.json], has occurred - updating... (live nodes size: [1])
   [junit4]   2> 2613124 INFO  (TEST-ChaosMonkeyNothingIsSafeTest.test-seed#[CBE1609917253D16]) [    ] o.a.s.c.c.SolrZkClient Using default ZkCredentialsProvider
   [junit4]   2> 2613125 INFO  (TEST-ChaosMonkeyNothingIsSafeTest.test-seed#[CBE1609917253D16]) [    ] o.a.s.c.c.ConnectionManager Waiting for client to connect to ZooKeeper
   [junit4]   2> 2613126 INFO  (zkCallback-3528-thread-1) [    ] o.a.s.c.c.ConnectionManager Watcher org.apache.solr.common.cloud.ConnectionManager@cd397e name:ZooKeeperConnection Watcher:127.0.0.1:58478/solr got event WatchedEvent state:SyncConnected type:None path:null path:null type:None
   [junit4]   2> 2613126 INFO  (TEST-ChaosMonkeyNothingIsSafeTest.test-seed#[CBE1609917253D16]) [    ] o.a.s.c.c.ConnectionManager Client is connected to ZooKeeper
   [junit4]   2> 2613127 INFO  (TEST-ChaosMonkeyNothingIsSafeTest.test-seed#[CBE1609917253D16]) [    ] o.a.s.c.c.SolrZkClient Using default ZkACLProvider
   [junit4]   2> 2613127 INFO  (TEST-ChaosMonkeyNothingIsSafeTest.test-seed#[CBE1609917253D16]) [    ] o.a.s.c.c.ZkStateReader Updating cluster state from ZooKeeper... 
   [junit4]   2> 2613130 INFO  (TEST-ChaosMonkeyNothingIsSafeTest.test-seed#[CBE1609917253D16]) [    ] o.a.s.c.ChaosMonkey monkey: init - expire sessions:false cause connection loss:false
   [junit4]   2> 2630721 INFO  (TEST-ChaosMonkeyNothingIsSafeTest.test-seed#[CBE1609917253D16]) [    ] o.a.s.SolrTestCaseJ4 Writing core.properties file to C:\Users\JenkinsSlave\workspace\Lucene-Solr-5.5-Windows\solr\build\solr-core\test\J0\temp\solr.cloud.ChaosMonkeyNothingIsSafeTest_CBE1609917253D16-001\shard-1-001\cores\collection1
   [junit4]   2> 2630723 INFO  (TEST-ChaosMonkeyNothingIsSafeTest.test-seed#[CBE1609917253D16]) [    ] o.a.s.c.AbstractFullDistribZkTestBase create jetty 1 in directory C:\Users\JenkinsSlave\workspace\Lucene-Solr-5.5-Windows\solr\build\solr-core\test\J0\temp\solr.cloud.ChaosMonkeyNothingIsSafeTest_CBE1609917253D16-001\shard-1-001
   [junit4]   2> 2630724 INFO  (TEST-ChaosMonkeyNothingIsSafeTest.test-seed#[CBE1609917253D16]) [    ] o.e.j.s.Server jetty-9.2.13.v20150730
   [junit4]   2> 2630725 INFO  (TEST-ChaosMonkeyNothingIsSafeTest.test-seed#[CBE1609917253D16]) [    ] o.e.j.s.h.ContextHandler Started o.e.j.s.ServletContextHandler@193eddb{/,null,AVAILABLE}
   [junit4]   2> 2630726 INFO  (TEST-ChaosMonkeyNothingIsSafeTest.test-seed#[CBE1609917253D16]) [    ] o.e.j.s.ServerConnector Started ServerConnector@e50024{HTTP/1.1}{127.0.0.1:58500}
   [junit4]   2> 2630726 INFO  (TEST-ChaosMonkeyNothingIsSafeTest.test-seed#[CBE1609917253D16]) [    ] o.e.j.s.Server Started @2634939ms
   [junit4]   2> 2630726 INFO  (TEST-ChaosMonkeyNothingIsSafeTest.test-seed#[CBE1609917253D16]) [    ] o.a.s.c.s.e.JettySolrRunner Jetty properties: {solrconfig=solrconfig.xml, hostContext=/, hostPort=58500, coreRootDirectory=C:\Users\JenkinsSlave\workspace\Lucene-Solr-5.5-Windows\solr\build\solr-core\test\J0\..\..\..\..\..\..\..\..\..\Users\JenkinsSlave\workspace\Lucene-Solr-5.5-Windows\solr\build\solr-core\test\J0\temp\solr.cloud.ChaosMonkeyNothingIsSafeTest_CBE1609917253D16-001\shard-1-001\cores, solr.data.dir=C:\Users\JenkinsSlave\workspace\Lucene-Solr-5.5-Windows\solr\build\solr-core\test\J0\temp\solr.cloud.ChaosMonkeyNothingIsSafeTest_CBE1609917253D16-001\tempDir-001/jetty1}
   [junit4]   2> 2630726 INFO  (TEST-ChaosMonkeyNothingIsSafeTest.test-seed#[CBE1609917253D16]) [    ] o.a.s.s.SolrDispatchFilter SolrDispatchFilter.init(): sun.misc.Launcher$AppClassLoader@1756db3
   [junit4]   2> 2630727 INFO  (TEST-ChaosMonkeyNothingIsSafeTest.test-seed#[CBE1609917253D16]) [    ] o.a.s.c.SolrResourceLoader new SolrResourceLoader for directory: 'C:\Users\JenkinsSlave\workspace\Lucene-Solr-5.5-Windows\solr\build\solr-core\test\J0\temp\solr.cloud.ChaosMonkeyNothingIsSafeTest_CBE1609917253D16-001\shard-1-001'
   [junit4]   2> 2630727 INFO  (TEST-ChaosMonkeyNothingIsSafeTest.test-seed#[CBE1609917253D16]) [    ] o.a.s.c.SolrResourceLoader JNDI not configured for solr (NoInitialContextEx)
   [junit4]   2> 2630727 INFO  (TEST-ChaosMonkeyNothingIsSafeTest.test-seed#[CBE1609917253D16]) [    ] o.a.s.c.SolrResourceLoader solr home defaulted to 'solr/' (could not find system property or JNDI)
   [junit4]   2> 2630727 INFO  (TEST-ChaosMonkeyNothingIsSafeTest.test-seed#[CBE1609917253D16]) [    ] o.a.s.c.c.SolrZkClient Using default ZkCredentialsProvider
   [junit4]   2> 2630728 INFO  (TEST-ChaosMonkeyNothingIsSafeTest.test-seed#[CBE1609917253D16]) [    ] o.a.s.c.c.ConnectionManager Waiting for client to connect to ZooKeeper
   [junit4]   2> 2630729 INFO  (zkCallback-3529-thread-1) [    ] o.a.s.c.c.ConnectionManager Watcher org.apache.solr.common.cloud.ConnectionManager@b8c012 name:ZooKeeperConnection Watcher:127.0.0.1:58478/solr got event WatchedEvent state:SyncConnected type:None path:null path:null type:None
   [junit4]   2> 2630730 INFO  (TEST-ChaosMonkeyNothingIsSafeTest.test-seed#[CBE1609917253D16]) [    ] o.a.s.c.c.ConnectionManager Client is connected to ZooKeeper
   [junit4]   2> 2630730 INFO  (TEST-ChaosMonkeyNothingIsSafeTest.test-seed#[CBE1609917253D16]) [    ] o.a.s.c.c.SolrZkClient Using default ZkACLProvider
   [junit4]   2> 2630731 INFO  (TEST-ChaosMonkeyNothingIsSafeTest.test-seed#[CBE1609917253D16]) [    ] o.a.s.s.SolrDispatchFilter Loading solr.xml from SolrHome (not found in ZooKeeper)
   [junit4]   2> 2630731 INFO  (TEST-ChaosMonkeyNothingIsSafeTest.test-seed#[CBE1609917253D16]) [    ] o.a.s.c.SolrXmlConfig Loading container configuration from C:\Users\JenkinsSlave\workspace\Lucene-Solr-5.5-Windows\solr\build\solr-core\test\J0\temp\solr.cloud.ChaosMonkeyNothingIsSafeTest_CBE1609917253D16-001\shard-1-001\solr.xml
   [junit4]   2> 2630765 INFO  (TEST-ChaosMonkeyNothingIsSafeTest.test-seed#[CBE1609917253D16]) [    ] o.a.s.c.CorePropertiesLocator Config-defined core root directory: C:\Users\JenkinsSlave\workspace\Lucene-Solr-5.5-Windows\solr\build\solr-core\test\J0\..\..\..\..\..\..\..\..\..\Users\JenkinsSlave\workspace\Lucene-Solr-5.5-Windows\solr\build\solr-core\test\J0\temp\solr.cloud.ChaosMonkeyNothingIsSafeTest_CBE1609917253D16-001\shard-1-001\cores
   [junit4]   2> 2630765 INFO  (TEST-ChaosMonkeyNothingIsSafeTest.test-seed#[CBE1609917253D16]) [    ] o.a.s.c.CoreContainer New CoreContainer 20791217
   [junit4]   2> 2630765 INFO  (TEST-ChaosMonkeyNothingIsSafeTest.test-seed#[CBE1609917253D16]) [    ] o.a.s.c.CoreContainer Loading cores into CoreContainer [instanceDir=C:\Users\JenkinsSlave\workspace\Lucene-Solr-5.5-Windows\solr\build\solr-core\test\J0\temp\solr.cloud.ChaosMonkeyNothingIsSafeTest_CBE1609917253D16-001\shard-1-001]
   [junit4]   2> 2630766 WARN  (TEST-ChaosMonkeyNothingIsSafeTest.test-seed#[CBE1609917253D16]) [    ] o.a.s.c.CoreContainer Couldn't add files from C:\Users\JenkinsSlave\workspace\Lucene-Solr-5.5-Windows\solr\build\solr-core\test\J0\temp\solr.cloud.ChaosMonkeyNothingIsSafeTest_CBE1609917253D16-001\shard-1-001\lib to classpath: C:\Users\JenkinsSlave\workspace\Lucene-Solr-5.5-Windows\solr\build\solr-core\test\J0\temp\solr.cloud.ChaosMonkeyNothingIsSafeTest_CBE1609917253D16-001\shard-1-001\lib
   [junit4]   2> 2630766 INFO  (TEST-ChaosMonkeyNothingIsSafeTest.test-seed#[CBE1609917253D16]) [    ] o.a.s.h.c.HttpShardHandlerFactory created with socketTimeout : 90000,urlScheme : ,connTimeout : 15000,maxConnectionsPerHost : 20,maxConnections : 10000,corePoolSize : 0,maximumPoolSize : 2147483647,maxThreadIdleTime : 5,sizeOfQueue : -1,fairnessPolicy : false,useRetries : false,
   [junit4]   2> 2630770 INFO  (TEST-ChaosMonkeyNothingIsSafeTest.test-seed#[CBE1609917253D16]) [    ] o.a.s.u.UpdateShardHandler Creating UpdateShardHandler HTTP client with params: socketTimeout=340000&connTimeout=45000&retry=true
   [junit4]   2> 2630771 INFO  (TEST-ChaosMonkeyNothingIsSafeTest.test-seed#[CBE1609917253D16]) [    ] o.a.s.l.LogWatcher SLF4J impl is org.slf4j.impl.Log4jLoggerFactory
   [junit4]   2> 2630771 INFO  (TEST-ChaosMonkeyNothingIsSafeTest.test-seed#[CBE1609917253D16]) [    ] o.a.s.l.LogWatcher Registering Log Listener [Log4j (org.slf4j.impl.Log4jLoggerFactory)]
   [junit4]   2> 2630771 INFO  (TEST-ChaosMonkeyNothingIsSafeTest.test-seed#[CBE1609917253D16]) [    ] o.a.s.c.ZkContainer Zookeeper client=127.0.0.1:58478/solr
   [junit4]   2> 2630771 INFO  (TEST-ChaosMonkeyNothingIsSafeTest.test-seed#[CBE1609917253D16]) [    ] o.a.s.c.ZkController zkHost includes chroot
   [junit4]   2> 2630771 INFO  (TEST-ChaosMonkeyNothingIsSafeTest.test-seed#[CBE1609917253D16]) [    ] o.a.s.c.c.SolrZkClient Using default ZkCredentialsProvider
   [junit4]   2> 2630772 INFO  (TEST-ChaosMonkeyNothingIsSafeTest.test-seed#[CBE1609917253D16]) [    ] o.a.s.c.c.ConnectionManager Waiting for client to connect to ZooKeeper
   [junit4]   2> 2630775 INFO  (zkCallback-3532-thread-1) [    ] o.a.s.c.c.ConnectionManager Watcher org.apache.solr.common.cloud.ConnectionManager@173824a name:ZooKeeperConnection Watcher:127.0.0.1:58478 got event WatchedEvent state:SyncConnected type:None path:null path:null type:None
   [junit4]   2> 2630775 INFO  (TEST-ChaosMonkeyNothingIsSafeTest.test-seed#[CBE1609917253D16]) [    ] o.a.s.c.c.ConnectionManager Client is connected to ZooKeeper
   [junit4]   2> 2630775 INFO  (TEST-ChaosMonkeyNothingIsSafeTest.test-seed#[CBE1609917253D16]) [    ] o.a.s.c.c.SolrZkClient Using default ZkACLProvider
   [junit4]   2> 2630777 INFO  (TEST-ChaosMonkeyNothingIsSafeTest.test-seed#[CBE1609917253D16]) [n:127.0.0.1:58500_    ] o.a.s.c.c.ConnectionManager Waiting for client to connect to ZooKeeper
   [junit4]   2> 2630779 INFO  (zkCallback-3533-thread-1-processing-n:127.0.0.1:58500_) [n:127.0.0.1:58500_    ] o.a.s.c.c.ConnectionManager Watcher org.apache.solr.common.cloud.ConnectionManager@a49d2a name:ZooKeeperConnection Watcher:127.0.0.1:58478/solr got event WatchedEvent state:SyncConnected type:None path:null path:null type:None
   [junit4]   2> 2630779 INFO  (TEST-ChaosMonkeyNothingIsSafeTest.test-seed#[CBE1609917253D16]) [n:127.0.0.1:58500_    ] o.a.s.c.c.ConnectionManager Client is connected to ZooKeeper
   [junit4]   2> 2630785 INFO  (TEST-ChaosMonkeyNothingIsSafeTest.test-seed#[CBE1609917253D16]) [n:127.0.0.1:58500_    ] o.a.s.c.c.ZkStateReader Updating cluster state from ZooKeeper... 
   [junit4]   2> 2631826 INFO  (TEST-ChaosMonkeyNothingIsSafeTest.test-seed#[CBE1609917253D16]) [n:127.0.0.1:58500_    ] o.a.s.c.ZkController Register node as live in ZooKeeper:/live_nodes/127.0.0.1:58500_
   [junit4]   2> 2631827 INFO  (TEST-ChaosMonkeyNothingIsSafeTest.test-seed#[CBE1609917253D16]) [n:127.0.0.1:58500_    ] o.a.s.c.c.SolrZkClient makePath: /live_nodes/127.0.0.1:58500_
   [junit4]   2> 2631828 INFO  (zkCallback-3528-thread-1) [    ] o.a.s.c.c.ZkStateReader A live node change: [WatchedEvent state:SyncConnected type:NodeChildrenChanged path:/live_nodes], has occurred - updating... (live nodes size: [1])
   [junit4]   2> 2631828 INFO  (zkCallback-3533-thread-1-processing-n:127.0.0.1:58500_) [n:127.0.0.1:58500_    ] o.a.s.c.c.ZkStateReader A live node change: [WatchedEvent state:SyncConnected type:NodeChildrenChanged path:/live_nodes], has occurred - updating... (live nodes size: [1])
   [junit4]   2> 2631828 INFO  (zkCallback-3526-thread-2-processing-n:127.0.0.1:58485_) [n:127.0.0.1:58485_    ] o.a.s.c.c.ZkStateReader A live node change: [WatchedEvent state:SyncConnected type:NodeChildrenChanged path:/live_nodes], has occurred - updating... (live nodes size: [1])
   [junit4]   2> 2631831 INFO  (TEST-ChaosMonkeyNothingIsSafeTest.test-seed#[CBE1609917253D16]) [n:127.0.0.1:58500_    ] o.a.s.c.Overseer Overseer (id=null) closing
   [junit4]   2> 2631831 INFO  (TEST-ChaosMonkeyNothingIsSafeTest.test-seed#[CBE1609917253D16]) [n:127.0.0.1:58500_    ] o.a.s.c.LeaderElector Joined leadership election with path: /overseer_elect/election/95397660305326088-127.0.0.1:58500_-n_0000000001
   [junit4]   2> 2631832 INFO  (TEST-ChaosMonkeyNothingIsSafeTest.test-seed#[CBE1609917253D16]) [n:127.0.0.1:58500_    ] o.a.s.c.LeaderElector Watching path /overseer_elect/election/95397660305326084-127.0.0.1:58485_-n_0000000000 to know if I could be the leader
   [junit4]   2> 2631849 INFO  (TEST-ChaosMonkeyNothingIsSafeTest.test-seed#[CBE1609917253D16]) [n:127.0.0.1:58500_    ] o.a.s.c.CoreContainer Security conf doesn't exist. Skipping setup for authorization module.
   [junit4]   2> 2631849 INFO  (TEST-ChaosMonkeyNothingIsSafeTest.test-seed#[CBE1609917253D16]) [n:127.0.0.1:58500_    ] o.a.s.c.CoreContainer No authentication plugin used.
   [junit4]   2> 2631851 INFO  (TEST-ChaosMonkeyNothingIsSafeTest.test-seed#[CBE1609917253D16]) [n:127.0.0.1:58500_    ] o.a.s.c.CorePropertiesLocator Looking for core definitions underneath C:\Users\JenkinsSlave\workspace\Lucene-Solr-5.5-Windows\solr\build\solr-core\test\J0\..\..\..\..\..\..\..\..\..\Users\JenkinsSlave\workspace\Lucene-Solr-5.5-Windows\solr\build\solr-core\test\J0\temp\solr.cloud.ChaosMonkeyNothingIsSafeTest_CBE1609917253D16-001\shard-1-001\cores
   [junit4]   2> 2631854 INFO  (TEST-ChaosMonkeyNothingIsSafeTest.test-seed#[CBE1609917253D16]) [n:127.0.0.1:58500_    ] o.a.s.c.CoreDescriptor Created CoreDescriptor: {collection=collection1, name=collection1, configSetProperties=configsetprops.json, schema=schema.xml, transient=false, config=solrconfig.xml, coreNodeName=, shard=, dataDir=data\, loadOnStartup=true}
   [junit4]   2> 2631854 INFO  (TEST-ChaosMonkeyNothingIsSafeTest.test-seed#[CBE1609917253D16]) [n:127.0.0.1:58500_    ] o.a.s.c.CorePropertiesLocator Found core collection1 in C:\Users\JenkinsSlave\workspace\Lucene-Solr-5.5-Windows\solr\build\solr-core\test\J0\..\..\..\..\..\..\..\..\..\Users\JenkinsSlave\workspace\Lucene-Solr-5.5-Windows\solr\build\solr-core\test\J0\temp\solr.cloud.ChaosMonkeyNothingIsSafeTest_CBE1609917253D16-001\shard-1-001\cores\collection1
   [junit4]   2> 2631854 INFO  (TEST-ChaosMonkeyNothingIsSafeTest.test-seed#[CBE1609917253D16]) [n:127.0.0.1:58500_    ] o.a.s.c.CorePropertiesLocator Found 1 core definitions
   [junit4]   2> 2631856 INFO  (TEST-ChaosMonkeyNothingIsSafeTest.test-seed#[CBE1609917253D16]) [n:127.0.0.1:58500_    ] o.a.s.s.SolrDispatchFilter user.dir=C:\Users\JenkinsSlave\workspace\Lucene-Solr-5.5-Windows\solr\build\solr-core\test\J0
   [junit4]   2> 2631856 INFO  (TEST-ChaosMonkeyNothingIsSafeTest.test-seed#[CBE1609917253D16]) [n:127.0.0.1:58500_    ] o.a.s.s.SolrDispatchFilter SolrDispatchFilter.init() done
   [junit4]   2> 2631856 INFO  (coreLoadExecutor-7251-thread-1-processing-n:127.0.0.1:58500_) [n:127.0.0.1:58500_ c:collection1   x:collection1] o.a.s.c.ZkController publishing state=down
   [junit4]   2> 2631856 INFO  (coreLoadExecutor-7251-thread-1-processing-n:127.0.0.1:58500_) [n:127.0.0.1:58500_ c:collection1   x:collection1] o.a.s.c.ZkController numShards not found on descriptor - reading it from system property
   [junit4]   2> 2631858 INFO  (OverseerStateUpdate-95397660305326084-127.0.0.1:58485_-n_0000000000) [n:127.0.0.1:58485_    ] o.a.s.c.Overseer processMessage: queueSize: 1, message = {
   [junit4]   2>   "node_name":"127.0.0.1:58500_",
   [junit4]   2>   "core":"collection1",
   [junit4]   2>   "state":"down",
   [junit4]   2>   "roles":null,
   [junit4]   2>   "collection":"collection1",
   [junit4]   2>   "base_url":"http://127.0.0.1:58500",
   [junit4]   2>   "numShards":"1",
   [junit4]   2>   "shard":null,
   [junit4]   2>   "operation":"state"} current state version: 4
   [junit4]   2> 2631858 INFO  (coreLoadExecutor-7251-thread-1-processing-n:127.0.0.1:58500_) [n:127.0.0.1:58500_ c:collection1   x:collection1] o.a.s.c.ZkController look for our core node name
   [junit4]   2> 2631859 INFO  (OverseerStateUpdate-95397660305326084-127.0.0.1:58485_-n_0000000000) [n:127.0.0.1:58485_    ] o.a.s.c.o.ReplicaMutator Update state numShards=1 message={
   [junit4]   2>   "node_name":"127.0.0.1:58500_",
   [junit4]   2>   "core":"collection1",
   [junit4]   2>   "state":"down",
   [junit4]   2>   "roles":null,
   [junit4]   2>   "collection":"collection1",
   [junit4]   2>   "base_url":"http://127.0.0.1:58500",
   [junit4]   2>   "numShards":"1",
   [junit4]   2>   "shard":null,
   [junit4]   2>   "operation":"state"}
   [junit4]   2> 2631859 INFO  (OverseerStateUpdate-95397660305326084-127.0.0.1:58485_-n_0000000000) [n:127.0.0.1:58485_    ] o.a.s.c.o.ClusterStateMutator building a new cName: collection1
   [junit4]   2> 2631859 INFO  (OverseerStateUpdate-95397660305326084-127.0.0.1:58485_-n_0000000000) [n:127.0.0.1:58485_    ] o.a.s.c.o.ReplicaMutator Assigning new node to shard shard=shard1
   [junit4]   2> 2631860 INFO  (zkCallback-3528-thread-1) [    ] o.a.s.c.c.ZkStateReader A cluster state change: [WatchedEvent state:SyncConnected type:NodeDataChanged path:/clusterstate.json], has occurred - updating... (live nodes size: [2])
   [junit4]   2> 2631860 INFO  (zkCallback-3526-thread-2-processing-n:127.0.0.1:58485_) [n:127.0.0.1:58485_    ] o.a.s.c.c.ZkStateReader A cluster state change: [WatchedEvent state:SyncConnected type:NodeDataChanged path:/clusterstate.json], has occurred - updating... (live nodes size: [2])
   [junit4]   2> 2631860 INFO  (zkCallback-3533-thread-1-processing-n:127.0.0.1:58500_) [n:127.0.0.1:58500_    ] o.a.s.c.c.ZkStateReader A cluster state change: [WatchedEvent state:SyncConnected type:NodeDataChanged path:/clusterstate.json], has occurred - updating... (live nodes size: [2])
   [junit4]   2> 2632895 INFO  (coreLoadExecutor-7251-thread-1-processing-n:127.0.0.1:58500_) [n:127.0.0.1:58500_ c:collection1   x:collection1] o.a.s.c.ZkController waiting to find shard id in clusterstate for collection1
   [junit4]   2> 2632895 INFO  (coreLoadExecutor-7251-thread-1-processing-n:127.0.0.1:58500_) [n:127.0.0.1:58500_ c:collection1   x:collection1] o.a.s.c.ZkController Check for collection zkNode:collection1
   [junit4]   2> 2632895 INFO  (coreLoadExecutor-7251-thread-1-processing-n:127.0.0.1:58500_) [n:127.0.0.1:58500_ c:collection1   x:collection1] o.a.s.c.ZkController Collection zkNode exists
   [junit4]   2> 2632895 INFO  (coreLoadExecutor-7251-thread-1-processing-n:127.0.0.1:58500_) [n:127.0.0.1:58500_ c:collection1   x:collection1] o.a.s.c.c.ZkStateReader Load collection config from: [/collections/collection1]
   [junit4]   2> 2632896 INFO  (coreLoadExecutor-7251-thread-1-processing-n:127.0.0.1:58500_) [n:127.0.0.1:58500_ c:collection1   x:collection1] o.a.s.c.c.ZkStateReader path=[/collections/collection1] [configName]=[conf1] specified config exists in ZooKeeper
   [junit4]   2> 2632896 INFO  (coreLoadExecutor-7251-thread-1-processing-n:127.0.0.1:58500_) [n:127.0.0.1:58500_ c:collection1   x:collection1] o.a.s.c.SolrResourceLoader new SolrResourceLoader for directory: 'C:\Users\JenkinsSlave\workspace\Lucene-Solr-5.5-Windows\solr\build\solr-core\test\J0\temp\solr.cloud.ChaosMonkeyNothingIsSafeTest_CBE1609917253D16-001\shard-1-001\cores\collection1'
   [junit4]   2> 2632896 INFO  (coreLoadExecutor-7251-thread-1-processing-n:127.0.0.1:58500_) [n:127.0.0.1:58500_ c:collection1   x:collection1] o.a.s.c.SolrResourceLoader JNDI not configured for solr (NoInitialContextEx)
   [junit4]   2> 2632896 INFO  (coreLoadExecutor-7251-thread-1-processing-n:127.0.0.1:58500_) [n:127.0.0.1:58500_ c:collection1   x:collection1] o.a.s.c.SolrResourceLoader solr home defaulted to 'solr/' (could not find system property or JNDI)
   [junit4]   2> 2632900 INFO  (coreLoadExecutor-7251-thread-1-processing-n:127.0.0.1:58500_) [n:127.0.0.1:58500_ c:collection1   x:collection1] o.a.s.c.Config loaded config solrconfig.xml with version 0 
   [junit4]   2> 2632911 INFO  (coreLoadExecutor-7251-thread-1-processing-n:127.0.0.1:58500_) [n:127.0.0.1:58500_ c:collection1   x:collection1] o.a.s.c.SolrConfig current version of requestparams : -1
   [junit4]   2> 2632928 INFO  (coreLoadExecutor-7251-thread-1-processing-n:127.0.0.1:58500_) [n:127.0.0.1:58500_ c:collection1   x:collection1] o.a.s.c.SolrConfig Using Lucene MatchVersion: 5.5.0
   [junit4]   2> 2632965 INFO  (coreLoadExecutor-7251-thread-1-processing-n:127.0.0.1:58500_) [n:127.0.0.1:58500_ c:collection1   x:collection1] o.a.s.c.SolrConfig Loaded SolrConfig: solrconfig.xml
   [junit4]   2> 2632973 INFO  (coreLoadExecutor-7251-thread-1-processing-n:127.0.0.1:58500_) [n:127.0.0.1:58500_ c:collection1   x:collection1] o.a.s.s.IndexSchema [collection1] Schema name=test
   [junit4]   2> 2633209 INFO  (coreLoadExecutor-7251-thread-1-processing-n:127.0.0.1:58500_) [n:127.0.0.1:58500_ c:collection1   x:collection1] o.a.s.s.IndexSchema default search field in schema is text
   [junit4]   2> 2633210 INFO  (coreLoadExecutor-7251-thread-1-processing-n:127.0.0.1:58500_) [n:127.0.0.1:58500_ c:collection1   x:collection1] o.a.s.s.IndexSchema unique key field: id
   [junit4]   2> 2633212 INFO  (coreLoadExecutor-7251-thread-1-processing-n:127.0.0.1:58500_) [n:127.0.0.1:58500_ c:collection1   x:collection1] o.a.s.s.FileExchangeRateProvider Reloading exchange rates from file currency.xml
   [junit4]   2> 2633215 INFO  (coreLoadExecutor-7251-thread-1-processing-n:127.0.0.1:58500_) [n:127.0.0.1:58500_ c:collection1   x:collection1] o.a.s.s.FileExchangeRateProvider Reloading exchange rates from file currency.xml
   [junit4]   2> 2633235 INFO  (coreLoadExecutor-7251-thread-1-processing-n:127.0.0.1:58500_) [n:127.0.0.1:58500_ c:collection1   x:collection1] o.a.s.c.ConfigSetProperties Did not find ConfigSet properties, assuming default properties: Can't find resource 'configsetprops.json' in classpath or '/configs/conf1', cwd=C:\Users\JenkinsSlave\workspace\Lucene-Solr-5.5-Windows\solr\build\solr-core\test\J0
   [junit4]   2> 2633235 INFO  (coreLoadExecutor-7251-thread-1-processing-n:127.0.0.1:58500_) [n:127.0.0.1:58500_ c:collection1   x:collection1] o.a.s.c.CoreContainer Creating SolrCore 'collection1' using configuration from collection collection1
   [junit4]   2> 2633235 INFO  (coreLoadExecutor-7251-thread-1-processing-n:127.0.0.1:58500_) [n:127.0.0.1:58500_ c:collection1 s:shard1 r:core_node1 x:collection1] o.a.s.c.SolrCore solr.StandardDirectoryFactory
   [junit4]   2> 2633235 INFO  (coreLoadExecutor-7251-thread-1-processing-n:127.0.0.1:58500_) [n:127.0.0.1:58500_ c:collection1 s:shard1 r:core_node1 x:collection1] o.a.s.c.SolrCore [[collection1] ] Opening new SolrCore at [C:\Users\JenkinsSlave\workspace\Lucene-Solr-5.5-Windows\solr\build\solr-core\test\J0\temp\solr.cloud.ChaosMonkeyNothingIsSafeTest_CBE1609917253D16-001\shard-1-001\cores\collection1], dataDir=[C:\Users\JenkinsSlave\workspace\Lucene-Solr-5.5-Windows\solr\build\solr-core\test\J0\..\..\..\..\..\..\..\..\..\Users\JenkinsSlave\workspace\Lucene-Solr-5.5-Windows\solr\build\solr-core\test\J0\temp\solr.cloud.ChaosMonkeyNothingIsSafeTest_CBE1609917253D16-001\shard-1-001\cores\collection1\data\]
   [junit4]   2> 2633236 INFO  (coreLoadExecutor-7251-thread-1-processing-n:127.0.0.1:58500_) [n:127.0.0.1:58500_ c:collection1 s:shard1 r:core_node1 x:collection1] o.a.s.c.JmxMonitoredMap JMX monitoring is enabled. Adding Solr mbeans to JMX Server: com.sun.jmx.mbeanserver.JmxMBeanServer@116d3cf
   [junit4]   2> 2633237 INFO  (coreLoadExecutor-7251-thread-1-processing-n:127.0.0.1:58500_) [n:127.0.0.1:58500_ c:collection1 s:shard1 r:core_node1 x:collection1] o.a.s.c.CachingDirectoryFactory return new directory for C:\Users\JenkinsSlave\workspace\Lucene-Solr-5.5-Windows\solr\build\solr-core\test\J0\temp\solr.cloud.ChaosMonkeyNothingIsSafeTest_CBE1609917253D16-001\shard-1-001\cores\collection1\data
   [junit4]   2> 2633237 INFO  (coreLoadExecutor-7251-thread-1-processing-n:127.0.0.1:58500_) [n:127.0.0.1:58500_ c:collection1 s:shard1 r:core_node1 x:collection1] o.a.s.c.SolrCore New index directory detected: old=null new=C:\Users\JenkinsSlave\workspace\Lucene-Solr-5.5-Windows\solr\build\solr-core\test\J0\..\..\..\..\..\..\..\..\..\Users\JenkinsSlave\workspace\Lucene-Solr-5.5-Windows\solr\build\solr-core\test\J0\temp\solr.cloud.ChaosMonkeyNothingIsSafeTest_CBE1609917253D16-001\shard-1-001\cores\collection1\data\index/
   [junit4]   2> 2633238 WARN  (coreLoadExecutor-7251-thread-1-processing-n:127.0.0.1:58500_) [n:127.0.0.1:58500_ c:collection1 s:shard1 r:core_node1 x:collection1] o.a.s.c.SolrCore [collection1] Solr index directory 'C:\Users\JenkinsSlave\workspace\Lucene-Solr-5.5-Windows\solr\build\solr-core\test\J0\..\..\..\..\..\..\..\..\..\Users\JenkinsSlave\workspace\Lucene-Solr-5.5-Windows\solr\build\solr-core\test\J0\temp\solr.cloud.ChaosMonkeyNothingIsSafeTest_CBE1609917253D16-001\shard-1-001\cores\collection1\data\index' doesn't exist. Creating new index...
   [junit4]   2> 2633239 INFO  (coreLoadExecutor-7251-thread-1-processing-n:127.0.0.1:58500_) [n:127.0.0.1:58500_ c:collection1 s:shard1 r:core_node1 x:collection1] o.a.s.c.CachingDirectoryFactory return new directory for C:\Users\JenkinsSlave\workspace\Lucene-Solr-5.5-Windows\solr\build\solr-core\test\J0\temp\solr.cloud.ChaosMonkeyNothingIsSafeTest_CBE1609917253D16-001\shard-1-001\cores\collection1\data\index
   [junit4]   2> 2633239 INFO  (coreLoadExecutor-7251-thread-1-processing-n:127.0.0.1:58500_) [n:127.0.0.1:58500_ c:collection1 s:shard1 r:core_node1 x:collection1] o.a.s.u.RandomMergePolicy RandomMergePolicy wrapping class org.apache.lucene.index.LogByteSizeMergePolicy: [LogByteSizeMergePolicy: minMergeSize=1677721, mergeFactor=31, maxMergeSize=2147483648, maxMergeSizeForForcedMerge=9223372036854775807, calibrateSizeByDeletes=true, maxMergeDocs=2147483647, maxCFSSegmentSizeMB=8.796093022207999E12, noCFSRatio=1.0]
   [junit4]   2> 2633295 INFO  (coreLoadExecutor-7251-thread-1-processing-n:127.0.0.1:58500_) [n:127.0.0.1:58500_ c:collection1 s:shard1 r:core_node1 x:collection1] o.a.s.c.SolrDeletionPolicy SolrDeletionPolicy.onCommit: commits: num=1
   [junit4]   2> 	commit{dir=C:\Users\JenkinsSlave\workspace\Lucene-Solr-5.5-Windows\solr\build\solr-core\test\J0\temp\solr.cloud.ChaosMonkeyNothingIsSafeTest_CBE1609917253D16-001\shard-1-001\cores\collection1\data\index,segFN=segments_1,generation=1}
   [junit4]   2> 2633295 INFO  (coreLoadExecutor-7251-thread-1-processing-n:127.0.0.1:58500_) [n:127.0.0.1:58500_ c:collection1 s:shard1 r:core_node1 x:collection1] o.a.s.c.SolrDeletionPolicy newest commit generation = 1
   [junit4]   2> 2633295 INFO  (OldIndexDirectoryCleanupThreadForCore-collection1) [n:127.0.0.1:58500_ c:collection1 s:shard1 r:core_node1 x:collection1] o.a.s.c.SolrCore Looking for old index directories to cleanup for core collection1 in C:\Users\JenkinsSlave\workspace\Lucene-Solr-5.5-Windows\solr\build\solr-core\test\J0\..\..\..\..\..\..\..\..\..\Users\JenkinsSlave\workspace\Lucene-Solr-5.5-Windows\solr\build\solr-core\test\J0\temp\solr.cloud.ChaosMonkeyNothingIsSafeTest_CBE1609917253D16-001\shard-1-001\cores\collection1\data\
   [junit4]   2> 2633300 INFO  (coreLoadExecutor-7251-thread-1-processing-n:127.0.0.1:58500_) [n:127.0.0.1:58500_ c:collection1 s:shard1 r:core_node1 x:collection1] o.a.s.u.p.UpdateRequestProcessorChain creating updateRequestProcessorChain "nodistrib"
   [junit4]   2> 2633300 INFO  (coreLoadExecutor-7251-thread-1-processing-n:127.0.0.1:58500_) [n:127.0.0.1:58500_ c:collection1 s:shard1 r:core_node1 x:collection1] o.a.s.u.p.UpdateRequestProcessorChain creating updateRequestProcessorChain "dedupe"
   [junit4]   2> 2633300 INFO  (coreLoadExecutor-7251-thread-1-processing-n:127.0.0.1:58500_) [n:127.0.0.1:58500_ c:collection1 s:shard1 r:core_node1 x:collection1] o.a.s.u.p.UpdateRequestProcessorChain inserting DistributedUpdateProcessorFactory into updateRequestProcessorChain "dedupe"
   [junit4]   2> 2633300 INFO  (coreLoadExecutor-7251-thread-1-processing-n:127.0.0.1:58500_) [n:127.0.0.1:58500_ c:collection1 s:shard1 r:core_node1 x:collection1] o.a.s.u.p.UpdateRequestProcessorChain creating updateRequestProcessorChain "stored_sig"
   [junit4]   2> 2633300 INFO  (coreLoadExecutor-7251-thread-1-processing-n:127.0.0.1:58500_) [n:127.0.0.1:58500_ c:collection1 s:shard1 r:core_node1 x:collection1] o.a.s.u.p.UpdateRequestProcessorChain inserting DistributedUpdateProcessorFactory into updateRequestProcessorChain "stored_sig"
   [junit4]   2> 2633300 INFO  (coreLoadExecutor-7251-thread-1-processing-n:127.0.0.1:58500_) [n:127.0.0.1:58500_ c:collection1 s:shard1 r:core_node1 x:collection1] o.a.s.u.p.UpdateRequestProcessorChain creating updateRequestProcessorChain "distrib-dup-test-chain-explicit"
   [junit4]   2> 2633300 INFO  (coreLoadExecutor-7251-thread-1-processing-n:127.0.0.1:58500_) [n:127.0.0.1:58500_ c:collection1 s:shard1 r:core_node1 x:collection1] o.a.s.u.p.UpdateRequestProcessorChain creating updateRequestProcessorChain "distrib-dup-test-chain-implicit"
   [junit4]   2> 2633300 INFO  (coreLoadExecutor-7251-thread-1-processing-n:127.0.0.1:58500_) [n:127.0.0.1:58500_ c:collection1 s:shard1 r:core_node1 x:collection1] o.a.s.u.p.UpdateRequestProcessorChain inserting DistributedUpdateProcessorFactory into updateRequestProcessorChain "distrib-dup-test-chain-implicit"
   [junit4]   2> 2633300 INFO  (coreLoadExecutor-7251-thread-1-processing-n:127.0.0.1:58500_) [n:127.0.0.1:58500_ c:collection1 s:shard1 r:core_node1 x:collection1] o.a.s.c.SolrCore no updateRequestProcessorChain defined as default, creating implicit default
   [junit4]   2> 

[...truncated too long message...]

001\cores\collection1\data;done=false>>]
   [junit4]   2> 2675833 INFO  (zkCallback-3538-thread-3-processing-n:127.0.0.1:58518_) [n:127.0.0.1:58518_ c:collection1 s:shard1 r:core_node2 x:collection1] o.a.s.c.CachingDirectoryFactory Closing directory: C:\Users\JenkinsSlave\workspace\Lucene-Solr-5.5-Windows\solr\build\solr-core\test\J0\temp\solr.cloud.ChaosMonkeyNothingIsSafeTest_CBE1609917253D16-001\shard-2-001\cores\collection1\data
   [junit4]   2> 2675836 INFO  (TEST-ChaosMonkeyNothingIsSafeTest.test-seed#[CBE1609917253D16]) [    ] o.e.j.s.ServerConnector Stopped ServerConnector@1001df9{HTTP/1.1}{127.0.0.1:0}
   [junit4]   2> 2675836 INFO  (TEST-ChaosMonkeyNothingIsSafeTest.test-seed#[CBE1609917253D16]) [    ] o.e.j.s.h.ContextHandler Stopped o.e.j.s.ServletContextHandler@1a0e87f{/,null,UNAVAILABLE}
   [junit4]   2> 2675839 INFO  (TEST-ChaosMonkeyNothingIsSafeTest.test-seed#[CBE1609917253D16]) [    ] o.a.s.c.ZkTestServer connecting to 127.0.0.1:58478 58478
   [junit4]   2> 2678125 INFO  (Thread-5429) [    ] o.a.s.c.ZkTestServer connecting to 127.0.0.1:58478 58478
   [junit4]   2> 2678126 WARN  (Thread-5429) [    ] o.a.s.c.ZkTestServer Watch limit violations: 
   [junit4]   2> Maximum concurrent children watches above limit:
   [junit4]   2> 
   [junit4]   2> 	2	/solr/overseer/queue
   [junit4]   2> 
   [junit4]   2> NOTE: reproduce with: ant test  -Dtestcase=ChaosMonkeyNothingIsSafeTest -Dtests.method=test -Dtests.seed=CBE1609917253D16 -Dtests.slow=true -Dtests.locale=lv-LV -Dtests.timezone=America/Martinique -Dtests.asserts=true -Dtests.file.encoding=UTF-8
   [junit4] ERROR   67.4s J0 | ChaosMonkeyNothingIsSafeTest.test <<<
   [junit4]    > Throwable #1: org.apache.solr.common.SolrException: Could not find a healthy node to handle the request.
   [junit4]    > 	at __randomizedtesting.SeedInfo.seed([CBE1609917253D16:43B55F43B9D950EE]:0)
   [junit4]    > 	at org.apache.solr.client.solrj.impl.CloudSolrClient.sendRequest(CloudSolrClient.java:1084)
   [junit4]    > 	at org.apache.solr.client.solrj.impl.CloudSolrClient.requestWithRetryOnStaleState(CloudSolrClient.java:870)
   [junit4]    > 	at org.apache.solr.client.solrj.impl.CloudSolrClient.request(CloudSolrClient.java:806)
   [junit4]    > 	at org.apache.solr.client.solrj.SolrRequest.process(SolrRequest.java:149)
   [junit4]    > 	at org.apache.solr.client.solrj.SolrClient.commit(SolrClient.java:482)
   [junit4]    > 	at org.apache.solr.client.solrj.SolrClient.commit(SolrClient.java:463)
   [junit4]    > 	at org.apache.solr.cloud.AbstractFullDistribZkTestBase.commit(AbstractFullDistribZkTestBase.java:1504)
   [junit4]    > 	at org.apache.solr.cloud.ChaosMonkeyNothingIsSafeTest.test(ChaosMonkeyNothingIsSafeTest.java:214)
   [junit4]    > 	at org.apache.solr.BaseDistributedSearchTestCase$ShardsRepeatRule$ShardsFixedStatement.callStatement(BaseDistributedSearchTestCase.java:964)
   [junit4]    > 	at org.apache.solr.BaseDistributedSearchTestCase$ShardsRepeatRule$ShardsStatement.evaluate(BaseDistributedSearchTestCase.java:939)
   [junit4]    > 	at java.lang.Thread.run(Thread.java:745)
   [junit4]   2> 2678129 INFO  (SUITE-ChaosMonkeyNothingIsSafeTest-seed#[CBE1609917253D16]-worker) [    ] o.a.s.SolrTestCaseJ4 ###deleteCore
   [junit4]   2> NOTE: leaving temporary files on disk at: C:\Users\JenkinsSlave\workspace\Lucene-Solr-5.5-Windows\solr\build\solr-core\test\J0\temp\solr.cloud.ChaosMonkeyNothingIsSafeTest_CBE1609917253D16-001
   [junit4]   2> NOTE: test params are: codec=Asserting(Lucene54): {a_t=PostingsFormat(name=LuceneFixedGap), rnd_b=PostingsFormat(name=MockRandom), a_i=PostingsFormat(name=MockRandom), _version_=PostingsFormat(name=LuceneFixedGap), id=PostingsFormat(name=MockRandom)}, docValues:{}, sim=RandomSimilarity(queryNorm=true,coord=yes): {}, locale=lv-LV, timezone=America/Martinique
   [junit4]   2> NOTE: Windows 7 6.1 x86/Oracle Corporation 1.7.0_80 (32-bit)/cpus=3,threads=1,free=291148216,total=454557696
   [junit4]   2> NOTE: All tests run in this JVM: [ForceLeaderTest, BigEndianAscendingWordSerializerTest, TriLevelCompositeIdRoutingTest, DistributedFacetPivotWhiteBoxTest, LeaderElectionTest, TestRequestForwarding, SolrCloudExampleTest, TestRuleBasedAuthorizationPlugin, TestAuthorizationFramework, TestConfig, LeaderInitiatedRecoveryOnShardRestartTest, HighlighterTest, TestClassNameShortening, ZkStateWriterTest, WrapperMergePolicyFactoryTest, TestDistributedSearch, FastVectorHighlighterTest, TestInfoStreamLogging, TestConfigSetsAPI, CurrencyFieldXmlFileTest, TestManagedSynonymFilterFactory, TestLazyCores, SolrIndexConfigTest, BlockDirectoryTest, TestTestInjection, TestChildDocTransformer, TestSweetSpotSimilarityFactory, DeleteReplicaTest, TestSolrQueryResponse, TestExtendedDismaxParser, HLLSerializationTest, DisMaxRequestHandlerTest, TestArbitraryIndexDir, AddBlockUpdateTest, OverseerTest, TestCollapseQParserPlugin, TestJmxMonitoredMap, DistanceUnitsTest, JsonLoaderTest, ActionThrottleTest, TestJmxIntegration, RequestLoggingTest, TestSolr4Spatial2, PolyFieldTest, DeleteInactiveReplicaTest, PrimUtilsTest, QueryElevationComponentTest, AnalysisAfterCoreReloadTest, RestartWhileUpdatingTest, ReturnFieldsTest, SecurityConfHandlerTest, TestMiniSolrCloudClusterSSL, JSONWriterTest, StandardRequestHandlerTest, ZkControllerTest, SchemaVersionSpecificBehaviorTest, OverseerRolesTest, TestWordDelimiterFilterFactory, MultiThreadedOCPTest, IndexSchemaTest, SOLR749Test, TestDocSet, TestIntervalFaceting, XsltUpdateRequestHandlerTest, DistributedDebugComponentTest, TestConfigSetsAPIZkFailure, SliceStateTest, PrimitiveFieldTypeTest, ClusterStateTest, TestPartialUpdateDeduplication, JavabinLoaderTest, TestSimpleQParserPlugin, DocValuesMultiTest, TestSolrDeletionPolicy1, TestStressLucene, TestIBSimilarityFactory, CoreAdminCreateDiscoverTest, TestStressUserVersions, TestRandomCollapseQParserPlugin, SimpleFacetsTest, TestFaceting, HardAutoCommitTest, AlternateDirectoryTest, RequiredFieldsTest, TestRebalanceLeaders, SimplePostToolTest, DistributedQueryComponentOptimizationTest, ShardRoutingTest, DistributedSpellCheckComponentTest, TestNRTOpen, TestNoOpRegenerator, AnalyticsMergeStrategyTest, TestManagedResource, CursorPagingTest, MBeansHandlerTest, TestDistributedStatsComponentCardinality, RankQueryTest, HdfsBasicDistributedZk2Test, TestCloudSchemaless, TestDefaultSearchFieldResource, TestCSVLoader, DistributedFacetPivotLargeTest, TestXIncludeConfig, TestClassicSimilarityFactory, LeaderFailoverAfterPartitionTest, XmlUpdateRequestHandlerTest, TestCoreContainer, PathHierarchyTokenizerFactoryTest, ParsingFieldUpdateProcessorsTest, TestPivotHelperCode, SuggestComponentContextFilterQueryTest, DistributedQueueTest, TestExclusionRuleCollectionAccess, TestComponentsName, CollectionTooManyReplicasTest, TestSolrConfigHandlerCloud, TestFieldTypeResource, SoftAutoCommitTest, DocumentBuilderTest, UpdateParamsTest, SpatialFilterTest, ScriptEngineTest, IndexBasedSpellCheckerTest, TestUniqueKeyFieldResource, TestPhraseSuggestions, TestSort, TestRTimerTree, TestSurroundQueryParser, CircularListTest, SpatialRPTFieldTypeTest, TestGroupingSearch, TestHashPartitioner, TestFileDictionaryLookup, TestAuthenticationFramework, RegexBoostProcessorTest, TestRemoteStreaming, SharedFSAutoReplicaFailoverUtilsTest, TestQuerySenderNoQuery, TestFieldResource, TestReplicationHandler, DocValuesTest, BasicDistributedZkTest, BasicDistributedZk2Test, SyncSliceTest, RecoveryZkTest, ZkSolrClientTest, AutoCommitTest, TestRecovery, TestRealTimeGet, TestStressReorder, TestJoin, TestReload, TestRangeQuery, TestSolr4Spatial, SolrCoreTest, PeerSyncTest, TestFiltering, TestFunctionQuery, DirectUpdateHandlerTest, DistributedQueryElevationComponentTest, CoreAdminHandlerTest, SuggesterTest, NoCacheHeaderTest, TestPseudoReturnFields, TestUpdate, FieldMutatingUpdateProcessorTest, DefaultValueUpdateProcessorTest, CacheHeaderTest, TestQueryUtils, TestWriterPerf, DirectSolrSpellCheckerTest, TermsComponentTest, TestIndexingPerformance, FieldAnalysisRequestHandlerTest, SolrPluginUtilsTest, QueryParsingTest, UniqFieldsUpdateProcessorFactoryTest, BinaryUpdateRequestHandlerTest, PingRequestHandlerTest, CopyFieldTest, ResponseLogComponentTest, BadComponentTest, TestStressRecovery, TestSolrDeletionPolicy2, MultiTermTest, SampleTest, NumericFieldsTest, MinimalSchemaTest, OutputWriterTest, ExternalFileFieldSortTest, TestPostingsSolrHighlighter, TestLuceneMatchVersion, TestCodecSupport, TestLMJelinekMercerSimilarityFactory, TimeZoneUtilsTest, PluginInfoTest, TestFastLRUCache, DateMathParserTest, ChaosMonkeyNothingIsSafeTest]
   [junit4] Completed [414/566 (1!)] on J0 in 67.38s, 1 test, 1 error <<< FAILURES!

[...truncated 493 lines...]
BUILD FAILED
C:\Users\JenkinsSlave\workspace\Lucene-Solr-5.5-Windows\build.xml:750: The following error occurred while executing this line:
C:\Users\JenkinsSlave\workspace\Lucene-Solr-5.5-Windows\build.xml:694: The following error occurred while executing this line:
C:\Users\JenkinsSlave\workspace\Lucene-Solr-5.5-Windows\build.xml:59: The following error occurred while executing this line:
C:\Users\JenkinsSlave\workspace\Lucene-Solr-5.5-Windows\solr\build.xml:233: The following error occurred while executing this line:
C:\Users\JenkinsSlave\workspace\Lucene-Solr-5.5-Windows\solr\common-build.xml:534: The following error occurred while executing this line:
C:\Users\JenkinsSlave\workspace\Lucene-Solr-5.5-Windows\lucene\common-build.xml:1477: The following error occurred while executing this line:
C:\Users\JenkinsSlave\workspace\Lucene-Solr-5.5-Windows\lucene\common-build.xml:1033: There were test failures: 566 suites (7 ignored), 2275 tests, 1 error, 94 ignored (49 assumptions) [seed: CBE1609917253D16]

Total time: 82 minutes 40 seconds
Build step 'Invoke Ant' marked build as failure
Archiving artifacts
[WARNINGS] Skipping publisher since build result is FAILURE
Recording test results
Email was triggered for: Failure - Any
Sending email for trigger: Failure - Any



Mime
View raw message