lucene-dev mailing list archives

Site index · List index
Message view « Date » · « Thread »
Top « Date » · « Thread »
From Policeman Jenkins Server <jenk...@thetaphi.de>
Subject [JENKINS] Lucene-Solr-trunk-Solaris (64bit/jdk1.8.0) - Build # 426 - Still Failing!
Date Thu, 25 Feb 2016 01:10:07 GMT
Build: http://jenkins.thetaphi.de/job/Lucene-Solr-trunk-Solaris/426/
Java: 64bit/jdk1.8.0 -XX:-UseCompressedOops -XX:+UseConcMarkSweepGC

5 tests failed.
FAILED:  org.apache.solr.cloud.CollectionStateFormat2Test.test

Error Message:
No live SolrServers available to handle this request:[http://127.0.0.1:56971/hpx, http://127.0.0.1:33604/hpx, http://127.0.0.1:33063/hpx, http://127.0.0.1:63911/hpx, http://127.0.0.1:42735/hpx]

Stack Trace:
org.apache.solr.client.solrj.SolrServerException: No live SolrServers available to handle this request:[http://127.0.0.1:56971/hpx, http://127.0.0.1:33604/hpx, http://127.0.0.1:33063/hpx, http://127.0.0.1:63911/hpx, http://127.0.0.1:42735/hpx]
	at __randomizedtesting.SeedInfo.seed([7A09376CAEEE6563:F25D08B60012089B]:0)
	at org.apache.solr.client.solrj.impl.LBHttpSolrClient.request(LBHttpSolrClient.java:352)
	at org.apache.solr.client.solrj.impl.CloudSolrClient.sendRequest(CloudSolrClient.java:1100)
	at org.apache.solr.client.solrj.impl.CloudSolrClient.requestWithRetryOnStaleState(CloudSolrClient.java:870)
	at org.apache.solr.client.solrj.impl.CloudSolrClient.request(CloudSolrClient.java:806)
	at org.apache.solr.client.solrj.SolrClient.request(SolrClient.java:1219)
	at org.apache.solr.cloud.AbstractFullDistribZkTestBase.createCollection(AbstractFullDistribZkTestBase.java:1593)
	at org.apache.solr.cloud.AbstractFullDistribZkTestBase.createCollection(AbstractFullDistribZkTestBase.java:1547)
	at org.apache.solr.cloud.AbstractFullDistribZkTestBase.createCollection(AbstractFullDistribZkTestBase.java:1808)
	at org.apache.solr.cloud.CollectionStateFormat2Test.testConfNameAndCollectionNameSame(CollectionStateFormat2Test.java:52)
	at org.apache.solr.cloud.CollectionStateFormat2Test.test(CollectionStateFormat2Test.java:40)
	at sun.reflect.NativeMethodAccessorImpl.invoke0(Native Method)
	at sun.reflect.NativeMethodAccessorImpl.invoke(NativeMethodAccessorImpl.java:62)
	at sun.reflect.DelegatingMethodAccessorImpl.invoke(DelegatingMethodAccessorImpl.java:43)
	at java.lang.reflect.Method.invoke(Method.java:498)
	at com.carrotsearch.randomizedtesting.RandomizedRunner.invoke(RandomizedRunner.java:1764)
	at com.carrotsearch.randomizedtesting.RandomizedRunner$8.evaluate(RandomizedRunner.java:871)
	at com.carrotsearch.randomizedtesting.RandomizedRunner$9.evaluate(RandomizedRunner.java:907)
	at com.carrotsearch.randomizedtesting.RandomizedRunner$10.evaluate(RandomizedRunner.java:921)
	at org.apache.solr.BaseDistributedSearchTestCase$ShardsRepeatRule$ShardsFixedStatement.callStatement(BaseDistributedSearchTestCase.java:964)
	at org.apache.solr.BaseDistributedSearchTestCase$ShardsRepeatRule$ShardsStatement.evaluate(BaseDistributedSearchTestCase.java:939)
	at com.carrotsearch.randomizedtesting.rules.SystemPropertiesRestoreRule$1.evaluate(SystemPropertiesRestoreRule.java:57)
	at org.apache.lucene.util.TestRuleSetupTeardownChained$1.evaluate(TestRuleSetupTeardownChained.java:49)
	at org.apache.lucene.util.AbstractBeforeAfterRule$1.evaluate(AbstractBeforeAfterRule.java:45)
	at org.apache.lucene.util.TestRuleThreadAndTestName$1.evaluate(TestRuleThreadAndTestName.java:48)
	at org.apache.lucene.util.TestRuleIgnoreAfterMaxFailures$1.evaluate(TestRuleIgnoreAfterMaxFailures.java:64)
	at org.apache.lucene.util.TestRuleMarkFailure$1.evaluate(TestRuleMarkFailure.java:47)
	at com.carrotsearch.randomizedtesting.rules.StatementAdapter.evaluate(StatementAdapter.java:36)
	at com.carrotsearch.randomizedtesting.ThreadLeakControl$StatementRunner.run(ThreadLeakControl.java:367)
	at com.carrotsearch.randomizedtesting.ThreadLeakControl.forkTimeoutingTask(ThreadLeakControl.java:809)
	at com.carrotsearch.randomizedtesting.ThreadLeakControl$3.evaluate(ThreadLeakControl.java:460)
	at com.carrotsearch.randomizedtesting.RandomizedRunner.runSingleTest(RandomizedRunner.java:880)
	at com.carrotsearch.randomizedtesting.RandomizedRunner$5.evaluate(RandomizedRunner.java:781)
	at com.carrotsearch.randomizedtesting.RandomizedRunner$6.evaluate(RandomizedRunner.java:816)
	at com.carrotsearch.randomizedtesting.RandomizedRunner$7.evaluate(RandomizedRunner.java:827)
	at com.carrotsearch.randomizedtesting.rules.StatementAdapter.evaluate(StatementAdapter.java:36)
	at com.carrotsearch.randomizedtesting.rules.SystemPropertiesRestoreRule$1.evaluate(SystemPropertiesRestoreRule.java:57)
	at org.apache.lucene.util.AbstractBeforeAfterRule$1.evaluate(AbstractBeforeAfterRule.java:45)
	at com.carrotsearch.randomizedtesting.rules.StatementAdapter.evaluate(StatementAdapter.java:36)
	at org.apache.lucene.util.TestRuleStoreClassName$1.evaluate(TestRuleStoreClassName.java:41)
	at com.carrotsearch.randomizedtesting.rules.NoShadowingOrOverridesOnMethodsRule$1.evaluate(NoShadowingOrOverridesOnMethodsRule.java:40)
	at com.carrotsearch.randomizedtesting.rules.NoShadowingOrOverridesOnMethodsRule$1.evaluate(NoShadowingOrOverridesOnMethodsRule.java:40)
	at com.carrotsearch.randomizedtesting.rules.StatementAdapter.evaluate(StatementAdapter.java:36)
	at com.carrotsearch.randomizedtesting.rules.StatementAdapter.evaluate(StatementAdapter.java:36)
	at com.carrotsearch.randomizedtesting.rules.StatementAdapter.evaluate(StatementAdapter.java:36)
	at org.apache.lucene.util.TestRuleAssertionsRequired$1.evaluate(TestRuleAssertionsRequired.java:53)
	at org.apache.lucene.util.TestRuleMarkFailure$1.evaluate(TestRuleMarkFailure.java:47)
	at org.apache.lucene.util.TestRuleIgnoreAfterMaxFailures$1.evaluate(TestRuleIgnoreAfterMaxFailures.java:64)
	at org.apache.lucene.util.TestRuleIgnoreTestSuites$1.evaluate(TestRuleIgnoreTestSuites.java:54)
	at com.carrotsearch.randomizedtesting.rules.StatementAdapter.evaluate(StatementAdapter.java:36)
	at com.carrotsearch.randomizedtesting.ThreadLeakControl$StatementRunner.run(ThreadLeakControl.java:367)
	at java.lang.Thread.run(Thread.java:745)
Caused by: org.apache.solr.client.solrj.impl.HttpSolrClient$RemoteSolrException: Error from server at http://127.0.0.1:33063/hpx: java.lang.NullPointerException
	at org.apache.commons.io.IOUtils.copyLarge(IOUtils.java:1792)
	at org.apache.commons.io.IOUtils.copyLarge(IOUtils.java:1769)
	at org.apache.commons.io.IOUtils.copy(IOUtils.java:1744)
	at org.apache.commons.io.IOUtils.toByteArray(IOUtils.java:462)
	at org.apache.solr.handler.admin.CollectionsHandler$CollectionOperation$1.createSysConfigSet(CollectionsHandler.java:385)
	at org.apache.solr.handler.admin.CollectionsHandler$CollectionOperation$1.call(CollectionsHandler.java:366)
	at org.apache.solr.handler.admin.CollectionsHandler.handleRequestBody(CollectionsHandler.java:188)
	at org.apache.solr.handler.RequestHandlerBase.handleRequest(RequestHandlerBase.java:155)
	at org.apache.solr.servlet.HttpSolrCall.handleAdminRequest(HttpSolrCall.java:655)
	at org.apache.solr.servlet.HttpSolrCall.call(HttpSolrCall.java:438)
	at org.apache.solr.servlet.SolrDispatchFilter.doFilter(SolrDispatchFilter.java:229)
	at org.apache.solr.servlet.SolrDispatchFilter.doFilter(SolrDispatchFilter.java:184)
	at org.eclipse.jetty.servlet.ServletHandler$CachedChain.doFilter(ServletHandler.java:1668)
	at org.apache.solr.client.solrj.embedded.JettySolrRunner$DebugFilter.doFilter(JettySolrRunner.java:109)
	at org.eclipse.jetty.servlet.ServletHandler$CachedChain.doFilter(ServletHandler.java:1668)
	at org.eclipse.jetty.servlet.ServletHandler.doHandle(ServletHandler.java:581)
	at org.eclipse.jetty.server.session.SessionHandler.doHandle(SessionHandler.java:224)
	at org.eclipse.jetty.server.handler.ContextHandler.doHandle(ContextHandler.java:1158)
	at org.eclipse.jetty.servlet.ServletHandler.doScope(ServletHandler.java:511)
	at org.eclipse.jetty.server.session.SessionHandler.doScope(SessionHandler.java:185)
	at org.eclipse.jetty.server.handler.ContextHandler.doScope(ContextHandler.java:1090)
	at org.eclipse.jetty.server.handler.ScopedHandler.handle(ScopedHandler.java:141)
	at org.eclipse.jetty.server.handler.gzip.GzipHandler.handle(GzipHandler.java:437)
	at org.eclipse.jetty.server.handler.HandlerWrapper.handle(HandlerWrapper.java:119)
	at org.eclipse.jetty.server.Server.handle(Server.java:517)
	at org.eclipse.jetty.server.HttpChannel.handle(HttpChannel.java:308)
	at org.eclipse.jetty.server.HttpConnection.onFillable(HttpConnection.java:242)
	at org.eclipse.jetty.io.AbstractConnection$ReadCallback.succeeded(AbstractConnection.java:261)
	at org.eclipse.jetty.io.FillInterest.fillable(FillInterest.java:95)
	at org.eclipse.jetty.io.SelectChannelEndPoint$2.run(SelectChannelEndPoint.java:75)
	at org.eclipse.jetty.util.thread.strategy.ExecuteProduceConsume.produceAndRun(ExecuteProduceConsume.java:213)
	at org.eclipse.jetty.util.thread.strategy.ExecuteProduceConsume.run(ExecuteProduceConsume.java:147)
	at org.eclipse.jetty.util.thread.QueuedThreadPool.runJob(QueuedThreadPool.java:654)
	at org.eclipse.jetty.util.thread.QueuedThreadPool$3.run(QueuedThreadPool.java:572)
	at java.lang.Thread.run(Thread.java:745)

	at org.apache.solr.client.solrj.impl.HttpSolrClient.executeMethod(HttpSolrClient.java:577)
	at org.apache.solr.client.solrj.impl.HttpSolrClient.request(HttpSolrClient.java:241)
	at org.apache.solr.client.solrj.impl.HttpSolrClient.request(HttpSolrClient.java:230)
	at org.apache.solr.client.solrj.impl.LBHttpSolrClient.doRequest(LBHttpSolrClient.java:372)
	at org.apache.solr.client.solrj.impl.LBHttpSolrClient.request(LBHttpSolrClient.java:325)
	... 50 more


FAILED:  org.apache.solr.cloud.TestCryptoKeys.test

Error Message:
Error from server at http://127.0.0.1:57744/_/b: java.lang.NullPointerException  at org.apache.commons.io.IOUtils.copyLarge(IOUtils.java:1792)  at org.apache.commons.io.IOUtils.copyLarge(IOUtils.java:1769)  at org.apache.commons.io.IOUtils.copy(IOUtils.java:1744)  at org.apache.commons.io.IOUtils.toByteArray(IOUtils.java:462)  at org.apache.solr.handler.admin.CollectionsHandler$CollectionOperation$1.createSysConfigSet(CollectionsHandler.java:385)  at org.apache.solr.handler.admin.CollectionsHandler$CollectionOperation$1.call(CollectionsHandler.java:366)  at org.apache.solr.handler.admin.CollectionsHandler.handleRequestBody(CollectionsHandler.java:188)  at org.apache.solr.handler.RequestHandlerBase.handleRequest(RequestHandlerBase.java:155)  at org.apache.solr.servlet.HttpSolrCall.handleAdminRequest(HttpSolrCall.java:655)  at org.apache.solr.servlet.HttpSolrCall.call(HttpSolrCall.java:438)  at org.apache.solr.servlet.SolrDispatchFilter.doFilter(SolrDispatchFilter.java:229)  at org.apache.solr.servlet.SolrDispatchFilter.doFilter(SolrDispatchFilter.java:184)  at org.eclipse.jetty.servlet.ServletHandler$CachedChain.doFilter(ServletHandler.java:1668)  at org.apache.solr.client.solrj.embedded.JettySolrRunner$DebugFilter.doFilter(JettySolrRunner.java:109)  at org.eclipse.jetty.servlet.ServletHandler$CachedChain.doFilter(ServletHandler.java:1668)  at org.eclipse.jetty.servlet.ServletHandler.doHandle(ServletHandler.java:581)  at org.eclipse.jetty.server.session.SessionHandler.doHandle(SessionHandler.java:224)  at org.eclipse.jetty.server.handler.ContextHandler.doHandle(ContextHandler.java:1158)  at org.eclipse.jetty.servlet.ServletHandler.doScope(ServletHandler.java:511)  at org.eclipse.jetty.server.session.SessionHandler.doScope(SessionHandler.java:185)  at org.eclipse.jetty.server.handler.ContextHandler.doScope(ContextHandler.java:1090)  at org.eclipse.jetty.server.handler.ScopedHandler.handle(ScopedHandler.java:141)  at org.eclipse.jetty.server.handler.gzip.GzipHandler.handle(GzipHandler.java:437)  at org.eclipse.jetty.server.handler.HandlerWrapper.handle(HandlerWrapper.java:119)  at org.eclipse.jetty.server.Server.handle(Server.java:517)  at org.eclipse.jetty.server.HttpChannel.handle(HttpChannel.java:308)  at org.eclipse.jetty.server.HttpConnection.onFillable(HttpConnection.java:242)  at org.eclipse.jetty.io.AbstractConnection$ReadCallback.succeeded(AbstractConnection.java:261)  at org.eclipse.jetty.io.FillInterest.fillable(FillInterest.java:95)  at org.eclipse.jetty.io.SelectChannelEndPoint$2.run(SelectChannelEndPoint.java:75)  at org.eclipse.jetty.util.thread.strategy.ExecuteProduceConsume.produceAndRun(ExecuteProduceConsume.java:213)  at org.eclipse.jetty.util.thread.strategy.ExecuteProduceConsume.run(ExecuteProduceConsume.java:147)  at org.eclipse.jetty.util.thread.QueuedThreadPool.runJob(QueuedThreadPool.java:654)  at org.eclipse.jetty.util.thread.QueuedThreadPool$3.run(QueuedThreadPool.java:572)  at java.lang.Thread.run(Thread.java:745) 

Stack Trace:
org.apache.solr.client.solrj.impl.HttpSolrClient$RemoteSolrException: Error from server at http://127.0.0.1:57744/_/b: java.lang.NullPointerException
	at org.apache.commons.io.IOUtils.copyLarge(IOUtils.java:1792)
	at org.apache.commons.io.IOUtils.copyLarge(IOUtils.java:1769)
	at org.apache.commons.io.IOUtils.copy(IOUtils.java:1744)
	at org.apache.commons.io.IOUtils.toByteArray(IOUtils.java:462)
	at org.apache.solr.handler.admin.CollectionsHandler$CollectionOperation$1.createSysConfigSet(CollectionsHandler.java:385)
	at org.apache.solr.handler.admin.CollectionsHandler$CollectionOperation$1.call(CollectionsHandler.java:366)
	at org.apache.solr.handler.admin.CollectionsHandler.handleRequestBody(CollectionsHandler.java:188)
	at org.apache.solr.handler.RequestHandlerBase.handleRequest(RequestHandlerBase.java:155)
	at org.apache.solr.servlet.HttpSolrCall.handleAdminRequest(HttpSolrCall.java:655)
	at org.apache.solr.servlet.HttpSolrCall.call(HttpSolrCall.java:438)
	at org.apache.solr.servlet.SolrDispatchFilter.doFilter(SolrDispatchFilter.java:229)
	at org.apache.solr.servlet.SolrDispatchFilter.doFilter(SolrDispatchFilter.java:184)
	at org.eclipse.jetty.servlet.ServletHandler$CachedChain.doFilter(ServletHandler.java:1668)
	at org.apache.solr.client.solrj.embedded.JettySolrRunner$DebugFilter.doFilter(JettySolrRunner.java:109)
	at org.eclipse.jetty.servlet.ServletHandler$CachedChain.doFilter(ServletHandler.java:1668)
	at org.eclipse.jetty.servlet.ServletHandler.doHandle(ServletHandler.java:581)
	at org.eclipse.jetty.server.session.SessionHandler.doHandle(SessionHandler.java:224)
	at org.eclipse.jetty.server.handler.ContextHandler.doHandle(ContextHandler.java:1158)
	at org.eclipse.jetty.servlet.ServletHandler.doScope(ServletHandler.java:511)
	at org.eclipse.jetty.server.session.SessionHandler.doScope(SessionHandler.java:185)
	at org.eclipse.jetty.server.handler.ContextHandler.doScope(ContextHandler.java:1090)
	at org.eclipse.jetty.server.handler.ScopedHandler.handle(ScopedHandler.java:141)
	at org.eclipse.jetty.server.handler.gzip.GzipHandler.handle(GzipHandler.java:437)
	at org.eclipse.jetty.server.handler.HandlerWrapper.handle(HandlerWrapper.java:119)
	at org.eclipse.jetty.server.Server.handle(Server.java:517)
	at org.eclipse.jetty.server.HttpChannel.handle(HttpChannel.java:308)
	at org.eclipse.jetty.server.HttpConnection.onFillable(HttpConnection.java:242)
	at org.eclipse.jetty.io.AbstractConnection$ReadCallback.succeeded(AbstractConnection.java:261)
	at org.eclipse.jetty.io.FillInterest.fillable(FillInterest.java:95)
	at org.eclipse.jetty.io.SelectChannelEndPoint$2.run(SelectChannelEndPoint.java:75)
	at org.eclipse.jetty.util.thread.strategy.ExecuteProduceConsume.produceAndRun(ExecuteProduceConsume.java:213)
	at org.eclipse.jetty.util.thread.strategy.ExecuteProduceConsume.run(ExecuteProduceConsume.java:147)
	at org.eclipse.jetty.util.thread.QueuedThreadPool.runJob(QueuedThreadPool.java:654)
	at org.eclipse.jetty.util.thread.QueuedThreadPool$3.run(QueuedThreadPool.java:572)
	at java.lang.Thread.run(Thread.java:745)

	at __randomizedtesting.SeedInfo.seed([7A09376CAEEE6563:F25D08B60012089B]:0)
	at org.apache.solr.client.solrj.impl.HttpSolrClient.executeMethod(HttpSolrClient.java:577)
	at org.apache.solr.client.solrj.impl.HttpSolrClient.request(HttpSolrClient.java:241)
	at org.apache.solr.client.solrj.impl.HttpSolrClient.request(HttpSolrClient.java:230)
	at org.apache.solr.client.solrj.SolrRequest.process(SolrRequest.java:149)
	at org.apache.solr.client.solrj.SolrRequest.process(SolrRequest.java:166)
	at org.apache.solr.handler.TestBlobHandler.createSystemCollection(TestBlobHandler.java:113)
	at org.apache.solr.cloud.TestCryptoKeys.test(TestCryptoKeys.java:122)
	at sun.reflect.NativeMethodAccessorImpl.invoke0(Native Method)
	at sun.reflect.NativeMethodAccessorImpl.invoke(NativeMethodAccessorImpl.java:62)
	at sun.reflect.DelegatingMethodAccessorImpl.invoke(DelegatingMethodAccessorImpl.java:43)
	at java.lang.reflect.Method.invoke(Method.java:498)
	at com.carrotsearch.randomizedtesting.RandomizedRunner.invoke(RandomizedRunner.java:1764)
	at com.carrotsearch.randomizedtesting.RandomizedRunner$8.evaluate(RandomizedRunner.java:871)
	at com.carrotsearch.randomizedtesting.RandomizedRunner$9.evaluate(RandomizedRunner.java:907)
	at com.carrotsearch.randomizedtesting.RandomizedRunner$10.evaluate(RandomizedRunner.java:921)
	at org.apache.solr.BaseDistributedSearchTestCase$ShardsRepeatRule$ShardsFixedStatement.callStatement(BaseDistributedSearchTestCase.java:964)
	at org.apache.solr.BaseDistributedSearchTestCase$ShardsRepeatRule$ShardsStatement.evaluate(BaseDistributedSearchTestCase.java:939)
	at com.carrotsearch.randomizedtesting.rules.SystemPropertiesRestoreRule$1.evaluate(SystemPropertiesRestoreRule.java:57)
	at org.apache.lucene.util.TestRuleSetupTeardownChained$1.evaluate(TestRuleSetupTeardownChained.java:49)
	at org.apache.lucene.util.AbstractBeforeAfterRule$1.evaluate(AbstractBeforeAfterRule.java:45)
	at org.apache.lucene.util.TestRuleThreadAndTestName$1.evaluate(TestRuleThreadAndTestName.java:48)
	at org.apache.lucene.util.TestRuleIgnoreAfterMaxFailures$1.evaluate(TestRuleIgnoreAfterMaxFailures.java:64)
	at org.apache.lucene.util.TestRuleMarkFailure$1.evaluate(TestRuleMarkFailure.java:47)
	at com.carrotsearch.randomizedtesting.rules.StatementAdapter.evaluate(StatementAdapter.java:36)
	at com.carrotsearch.randomizedtesting.ThreadLeakControl$StatementRunner.run(ThreadLeakControl.java:367)
	at com.carrotsearch.randomizedtesting.ThreadLeakControl.forkTimeoutingTask(ThreadLeakControl.java:809)
	at com.carrotsearch.randomizedtesting.ThreadLeakControl$3.evaluate(ThreadLeakControl.java:460)
	at com.carrotsearch.randomizedtesting.RandomizedRunner.runSingleTest(RandomizedRunner.java:880)
	at com.carrotsearch.randomizedtesting.RandomizedRunner$5.evaluate(RandomizedRunner.java:781)
	at com.carrotsearch.randomizedtesting.RandomizedRunner$6.evaluate(RandomizedRunner.java:816)
	at com.carrotsearch.randomizedtesting.RandomizedRunner$7.evaluate(RandomizedRunner.java:827)
	at com.carrotsearch.randomizedtesting.rules.StatementAdapter.evaluate(StatementAdapter.java:36)
	at com.carrotsearch.randomizedtesting.rules.SystemPropertiesRestoreRule$1.evaluate(SystemPropertiesRestoreRule.java:57)
	at org.apache.lucene.util.AbstractBeforeAfterRule$1.evaluate(AbstractBeforeAfterRule.java:45)
	at com.carrotsearch.randomizedtesting.rules.StatementAdapter.evaluate(StatementAdapter.java:36)
	at org.apache.lucene.util.TestRuleStoreClassName$1.evaluate(TestRuleStoreClassName.java:41)
	at com.carrotsearch.randomizedtesting.rules.NoShadowingOrOverridesOnMethodsRule$1.evaluate(NoShadowingOrOverridesOnMethodsRule.java:40)
	at com.carrotsearch.randomizedtesting.rules.NoShadowingOrOverridesOnMethodsRule$1.evaluate(NoShadowingOrOverridesOnMethodsRule.java:40)
	at com.carrotsearch.randomizedtesting.rules.StatementAdapter.evaluate(StatementAdapter.java:36)
	at com.carrotsearch.randomizedtesting.rules.StatementAdapter.evaluate(StatementAdapter.java:36)
	at com.carrotsearch.randomizedtesting.rules.StatementAdapter.evaluate(StatementAdapter.java:36)
	at org.apache.lucene.util.TestRuleAssertionsRequired$1.evaluate(TestRuleAssertionsRequired.java:53)
	at org.apache.lucene.util.TestRuleMarkFailure$1.evaluate(TestRuleMarkFailure.java:47)
	at org.apache.lucene.util.TestRuleIgnoreAfterMaxFailures$1.evaluate(TestRuleIgnoreAfterMaxFailures.java:64)
	at org.apache.lucene.util.TestRuleIgnoreTestSuites$1.evaluate(TestRuleIgnoreTestSuites.java:54)
	at com.carrotsearch.randomizedtesting.rules.StatementAdapter.evaluate(StatementAdapter.java:36)
	at com.carrotsearch.randomizedtesting.ThreadLeakControl$StatementRunner.run(ThreadLeakControl.java:367)
	at java.lang.Thread.run(Thread.java:745)


FAILED:  org.apache.solr.core.TestDynamicLoading.testDynamicLoading

Error Message:
Error from server at http://127.0.0.1:52262: java.lang.NullPointerException  at org.apache.commons.io.IOUtils.copyLarge(IOUtils.java:1792)  at org.apache.commons.io.IOUtils.copyLarge(IOUtils.java:1769)  at org.apache.commons.io.IOUtils.copy(IOUtils.java:1744)  at org.apache.commons.io.IOUtils.toByteArray(IOUtils.java:462)  at org.apache.solr.handler.admin.CollectionsHandler$CollectionOperation$1.createSysConfigSet(CollectionsHandler.java:385)  at org.apache.solr.handler.admin.CollectionsHandler$CollectionOperation$1.call(CollectionsHandler.java:366)  at org.apache.solr.handler.admin.CollectionsHandler.handleRequestBody(CollectionsHandler.java:188)  at org.apache.solr.handler.RequestHandlerBase.handleRequest(RequestHandlerBase.java:155)  at org.apache.solr.servlet.HttpSolrCall.handleAdminRequest(HttpSolrCall.java:655)  at org.apache.solr.servlet.HttpSolrCall.call(HttpSolrCall.java:438)  at org.apache.solr.servlet.SolrDispatchFilter.doFilter(SolrDispatchFilter.java:229)  at org.apache.solr.servlet.SolrDispatchFilter.doFilter(SolrDispatchFilter.java:184)  at org.eclipse.jetty.servlet.ServletHandler$CachedChain.doFilter(ServletHandler.java:1668)  at org.apache.solr.client.solrj.embedded.JettySolrRunner$DebugFilter.doFilter(JettySolrRunner.java:109)  at org.eclipse.jetty.servlet.ServletHandler$CachedChain.doFilter(ServletHandler.java:1668)  at org.eclipse.jetty.servlet.ServletHandler.doHandle(ServletHandler.java:581)  at org.eclipse.jetty.server.session.SessionHandler.doHandle(SessionHandler.java:224)  at org.eclipse.jetty.server.handler.ContextHandler.doHandle(ContextHandler.java:1158)  at org.eclipse.jetty.servlet.ServletHandler.doScope(ServletHandler.java:511)  at org.eclipse.jetty.server.session.SessionHandler.doScope(SessionHandler.java:185)  at org.eclipse.jetty.server.handler.ContextHandler.doScope(ContextHandler.java:1090)  at org.eclipse.jetty.server.handler.ScopedHandler.handle(ScopedHandler.java:141)  at org.eclipse.jetty.server.handler.gzip.GzipHandler.handle(GzipHandler.java:437)  at org.eclipse.jetty.server.handler.HandlerWrapper.handle(HandlerWrapper.java:119)  at org.eclipse.jetty.server.Server.handle(Server.java:517)  at org.eclipse.jetty.server.HttpChannel.handle(HttpChannel.java:308)  at org.eclipse.jetty.server.HttpConnection.onFillable(HttpConnection.java:242)  at org.eclipse.jetty.io.AbstractConnection$ReadCallback.succeeded(AbstractConnection.java:261)  at org.eclipse.jetty.io.FillInterest.fillable(FillInterest.java:95)  at org.eclipse.jetty.io.SelectChannelEndPoint$2.run(SelectChannelEndPoint.java:75)  at org.eclipse.jetty.util.thread.strategy.ExecuteProduceConsume.produceAndRun(ExecuteProduceConsume.java:213)  at org.eclipse.jetty.util.thread.strategy.ExecuteProduceConsume.run(ExecuteProduceConsume.java:147)  at org.eclipse.jetty.util.thread.QueuedThreadPool.runJob(QueuedThreadPool.java:654)  at org.eclipse.jetty.util.thread.QueuedThreadPool$3.run(QueuedThreadPool.java:572)  at java.lang.Thread.run(Thread.java:745) 

Stack Trace:
org.apache.solr.client.solrj.impl.HttpSolrClient$RemoteSolrException: Error from server at http://127.0.0.1:52262: java.lang.NullPointerException
	at org.apache.commons.io.IOUtils.copyLarge(IOUtils.java:1792)
	at org.apache.commons.io.IOUtils.copyLarge(IOUtils.java:1769)
	at org.apache.commons.io.IOUtils.copy(IOUtils.java:1744)
	at org.apache.commons.io.IOUtils.toByteArray(IOUtils.java:462)
	at org.apache.solr.handler.admin.CollectionsHandler$CollectionOperation$1.createSysConfigSet(CollectionsHandler.java:385)
	at org.apache.solr.handler.admin.CollectionsHandler$CollectionOperation$1.call(CollectionsHandler.java:366)
	at org.apache.solr.handler.admin.CollectionsHandler.handleRequestBody(CollectionsHandler.java:188)
	at org.apache.solr.handler.RequestHandlerBase.handleRequest(RequestHandlerBase.java:155)
	at org.apache.solr.servlet.HttpSolrCall.handleAdminRequest(HttpSolrCall.java:655)
	at org.apache.solr.servlet.HttpSolrCall.call(HttpSolrCall.java:438)
	at org.apache.solr.servlet.SolrDispatchFilter.doFilter(SolrDispatchFilter.java:229)
	at org.apache.solr.servlet.SolrDispatchFilter.doFilter(SolrDispatchFilter.java:184)
	at org.eclipse.jetty.servlet.ServletHandler$CachedChain.doFilter(ServletHandler.java:1668)
	at org.apache.solr.client.solrj.embedded.JettySolrRunner$DebugFilter.doFilter(JettySolrRunner.java:109)
	at org.eclipse.jetty.servlet.ServletHandler$CachedChain.doFilter(ServletHandler.java:1668)
	at org.eclipse.jetty.servlet.ServletHandler.doHandle(ServletHandler.java:581)
	at org.eclipse.jetty.server.session.SessionHandler.doHandle(SessionHandler.java:224)
	at org.eclipse.jetty.server.handler.ContextHandler.doHandle(ContextHandler.java:1158)
	at org.eclipse.jetty.servlet.ServletHandler.doScope(ServletHandler.java:511)
	at org.eclipse.jetty.server.session.SessionHandler.doScope(SessionHandler.java:185)
	at org.eclipse.jetty.server.handler.ContextHandler.doScope(ContextHandler.java:1090)
	at org.eclipse.jetty.server.handler.ScopedHandler.handle(ScopedHandler.java:141)
	at org.eclipse.jetty.server.handler.gzip.GzipHandler.handle(GzipHandler.java:437)
	at org.eclipse.jetty.server.handler.HandlerWrapper.handle(HandlerWrapper.java:119)
	at org.eclipse.jetty.server.Server.handle(Server.java:517)
	at org.eclipse.jetty.server.HttpChannel.handle(HttpChannel.java:308)
	at org.eclipse.jetty.server.HttpConnection.onFillable(HttpConnection.java:242)
	at org.eclipse.jetty.io.AbstractConnection$ReadCallback.succeeded(AbstractConnection.java:261)
	at org.eclipse.jetty.io.FillInterest.fillable(FillInterest.java:95)
	at org.eclipse.jetty.io.SelectChannelEndPoint$2.run(SelectChannelEndPoint.java:75)
	at org.eclipse.jetty.util.thread.strategy.ExecuteProduceConsume.produceAndRun(ExecuteProduceConsume.java:213)
	at org.eclipse.jetty.util.thread.strategy.ExecuteProduceConsume.run(ExecuteProduceConsume.java:147)
	at org.eclipse.jetty.util.thread.QueuedThreadPool.runJob(QueuedThreadPool.java:654)
	at org.eclipse.jetty.util.thread.QueuedThreadPool$3.run(QueuedThreadPool.java:572)
	at java.lang.Thread.run(Thread.java:745)

	at __randomizedtesting.SeedInfo.seed([7A09376CAEEE6563:A2441A3B5933C0C3]:0)
	at org.apache.solr.client.solrj.impl.HttpSolrClient.executeMethod(HttpSolrClient.java:577)
	at org.apache.solr.client.solrj.impl.HttpSolrClient.request(HttpSolrClient.java:241)
	at org.apache.solr.client.solrj.impl.HttpSolrClient.request(HttpSolrClient.java:230)
	at org.apache.solr.client.solrj.SolrRequest.process(SolrRequest.java:149)
	at org.apache.solr.client.solrj.SolrRequest.process(SolrRequest.java:166)
	at org.apache.solr.handler.TestBlobHandler.createSystemCollection(TestBlobHandler.java:113)
	at org.apache.solr.core.TestDynamicLoading.testDynamicLoading(TestDynamicLoading.java:115)
	at sun.reflect.NativeMethodAccessorImpl.invoke0(Native Method)
	at sun.reflect.NativeMethodAccessorImpl.invoke(NativeMethodAccessorImpl.java:62)
	at sun.reflect.DelegatingMethodAccessorImpl.invoke(DelegatingMethodAccessorImpl.java:43)
	at java.lang.reflect.Method.invoke(Method.java:498)
	at com.carrotsearch.randomizedtesting.RandomizedRunner.invoke(RandomizedRunner.java:1764)
	at com.carrotsearch.randomizedtesting.RandomizedRunner$8.evaluate(RandomizedRunner.java:871)
	at com.carrotsearch.randomizedtesting.RandomizedRunner$9.evaluate(RandomizedRunner.java:907)
	at com.carrotsearch.randomizedtesting.RandomizedRunner$10.evaluate(RandomizedRunner.java:921)
	at org.apache.solr.BaseDistributedSearchTestCase$ShardsRepeatRule$ShardsFixedStatement.callStatement(BaseDistributedSearchTestCase.java:964)
	at org.apache.solr.BaseDistributedSearchTestCase$ShardsRepeatRule$ShardsStatement.evaluate(BaseDistributedSearchTestCase.java:939)
	at com.carrotsearch.randomizedtesting.rules.SystemPropertiesRestoreRule$1.evaluate(SystemPropertiesRestoreRule.java:57)
	at org.apache.lucene.util.TestRuleSetupTeardownChained$1.evaluate(TestRuleSetupTeardownChained.java:49)
	at org.apache.lucene.util.AbstractBeforeAfterRule$1.evaluate(AbstractBeforeAfterRule.java:45)
	at org.apache.lucene.util.TestRuleThreadAndTestName$1.evaluate(TestRuleThreadAndTestName.java:48)
	at org.apache.lucene.util.TestRuleIgnoreAfterMaxFailures$1.evaluate(TestRuleIgnoreAfterMaxFailures.java:64)
	at org.apache.lucene.util.TestRuleMarkFailure$1.evaluate(TestRuleMarkFailure.java:47)
	at com.carrotsearch.randomizedtesting.rules.StatementAdapter.evaluate(StatementAdapter.java:36)
	at com.carrotsearch.randomizedtesting.ThreadLeakControl$StatementRunner.run(ThreadLeakControl.java:367)
	at com.carrotsearch.randomizedtesting.ThreadLeakControl.forkTimeoutingTask(ThreadLeakControl.java:809)
	at com.carrotsearch.randomizedtesting.ThreadLeakControl$3.evaluate(ThreadLeakControl.java:460)
	at com.carrotsearch.randomizedtesting.RandomizedRunner.runSingleTest(RandomizedRunner.java:880)
	at com.carrotsearch.randomizedtesting.RandomizedRunner$5.evaluate(RandomizedRunner.java:781)
	at com.carrotsearch.randomizedtesting.RandomizedRunner$6.evaluate(RandomizedRunner.java:816)
	at com.carrotsearch.randomizedtesting.RandomizedRunner$7.evaluate(RandomizedRunner.java:827)
	at com.carrotsearch.randomizedtesting.rules.StatementAdapter.evaluate(StatementAdapter.java:36)
	at com.carrotsearch.randomizedtesting.rules.SystemPropertiesRestoreRule$1.evaluate(SystemPropertiesRestoreRule.java:57)
	at org.apache.lucene.util.AbstractBeforeAfterRule$1.evaluate(AbstractBeforeAfterRule.java:45)
	at com.carrotsearch.randomizedtesting.rules.StatementAdapter.evaluate(StatementAdapter.java:36)
	at org.apache.lucene.util.TestRuleStoreClassName$1.evaluate(TestRuleStoreClassName.java:41)
	at com.carrotsearch.randomizedtesting.rules.NoShadowingOrOverridesOnMethodsRule$1.evaluate(NoShadowingOrOverridesOnMethodsRule.java:40)
	at com.carrotsearch.randomizedtesting.rules.NoShadowingOrOverridesOnMethodsRule$1.evaluate(NoShadowingOrOverridesOnMethodsRule.java:40)
	at com.carrotsearch.randomizedtesting.rules.StatementAdapter.evaluate(StatementAdapter.java:36)
	at com.carrotsearch.randomizedtesting.rules.StatementAdapter.evaluate(StatementAdapter.java:36)
	at com.carrotsearch.randomizedtesting.rules.StatementAdapter.evaluate(StatementAdapter.java:36)
	at org.apache.lucene.util.TestRuleAssertionsRequired$1.evaluate(TestRuleAssertionsRequired.java:53)
	at org.apache.lucene.util.TestRuleMarkFailure$1.evaluate(TestRuleMarkFailure.java:47)
	at org.apache.lucene.util.TestRuleIgnoreAfterMaxFailures$1.evaluate(TestRuleIgnoreAfterMaxFailures.java:64)
	at org.apache.lucene.util.TestRuleIgnoreTestSuites$1.evaluate(TestRuleIgnoreTestSuites.java:54)
	at com.carrotsearch.randomizedtesting.rules.StatementAdapter.evaluate(StatementAdapter.java:36)
	at com.carrotsearch.randomizedtesting.ThreadLeakControl$StatementRunner.run(ThreadLeakControl.java:367)
	at java.lang.Thread.run(Thread.java:745)


FAILED:  org.apache.solr.handler.TestBlobHandler.doBlobHandlerTest

Error Message:
Error from server at http://127.0.0.1:53529/k_: java.lang.NullPointerException  at org.apache.commons.io.IOUtils.copyLarge(IOUtils.java:1792)  at org.apache.commons.io.IOUtils.copyLarge(IOUtils.java:1769)  at org.apache.commons.io.IOUtils.copy(IOUtils.java:1744)  at org.apache.commons.io.IOUtils.toByteArray(IOUtils.java:462)  at org.apache.solr.handler.admin.CollectionsHandler$CollectionOperation$1.createSysConfigSet(CollectionsHandler.java:385)  at org.apache.solr.handler.admin.CollectionsHandler$CollectionOperation$1.call(CollectionsHandler.java:366)  at org.apache.solr.handler.admin.CollectionsHandler.handleRequestBody(CollectionsHandler.java:188)  at org.apache.solr.handler.RequestHandlerBase.handleRequest(RequestHandlerBase.java:155)  at org.apache.solr.servlet.HttpSolrCall.handleAdminRequest(HttpSolrCall.java:655)  at org.apache.solr.servlet.HttpSolrCall.call(HttpSolrCall.java:438)  at org.apache.solr.servlet.SolrDispatchFilter.doFilter(SolrDispatchFilter.java:229)  at org.apache.solr.servlet.SolrDispatchFilter.doFilter(SolrDispatchFilter.java:184)  at org.eclipse.jetty.servlet.ServletHandler$CachedChain.doFilter(ServletHandler.java:1668)  at org.apache.solr.client.solrj.embedded.JettySolrRunner$DebugFilter.doFilter(JettySolrRunner.java:109)  at org.eclipse.jetty.servlet.ServletHandler$CachedChain.doFilter(ServletHandler.java:1668)  at org.eclipse.jetty.servlet.ServletHandler.doHandle(ServletHandler.java:581)  at org.eclipse.jetty.server.session.SessionHandler.doHandle(SessionHandler.java:224)  at org.eclipse.jetty.server.handler.ContextHandler.doHandle(ContextHandler.java:1158)  at org.eclipse.jetty.servlet.ServletHandler.doScope(ServletHandler.java:511)  at org.eclipse.jetty.server.session.SessionHandler.doScope(SessionHandler.java:185)  at org.eclipse.jetty.server.handler.ContextHandler.doScope(ContextHandler.java:1090)  at org.eclipse.jetty.server.handler.ScopedHandler.handle(ScopedHandler.java:141)  at org.eclipse.jetty.server.handler.gzip.GzipHandler.handle(GzipHandler.java:437)  at org.eclipse.jetty.server.handler.HandlerWrapper.handle(HandlerWrapper.java:119)  at org.eclipse.jetty.server.Server.handle(Server.java:517)  at org.eclipse.jetty.server.HttpChannel.handle(HttpChannel.java:308)  at org.eclipse.jetty.server.HttpConnection.onFillable(HttpConnection.java:242)  at org.eclipse.jetty.io.AbstractConnection$ReadCallback.succeeded(AbstractConnection.java:261)  at org.eclipse.jetty.io.FillInterest.fillable(FillInterest.java:95)  at org.eclipse.jetty.io.SelectChannelEndPoint$2.run(SelectChannelEndPoint.java:75)  at org.eclipse.jetty.util.thread.strategy.ExecuteProduceConsume.produceAndRun(ExecuteProduceConsume.java:213)  at org.eclipse.jetty.util.thread.strategy.ExecuteProduceConsume.run(ExecuteProduceConsume.java:147)  at org.eclipse.jetty.util.thread.QueuedThreadPool.runJob(QueuedThreadPool.java:654)  at org.eclipse.jetty.util.thread.QueuedThreadPool$3.run(QueuedThreadPool.java:572)  at java.lang.Thread.run(Thread.java:745) 

Stack Trace:
org.apache.solr.client.solrj.impl.HttpSolrClient$RemoteSolrException: Error from server at http://127.0.0.1:53529/k_: java.lang.NullPointerException
	at org.apache.commons.io.IOUtils.copyLarge(IOUtils.java:1792)
	at org.apache.commons.io.IOUtils.copyLarge(IOUtils.java:1769)
	at org.apache.commons.io.IOUtils.copy(IOUtils.java:1744)
	at org.apache.commons.io.IOUtils.toByteArray(IOUtils.java:462)
	at org.apache.solr.handler.admin.CollectionsHandler$CollectionOperation$1.createSysConfigSet(CollectionsHandler.java:385)
	at org.apache.solr.handler.admin.CollectionsHandler$CollectionOperation$1.call(CollectionsHandler.java:366)
	at org.apache.solr.handler.admin.CollectionsHandler.handleRequestBody(CollectionsHandler.java:188)
	at org.apache.solr.handler.RequestHandlerBase.handleRequest(RequestHandlerBase.java:155)
	at org.apache.solr.servlet.HttpSolrCall.handleAdminRequest(HttpSolrCall.java:655)
	at org.apache.solr.servlet.HttpSolrCall.call(HttpSolrCall.java:438)
	at org.apache.solr.servlet.SolrDispatchFilter.doFilter(SolrDispatchFilter.java:229)
	at org.apache.solr.servlet.SolrDispatchFilter.doFilter(SolrDispatchFilter.java:184)
	at org.eclipse.jetty.servlet.ServletHandler$CachedChain.doFilter(ServletHandler.java:1668)
	at org.apache.solr.client.solrj.embedded.JettySolrRunner$DebugFilter.doFilter(JettySolrRunner.java:109)
	at org.eclipse.jetty.servlet.ServletHandler$CachedChain.doFilter(ServletHandler.java:1668)
	at org.eclipse.jetty.servlet.ServletHandler.doHandle(ServletHandler.java:581)
	at org.eclipse.jetty.server.session.SessionHandler.doHandle(SessionHandler.java:224)
	at org.eclipse.jetty.server.handler.ContextHandler.doHandle(ContextHandler.java:1158)
	at org.eclipse.jetty.servlet.ServletHandler.doScope(ServletHandler.java:511)
	at org.eclipse.jetty.server.session.SessionHandler.doScope(SessionHandler.java:185)
	at org.eclipse.jetty.server.handler.ContextHandler.doScope(ContextHandler.java:1090)
	at org.eclipse.jetty.server.handler.ScopedHandler.handle(ScopedHandler.java:141)
	at org.eclipse.jetty.server.handler.gzip.GzipHandler.handle(GzipHandler.java:437)
	at org.eclipse.jetty.server.handler.HandlerWrapper.handle(HandlerWrapper.java:119)
	at org.eclipse.jetty.server.Server.handle(Server.java:517)
	at org.eclipse.jetty.server.HttpChannel.handle(HttpChannel.java:308)
	at org.eclipse.jetty.server.HttpConnection.onFillable(HttpConnection.java:242)
	at org.eclipse.jetty.io.AbstractConnection$ReadCallback.succeeded(AbstractConnection.java:261)
	at org.eclipse.jetty.io.FillInterest.fillable(FillInterest.java:95)
	at org.eclipse.jetty.io.SelectChannelEndPoint$2.run(SelectChannelEndPoint.java:75)
	at org.eclipse.jetty.util.thread.strategy.ExecuteProduceConsume.produceAndRun(ExecuteProduceConsume.java:213)
	at org.eclipse.jetty.util.thread.strategy.ExecuteProduceConsume.run(ExecuteProduceConsume.java:147)
	at org.eclipse.jetty.util.thread.QueuedThreadPool.runJob(QueuedThreadPool.java:654)
	at org.eclipse.jetty.util.thread.QueuedThreadPool$3.run(QueuedThreadPool.java:572)
	at java.lang.Thread.run(Thread.java:745)

	at __randomizedtesting.SeedInfo.seed([7A09376CAEEE6563:9AC8153E15021391]:0)
	at org.apache.solr.client.solrj.impl.HttpSolrClient.executeMethod(HttpSolrClient.java:577)
	at org.apache.solr.client.solrj.impl.HttpSolrClient.request(HttpSolrClient.java:241)
	at org.apache.solr.client.solrj.impl.HttpSolrClient.request(HttpSolrClient.java:230)
	at org.apache.solr.client.solrj.SolrRequest.process(SolrRequest.java:149)
	at org.apache.solr.client.solrj.SolrRequest.process(SolrRequest.java:166)
	at org.apache.solr.handler.TestBlobHandler.doBlobHandlerTest(TestBlobHandler.java:70)
	at sun.reflect.NativeMethodAccessorImpl.invoke0(Native Method)
	at sun.reflect.NativeMethodAccessorImpl.invoke(NativeMethodAccessorImpl.java:62)
	at sun.reflect.DelegatingMethodAccessorImpl.invoke(DelegatingMethodAccessorImpl.java:43)
	at java.lang.reflect.Method.invoke(Method.java:498)
	at com.carrotsearch.randomizedtesting.RandomizedRunner.invoke(RandomizedRunner.java:1764)
	at com.carrotsearch.randomizedtesting.RandomizedRunner$8.evaluate(RandomizedRunner.java:871)
	at com.carrotsearch.randomizedtesting.RandomizedRunner$9.evaluate(RandomizedRunner.java:907)
	at com.carrotsearch.randomizedtesting.RandomizedRunner$10.evaluate(RandomizedRunner.java:921)
	at org.apache.solr.BaseDistributedSearchTestCase$ShardsRepeatRule$ShardsFixedStatement.callStatement(BaseDistributedSearchTestCase.java:964)
	at org.apache.solr.BaseDistributedSearchTestCase$ShardsRepeatRule$ShardsStatement.evaluate(BaseDistributedSearchTestCase.java:939)
	at com.carrotsearch.randomizedtesting.rules.SystemPropertiesRestoreRule$1.evaluate(SystemPropertiesRestoreRule.java:57)
	at org.apache.lucene.util.TestRuleSetupTeardownChained$1.evaluate(TestRuleSetupTeardownChained.java:49)
	at org.apache.lucene.util.AbstractBeforeAfterRule$1.evaluate(AbstractBeforeAfterRule.java:45)
	at org.apache.lucene.util.TestRuleThreadAndTestName$1.evaluate(TestRuleThreadAndTestName.java:48)
	at org.apache.lucene.util.TestRuleIgnoreAfterMaxFailures$1.evaluate(TestRuleIgnoreAfterMaxFailures.java:64)
	at org.apache.lucene.util.TestRuleMarkFailure$1.evaluate(TestRuleMarkFailure.java:47)
	at com.carrotsearch.randomizedtesting.rules.StatementAdapter.evaluate(StatementAdapter.java:36)
	at com.carrotsearch.randomizedtesting.ThreadLeakControl$StatementRunner.run(ThreadLeakControl.java:367)
	at com.carrotsearch.randomizedtesting.ThreadLeakControl.forkTimeoutingTask(ThreadLeakControl.java:809)
	at com.carrotsearch.randomizedtesting.ThreadLeakControl$3.evaluate(ThreadLeakControl.java:460)
	at com.carrotsearch.randomizedtesting.RandomizedRunner.runSingleTest(RandomizedRunner.java:880)
	at com.carrotsearch.randomizedtesting.RandomizedRunner$5.evaluate(RandomizedRunner.java:781)
	at com.carrotsearch.randomizedtesting.RandomizedRunner$6.evaluate(RandomizedRunner.java:816)
	at com.carrotsearch.randomizedtesting.RandomizedRunner$7.evaluate(RandomizedRunner.java:827)
	at com.carrotsearch.randomizedtesting.rules.StatementAdapter.evaluate(StatementAdapter.java:36)
	at com.carrotsearch.randomizedtesting.rules.SystemPropertiesRestoreRule$1.evaluate(SystemPropertiesRestoreRule.java:57)
	at org.apache.lucene.util.AbstractBeforeAfterRule$1.evaluate(AbstractBeforeAfterRule.java:45)
	at com.carrotsearch.randomizedtesting.rules.StatementAdapter.evaluate(StatementAdapter.java:36)
	at org.apache.lucene.util.TestRuleStoreClassName$1.evaluate(TestRuleStoreClassName.java:41)
	at com.carrotsearch.randomizedtesting.rules.NoShadowingOrOverridesOnMethodsRule$1.evaluate(NoShadowingOrOverridesOnMethodsRule.java:40)
	at com.carrotsearch.randomizedtesting.rules.NoShadowingOrOverridesOnMethodsRule$1.evaluate(NoShadowingOrOverridesOnMethodsRule.java:40)
	at com.carrotsearch.randomizedtesting.rules.StatementAdapter.evaluate(StatementAdapter.java:36)
	at com.carrotsearch.randomizedtesting.rules.StatementAdapter.evaluate(StatementAdapter.java:36)
	at com.carrotsearch.randomizedtesting.rules.StatementAdapter.evaluate(StatementAdapter.java:36)
	at org.apache.lucene.util.TestRuleAssertionsRequired$1.evaluate(TestRuleAssertionsRequired.java:53)
	at org.apache.lucene.util.TestRuleMarkFailure$1.evaluate(TestRuleMarkFailure.java:47)
	at org.apache.lucene.util.TestRuleIgnoreAfterMaxFailures$1.evaluate(TestRuleIgnoreAfterMaxFailures.java:64)
	at org.apache.lucene.util.TestRuleIgnoreTestSuites$1.evaluate(TestRuleIgnoreTestSuites.java:54)
	at com.carrotsearch.randomizedtesting.rules.StatementAdapter.evaluate(StatementAdapter.java:36)
	at com.carrotsearch.randomizedtesting.ThreadLeakControl$StatementRunner.run(ThreadLeakControl.java:367)
	at java.lang.Thread.run(Thread.java:745)


FAILED:  org.apache.solr.update.processor.TestNamedUpdateProcessors.test

Error Message:
Error from server at https://127.0.0.1:35654/_/ke: java.lang.NullPointerException  at org.apache.commons.io.IOUtils.copyLarge(IOUtils.java:1792)  at org.apache.commons.io.IOUtils.copyLarge(IOUtils.java:1769)  at org.apache.commons.io.IOUtils.copy(IOUtils.java:1744)  at org.apache.commons.io.IOUtils.toByteArray(IOUtils.java:462)  at org.apache.solr.handler.admin.CollectionsHandler$CollectionOperation$1.createSysConfigSet(CollectionsHandler.java:385)  at org.apache.solr.handler.admin.CollectionsHandler$CollectionOperation$1.call(CollectionsHandler.java:366)  at org.apache.solr.handler.admin.CollectionsHandler.handleRequestBody(CollectionsHandler.java:188)  at org.apache.solr.handler.RequestHandlerBase.handleRequest(RequestHandlerBase.java:155)  at org.apache.solr.servlet.HttpSolrCall.handleAdminRequest(HttpSolrCall.java:655)  at org.apache.solr.servlet.HttpSolrCall.call(HttpSolrCall.java:438)  at org.apache.solr.servlet.SolrDispatchFilter.doFilter(SolrDispatchFilter.java:229)  at org.apache.solr.servlet.SolrDispatchFilter.doFilter(SolrDispatchFilter.java:184)  at org.eclipse.jetty.servlet.ServletHandler$CachedChain.doFilter(ServletHandler.java:1668)  at org.apache.solr.client.solrj.embedded.JettySolrRunner$DebugFilter.doFilter(JettySolrRunner.java:109)  at org.eclipse.jetty.servlet.ServletHandler$CachedChain.doFilter(ServletHandler.java:1668)  at org.eclipse.jetty.servlet.ServletHandler.doHandle(ServletHandler.java:581)  at org.eclipse.jetty.server.session.SessionHandler.doHandle(SessionHandler.java:224)  at org.eclipse.jetty.server.handler.ContextHandler.doHandle(ContextHandler.java:1158)  at org.eclipse.jetty.servlet.ServletHandler.doScope(ServletHandler.java:511)  at org.eclipse.jetty.server.session.SessionHandler.doScope(SessionHandler.java:185)  at org.eclipse.jetty.server.handler.ContextHandler.doScope(ContextHandler.java:1090)  at org.eclipse.jetty.server.handler.ScopedHandler.handle(ScopedHandler.java:141)  at org.eclipse.jetty.server.handler.gzip.GzipHandler.handle(GzipHandler.java:437)  at org.eclipse.jetty.server.handler.HandlerWrapper.handle(HandlerWrapper.java:119)  at org.eclipse.jetty.server.Server.handle(Server.java:517)  at org.eclipse.jetty.server.HttpChannel.handle(HttpChannel.java:308)  at org.eclipse.jetty.server.HttpConnection.onFillable(HttpConnection.java:242)  at org.eclipse.jetty.io.AbstractConnection$ReadCallback.succeeded(AbstractConnection.java:261)  at org.eclipse.jetty.io.FillInterest.fillable(FillInterest.java:95)  at org.eclipse.jetty.io.ssl.SslConnection.onFillable(SslConnection.java:192)  at org.eclipse.jetty.io.AbstractConnection$ReadCallback.succeeded(AbstractConnection.java:261)  at org.eclipse.jetty.io.FillInterest.fillable(FillInterest.java:95)  at org.eclipse.jetty.io.SelectChannelEndPoint$2.run(SelectChannelEndPoint.java:75)  at org.eclipse.jetty.util.thread.strategy.ExecuteProduceConsume.produceAndRun(ExecuteProduceConsume.java:213)  at org.eclipse.jetty.util.thread.strategy.ExecuteProduceConsume.run(ExecuteProduceConsume.java:147)  at org.eclipse.jetty.util.thread.QueuedThreadPool.runJob(QueuedThreadPool.java:654)  at org.eclipse.jetty.util.thread.QueuedThreadPool$3.run(QueuedThreadPool.java:572)  at java.lang.Thread.run(Thread.java:745) 

Stack Trace:
org.apache.solr.client.solrj.impl.HttpSolrClient$RemoteSolrException: Error from server at https://127.0.0.1:35654/_/ke: java.lang.NullPointerException
	at org.apache.commons.io.IOUtils.copyLarge(IOUtils.java:1792)
	at org.apache.commons.io.IOUtils.copyLarge(IOUtils.java:1769)
	at org.apache.commons.io.IOUtils.copy(IOUtils.java:1744)
	at org.apache.commons.io.IOUtils.toByteArray(IOUtils.java:462)
	at org.apache.solr.handler.admin.CollectionsHandler$CollectionOperation$1.createSysConfigSet(CollectionsHandler.java:385)
	at org.apache.solr.handler.admin.CollectionsHandler$CollectionOperation$1.call(CollectionsHandler.java:366)
	at org.apache.solr.handler.admin.CollectionsHandler.handleRequestBody(CollectionsHandler.java:188)
	at org.apache.solr.handler.RequestHandlerBase.handleRequest(RequestHandlerBase.java:155)
	at org.apache.solr.servlet.HttpSolrCall.handleAdminRequest(HttpSolrCall.java:655)
	at org.apache.solr.servlet.HttpSolrCall.call(HttpSolrCall.java:438)
	at org.apache.solr.servlet.SolrDispatchFilter.doFilter(SolrDispatchFilter.java:229)
	at org.apache.solr.servlet.SolrDispatchFilter.doFilter(SolrDispatchFilter.java:184)
	at org.eclipse.jetty.servlet.ServletHandler$CachedChain.doFilter(ServletHandler.java:1668)
	at org.apache.solr.client.solrj.embedded.JettySolrRunner$DebugFilter.doFilter(JettySolrRunner.java:109)
	at org.eclipse.jetty.servlet.ServletHandler$CachedChain.doFilter(ServletHandler.java:1668)
	at org.eclipse.jetty.servlet.ServletHandler.doHandle(ServletHandler.java:581)
	at org.eclipse.jetty.server.session.SessionHandler.doHandle(SessionHandler.java:224)
	at org.eclipse.jetty.server.handler.ContextHandler.doHandle(ContextHandler.java:1158)
	at org.eclipse.jetty.servlet.ServletHandler.doScope(ServletHandler.java:511)
	at org.eclipse.jetty.server.session.SessionHandler.doScope(SessionHandler.java:185)
	at org.eclipse.jetty.server.handler.ContextHandler.doScope(ContextHandler.java:1090)
	at org.eclipse.jetty.server.handler.ScopedHandler.handle(ScopedHandler.java:141)
	at org.eclipse.jetty.server.handler.gzip.GzipHandler.handle(GzipHandler.java:437)
	at org.eclipse.jetty.server.handler.HandlerWrapper.handle(HandlerWrapper.java:119)
	at org.eclipse.jetty.server.Server.handle(Server.java:517)
	at org.eclipse.jetty.server.HttpChannel.handle(HttpChannel.java:308)
	at org.eclipse.jetty.server.HttpConnection.onFillable(HttpConnection.java:242)
	at org.eclipse.jetty.io.AbstractConnection$ReadCallback.succeeded(AbstractConnection.java:261)
	at org.eclipse.jetty.io.FillInterest.fillable(FillInterest.java:95)
	at org.eclipse.jetty.io.ssl.SslConnection.onFillable(SslConnection.java:192)
	at org.eclipse.jetty.io.AbstractConnection$ReadCallback.succeeded(AbstractConnection.java:261)
	at org.eclipse.jetty.io.FillInterest.fillable(FillInterest.java:95)
	at org.eclipse.jetty.io.SelectChannelEndPoint$2.run(SelectChannelEndPoint.java:75)
	at org.eclipse.jetty.util.thread.strategy.ExecuteProduceConsume.produceAndRun(ExecuteProduceConsume.java:213)
	at org.eclipse.jetty.util.thread.strategy.ExecuteProduceConsume.run(ExecuteProduceConsume.java:147)
	at org.eclipse.jetty.util.thread.QueuedThreadPool.runJob(QueuedThreadPool.java:654)
	at org.eclipse.jetty.util.thread.QueuedThreadPool$3.run(QueuedThreadPool.java:572)
	at java.lang.Thread.run(Thread.java:745)

	at __randomizedtesting.SeedInfo.seed([7A09376CAEEE6563:F25D08B60012089B]:0)
	at org.apache.solr.client.solrj.impl.HttpSolrClient.executeMethod(HttpSolrClient.java:577)
	at org.apache.solr.client.solrj.impl.HttpSolrClient.request(HttpSolrClient.java:241)
	at org.apache.solr.client.solrj.impl.HttpSolrClient.request(HttpSolrClient.java:230)
	at org.apache.solr.client.solrj.SolrRequest.process(SolrRequest.java:149)
	at org.apache.solr.client.solrj.SolrRequest.process(SolrRequest.java:166)
	at org.apache.solr.handler.TestBlobHandler.createSystemCollection(TestBlobHandler.java:113)
	at org.apache.solr.update.processor.TestNamedUpdateProcessors.test(TestNamedUpdateProcessors.java:81)
	at sun.reflect.NativeMethodAccessorImpl.invoke0(Native Method)
	at sun.reflect.NativeMethodAccessorImpl.invoke(NativeMethodAccessorImpl.java:62)
	at sun.reflect.DelegatingMethodAccessorImpl.invoke(DelegatingMethodAccessorImpl.java:43)
	at java.lang.reflect.Method.invoke(Method.java:498)
	at com.carrotsearch.randomizedtesting.RandomizedRunner.invoke(RandomizedRunner.java:1764)
	at com.carrotsearch.randomizedtesting.RandomizedRunner$8.evaluate(RandomizedRunner.java:871)
	at com.carrotsearch.randomizedtesting.RandomizedRunner$9.evaluate(RandomizedRunner.java:907)
	at com.carrotsearch.randomizedtesting.RandomizedRunner$10.evaluate(RandomizedRunner.java:921)
	at org.apache.solr.BaseDistributedSearchTestCase$ShardsRepeatRule$ShardsFixedStatement.callStatement(BaseDistributedSearchTestCase.java:964)
	at org.apache.solr.BaseDistributedSearchTestCase$ShardsRepeatRule$ShardsStatement.evaluate(BaseDistributedSearchTestCase.java:939)
	at com.carrotsearch.randomizedtesting.rules.SystemPropertiesRestoreRule$1.evaluate(SystemPropertiesRestoreRule.java:57)
	at org.apache.lucene.util.TestRuleSetupTeardownChained$1.evaluate(TestRuleSetupTeardownChained.java:49)
	at org.apache.lucene.util.AbstractBeforeAfterRule$1.evaluate(AbstractBeforeAfterRule.java:45)
	at org.apache.lucene.util.TestRuleThreadAndTestName$1.evaluate(TestRuleThreadAndTestName.java:48)
	at org.apache.lucene.util.TestRuleIgnoreAfterMaxFailures$1.evaluate(TestRuleIgnoreAfterMaxFailures.java:64)
	at org.apache.lucene.util.TestRuleMarkFailure$1.evaluate(TestRuleMarkFailure.java:47)
	at com.carrotsearch.randomizedtesting.rules.StatementAdapter.evaluate(StatementAdapter.java:36)
	at com.carrotsearch.randomizedtesting.ThreadLeakControl$StatementRunner.run(ThreadLeakControl.java:367)
	at com.carrotsearch.randomizedtesting.ThreadLeakControl.forkTimeoutingTask(ThreadLeakControl.java:809)
	at com.carrotsearch.randomizedtesting.ThreadLeakControl$3.evaluate(ThreadLeakControl.java:460)
	at com.carrotsearch.randomizedtesting.RandomizedRunner.runSingleTest(RandomizedRunner.java:880)
	at com.carrotsearch.randomizedtesting.RandomizedRunner$5.evaluate(RandomizedRunner.java:781)
	at com.carrotsearch.randomizedtesting.RandomizedRunner$6.evaluate(RandomizedRunner.java:816)
	at com.carrotsearch.randomizedtesting.RandomizedRunner$7.evaluate(RandomizedRunner.java:827)
	at com.carrotsearch.randomizedtesting.rules.StatementAdapter.evaluate(StatementAdapter.java:36)
	at com.carrotsearch.randomizedtesting.rules.SystemPropertiesRestoreRule$1.evaluate(SystemPropertiesRestoreRule.java:57)
	at org.apache.lucene.util.AbstractBeforeAfterRule$1.evaluate(AbstractBeforeAfterRule.java:45)
	at com.carrotsearch.randomizedtesting.rules.StatementAdapter.evaluate(StatementAdapter.java:36)
	at org.apache.lucene.util.TestRuleStoreClassName$1.evaluate(TestRuleStoreClassName.java:41)
	at com.carrotsearch.randomizedtesting.rules.NoShadowingOrOverridesOnMethodsRule$1.evaluate(NoShadowingOrOverridesOnMethodsRule.java:40)
	at com.carrotsearch.randomizedtesting.rules.NoShadowingOrOverridesOnMethodsRule$1.evaluate(NoShadowingOrOverridesOnMethodsRule.java:40)
	at com.carrotsearch.randomizedtesting.rules.StatementAdapter.evaluate(StatementAdapter.java:36)
	at com.carrotsearch.randomizedtesting.rules.StatementAdapter.evaluate(StatementAdapter.java:36)
	at com.carrotsearch.randomizedtesting.rules.StatementAdapter.evaluate(StatementAdapter.java:36)
	at org.apache.lucene.util.TestRuleAssertionsRequired$1.evaluate(TestRuleAssertionsRequired.java:53)
	at org.apache.lucene.util.TestRuleMarkFailure$1.evaluate(TestRuleMarkFailure.java:47)
	at org.apache.lucene.util.TestRuleIgnoreAfterMaxFailures$1.evaluate(TestRuleIgnoreAfterMaxFailures.java:64)
	at org.apache.lucene.util.TestRuleIgnoreTestSuites$1.evaluate(TestRuleIgnoreTestSuites.java:54)
	at com.carrotsearch.randomizedtesting.rules.StatementAdapter.evaluate(StatementAdapter.java:36)
	at com.carrotsearch.randomizedtesting.ThreadLeakControl$StatementRunner.run(ThreadLeakControl.java:367)
	at java.lang.Thread.run(Thread.java:745)




Build Log:
[...truncated 10328 lines...]
   [junit4] Suite: org.apache.solr.cloud.TestCryptoKeys
   [junit4]   2> Creating dataDir: /export/home/jenkins/workspace/Lucene-Solr-trunk-Solaris/solr/build/solr-core/test/J0/temp/solr.cloud.TestCryptoKeys_7A09376CAEEE6563-001/init-core-data-001
   [junit4]   2> 91076 INFO  (SUITE-TestCryptoKeys-seed#[7A09376CAEEE6563]-worker) [    ] o.a.s.SolrTestCaseJ4 Randomized ssl (false) and clientAuth (false)
   [junit4]   2> 91076 INFO  (SUITE-TestCryptoKeys-seed#[7A09376CAEEE6563]-worker) [    ] o.a.s.BaseDistributedSearchTestCase Setting hostContext system property: /_/b
   [junit4]   2> 91115 INFO  (TEST-TestCryptoKeys.test-seed#[7A09376CAEEE6563]) [    ] o.a.s.c.ZkTestServer STARTING ZK TEST SERVER
   [junit4]   2> 91115 INFO  (Thread-79) [    ] o.a.s.c.ZkTestServer client port:0.0.0.0/0.0.0.0:0
   [junit4]   2> 91115 INFO  (Thread-79) [    ] o.a.s.c.ZkTestServer Starting server
   [junit4]   2> 91216 INFO  (TEST-TestCryptoKeys.test-seed#[7A09376CAEEE6563]) [    ] o.a.s.c.ZkTestServer start zk server on port:55878
   [junit4]   2> 91216 INFO  (TEST-TestCryptoKeys.test-seed#[7A09376CAEEE6563]) [    ] o.a.s.c.c.SolrZkClient Using default ZkCredentialsProvider
   [junit4]   2> 91216 INFO  (TEST-TestCryptoKeys.test-seed#[7A09376CAEEE6563]) [    ] o.a.s.c.c.ConnectionManager Waiting for client to connect to ZooKeeper
   [junit4]   2> 91220 INFO  (zkCallback-37-thread-1) [    ] o.a.s.c.c.ConnectionManager Watcher org.apache.solr.common.cloud.ConnectionManager@216c6732 name:ZooKeeperConnection Watcher:127.0.0.1:55878 got event WatchedEvent state:SyncConnected type:None path:null path:null type:None
   [junit4]   2> 91221 INFO  (TEST-TestCryptoKeys.test-seed#[7A09376CAEEE6563]) [    ] o.a.s.c.c.ConnectionManager Client is connected to ZooKeeper
   [junit4]   2> 91221 INFO  (TEST-TestCryptoKeys.test-seed#[7A09376CAEEE6563]) [    ] o.a.s.c.c.SolrZkClient Using default ZkACLProvider
   [junit4]   2> 91221 INFO  (TEST-TestCryptoKeys.test-seed#[7A09376CAEEE6563]) [    ] o.a.s.c.c.SolrZkClient makePath: /solr
   [junit4]   2> 91242 INFO  (TEST-TestCryptoKeys.test-seed#[7A09376CAEEE6563]) [    ] o.a.s.c.c.SolrZkClient Using default ZkCredentialsProvider
   [junit4]   2> 91242 INFO  (TEST-TestCryptoKeys.test-seed#[7A09376CAEEE6563]) [    ] o.a.s.c.c.ConnectionManager Waiting for client to connect to ZooKeeper
   [junit4]   2> 91244 INFO  (zkCallback-38-thread-1) [    ] o.a.s.c.c.ConnectionManager Watcher org.apache.solr.common.cloud.ConnectionManager@1a6108db name:ZooKeeperConnection Watcher:127.0.0.1:55878/solr got event WatchedEvent state:SyncConnected type:None path:null path:null type:None
   [junit4]   2> 91244 INFO  (TEST-TestCryptoKeys.test-seed#[7A09376CAEEE6563]) [    ] o.a.s.c.c.ConnectionManager Client is connected to ZooKeeper
   [junit4]   2> 91244 INFO  (TEST-TestCryptoKeys.test-seed#[7A09376CAEEE6563]) [    ] o.a.s.c.c.SolrZkClient Using default ZkACLProvider
   [junit4]   2> 91244 INFO  (TEST-TestCryptoKeys.test-seed#[7A09376CAEEE6563]) [    ] o.a.s.c.c.SolrZkClient makePath: /collections/collection1
   [junit4]   2> 91247 INFO  (TEST-TestCryptoKeys.test-seed#[7A09376CAEEE6563]) [    ] o.a.s.c.c.SolrZkClient makePath: /collections/collection1/shards
   [junit4]   2> 91251 INFO  (TEST-TestCryptoKeys.test-seed#[7A09376CAEEE6563]) [    ] o.a.s.c.c.SolrZkClient makePath: /collections/control_collection
   [junit4]   2> 91253 INFO  (TEST-TestCryptoKeys.test-seed#[7A09376CAEEE6563]) [    ] o.a.s.c.c.SolrZkClient makePath: /collections/control_collection/shards
   [junit4]   2> 91255 INFO  (TEST-TestCryptoKeys.test-seed#[7A09376CAEEE6563]) [    ] o.a.s.c.AbstractZkTestCase put /export/home/jenkins/workspace/Lucene-Solr-trunk-Solaris/solr/core/src/test-files/solr/collection1/conf/solrconfig-tlog.xml to /configs/conf1/solrconfig.xml
   [junit4]   2> 91256 INFO  (TEST-TestCryptoKeys.test-seed#[7A09376CAEEE6563]) [    ] o.a.s.c.c.SolrZkClient makePath: /configs/conf1/solrconfig.xml
   [junit4]   2> 91261 INFO  (TEST-TestCryptoKeys.test-seed#[7A09376CAEEE6563]) [    ] o.a.s.c.AbstractZkTestCase put /export/home/jenkins/workspace/Lucene-Solr-trunk-Solaris/solr/core/src/test-files/solr/collection1/conf/schema.xml to /configs/conf1/schema.xml
   [junit4]   2> 91261 INFO  (TEST-TestCryptoKeys.test-seed#[7A09376CAEEE6563]) [    ] o.a.s.c.c.SolrZkClient makePath: /configs/conf1/schema.xml
   [junit4]   2> 91263 INFO  (TEST-TestCryptoKeys.test-seed#[7A09376CAEEE6563]) [    ] o.a.s.c.AbstractZkTestCase put /export/home/jenkins/workspace/Lucene-Solr-trunk-Solaris/solr/core/src/test-files/solr/collection1/conf/solrconfig.snippet.randomindexconfig.xml to /configs/conf1/solrconfig.snippet.randomindexconfig.xml
   [junit4]   2> 91264 INFO  (TEST-TestCryptoKeys.test-seed#[7A09376CAEEE6563]) [    ] o.a.s.c.c.SolrZkClient makePath: /configs/conf1/solrconfig.snippet.randomindexconfig.xml
   [junit4]   2> 91266 INFO  (TEST-TestCryptoKeys.test-seed#[7A09376CAEEE6563]) [    ] o.a.s.c.AbstractZkTestCase put /export/home/jenkins/workspace/Lucene-Solr-trunk-Solaris/solr/core/src/test-files/solr/collection1/conf/stopwords.txt to /configs/conf1/stopwords.txt
   [junit4]   2> 91266 INFO  (TEST-TestCryptoKeys.test-seed#[7A09376CAEEE6563]) [    ] o.a.s.c.c.SolrZkClient makePath: /configs/conf1/stopwords.txt
   [junit4]   2> 91269 INFO  (TEST-TestCryptoKeys.test-seed#[7A09376CAEEE6563]) [    ] o.a.s.c.AbstractZkTestCase put /export/home/jenkins/workspace/Lucene-Solr-trunk-Solaris/solr/core/src/test-files/solr/collection1/conf/protwords.txt to /configs/conf1/protwords.txt
   [junit4]   2> 91269 INFO  (TEST-TestCryptoKeys.test-seed#[7A09376CAEEE6563]) [    ] o.a.s.c.c.SolrZkClient makePath: /configs/conf1/protwords.txt
   [junit4]   2> 91271 INFO  (TEST-TestCryptoKeys.test-seed#[7A09376CAEEE6563]) [    ] o.a.s.c.AbstractZkTestCase put /export/home/jenkins/workspace/Lucene-Solr-trunk-Solaris/solr/core/src/test-files/solr/collection1/conf/currency.xml to /configs/conf1/currency.xml
   [junit4]   2> 91271 INFO  (TEST-TestCryptoKeys.test-seed#[7A09376CAEEE6563]) [    ] o.a.s.c.c.SolrZkClient makePath: /configs/conf1/currency.xml
   [junit4]   2> 91275 INFO  (TEST-TestCryptoKeys.test-seed#[7A09376CAEEE6563]) [    ] o.a.s.c.AbstractZkTestCase put /export/home/jenkins/workspace/Lucene-Solr-trunk-Solaris/solr/core/src/test-files/solr/collection1/conf/enumsConfig.xml to /configs/conf1/enumsConfig.xml
   [junit4]   2> 91275 INFO  (TEST-TestCryptoKeys.test-seed#[7A09376CAEEE6563]) [    ] o.a.s.c.c.SolrZkClient makePath: /configs/conf1/enumsConfig.xml
   [junit4]   2> 91278 INFO  (TEST-TestCryptoKeys.test-seed#[7A09376CAEEE6563]) [    ] o.a.s.c.AbstractZkTestCase put /export/home/jenkins/workspace/Lucene-Solr-trunk-Solaris/solr/core/src/test-files/solr/collection1/conf/open-exchange-rates.json to /configs/conf1/open-exchange-rates.json
   [junit4]   2> 91278 INFO  (TEST-TestCryptoKeys.test-seed#[7A09376CAEEE6563]) [    ] o.a.s.c.c.SolrZkClient makePath: /configs/conf1/open-exchange-rates.json
   [junit4]   2> 91281 INFO  (TEST-TestCryptoKeys.test-seed#[7A09376CAEEE6563]) [    ] o.a.s.c.AbstractZkTestCase put /export/home/jenkins/workspace/Lucene-Solr-trunk-Solaris/solr/core/src/test-files/solr/collection1/conf/mapping-ISOLatin1Accent.txt to /configs/conf1/mapping-ISOLatin1Accent.txt
   [junit4]   2> 91281 INFO  (TEST-TestCryptoKeys.test-seed#[7A09376CAEEE6563]) [    ] o.a.s.c.c.SolrZkClient makePath: /configs/conf1/mapping-ISOLatin1Accent.txt
   [junit4]   2> 91283 INFO  (TEST-TestCryptoKeys.test-seed#[7A09376CAEEE6563]) [    ] o.a.s.c.AbstractZkTestCase put /export/home/jenkins/workspace/Lucene-Solr-trunk-Solaris/solr/core/src/test-files/solr/collection1/conf/old_synonyms.txt to /configs/conf1/old_synonyms.txt
   [junit4]   2> 91283 INFO  (TEST-TestCryptoKeys.test-seed#[7A09376CAEEE6563]) [    ] o.a.s.c.c.SolrZkClient makePath: /configs/conf1/old_synonyms.txt
   [junit4]   2> 91287 INFO  (TEST-TestCryptoKeys.test-seed#[7A09376CAEEE6563]) [    ] o.a.s.c.AbstractZkTestCase put /export/home/jenkins/workspace/Lucene-Solr-trunk-Solaris/solr/core/src/test-files/solr/collection1/conf/synonyms.txt to /configs/conf1/synonyms.txt
   [junit4]   2> 91287 INFO  (TEST-TestCryptoKeys.test-seed#[7A09376CAEEE6563]) [    ] o.a.s.c.c.SolrZkClient makePath: /configs/conf1/synonyms.txt
   [junit4]   2> 91563 INFO  (TEST-TestCryptoKeys.test-seed#[7A09376CAEEE6563]) [    ] o.a.s.SolrTestCaseJ4 Writing core.properties file to /export/home/jenkins/workspace/Lucene-Solr-trunk-Solaris/solr/build/solr-core/test/J0/temp/solr.cloud.TestCryptoKeys_7A09376CAEEE6563-001/control-001/cores/collection1
   [junit4]   2> 91565 INFO  (TEST-TestCryptoKeys.test-seed#[7A09376CAEEE6563]) [    ] o.e.j.s.Server jetty-9.3.6.v20151106
   [junit4]   2> 91566 INFO  (TEST-TestCryptoKeys.test-seed#[7A09376CAEEE6563]) [    ] o.e.j.s.h.ContextHandler Started o.e.j.s.ServletContextHandler@6c288b6f{/_/b,null,AVAILABLE}
   [junit4]   2> 91568 INFO  (TEST-TestCryptoKeys.test-seed#[7A09376CAEEE6563]) [    ] o.e.j.s.ServerConnector Started ServerConnector@3f8ec7cc{HTTP/1.1,[http/1.1]}{127.0.0.1:61799}
   [junit4]   2> 91568 INFO  (TEST-TestCryptoKeys.test-seed#[7A09376CAEEE6563]) [    ] o.e.j.s.Server Started @95027ms
   [junit4]   2> 91568 INFO  (TEST-TestCryptoKeys.test-seed#[7A09376CAEEE6563]) [    ] o.a.s.c.s.e.JettySolrRunner Jetty properties: {solr.data.dir=/export/home/jenkins/workspace/Lucene-Solr-trunk-Solaris/solr/build/solr-core/test/J0/temp/solr.cloud.TestCryptoKeys_7A09376CAEEE6563-001/tempDir-001/control/data, hostContext=/_/b, hostPort=61799, coreRootDirectory=/export/home/jenkins/workspace/Lucene-Solr-trunk-Solaris/solr/build/solr-core/test/J0/temp/solr.cloud.TestCryptoKeys_7A09376CAEEE6563-001/control-001/cores}
   [junit4]   2> 91568 INFO  (TEST-TestCryptoKeys.test-seed#[7A09376CAEEE6563]) [    ] o.a.s.s.SolrDispatchFilter SolrDispatchFilter.init(): sun.misc.Launcher$AppClassLoader@6d06d69c
   [junit4]   2> 91568 INFO  (TEST-TestCryptoKeys.test-seed#[7A09376CAEEE6563]) [    ] o.a.s.c.SolrResourceLoader new SolrResourceLoader for directory: '/export/home/jenkins/workspace/Lucene-Solr-trunk-Solaris/solr/build/solr-core/test/J0/temp/solr.cloud.TestCryptoKeys_7A09376CAEEE6563-001/control-001'
   [junit4]   2> 91569 INFO  (TEST-TestCryptoKeys.test-seed#[7A09376CAEEE6563]) [    ] o.a.s.c.SolrResourceLoader JNDI not configured for solr (NoInitialContextEx)
   [junit4]   2> 91569 INFO  (TEST-TestCryptoKeys.test-seed#[7A09376CAEEE6563]) [    ] o.a.s.c.SolrResourceLoader solr home defaulted to 'solr/' (could not find system property or JNDI)
   [junit4]   2> 91569 INFO  (TEST-TestCryptoKeys.test-seed#[7A09376CAEEE6563]) [    ] o.a.s.c.c.SolrZkClient Using default ZkCredentialsProvider
   [junit4]   2> 91570 INFO  (TEST-TestCryptoKeys.test-seed#[7A09376CAEEE6563]) [    ] o.a.s.c.c.ConnectionManager Waiting for client to connect to ZooKeeper
   [junit4]   2> 91683 INFO  (zkCallback-39-thread-1) [    ] o.a.s.c.c.ConnectionManager Watcher org.apache.solr.common.cloud.ConnectionManager@3d7925a3 name:ZooKeeperConnection Watcher:127.0.0.1:55878/solr got event WatchedEvent state:SyncConnected type:None path:null path:null type:None
   [junit4]   2> 91683 INFO  (TEST-TestCryptoKeys.test-seed#[7A09376CAEEE6563]) [    ] o.a.s.c.c.ConnectionManager Client is connected to ZooKeeper
   [junit4]   2> 91683 INFO  (TEST-TestCryptoKeys.test-seed#[7A09376CAEEE6563]) [    ] o.a.s.c.c.SolrZkClient Using default ZkACLProvider
   [junit4]   2> 91693 INFO  (TEST-TestCryptoKeys.test-seed#[7A09376CAEEE6563]) [    ] o.a.s.s.SolrDispatchFilter Loading solr.xml from SolrHome (not found in ZooKeeper)
   [junit4]   2> 91693 INFO  (TEST-TestCryptoKeys.test-seed#[7A09376CAEEE6563]) [    ] o.a.s.c.SolrXmlConfig Loading container configuration from /export/home/jenkins/workspace/Lucene-Solr-trunk-Solaris/solr/build/solr-core/test/J0/temp/solr.cloud.TestCryptoKeys_7A09376CAEEE6563-001/control-001/solr.xml
   [junit4]   2> 91704 INFO  (TEST-TestCryptoKeys.test-seed#[7A09376CAEEE6563]) [    ] o.a.s.c.CorePropertiesLocator Config-defined core root directory: /export/home/jenkins/workspace/Lucene-Solr-trunk-Solaris/solr/build/solr-core/test/J0/temp/solr.cloud.TestCryptoKeys_7A09376CAEEE6563-001/control-001/cores
   [junit4]   2> 91704 INFO  (TEST-TestCryptoKeys.test-seed#[7A09376CAEEE6563]) [    ] o.a.s.c.CoreContainer New CoreContainer 1148196385
   [junit4]   2> 91704 INFO  (TEST-TestCryptoKeys.test-seed#[7A09376CAEEE6563]) [    ] o.a.s.c.CoreContainer Loading cores into CoreContainer [instanceDir=/export/home/jenkins/workspace/Lucene-Solr-trunk-Solaris/solr/build/solr-core/test/J0/temp/solr.cloud.TestCryptoKeys_7A09376CAEEE6563-001/control-001]
   [junit4]   2> 91704 WARN  (TEST-TestCryptoKeys.test-seed#[7A09376CAEEE6563]) [    ] o.a.s.c.CoreContainer Couldn't add files from /export/home/jenkins/workspace/Lucene-Solr-trunk-Solaris/solr/build/solr-core/test/J0/temp/solr.cloud.TestCryptoKeys_7A09376CAEEE6563-001/control-001/lib to classpath: /export/home/jenkins/workspace/Lucene-Solr-trunk-Solaris/solr/build/solr-core/test/J0/temp/solr.cloud.TestCryptoKeys_7A09376CAEEE6563-001/control-001/lib
   [junit4]   2> 91705 INFO  (TEST-TestCryptoKeys.test-seed#[7A09376CAEEE6563]) [    ] o.a.s.h.c.HttpShardHandlerFactory created with socketTimeout : 90000,urlScheme : ,connTimeout : 15000,maxConnectionsPerHost : 20,maxConnections : 10000,corePoolSize : 0,maximumPoolSize : 2147483647,maxThreadIdleTime : 5,sizeOfQueue : -1,fairnessPolicy : false,useRetries : false,
   [junit4]   2> 91706 INFO  (TEST-TestCryptoKeys.test-seed#[7A09376CAEEE6563]) [    ] o.a.s.u.UpdateShardHandler Creating UpdateShardHandler HTTP client with params: socketTimeout=340000&connTimeout=45000&retry=true
   [junit4]   2> 91707 INFO  (TEST-TestCryptoKeys.test-seed#[7A09376CAEEE6563]) [    ] o.a.s.l.LogWatcher SLF4J impl is org.slf4j.impl.Log4jLoggerFactory
   [junit4]   2> 91707 INFO  (TEST-TestCryptoKeys.test-seed#[7A09376CAEEE6563]) [    ] o.a.s.l.LogWatcher Registering Log Listener [Log4j (org.slf4j.impl.Log4jLoggerFactory)]
   [junit4]   2> 91707 INFO  (TEST-TestCryptoKeys.test-seed#[7A09376CAEEE6563]) [    ] o.a.s.c.ZkContainer Zookeeper client=127.0.0.1:55878/solr
   [junit4]   2> 91707 INFO  (TEST-TestCryptoKeys.test-seed#[7A09376CAEEE6563]) [    ] o.a.s.c.ZkController zkHost includes chroot
   [junit4]   2> 91707 INFO  (TEST-TestCryptoKeys.test-seed#[7A09376CAEEE6563]) [    ] o.a.s.c.c.SolrZkClient Using default ZkCredentialsProvider
   [junit4]   2> 91707 INFO  (TEST-TestCryptoKeys.test-seed#[7A09376CAEEE6563]) [    ] o.a.s.c.c.ConnectionManager Waiting for client to connect to ZooKeeper
   [junit4]   2> 91723 INFO  (zkCallback-42-thread-1) [    ] o.a.s.c.c.ConnectionManager Watcher org.apache.solr.common.cloud.ConnectionManager@75213635 name:ZooKeeperConnection Watcher:127.0.0.1:55878 got event WatchedEvent state:SyncConnected type:None path:null path:null type:None
   [junit4]   2> 91728 INFO  (TEST-TestCryptoKeys.test-seed#[7A09376CAEEE6563]) [    ] o.a.s.c.c.ConnectionManager Client is connected to ZooKeeper
   [junit4]   2> 91728 INFO  (TEST-TestCryptoKeys.test-seed#[7A09376CAEEE6563]) [    ] o.a.s.c.c.SolrZkClient Using default ZkACLProvider
   [junit4]   2> 91762 INFO  (TEST-TestCryptoKeys.test-seed#[7A09376CAEEE6563]) [n:127.0.0.1:61799__%2Fb    ] o.a.s.c.c.ConnectionManager Waiting for client to connect to ZooKeeper
   [junit4]   2> 91778 INFO  (zkCallback-43-thread-1-processing-n:127.0.0.1:61799__%2Fb) [n:127.0.0.1:61799__%2Fb    ] o.a.s.c.c.ConnectionManager Watcher org.apache.solr.common.cloud.ConnectionManager@546c2680 name:ZooKeeperConnection Watcher:127.0.0.1:55878/solr got event WatchedEvent state:SyncConnected type:None path:null path:null type:None
   [junit4]   2> 91779 INFO  (TEST-TestCryptoKeys.test-seed#[7A09376CAEEE6563]) [n:127.0.0.1:61799__%2Fb    ] o.a.s.c.c.ConnectionManager Client is connected to ZooKeeper
   [junit4]   2> 91783 INFO  (TEST-TestCryptoKeys.test-seed#[7A09376CAEEE6563]) [n:127.0.0.1:61799__%2Fb    ] o.a.s.c.c.SolrZkClient makePath: /overseer/queue
   [junit4]   2> 91786 INFO  (TEST-TestCryptoKeys.test-seed#[7A09376CAEEE6563]) [n:127.0.0.1:61799__%2Fb    ] o.a.s.c.c.SolrZkClient makePath: /overseer/collection-queue-work
   [junit4]   2> 91807 INFO  (TEST-TestCryptoKeys.test-seed#[7A09376CAEEE6563]) [n:127.0.0.1:61799__%2Fb    ] o.a.s.c.c.SolrZkClient makePath: /overseer/collection-map-running
   [junit4]   2> 91810 INFO  (TEST-TestCryptoKeys.test-seed#[7A09376CAEEE6563]) [n:127.0.0.1:61799__%2Fb    ] o.a.s.c.c.SolrZkClient makePath: /overseer/collection-map-completed
   [junit4]   2> 91813 INFO  (TEST-TestCryptoKeys.test-seed#[7A09376CAEEE6563]) [n:127.0.0.1:61799__%2Fb    ] o.a.s.c.c.SolrZkClient makePath: /overseer/collection-map-failure
   [junit4]   2> 91816 INFO  (TEST-TestCryptoKeys.test-seed#[7A09376CAEEE6563]) [n:127.0.0.1:61799__%2Fb    ] o.a.s.c.c.SolrZkClient makePath: /live_nodes
   [junit4]   2> 91819 INFO  (TEST-TestCryptoKeys.test-seed#[7A09376CAEEE6563]) [n:127.0.0.1:61799__%2Fb    ] o.a.s.c.c.SolrZkClient makePath: /aliases.json
   [junit4]   2> 91821 INFO  (TEST-TestCryptoKeys.test-seed#[7A09376CAEEE6563]) [n:127.0.0.1:61799__%2Fb    ] o.a.s.c.c.SolrZkClient makePath: /clusterstate.json
   [junit4]   2> 91823 INFO  (TEST-TestCryptoKeys.test-seed#[7A09376CAEEE6563]) [n:127.0.0.1:61799__%2Fb    ] o.a.s.c.c.SolrZkClient makePath: /security.json
   [junit4]   2> 91827 INFO  (TEST-TestCryptoKeys.test-seed#[7A09376CAEEE6563]) [n:127.0.0.1:61799__%2Fb    ] o.a.s.c.c.SolrZkClient makePath: /overseer_elect
   [junit4]   2> 91829 INFO  (TEST-TestCryptoKeys.test-seed#[7A09376CAEEE6563]) [n:127.0.0.1:61799__%2Fb    ] o.a.s.c.c.SolrZkClient makePath: /overseer_elect/election
   [junit4]   2> 91832 INFO  (TEST-TestCryptoKeys.test-seed#[7A09376CAEEE6563]) [n:127.0.0.1:61799__%2Fb    ] o.a.s.c.Overseer Overseer (id=null) closing
   [junit4]   2> 91832 INFO  (TEST-TestCryptoKeys.test-seed#[7A09376CAEEE6563]) [n:127.0.0.1:61799__%2Fb    ] o.a.s.c.LeaderElector Joined leadership election with path: /overseer_elect/election/95443975965442052-127.0.0.1:61799__%2Fb-n_0000000000
   [junit4]   2> 91833 INFO  (TEST-TestCryptoKeys.test-seed#[7A09376CAEEE6563]) [n:127.0.0.1:61799__%2Fb    ] o.a.s.c.OverseerElectionContext I am going to be the leader 127.0.0.1:61799__%2Fb
   [junit4]   2> 91833 INFO  (TEST-TestCryptoKeys.test-seed#[7A09376CAEEE6563]) [n:127.0.0.1:61799__%2Fb    ] o.a.s.c.c.SolrZkClient makePath: /overseer_elect/leader
   [junit4]   2> 91836 INFO  (TEST-TestCryptoKeys.test-seed#[7A09376CAEEE6563]) [n:127.0.0.1:61799__%2Fb    ] o.a.s.c.Overseer Overseer (id=95443975965442052-127.0.0.1:61799__%2Fb-n_0000000000) starting
   [junit4]   2> 91839 INFO  (TEST-TestCryptoKeys.test-seed#[7A09376CAEEE6563]) [n:127.0.0.1:61799__%2Fb    ] o.a.s.c.c.SolrZkClient makePath: /overseer/queue-work
   [junit4]   2> 91850 INFO  (TEST-TestCryptoKeys.test-seed#[7A09376CAEEE6563]) [n:127.0.0.1:61799__%2Fb    ] o.a.s.c.OverseerAutoReplicaFailoverThread Starting OverseerAutoReplicaFailoverThread autoReplicaFailoverWorkLoopDelay=10000 autoReplicaFailoverWaitAfterExpiration=30000 autoReplicaFailoverBadNodeExpiration=60000
   [junit4]   2> 91850 INFO  (TEST-TestCryptoKeys.test-seed#[7A09376CAEEE6563]) [n:127.0.0.1:61799__%2Fb    ] o.a.s.c.c.ZkStateReader Updating cluster state from ZooKeeper... 
   [junit4]   2> 91851 INFO  (OverseerStateUpdate-95443975965442052-127.0.0.1:61799__%2Fb-n_0000000000) [n:127.0.0.1:61799__%2Fb    ] o.a.s.c.Overseer Starting to work on the main queue
   [junit4]   2> 91854 INFO  (OverseerCollectionConfigSetProcessor-95443975965442052-127.0.0.1:61799__%2Fb-n_0000000000) [n:127.0.0.1:61799__%2Fb    ] o.a.s.c.OverseerTaskProcessor Process current queue of overseer operations
   [junit4]   2> 91859 INFO  (TEST-TestCryptoKeys.test-seed#[7A09376CAEEE6563]) [n:127.0.0.1:61799__%2Fb    ] o.a.s.c.c.ZkStateReader Updated live nodes from ZooKeeper... (0) -> (0)
   [junit4]   2> 91862 INFO  (TEST-TestCryptoKeys.test-seed#[7A09376CAEEE6563]) [n:127.0.0.1:61799__%2Fb    ] o.a.s.c.ZkController Register node as live in ZooKeeper:/live_nodes/127.0.0.1:61799__%2Fb
   [junit4]   2> 91863 INFO  (TEST-TestCryptoKeys.test-seed#[7A09376CAEEE6563]) [n:127.0.0.1:61799__%2Fb    ] o.a.s.c.c.SolrZkClient makePath: /live_nodes/127.0.0.1:61799__%2Fb
   [junit4]   2> 91865 INFO  (zkCallback-43-thread-1-processing-n:127.0.0.1:61799__%2Fb) [n:127.0.0.1:61799__%2Fb    ] o.a.s.c.c.ZkStateReader A live node change: [WatchedEvent state:SyncConnected type:NodeChildrenChanged path:/live_nodes], has occurred - updating... (live nodes size: [0])
   [junit4]   2> 91866 INFO  (zkCallback-43-thread-1-processing-n:127.0.0.1:61799__%2Fb) [n:127.0.0.1:61799__%2Fb    ] o.a.s.c.c.ZkStateReader Updated live nodes from ZooKeeper... (0) -> (1)
   [junit4]   2> 91896 INFO  (TEST-TestCryptoKeys.test-seed#[7A09376CAEEE6563]) [n:127.0.0.1:61799__%2Fb    ] o.a.s.c.CoreContainer Security conf doesn't exist. Skipping setup for authorization module.
   [junit4]   2> 91897 INFO  (TEST-TestCryptoKeys.test-seed#[7A09376CAEEE6563]) [n:127.0.0.1:61799__%2Fb    ] o.a.s.c.CoreContainer No authentication plugin used.
   [junit4]   2> 91898 INFO  (TEST-TestCryptoKeys.test-seed#[7A09376CAEEE6563]) [n:127.0.0.1:61799__%2Fb    ] o.a.s.c.CorePropertiesLocator Looking for core definitions underneath /export/home/jenkins/workspace/Lucene-Solr-trunk-Solaris/solr/build/solr-core/test/J0/temp/solr.cloud.TestCryptoKeys_7A09376CAEEE6563-001/control-001/cores
   [junit4]   2> 91899 INFO  (TEST-TestCryptoKeys.test-seed#[7A09376CAEEE6563]) [n:127.0.0.1:61799__%2Fb    ] o.a.s.c.CoreDescriptor Created CoreDescriptor: {name=collection1, config=solrconfig.xml, transient=false, schema=schema.xml, loadOnStartup=true, configSetProperties=configsetprops.json, collection=control_collection, coreNodeName=, dataDir=data/, shard=}
   [junit4]   2> 91899 INFO  (TEST-TestCryptoKeys.test-seed#[7A09376CAEEE6563]) [n:127.0.0.1:61799__%2Fb    ] o.a.s.c.CorePropertiesLocator Found core collection1 in /export/home/jenkins/workspace/Lucene-Solr-trunk-Solaris/solr/build/solr-core/test/J0/temp/solr.cloud.TestCryptoKeys_7A09376CAEEE6563-001/control-001/cores/collection1
   [junit4]   2> 91899 INFO  (TEST-TestCryptoKeys.test-seed#[7A09376CAEEE6563]) [n:127.0.0.1:61799__%2Fb    ] o.a.s.c.CorePropertiesLocator Found 1 core definitions
   [junit4]   2> 91901 INFO  (TEST-TestCryptoKeys.test-seed#[7A09376CAEEE6563]) [n:127.0.0.1:61799__%2Fb    ] o.a.s.s.SolrDispatchFilter user.dir=/export/home/jenkins/workspace/Lucene-Solr-trunk-Solaris/solr/build/solr-core/test/J0
   [junit4]   2> 91901 INFO  (TEST-TestCryptoKeys.test-seed#[7A09376CAEEE6563]) [n:127.0.0.1:61799__%2Fb    ] o.a.s.s.SolrDispatchFilter SolrDispatchFilter.init() done
   [junit4]   2> 91903 INFO  (coreLoadExecutor-128-thread-1-processing-n:127.0.0.1:61799__%2Fb) [n:127.0.0.1:61799__%2Fb c:control_collection   x:collection1] o.a.s.c.ZkController publishing state=down
   [junit4]   2> 91903 INFO  (coreLoadExecutor-128-thread-1-processing-n:127.0.0.1:61799__%2Fb) [n:127.0.0.1:61799__%2Fb c:control_collection   x:collection1] o.a.s.c.ZkController numShards not found on descriptor - reading it from system property
   [junit4]   2> 91904 INFO  (OverseerStateUpdate-95443975965442052-127.0.0.1:61799__%2Fb-n_0000000000) [n:127.0.0.1:61799__%2Fb    ] o.a.s.c.c.ZkStateReader Updated live nodes from ZooKeeper... (1) -> (1)
   [junit4]   2> 91907 INFO  (OverseerStateUpdate-95443975965442052-127.0.0.1:61799__%2Fb-n_0000000000) [n:127.0.0.1:61799__%2Fb    ] o.a.s.c.Overseer processMessage: queueSize: 1, message = {
   [junit4]   2>   "core":"collection1",
   [junit4]   2>   "roles":null,
   [junit4]   2>   "base_url":"http://127.0.0.1:61799/_/b",
   [junit4]   2>   "node_name":"127.0.0.1:61799__%2Fb",
   [junit4]   2>   "numShards":"1",
   [junit4]   2>   "state":"down",
   [junit4]   2>   "shard":null,
   [junit4]   2>   "collection":"control_collection",
   [junit4]   2>   "operation":"state"} current state version: 0
   [junit4]   2> 91907 INFO  (coreLoadExecutor-128-thread-1-processing-n:127.0.0.1:61799__%2Fb) [n:127.0.0.1:61799__%2Fb c:control_collection   x:collection1] o.a.s.c.ZkController look for our core node name
   [junit4]   2> 91907 INFO  (OverseerStateUpdate-95443975965442052-127.0.0.1:61799__%2Fb-n_0000000000) [n:127.0.0.1:61799__%2Fb    ] o.a.s.c.o.ReplicaMutator Update state numShards=1 message={
   [junit4]   2>   "core":"collection1",
   [junit4]   2>   "roles":null,
   [junit4]   2>   "base_url":"http://127.0.0.1:61799/_/b",
   [junit4]   2>   "node_name":"127.0.0.1:61799__%2Fb",
   [junit4]   2>   "numShards":"1",
   [junit4]   2>   "state":"down",
   [junit4]   2>   "shard":null,
   [junit4]   2>   "collection":"control_collection",
   [junit4]   2>   "operation":"state"}
   [junit4]   2> 91909 INFO  (OverseerStateUpdate-95443975965442052-127.0.0.1:61799__%2Fb-n_0000000000) [n:127.0.0.1:61799__%2Fb    ] o.a.s.c.o.ClusterStateMutator building a new cName: control_collection
   [junit4]   2> 91909 INFO  (OverseerStateUpdate-95443975965442052-127.0.0.1:61799__%2Fb-n_0000000000) [n:127.0.0.1:61799__%2Fb    ] o.a.s.c.o.ReplicaMutator Assigning new node to shard shard=shard1
   [junit4]   2> 91911 INFO  (zkCallback-43-thread-1-processing-n:127.0.0.1:61799__%2Fb) [n:127.0.0.1:61799__%2Fb    ] o.a.s.c.c.ZkStateReader A cluster state change: [WatchedEvent state:SyncConnected type:NodeDataChanged path:/clusterstate.json], has occurred - updating... (live nodes size: [1])
   [junit4]   2> 92908 INFO  (coreLoadExecutor-128-thread-1-processing-n:127.0.0.1:61799__%2Fb) [n:127.0.0.1:61799__%2Fb c:control_collection   x:collection1] o.a.s.c.ZkController waiting to find shard id in clusterstate for collection1
   [junit4]   2> 92908 INFO  (coreLoadExecutor-128-thread-1-processing-n:127.0.0.1:61799__%2Fb) [n:127.0.0.1:61799__%2Fb c:control_collection   x:collection1] o.a.s.c.ZkController Check for collection zkNode:control_collection
   [junit4]   2> 92909 INFO  (coreLoadExecutor-128-thread-1-processing-n:127.0.0.1:61799__%2Fb) [n:127.0.0.1:61799__%2Fb c:control_collection   x:collection1] o.a.s.c.ZkController Collection zkNode exists
   [junit4]   2> 92909 INFO  (coreLoadExecutor-128-thread-1-processing-n:127.0.0.1:61799__%2Fb) [n:127.0.0.1:61799__%2Fb c:control_collection   x:collection1] o.a.s.c.c.ZkStateReader Load collection config from: [/collections/control_collection]
   [junit4]   2> 92910 INFO  (coreLoadExecutor-128-thread-1-processing-n:127.0.0.1:61799__%2Fb) [n:127.0.0.1:61799__%2Fb c:control_collection   x:collection1] o.a.s.c.c.ZkStateReader path=[/collections/control_collection] [configName]=[conf1] specified config exists in ZooKeeper
   [junit4]   2> 92911 INFO  (coreLoadExecutor-128-thread-1-processing-n:127.0.0.1:61799__%2Fb) [n:127.0.0.1:61799__%2Fb c:control_collection   x:collection1] o.a.s.c.SolrResourceLoader new SolrResourceLoader for directory: '/export/home/jenkins/workspace/Lucene-Solr-trunk-Solaris/solr/build/solr-core/test/J0/temp/solr.cloud.TestCryptoKeys_7A09376CAEEE6563-001/control-001/cores/collection1'
   [junit4]   2> 92911 INFO  (coreLoadExecutor-128-thread-1-processing-n:127.0.0.1:61799__%2Fb) [n:127.0.0.1:61799__%2Fb c:control_collection   x:collection1] o.a.s.c.SolrResourceLoader JNDI not configured for solr (NoInitialContextEx)
   [junit4]   2> 92911 INFO  (coreLoadExecutor-128-thread-1-processing-n:127.0.0.1:61799__%2Fb) [n:127.0.0.1:61799__%2Fb c:control_collection   x:collection1] o.a.s.c.SolrResourceLoader solr home defaulted to 'solr/' (could not find system property or JNDI)
   [junit4]   2> 92914 INFO  (coreLoadExecutor-128-thread-1-processing-n:127.0.0.1:61799__%2Fb) [n:127.0.0.1:61799__%2Fb c:control_collection   x:collection1] o.a.s.c.Config loaded config solrconfig.xml with version 0 
   [junit4]   2> 92927 INFO  (coreLoadExecutor-128-thread-1-processing-n:127.0.0.1:61799__%2Fb) [n:127.0.0.1:61799__%2Fb c:control_collection   x:collection1] o.a.s.c.SolrConfig current version of requestparams : -1
   [junit4]   2> 92946 INFO  (coreLoadExecutor-128-thread-1-processing-n:127.0.0.1:61799__%2Fb) [n:127.0.0.1:61799__%2Fb c:control_collection   x:collection1] o.a.s.c.SolrConfig Using Lucene MatchVersion: 6.0.0
   [junit4]   2> 92963 INFO  (coreLoadExecutor-128-thread-1-processing-n:127.0.0.1:61799__%2Fb) [n:127.0.0.1:61799__%2Fb c:control_collection   x:collection1] o.a.s.c.SolrConfig Loaded SolrConfig: solrconfig.xml
   [junit4]   2> 92970 INFO  (coreLoadExecutor-128-thread-1-processing-n:127.0.0.1:61799__%2Fb) [n:127.0.0.1:61799__%2Fb c:control_collection   x:collection1] o.a.s.s.IndexSchema [collection1] Schema name=test
   [junit4]   2> 93202 INFO  (coreLoadExecutor-128-thread-1-processing-n:127.0.0.1:61799__%2Fb) [n:127.0.0.1:61799__%2Fb c:control_collection   x:collection1] o.a.s.s.OpenExchangeRatesOrgProvider Initialized with rates=open-exchange-rates.json, refreshInterval=1440.
   [junit4]   2> 93219 INFO  (coreLoadExecutor-128-thread-1-processing-n:127.0.0.1:61799__%2Fb) [n:127.0.0.1:61799__%2Fb c:control_collection   x:collection1] o.a.s.s.IndexSchema default search field in schema is text
   [junit4]   2> 93220 INFO  (coreLoadExecutor-128-thread-1-processing-n:127.0.0.1:61799__%2Fb) [n:127.0.0.1:61799__%2Fb c:control_collection   x:collection1] o.a.s.s.IndexSchema unique key field: id
   [junit4]   2> 93273 INFO  (coreLoadExecutor-128-thread-1-processing-n:127.0.0.1:61799__%2Fb) [n:127.0.0.1:61799__%2Fb c:control_collection   x:collection1] o.a.s.s.FileExchangeRateProvider Reloading exchange rates from file currency.xml
   [junit4]   2> 93277 INFO  (coreLoadExecutor-128-thread-1-processing-n:127.0.0.1:61799__%2Fb) [n:127.0.0.1:61799__%2Fb c:control_collection   x:collection1] o.a.s.s.FileExchangeRateProvider Reloading exchange rates from file currency.xml
   [junit4]   2> 93284 INFO  (coreLoadExecutor-128-thread-1-processing-n:127.0.0.1:61799__%2Fb) [n:127.0.0.1:61799__%2Fb c:control_collection   x:collection1] o.a.s.s.OpenExchangeRatesOrgProvider Reloading exchange rates from open-exchange-rates.json
   [junit4]   2> 93286 INFO  (coreLoadExecutor-128-thread-1-processing-n:127.0.0.1:61799__%2Fb) [n:127.0.0.1:61799__%2Fb c:control_collection   x:collection1] o.a.s.s.OpenExchangeRatesOrgProvider Reloading exchange rates from open-exchange-rates.json
   [junit4]   2> 93288 INFO  (coreLoadExecutor-128-thread-1-processing-n:127.0.0.1:61799__%2Fb) [n:127.0.0.1:61799__%2Fb c:control_collection   x:collection1] o.a.s.c.ConfigSetProperties Did not find ConfigSet properties, assuming default properties: Can't find resource 'configsetprops.json' in classpath or '/configs/conf1', cwd=/export/home/jenkins/workspace/Lucene-Solr-trunk-Solaris/solr/build/solr-core/test/J0
   [junit4]   2> 93288 INFO  (coreLoadExecutor-128-thread-1-processing-n:127.0.0.1:61799__%2Fb) [n:127.0.0.1:61799__%2Fb c:control_collection   x:collection1] o.a.s.c.CoreContainer Creating SolrCore 'collection1' using configuration from collection control_collection
   [junit4]   2> 93288 INFO  (coreLoadExecutor-128-thread-1-processing-n:127.0.0.1:61799__%2Fb) [n:127.0.0.1:61799__%2Fb c:control_collection s:shard1 r:core_node1 x:collection1] o.a.s.c.SolrCore org.apache.solr.core.MockDirectoryFactory
   [junit4]   2> 93288 INFO  (coreLoadExecutor-128-thread-1-processing-n:127.0.0.1:61799__%2Fb) [n:127.0.0.1:61799__%2Fb c:control_collection s:shard1 r:core_node1 x:collection1] o.a.s.c.SolrCore [[collection1] ] Opening new SolrCore at [/export/home/jenkins/workspace/Lucene-Solr-trunk-Solaris/solr/build/solr-core/test/J0/temp/solr.cloud.TestCryptoKeys_7A09376CAEEE6563-001/control-001/cores/collection1], dataDir=[/export/home/jenkins/workspace/Lucene-Solr-trunk-Solaris/solr/build/solr-core/test/J0/temp/solr.cloud.TestCryptoKeys_7A09376CAEEE6563-001/control-001/cores/collection1/data/]
   [junit4]   2> 93289 INFO  (coreLoadExecutor-128-thread-1-processing-n:127.0.0.1:61799__%2Fb) [n:127.0.0.1:61799__%2Fb c:control_collection s:shard1 r:core_node1 x:collection1] o.a.s.c.JmxMonitoredMap JMX monitoring is enabled. Adding Solr mbeans to JMX Server: com.sun.jmx.mbeanserver.JmxMBeanServer@4bc67cb0
   [junit4]   2> 93289 INFO  (coreLoadExecutor-128-thread-1-processing-n:127.0.0.1:61799__%2Fb) [n:127.0.0.1:61799__%2Fb c:control_collection s:shard1 r:core_node1 x:collection1] o.a.s.c.CachingDirectoryFactory return new directory for /export/home/jenkins/workspace/Lucene-Solr-trunk-Solaris/solr/build/solr-core/test/J0/temp/solr.cloud.TestCryptoKeys_7A09376CAEEE6563-001/control-001/cores/collection1/data
   [junit4]   2> 93289 INFO  (coreLoadExecutor-128-thread-1-processing-n:127.0.0.1:61799__%2Fb) [n:127.0.0.1:61799__%2Fb c:control_collection s:shard1 r:core_node1 x:collection1] o.a.s.c.SolrCore New index directory detected: old=null new=/export/home/jenkins/workspace/Lucene-Solr-trunk-Solaris/solr/build/solr-core/test/J0/temp/solr.cloud.TestCryptoKeys_7A09376CAEEE6563-001/control-001/cores/collection1/data/index/
   [junit4]   2> 93290 WARN  (coreLoadExecutor-128-thread-1-processing-n:127.0.0.1:61799__%2Fb) [n:127.0.0.1:61799__%2Fb c:control_collection s:shard1 r:core_node1 x:collection1] o.a.s.c.SolrCore [collection1] Solr index directory '/export/home/jenkins/workspace/Lucene-Solr-trunk-Solaris/solr/build/solr-core/test/J0/temp/solr.cloud.TestCryptoKeys_7A09376CAEEE6563-001/control-001/cores/collection1/data/index' doesn't exist. Creating new index...
   [junit4]   2> 93290 INFO  (coreLoadExecutor-128-thread-1-processing-n:127.0.0.1:61799__%2Fb) [n:127.0.0.1:61799__%2Fb c:control_collection s:shard1 r:core_node1 x:collection1] o.a.s.c.CachingDirectoryFactory return new directory for /export/home/jenkins/workspace/Lucene-Solr-trunk-Solaris/solr/build/solr-core/test/J0/temp/solr.cloud.TestCryptoKeys_7A09376CAEEE6563-001/control-001/cores/collection1/data/index
   [junit4]   2> 93290 INFO  (coreLoadExecutor-128-thread-1-processing-n:127.0.0.1:61799__%2Fb) [n:127.0.0.1:61799__%2Fb c:control_collection s:shard1 r:core_node1 x:collection1] o.a.s.u.RandomMergePolicy RandomMergePolicy wrapping class org.apache.lucene.index.TieredMergePolicy: [TieredMergePolicy: maxMergeAtOnce=32, maxMergeAtOnceExplicit=37, maxMergedSegmentMB=95.1787109375, floorSegmentMB=0.763671875, forceMergeDeletesPctAllowed=17.275784419165618, segmentsPerTier=30.0, maxCFSSegmentSizeMB=8.796093022207999E12, noCFSRatio=0.7026409991769679
   [junit4]   2> 93290 INFO  (coreLoadExecutor-128-thread-1-processing-n:127.0.0.1:61799__%2Fb) [n:127.0.0.1:61799__%2Fb c:control_collection s:shard1 r:core_node1 x:collection1] o.a.s.c.SolrDeletionPolicy SolrDeletionPolicy.onCommit: commits: num=1
   [junit4]   2> 	commit{dir=MockDirectoryWrapper(RAMDirectory@343daa11 lockFactory=org.apache.lucene.store.SingleInstanceLockFactory@73742f5c),segFN=segments_1,generation=1}
   [junit4]   2> 93290 INFO  (coreLoadExecutor-128-thread-1-processing-n:127.0.0.1:61799__%2Fb) [n:127.0.0.1:61799__%2Fb c:control_collection s:shard1 r:core_node1 x:collection1] o.a.s.c.SolrDeletionPolicy newest commit generation = 1
   [junit4]   2> 93291 INFO  (OldIndexDirectoryCleanupThreadForCore-collection1) [n:127.0.0.1:61799__%2Fb c:control_collection s:shard1 r:core_node1 x:collection1] o.a.s.c.SolrCore Looking for old index directories to cleanup for core collection1 in /export/home/jenkins/workspace/Lucene-Solr-trunk-Solaris/solr/build/solr-core/test/J0/temp/solr.cloud.TestCryptoKeys_7A09376CAEEE6563-001/control-001/cores/collection1/data/
   [junit4]   2> 93291 WARN  (OldIndexDirectoryCleanupThreadForCore-collection1) [n:127.0.0.1:61799__%2Fb c:control_collection s:shard1 r:core_node1 x:collection1] o.a.s.c.DirectoryFactory /export/home/jenkins/workspace/Lucene-Solr-trunk-Solaris/solr/build/solr-core/test/J0/temp/solr.cloud.TestCryptoKeys_7A09376CAEEE6563-001/control-001/cores/collection1/data/ does not point to a valid data directory; skipping clean-up of old index directories.
   [junit4]   2> 93299 INFO  (coreLoadExecutor-128-thread-1-processing-n:127.0.0.1:61799__%2Fb) [n:127.0.0.1:61799__%2Fb c:control_collection s:shard1 r:core_node1 x:collection1] o.a.s.u.p.UpdateRequestProcessorChain creating updateRequestProcessorChain "nodistrib"
   [junit4]   2> 93300 INFO  (coreLoadExecutor-128-thread-1-processing-n:127.0.0.1:61799__%2Fb) [n:127.0.0.1:61799__%2Fb c:control_collection s:shard1 r:core_node1 x:collection1] o.a.s.u.p.UpdateRequestProcessorChain creating updateRequestProcessorChain "dedupe"
   [junit4]   2> 93300 INFO  (coreLoadExecutor-128-thread-1-processing-n:127.0.0.1:61799__%2Fb) [n:127.0.0.1:61799__%2Fb c:control_collection s:shard1 r:core_node1 x:collection1] o.a.s.u.p.UpdateRequestProcessorChain inserting DistributedUpdateProcessorFactory into updateRequestProcessorChain "dedupe"
   [ju

[...truncated too long message...]

apache.solr.handler.RequestHandlerBase.handleRequest(RequestHandlerBase.java:155)
   [junit4]    > 	at org.apache.solr.servlet.HttpSolrCall.handleAdminRequest(HttpSolrCall.java:655)
   [junit4]    > 	at org.apache.solr.servlet.HttpSolrCall.call(HttpSolrCall.java:438)
   [junit4]    > 	at org.apache.solr.servlet.SolrDispatchFilter.doFilter(SolrDispatchFilter.java:229)
   [junit4]    > 	at org.apache.solr.servlet.SolrDispatchFilter.doFilter(SolrDispatchFilter.java:184)
   [junit4]    > 	at org.eclipse.jetty.servlet.ServletHandler$CachedChain.doFilter(ServletHandler.java:1668)
   [junit4]    > 	at org.apache.solr.client.solrj.embedded.JettySolrRunner$DebugFilter.doFilter(JettySolrRunner.java:109)
   [junit4]    > 	at org.eclipse.jetty.servlet.ServletHandler$CachedChain.doFilter(ServletHandler.java:1668)
   [junit4]    > 	at org.eclipse.jetty.servlet.ServletHandler.doHandle(ServletHandler.java:581)
   [junit4]    > 	at org.eclipse.jetty.server.session.SessionHandler.doHandle(SessionHandler.java:224)
   [junit4]    > 	at org.eclipse.jetty.server.handler.ContextHandler.doHandle(ContextHandler.java:1158)
   [junit4]    > 	at org.eclipse.jetty.servlet.ServletHandler.doScope(ServletHandler.java:511)
   [junit4]    > 	at org.eclipse.jetty.server.session.SessionHandler.doScope(SessionHandler.java:185)
   [junit4]    > 	at org.eclipse.jetty.server.handler.ContextHandler.doScope(ContextHandler.java:1090)
   [junit4]    > 	at org.eclipse.jetty.server.handler.ScopedHandler.handle(ScopedHandler.java:141)
   [junit4]    > 	at org.eclipse.jetty.server.handler.gzip.GzipHandler.handle(GzipHandler.java:437)
   [junit4]    > 	at org.eclipse.jetty.server.handler.HandlerWrapper.handle(HandlerWrapper.java:119)
   [junit4]    > 	at org.eclipse.jetty.server.Server.handle(Server.java:517)
   [junit4]    > 	at org.eclipse.jetty.server.HttpChannel.handle(HttpChannel.java:308)
   [junit4]    > 	at org.eclipse.jetty.server.HttpConnection.onFillable(HttpConnection.java:242)
   [junit4]    > 	at org.eclipse.jetty.io.AbstractConnection$ReadCallback.succeeded(AbstractConnection.java:261)
   [junit4]    > 	at org.eclipse.jetty.io.FillInterest.fillable(FillInterest.java:95)
   [junit4]    > 	at org.eclipse.jetty.io.SelectChannelEndPoint$2.run(SelectChannelEndPoint.java:75)
   [junit4]    > 	at org.eclipse.jetty.util.thread.strategy.ExecuteProduceConsume.produceAndRun(ExecuteProduceConsume.java:213)
   [junit4]    > 	at org.eclipse.jetty.util.thread.strategy.ExecuteProduceConsume.run(ExecuteProduceConsume.java:147)
   [junit4]    > 	at org.eclipse.jetty.util.thread.QueuedThreadPool.runJob(QueuedThreadPool.java:654)
   [junit4]    > 	at org.eclipse.jetty.util.thread.QueuedThreadPool$3.run(QueuedThreadPool.java:572)
   [junit4]    > 	at java.lang.Thread.run(Thread.java:745)
   [junit4]    > 	at org.apache.solr.client.solrj.impl.HttpSolrClient.executeMethod(HttpSolrClient.java:577)
   [junit4]    > 	at org.apache.solr.client.solrj.impl.HttpSolrClient.request(HttpSolrClient.java:241)
   [junit4]    > 	at org.apache.solr.client.solrj.impl.HttpSolrClient.request(HttpSolrClient.java:230)
   [junit4]    > 	at org.apache.solr.client.solrj.impl.LBHttpSolrClient.doRequest(LBHttpSolrClient.java:372)
   [junit4]    > 	at org.apache.solr.client.solrj.impl.LBHttpSolrClient.request(LBHttpSolrClient.java:325)
   [junit4]    > 	... 50 more
   [junit4]   2> 2145258 INFO  (SUITE-CollectionStateFormat2Test-seed#[7A09376CAEEE6563]-worker) [    ] o.a.s.SolrTestCaseJ4 ###deleteCore
   [junit4]   2> NOTE: leaving temporary files on disk at: /export/home/jenkins/workspace/Lucene-Solr-trunk-Solaris/solr/build/solr-core/test/J0/temp/solr.cloud.CollectionStateFormat2Test_7A09376CAEEE6563-001
   [junit4]   2> Feb 25, 2016 12:52:30 AM com.carrotsearch.randomizedtesting.ThreadLeakControl checkThreadLeaks
   [junit4]   2> WARNING: Will linger awaiting termination of 1 leaked thread(s).
   [junit4]   2> NOTE: test params are: codec=Asserting(Lucene60): {}, docValues:{}, sim=RandomSimilarity(queryNorm=false,coord=no): {}, locale=ar-TN, timezone=Asia/Dushanbe
   [junit4]   2> NOTE: SunOS 5.11 amd64/Oracle Corporation 1.8.0_72 (64-bit)/cpus=3,threads=1,free=343323560,total=518979584
   [junit4]   2> NOTE: All tests run in this JVM: [DirectSolrSpellCheckerTest, CdcrRequestHandlerTest, PolyFieldTest, DocValuesMultiTest, HdfsBasicDistributedZk2Test, TestPerFieldSimilarityWithDefaultOverride, TestSerializedLuceneMatchVersion, RecoveryAfterSoftCommitTest, TestStressVersions, TestStressLucene, TestStressReorder, HdfsChaosMonkeyNothingIsSafeTest, TestCryptoKeys, SimpleCollectionCreateDeleteTest, CustomCollectionTest, SuggesterFSTTest, TestMacros, TestFaceting, TestFieldCollectionResource, AnalyticsQueryTest, TestDocSet, DocExpirationUpdateProcessorFactoryTest, SmileWriterTest, ZkStateReaderTest, PingRequestHandlerTest, UnloadDistributedZkTest, TestTolerantSearch, TestDFRSimilarityFactory, TestPKIAuthenticationPlugin, DistributedSuggestComponentTest, TestReplicationHandler, TestManagedSchemaDynamicFieldResource, DocValuesTest, AtomicUpdatesTest, URLClassifyProcessorTest, TestJsonFacets, RegexBoostProcessorTest, TestLRUCache, PrimUtilsTest, DocumentBuilderTest, RollingRestartTest, TestMergePolicyConfig, DistributedSpellCheckComponentTest, TestBulkSchemaAPI, TestLMDirichletSimilarityFactory, StressHdfsTest, TestNRTOpen, TestReplicaProperties, CollectionsAPIAsyncDistributedZkTest, ShardRoutingTest, DistributedExpandComponentTest, TestComplexPhraseQParserPlugin, StandardRequestHandlerTest, RecoveryZkTest, RequiredFieldsTest, TestSweetSpotSimilarityFactory, SpatialHeatmapFacetsTest, SolrIndexConfigTest, SoftAutoCommitTest, TestPartialUpdateDeduplication, TestSolrCloudWithKerberosAlt, DeleteLastCustomShardedReplicaTest, ParsingFieldUpdateProcessorsTest, SharedFSAutoReplicaFailoverTest, AsyncMigrateRouteKeyTest, TestSolrDynamicMBean, TestPhraseSuggestions, TestDownShardTolerantSearch, DateRangeFieldTest, TestStandardQParsers, PrimitiveFieldTypeTest, TestDocumentBuilder, TestHashPartitioner, XsltUpdateRequestHandlerTest, RulesTest, TestRequestStatusCollectionAPI, TestSolrQueryParserResource, MoreLikeThisHandlerTest, TestEmbeddedSolrServerConstructors, ClusterStateUpdateTest, TestCopyFieldCollectionResource, HighlighterTest, SolrRequestParserTest, GraphQueryTest, UUIDFieldTest, AlternateDirectoryTest, StatelessScriptUpdateProcessorFactoryTest, IndexBasedSpellCheckerTest, MergeStrategyTest, PreAnalyzedFieldTest, TestSmileRequest, TestManagedSchemaFieldTypeResource, OverseerStatusTest, TestSha256AuthenticationProvider, TestUpdate, SliceStateTest, TestExactSharedStatsCache, TestRandomRequestDistribution, SimpleFacetsTest, TestExtendedDismaxParser, TestRecoveryHdfs, ScriptEngineTest, JsonLoaderTest, ZkCLITest, TestExceedMaxTermLength, TestNamedUpdateProcessors, TestScoreJoinQPScore, SuggestComponentTest, DataDrivenBlockJoinTest, SaslZkACLProviderTest, OverseerCollectionConfigSetProcessorTest, TestJmxMonitoredMap, TestSearcherReuse, BJQParserTest, BadCopyFieldTest, LeaderInitiatedRecoveryOnCommitTest, MigrateRouteKeyTest, TestComponentsName, HighlighterMaxOffsetTest, TestTrackingShardHandlerFactory, PKIAuthenticationIntegrationTest, TestCoreContainer, DistributedFacetPivotLongTailTest, CheckHdfsIndexTest, TestBlendedInfixSuggestions, ChaosMonkeyNothingIsSafeTest, DistributedFacetPivotSmallTest, TestSolrConfigHandlerConcurrent, SystemInfoHandlerTest, TestIBSimilarityFactory, SpatialFilterTest, QueryElevationComponentTest, TestConfigSetProperties, TestTestInjection, TestHighlightDedupGrouping, DocumentAnalysisRequestHandlerTest, TestFieldSortValues, AnalysisAfterCoreReloadTest, TestElisionMultitermQuery, TestXIncludeConfig, TestDynamicLoading, BasicDistributedZkTest, SyncSliceTest, OverseerTest, LeaderElectionTest, TestRandomDVFaceting, TestDistributedSearch, SchemaVersionSpecificBehaviorTest, TestPseudoReturnFields, QueryEqualityTest, SolrInfoMBeanTest, LukeRequestHandlerTest, XmlUpdateRequestHandlerTest, PathHierarchyTokenizerFactoryTest, FastVectorHighlighterTest, SolrPluginUtilsTest, TestJmxIntegration, JSONWriterTest, MBeansHandlerTest, TestAnalyzedSuggestions, CSVRequestHandlerTest, SOLR749Test, TestQuerySenderListener, UpdateParamsTest, TestQuerySenderNoQuery, CopyFieldTest, ResponseLogComponentTest, BadComponentTest, TestStressRecovery, SolrTestCaseJ4Test, TestCursorMarkWithoutUniqueKey, TestSimpleTrackingShardHandler, ActionThrottleTest, AssignTest, AsyncCallRequestStatusResponseTest, CdcrReplicationDistributedZkTest, CdcrReplicationHandlerTest, CdcrVersionReplicationTest, CleanupOldIndexTest, CollectionStateFormat2Test]
   [junit4] Completed [420/580 (5!)] on J0 in 24.73s, 1 test, 1 error <<< FAILURES!

[...truncated 544 lines...]
BUILD FAILED
/export/home/jenkins/workspace/Lucene-Solr-trunk-Solaris/build.xml:740: The following error occurred while executing this line:
/export/home/jenkins/workspace/Lucene-Solr-trunk-Solaris/build.xml:684: The following error occurred while executing this line:
/export/home/jenkins/workspace/Lucene-Solr-trunk-Solaris/build.xml:59: The following error occurred while executing this line:
/export/home/jenkins/workspace/Lucene-Solr-trunk-Solaris/solr/build.xml:233: The following error occurred while executing this line:
/export/home/jenkins/workspace/Lucene-Solr-trunk-Solaris/solr/common-build.xml:524: The following error occurred while executing this line:
/export/home/jenkins/workspace/Lucene-Solr-trunk-Solaris/lucene/common-build.xml:1457: The following error occurred while executing this line:
/export/home/jenkins/workspace/Lucene-Solr-trunk-Solaris/lucene/common-build.xml:1014: There were test failures: 580 suites (8 ignored), 2345 tests, 5 errors, 87 ignored (71 assumptions) [seed: 7A09376CAEEE6563]

Total time: 71 minutes 37 seconds
Build step 'Invoke Ant' marked build as failure
Archiving artifacts
[WARNINGS] Skipping publisher since build result is FAILURE
Recording test results
Email was triggered for: Failure - Any
Sending email for trigger: Failure - Any



Mime
View raw message