lucene-dev mailing list archives

Site index · List index
Message view « Date » · « Thread »
Top « Date » · « Thread »
From Adrien Grand <jpou...@gmail.com>
Subject Re: [JENKINS] Lucene-Solr-trunk-Linux (64bit/jdk1.8.0_66) - Build # 15621 - Failure!
Date Sat, 23 Jan 2016 14:39:30 GMT
Woohoo!

Le sam. 23 janv. 2016 15:35, Michael McCandless <lucene@mikemccandless.com>
a écrit :

> I *pushed* a fix ;)
>
> Mike McCandless
>
> http://blog.mikemccandless.com
>
>
> On Sat, Jan 23, 2016 at 9:27 AM, Michael McCandless
> <lucene@mikemccandless.com> wrote:
> > I'll fix.
> >
> > Mike McCandless
> >
> > http://blog.mikemccandless.com
> >
> >
> > On Sat, Jan 23, 2016 at 6:50 AM, Policeman Jenkins Server
> > <jenkins@thetaphi.de> wrote:
> >> Build: http://jenkins.thetaphi.de/job/Lucene-Solr-trunk-Linux/15621/
> >> Java: 64bit/jdk1.8.0_66 -XX:+UseCompressedOops -XX:+UseSerialGC
> >>
> >> 1 tests failed.
> >> FAILED:  org.apache.lucene.search.grouping.TestGrouping.testBasic
> >>
> >> Error Message:
> >>
> >>
> >> Stack Trace:
> >> java.lang.AssertionError
> >>         at
> __randomizedtesting.SeedInfo.seed([E3AE5C3FEE8E32AC:4854412A3152B482]:0)
> >>         at org.junit.Assert.fail(Assert.java:92)
> >>         at org.junit.Assert.assertTrue(Assert.java:43)
> >>         at org.junit.Assert.assertTrue(Assert.java:54)
> >>         at
> org.apache.lucene.search.grouping.TestGrouping.testBasic(TestGrouping.java:180)
> >>         at sun.reflect.NativeMethodAccessorImpl.invoke0(Native Method)
> >>         at
> sun.reflect.NativeMethodAccessorImpl.invoke(NativeMethodAccessorImpl.java:62)
> >>         at
> sun.reflect.DelegatingMethodAccessorImpl.invoke(DelegatingMethodAccessorImpl.java:43)
> >>         at java.lang.reflect.Method.invoke(Method.java:497)
> >>         at
> com.carrotsearch.randomizedtesting.RandomizedRunner.invoke(RandomizedRunner.java:1764)
> >>         at
> com.carrotsearch.randomizedtesting.RandomizedRunner$8.evaluate(RandomizedRunner.java:871)
> >>         at
> com.carrotsearch.randomizedtesting.RandomizedRunner$9.evaluate(RandomizedRunner.java:907)
> >>         at
> com.carrotsearch.randomizedtesting.RandomizedRunner$10.evaluate(RandomizedRunner.java:921)
> >>         at
> org.apache.lucene.util.TestRuleSetupTeardownChained$1.evaluate(TestRuleSetupTeardownChained.java:50)
> >>         at
> org.apache.lucene.util.AbstractBeforeAfterRule$1.evaluate(AbstractBeforeAfterRule.java:46)
> >>         at
> org.apache.lucene.util.TestRuleThreadAndTestName$1.evaluate(TestRuleThreadAndTestName.java:49)
> >>         at
> org.apache.lucene.util.TestRuleIgnoreAfterMaxFailures$1.evaluate(TestRuleIgnoreAfterMaxFailures.java:65)
> >>         at
> org.apache.lucene.util.TestRuleMarkFailure$1.evaluate(TestRuleMarkFailure.java:48)
> >>         at
> com.carrotsearch.randomizedtesting.rules.StatementAdapter.evaluate(StatementAdapter.java:36)
> >>         at
> com.carrotsearch.randomizedtesting.ThreadLeakControl$StatementRunner.run(ThreadLeakControl.java:367)
> >>         at
> com.carrotsearch.randomizedtesting.ThreadLeakControl.forkTimeoutingTask(ThreadLeakControl.java:809)
> >>         at
> com.carrotsearch.randomizedtesting.ThreadLeakControl$3.evaluate(ThreadLeakControl.java:460)
> >>         at
> com.carrotsearch.randomizedtesting.RandomizedRunner.runSingleTest(RandomizedRunner.java:880)
> >>         at
> com.carrotsearch.randomizedtesting.RandomizedRunner$5.evaluate(RandomizedRunner.java:781)
> >>         at
> com.carrotsearch.randomizedtesting.RandomizedRunner$6.evaluate(RandomizedRunner.java:816)
> >>         at
> com.carrotsearch.randomizedtesting.RandomizedRunner$7.evaluate(RandomizedRunner.java:827)
> >>         at
> org.apache.lucene.util.AbstractBeforeAfterRule$1.evaluate(AbstractBeforeAfterRule.java:46)
> >>         at
> com.carrotsearch.randomizedtesting.rules.StatementAdapter.evaluate(StatementAdapter.java:36)
> >>         at
> org.apache.lucene.util.TestRuleStoreClassName$1.evaluate(TestRuleStoreClassName.java:42)
> >>         at
> com.carrotsearch.randomizedtesting.rules.NoShadowingOrOverridesOnMethodsRule$1.evaluate(NoShadowingOrOverridesOnMethodsRule.java:40)
> >>         at
> com.carrotsearch.randomizedtesting.rules.NoShadowingOrOverridesOnMethodsRule$1.evaluate(NoShadowingOrOverridesOnMethodsRule.java:40)
> >>         at
> com.carrotsearch.randomizedtesting.rules.StatementAdapter.evaluate(StatementAdapter.java:36)
> >>         at
> com.carrotsearch.randomizedtesting.rules.StatementAdapter.evaluate(StatementAdapter.java:36)
> >>         at
> com.carrotsearch.randomizedtesting.rules.StatementAdapter.evaluate(StatementAdapter.java:36)
> >>         at
> org.apache.lucene.util.TestRuleAssertionsRequired$1.evaluate(TestRuleAssertionsRequired.java:54)
> >>         at
> org.apache.lucene.util.TestRuleMarkFailure$1.evaluate(TestRuleMarkFailure.java:48)
> >>         at
> org.apache.lucene.util.TestRuleIgnoreAfterMaxFailures$1.evaluate(TestRuleIgnoreAfterMaxFailures.java:65)
> >>         at
> org.apache.lucene.util.TestRuleIgnoreTestSuites$1.evaluate(TestRuleIgnoreTestSuites.java:55)
> >>         at
> com.carrotsearch.randomizedtesting.rules.StatementAdapter.evaluate(StatementAdapter.java:36)
> >>         at
> com.carrotsearch.randomizedtesting.ThreadLeakControl$StatementRunner.run(ThreadLeakControl.java:367)
> >>         at java.lang.Thread.run(Thread.java:745)
> >>
> >>
> >>
> >>
> >> Build Log:
> >> [...truncated 6204 lines...]
> >>    [junit4] Suite: org.apache.lucene.search.grouping.TestGrouping
> >>    [junit4]   2> NOTE: reproduce with: ant test
> -Dtestcase=TestGrouping -Dtests.method=testBasic
> -Dtests.seed=E3AE5C3FEE8E32AC -Dtests.multiplier=3 -Dtests.slow=true
> -Dtests.locale=es-CU -Dtests.timezone=America/Rio_Branco
> -Dtests.asserts=true -Dtests.file.encoding=ISO-8859-1
> >>    [junit4] FAILURE 0.01s J0 | TestGrouping.testBasic <<<
> >>    [junit4]    > Throwable #1: java.lang.AssertionError
> >>    [junit4]    >        at
> __randomizedtesting.SeedInfo.seed([E3AE5C3FEE8E32AC:4854412A3152B482]:0)
> >>    [junit4]    >        at
> org.apache.lucene.search.grouping.TestGrouping.testBasic(TestGrouping.java:180)
> >>    [junit4]    >        at java.lang.Thread.run(Thread.java:745)
> >>    [junit4]   2> NOTE: leaving temporary files on disk at:
> /home/jenkins/workspace/Lucene-Solr-trunk-Linux/lucene/build/grouping/test/J0/temp/lucene.search.grouping.TestGrouping_E3AE5C3FEE8E32AC-001
> >>    [junit4]   2> NOTE: test params are: codec=CheapBastard,
> sim=RandomSimilarity(queryNorm=false,coord=no):
> {content=DFI(Standardized)}, locale=es-CU, timezone=America/Rio_Branco
> >>    [junit4]   2> NOTE: Linux 3.19.0-42-generic amd64/Oracle Corporation
> 1.8.0_66 (64-bit)/cpus=12,threads=1,free=469842368,total=508887040
> >>    [junit4]   2> NOTE: All tests run in this JVM: [TestGrouping]
> >>    [junit4] Completed [6/6 (1!)] on J0 in 7.46s, 2 tests, 1 failure <<<
> FAILURES!
> >>
> >> [...truncated 11 lines...]
> >> BUILD FAILED
> >> /home/jenkins/workspace/Lucene-Solr-trunk-Linux/build.xml:784: The
> following error occurred while executing this line:
> >> /home/jenkins/workspace/Lucene-Solr-trunk-Linux/build.xml:728: The
> following error occurred while executing this line:
> >> /home/jenkins/workspace/Lucene-Solr-trunk-Linux/build.xml:59: The
> following error occurred while executing this line:
> >> /home/jenkins/workspace/Lucene-Solr-trunk-Linux/lucene/build.xml:472:
> The following error occurred while executing this line:
> >>
> /home/jenkins/workspace/Lucene-Solr-trunk-Linux/lucene/common-build.xml:2145:
> The following error occurred while executing this line:
> >>
> /home/jenkins/workspace/Lucene-Solr-trunk-Linux/lucene/module-build.xml:58:
> The following error occurred while executing this line:
> >>
> /home/jenkins/workspace/Lucene-Solr-trunk-Linux/lucene/common-build.xml:1415:
> The following error occurred while executing this line:
> >>
> /home/jenkins/workspace/Lucene-Solr-trunk-Linux/lucene/common-build.xml:972:
> There were test failures: 6 suites, 12 tests, 1 failure [seed:
> E3AE5C3FEE8E32AC]
> >>
> >> Total time: 13 minutes 22 seconds
> >> Build step 'Invoke Ant' marked build as failure
> >> Archiving artifacts
> >> [WARNINGS] Skipping publisher since build result is FAILURE
> >> Recording test results
> >> Email was triggered for: Failure - Any
> >> Sending email for trigger: Failure - Any
> >>
> >>
> >>
> >>
> >> ---------------------------------------------------------------------
> >> To unsubscribe, e-mail: dev-unsubscribe@lucene.apache.org
> >> For additional commands, e-mail: dev-help@lucene.apache.org
>
> ---------------------------------------------------------------------
> To unsubscribe, e-mail: dev-unsubscribe@lucene.apache.org
> For additional commands, e-mail: dev-help@lucene.apache.org
>
>

Mime
View raw message