lucene-dev mailing list archives

Site index · List index
Message view « Date » · « Thread »
Top « Date » · « Thread »
From Adrien Grand <adr...@elastic.co>
Subject Re: [CI] Lucene 5x Linux 64 Test Only - Build # 78648 - Failure!
Date Tue, 12 Jan 2016 17:28:38 GMT
I'm looking into these failures.

On Tue, Jan 12, 2016 at 5:27 PM <build@elastic.co> wrote:

> *BUILD FAILURE*
> Build URL
> http://build-eu-00.elastic.co/job/lucene_linux_java8_64_test_only/78648/
> Project:lucene_linux_java8_64_test_only Randomization: JDKO7,local,heap[512m],-server
> +UseSerialGC -UseCompressedOops +AggressiveOpts,sec manager on Date of
> build:Tue, 12 Jan 2016 17:20:36 +0100 Build duration:6 min 16 sec
> *CHANGES*   Revision by *jpountz: * *(Add version 5.4.1.)*   edit checkout
>   edit checkout/dev-tools   edit checkout/lucene   edit
> checkout/lucene/BUILD.txt   edit checkout/lucene/CHANGES.txt   edit
> checkout/lucene/JRE_VERSION_MIGRATION.txt   edit
> checkout/lucene/LICENSE.txt   edit checkout/lucene/MIGRATE.txt   edit
> checkout/lucene/NOTICE.txt   edit checkout/lucene/README.txt   edit
> checkout/lucene/SYSTEM_REQUIREMENTS.txt   edit checkout/lucene/analysis
>   edit
> checkout/lucene/analysis/common/src/java/org/apache/lucene/analysis/miscellaneous/Lucene47WordDelimiterFilter.java
>   edit
> checkout/lucene/analysis/common/src/java/org/apache/lucene/analysis/standard/std40/ASCIITLD.jflex-macro
>   edit
> checkout/lucene/analysis/common/src/java/org/apache/lucene/analysis/standard/std40/SUPPLEMENTARY.jflex-macro
>   edit
> checkout/lucene/analysis/common/src/java/org/apache/lucene/analysis/standard/std40/StandardTokenizerImpl40.java
>   edit
> checkout/lucene/analysis/common/src/java/org/apache/lucene/analysis/standard/std40/StandardTokenizerImpl40.jflex
>   edit
> checkout/lucene/analysis/common/src/java/org/apache/lucene/analysis/standard/std40/UAX29URLEmailTokenizerImpl40.java
>   edit
> checkout/lucene/analysis/common/src/java/org/apache/lucene/analysis/standard/std40/UAX29URLEmailTokenizerImpl40.jflex
>   edit
> checkout/lucene/analysis/common/src/java/org/apache/lucene/analysis/standard/std40/package.html
>   edit
> checkout/lucene/analysis/common/src/test/org/apache/lucene/analysis/miscellaneous/TestLucene47WordDelimiterFilter.java
>   edit checkout/lucene/backward-codecs   edit checkout/lucene/benchmark
>   edit checkout/lucene/build.xml   edit checkout/lucene/classification
>   edit checkout/lucene/classification/build.xml   edit
> checkout/lucene/classification/ivy.xml   edit
> checkout/lucene/classification/src   edit checkout/lucene/codecs   edit
> checkout/lucene/common-build.xml   edit checkout/lucene/core   edit
> checkout/lucene/core/src/java/org/apache/lucene/util/Version.java   edit
> checkout/lucene/core/src/test/org/apache/lucene/index/TestIndexWriterExceptions2.java
>   edit
> checkout/lucene/core/src/test/org/apache/lucene/search/TestSort.java
>   edit
> checkout/lucene/core/src/test/org/apache/lucene/search/TestSortRandom.java
>   edit
> checkout/lucene/core/src/test/org/apache/lucene/search/TestTopFieldCollector.java
>   edit
> checkout/lucene/core/src/test/org/apache/lucene/search/TestTotalHitCountCollector.java
>   edit checkout/lucene/demo   edit checkout/lucene/expressions   edit
> checkout/lucene/facet   edit checkout/lucene/grouping   edit
> checkout/lucene/highlighter   edit
> checkout/lucene/ivy-ignore-conflicts.properties   edit
> checkout/lucene/ivy-settings.xml   edit
> checkout/lucene/ivy-versions.properties   edit checkout/lucene/join   edit
> checkout/lucene/licenses   edit checkout/lucene/memory   edit
> checkout/lucene/misc   edit checkout/lucene/module-build.xml   edit
> checkout/lucene/queries   edit
> checkout/lucene/queries/src/test/org/apache/lucene/queries/function/TestFunctionQuerySort.java
>   edit checkout/lucene/queryparser   edit checkout/lucene/replicator
>   edit checkout/lucene/sandbox   edit checkout/lucene/site   edit
> checkout/lucene/spatial   edit
> checkout/lucene/spatial/src/java/org/apache/lucene/spatial/bbox   edit
> checkout/lucene/spatial/src/java/org/apache/lucene/spatial/prefix/PrefixTreeFacetCounter.java
>   edit
> checkout/lucene/spatial/src/java/org/apache/lucene/spatial/util/ShapeAreaValueSource.java
>   edit checkout/lucene/spatial/src/test-files/data/simple-bbox.txt   edit
> checkout/lucene/spatial/src/test-files/simple-Queries-BBox.txt   edit
> checkout/lucene/spatial/src/test/org/apache/lucene/spatial/bbox   edit
> checkout/lucene/spatial3d   edit checkout/lucene/suggest   edit
> checkout/lucene/test-framework   edit
> checkout/lucene/test-framework/src/java/org/apache/lucene/codecs/cranky
>   edit checkout/lucene/tools   edit checkout/lucene/version.properties
>   edit checkout/solr   edit checkout/solr/CHANGES.txt   edit
> checkout/solr/LICENSE.txt   edit checkout/solr/NOTICE.txt   edit
> checkout/solr/README.txt   edit checkout/solr/bin   edit
> checkout/solr/build.xml   edit checkout/solr/cloud-dev   edit
> checkout/solr/common-build.xml   edit checkout/solr/contrib   edit
> checkout/solr/core   edit
> checkout/solr/core/src/java/org/apache/solr/request/DocValuesStats.java
>   edit
> checkout/solr/core/src/java/org/apache/solr/schema/SchemaManager.java
>   edit checkout/solr/core/src/java/org/apache/solr/search   edit
> checkout/solr/core/src/test/org/apache/solr/core/TestConfig.java   edit
> checkout/solr/example   edit checkout/solr/licenses   edit
> checkout/solr/licenses/httpclient-LICENSE-ASL.txt   edit
> checkout/solr/licenses/httpclient-NOTICE.txt   edit
> checkout/solr/licenses/httpcore-LICENSE-ASL.txt   edit
> checkout/solr/licenses/httpcore-NOTICE.txt   edit
> checkout/solr/licenses/httpmime-LICENSE-ASL.txt   edit
> checkout/solr/licenses/httpmime-NOTICE.txt   edit checkout/solr/scripts
>   edit checkout/solr/server   edit checkout/solr/site   edit
> checkout/solr/site/SYSTEM_REQUIREMENTS.mdtext   edit checkout/solr/solrj
>   edit checkout/solr/test-framework   edit checkout/solr/webapp
> *BUILD ARTIFACTS*
>
>    -
>    checkout/lucene/build/backward-codecs/test/temp/junit4-J0-20160112_172543_008.events
>    <http://build-eu-00.elastic.co/job/lucene_linux_java8_64_test_only/78648/artifact/checkout/lucene/build/backward-codecs/test/temp/junit4-J0-20160112_172543_008.events>
>    -
>    checkout/lucene/build/backward-codecs/test/temp/junit4-J1-20160112_172543_008.events
>    <http://build-eu-00.elastic.co/job/lucene_linux_java8_64_test_only/78648/artifact/checkout/lucene/build/backward-codecs/test/temp/junit4-J1-20160112_172543_008.events>
>    -
>    checkout/lucene/build/backward-codecs/test/temp/junit4-J2-20160112_172543_008.events
>    <http://build-eu-00.elastic.co/job/lucene_linux_java8_64_test_only/78648/artifact/checkout/lucene/build/backward-codecs/test/temp/junit4-J2-20160112_172543_008.events>
>    -
>    checkout/lucene/build/backward-codecs/test/temp/junit4-J3-20160112_172543_008.events
>    <http://build-eu-00.elastic.co/job/lucene_linux_java8_64_test_only/78648/artifact/checkout/lucene/build/backward-codecs/test/temp/junit4-J3-20160112_172543_008.events>
>    -
>    checkout/lucene/build/backward-codecs/test/temp/junit4-J4-20160112_172543_008.events
>    <http://build-eu-00.elastic.co/job/lucene_linux_java8_64_test_only/78648/artifact/checkout/lucene/build/backward-codecs/test/temp/junit4-J4-20160112_172543_008.events>
>    -
>    checkout/lucene/build/backward-codecs/test/temp/junit4-J5-20160112_172543_009.events
>    <http://build-eu-00.elastic.co/job/lucene_linux_java8_64_test_only/78648/artifact/checkout/lucene/build/backward-codecs/test/temp/junit4-J5-20160112_172543_009.events>
>    -
>    checkout/lucene/build/backward-codecs/test/temp/junit4-J6-20160112_172543_009.events
>    <http://build-eu-00.elastic.co/job/lucene_linux_java8_64_test_only/78648/artifact/checkout/lucene/build/backward-codecs/test/temp/junit4-J6-20160112_172543_009.events>
>    -
>    checkout/lucene/build/backward-codecs/test/temp/junit4-J7-20160112_172543_009.events
>    <http://build-eu-00.elastic.co/job/lucene_linux_java8_64_test_only/78648/artifact/checkout/lucene/build/backward-codecs/test/temp/junit4-J7-20160112_172543_009.events>
>
>
> *FAILED JUNIT TESTS* Name: org.apache.lucene.index Failed: 1 test(s),
> Passed: 822 test(s), Skipped: 29 test(s), Total: 852 test(s)
>
>
> * - Failed:
> org.apache.lucene.index.TestBackwardsCompatibility.testAllVersionsTested *
> *CONSOLE OUTPUT* [...truncated 5555 lines...] [junit4] [junit4] [junit4]
> JVM J0: 0.31 .. 35.88 = 35.58s [junit4] JVM J1: 0.58 .. 37.67 = 37.09s [junit4]
> JVM J2: 0.59 .. 45.44 = 44.85s [junit4] JVM J3: 0.30 .. 37.46 = 37.16s [junit4]
> JVM J4: 0.58 .. 42.77 = 42.19s [junit4] JVM J5: 0.58 .. 63.69 = 63.11s [junit4]
> JVM J6: 0.33 .. 44.97 = 44.64s [junit4] JVM J7: 0.54 .. 34.13 = 33.60s [junit4]
> Execution time total: 1 minute 3 seconds [junit4] Tests summary: 30
> suites, 831 tests, 1 failure, 93 ignored (93 assumptions) BUILD FAILED /home/jenkins/workspace/lucene_linux_java8_64_test_only/checkout/lucene/build.xml:472:
> The following error occurred while executing this line: /home/jenkins/workspace/lucene_linux_java8_64_test_only/checkout/lucene/common-build.xml:2240:
> The following error occurred while executing this line: /home/jenkins/workspace/lucene_linux_java8_64_test_only/checkout/lucene/module-build.xml:58:
> The following error occurred while executing this line: /home/jenkins/workspace/lucene_linux_java8_64_test_only/checkout/lucene/common-build.xml:1444:
> The following error occurred while executing this line: /home/jenkins/workspace/lucene_linux_java8_64_test_only/checkout/lucene/common-build.xml:1000:
> There were test failures: 30 suites, 831 tests, 1 failure, 93 ignored (93
> assumptions) [seed: C9FAAA9D94D5929A] Total time: 5 minutes 56 seconds Build
> step 'Invoke Ant' marked build as failure Archiving artifacts Recording
> test results [description-setter] Description set:
> JDKO7,local,heap[512m],-server +UseSerialGC -UseCompressedOops
> +AggressiveOpts,sec manager on Email was triggered for: Failure - 1st Trigger
> Failure - Any was overridden by another trigger and will not send an email. Trigger
> Failure - Still was overridden by another trigger and will not send an
> email. Sending email for trigger: Failure - 1st
>

Mime
View raw message