lucene-dev mailing list archives

Site index · List index
Message view « Date » · « Thread »
Top « Date » · « Thread »
From Apache Jenkins Server <jenk...@builds.apache.org>
Subject [JENKINS] Lucene-Solr-Tests-5.x-Java7 - Build # 3926 - Still Failing
Date Wed, 20 Jan 2016 10:54:07 GMT
Build: https://builds.apache.org/job/Lucene-Solr-Tests-5.x-Java7/3926/

3 tests failed.
FAILED:  org.apache.solr.hadoop.MorphlineMapperTest.testMapper

Error Message:
Malformed / non-existent locale:  near: {     # /x1/jenkins/jenkins-slave/workspace/Lucene-Solr-Tests-5.x-Java7/solr/build/contrib/solr-map-reduce/test/J0/temp/solr.hadoop.MorphlineMapperTest_40C2758AB522AB4D-001/tempDir-001/test-morphlines/solrCellDocumentTypes.conf: 201     #  various java.text.SimpleDateFormat     #  xpath : "/xhtml:html/xhtml:body/xhtml:div/descendant:node()"     "uprefix" : "ignored_",     # /x1/jenkins/jenkins-slave/workspace/Lucene-Solr-Tests-5.x-Java7/solr/build/contrib/solr-map-reduce/test/J0/temp/solr.hadoop.MorphlineMapperTest_40C2758AB522AB4D-001/tempDir-001/test-morphlines/solrCellDocumentTypes.conf: 198     "fmap" : {         # /x1/jenkins/jenkins-slave/workspace/Lucene-Solr-Tests-5.x-Java7/solr/build/contrib/solr-map-reduce/test/J0/temp/solr.hadoop.MorphlineMapperTest_40C2758AB522AB4D-001/tempDir-001/test-morphlines/solrCellDocumentTypes.conf: 198         "content" : "text",         # /x1/jenkins/jenkins-slave/workspace/Lucene-Solr-Tests-5.x-Java7/solr/build/contrib/solr-map-reduce/test/J0/temp/solr.hadoop.MorphlineMapperTest_40C2758AB522AB4D-001/tempDir-001/test-morphlines/solrCellDocumentTypes.conf: 198         "content-type" : "content_type"     },     # /x1/jenkins/jenkins-slave/workspace/Lucene-Solr-Tests-5.x-Java7/solr/build/contrib/solr-map-reduce/test/J0/temp/solr.hadoop.MorphlineMapperTest_40C2758AB522AB4D-001/tempDir-001/test-morphlines/solrCellDocumentTypes.conf: 202     "lowernames" : true,     # /x1/jenkins/jenkins-slave/workspace/Lucene-Solr-Tests-5.x-Java7/solr/build/contrib/solr-map-reduce/test/J0/temp/solr.hadoop.MorphlineMapperTest_40C2758AB522AB4D-001/tempDir-001/test-morphlines/solrCellDocumentTypes.conf: 158     "solrLocator" : {         # /x1/jenkins/jenkins-slave/workspace/Lucene-Solr-Tests-5.x-Java7/solr/build/contrib/solr-map-reduce/test/J0/temp/solr.hadoop.MorphlineMapperTest_40C2758AB522AB4D-001/tempDir-001/test-morphlines/solrCellDocumentTypes.conf: 158         "collection" : "collection1"     },     # /x1/jenkins/jenkins-slave/workspace/Lucene-Solr-Tests-5.x-Java7/solr/build/contrib/solr-map-reduce/test/J0/temp/solr.hadoop.MorphlineMapperTest_40C2758AB522AB4D-001/tempDir-001/test-morphlines/solrCellDocumentTypes.conf: 199     #  rename "content" field to "text" fields     "dateFormats" : [         # /x1/jenkins/jenkins-slave/workspace/Lucene-Solr-Tests-5.x-Java7/solr/build/contrib/solr-map-reduce/test/J0/temp/solr.hadoop.MorphlineMapperTest_40C2758AB522AB4D-001/tempDir-001/test-morphlines/solrCellDocumentTypes.conf: 199         "yyyy-MM-dd'T'HH:mm:ss",         # /x1/jenkins/jenkins-slave/workspace/Lucene-Solr-Tests-5.x-Java7/solr/build/contrib/solr-map-reduce/test/J0/temp/solr.hadoop.MorphlineMapperTest_40C2758AB522AB4D-001/tempDir-001/test-morphlines/solrCellDocumentTypes.conf: 199         "yyyy-MM-dd"     ],     # /x1/jenkins/jenkins-slave/workspace/Lucene-Solr-Tests-5.x-Java7/solr/build/contrib/solr-map-reduce/test/J0/temp/solr.hadoop.MorphlineMapperTest_40C2758AB522AB4D-001/tempDir-001/test-morphlines/solrCellDocumentTypes.conf: 207     #  Tika parsers to be registered. If multiple parsers support the same MIME type,      #  the parser is chosen that is closest to the bottom in this list:     "parsers" : [         # /x1/jenkins/jenkins-slave/workspace/Lucene-Solr-Tests-5.x-Java7/solr/build/contrib/solr-map-reduce/test/J0/temp/solr.hadoop.MorphlineMapperTest_40C2758AB522AB4D-001/tempDir-001/test-morphlines/solrCellDocumentTypes.conf: 208         {             # /x1/jenkins/jenkins-slave/workspace/Lucene-Solr-Tests-5.x-Java7/solr/build/contrib/solr-map-reduce/test/J0/temp/solr.hadoop.MorphlineMapperTest_40C2758AB522AB4D-001/tempDir-001/test-morphlines/solrCellDocumentTypes.conf: 208             "parser" : "org.apache.tika.parser.asm.ClassParser"         },         # /x1/jenkins/jenkins-slave/workspace/Lucene-Solr-Tests-5.x-Java7/solr/build/contrib/solr-map-reduce/test/J0/temp/solr.hadoop.MorphlineMapperTest_40C2758AB522AB4D-001/tempDir-001/test-morphlines/solrCellDocumentTypes.conf: 211         #  { parser : org.apache.tika.parser.AutoDetectParser }                               #  { parser : org.gagravarr.tika.OggParser, additionalSupportedMimeTypes : [audio/ogg] }         {             # /x1/jenkins/jenkins-slave/workspace/Lucene-Solr-Tests-5.x-Java7/solr/build/contrib/solr-map-reduce/test/J0/temp/solr.hadoop.MorphlineMapperTest_40C2758AB522AB4D-001/tempDir-001/test-morphlines/solrCellDocumentTypes.conf: 211             "parser" : "org.gagravarr.tika.FlacParser"         },         # /x1/jenkins/jenkins-slave/workspace/Lucene-Solr-Tests-5.x-Java7/solr/build/contrib/solr-map-reduce/test/J0/temp/solr.hadoop.MorphlineMapperTest_40C2758AB522AB4D-001/tempDir-001/test-morphlines/solrCellDocumentTypes.conf: 212         {             # /x1/jenkins/jenkins-slave/workspace/Lucene-Solr-Tests-5.x-Java7/solr/build/contrib/solr-map-reduce/test/J0/temp/solr.hadoop.MorphlineMapperTest_40C2758AB522AB4D-001/tempDir-001/test-morphlines/solrCellDocumentTypes.conf: 212             "parser" : "org.apache.tika.parser.audio.AudioParser"         },         # /x1/jenkins/jenkins-slave/workspace/Lucene-Solr-Tests-5.x-Java7/solr/build/contrib/solr-map-reduce/test/J0/temp/solr.hadoop.MorphlineMapperTest_40C2758AB522AB4D-001/tempDir-001/test-morphlines/solrCellDocumentTypes.conf: 213         {             # /x1/jenkins/jenkins-slave/workspace/Lucene-Solr-Tests-5.x-Java7/solr/build/contrib/solr-map-reduce/test/J0/temp/solr.hadoop.MorphlineMapperTest_40C2758AB522AB4D-001/tempDir-001/test-morphlines/solrCellDocumentTypes.conf: 213             "parser" : "org.apache.tika.parser.audio.MidiParser"         },         # /x1/jenkins/jenkins-slave/workspace/Lucene-Solr-Tests-5.x-Java7/solr/build/contrib/solr-map-reduce/test/J0/temp/solr.hadoop.MorphlineMapperTest_40C2758AB522AB4D-001/tempDir-001/test-morphlines/solrCellDocumentTypes.conf: 214         {             # /x1/jenkins/jenkins-slave/workspace/Lucene-Solr-Tests-5.x-Java7/solr/build/contrib/solr-map-reduce/test/J0/temp/solr.hadoop.MorphlineMapperTest_40C2758AB522AB4D-001/tempDir-001/test-morphlines/solrCellDocumentTypes.conf: 214             "parser" : "org.apache.tika.parser.crypto.Pkcs7Parser"         },         # /x1/jenkins/jenkins-slave/workspace/Lucene-Solr-Tests-5.x-Java7/solr/build/contrib/solr-map-reduce/test/J0/temp/solr.hadoop.MorphlineMapperTest_40C2758AB522AB4D-001/tempDir-001/test-morphlines/solrCellDocumentTypes.conf: 215         {             # /x1/jenkins/jenkins-slave/workspace/Lucene-Solr-Tests-5.x-Java7/solr/build/contrib/solr-map-reduce/test/J0/temp/solr.hadoop.MorphlineMapperTest_40C2758AB522AB4D-001/tempDir-001/test-morphlines/solrCellDocumentTypes.conf: 215             "parser" : "org.apache.tika.parser.dwg.DWGParser"         },         # /x1/jenkins/jenkins-slave/workspace/Lucene-Solr-Tests-5.x-Java7/solr/build/contrib/solr-map-reduce/test/J0/temp/solr.hadoop.MorphlineMapperTest_40C2758AB522AB4D-001/tempDir-001/test-morphlines/solrCellDocumentTypes.conf: 216         {             # /x1/jenkins/jenkins-slave/workspace/Lucene-Solr-Tests-5.x-Java7/solr/build/contrib/solr-map-reduce/test/J0/temp/solr.hadoop.MorphlineMapperTest_40C2758AB522AB4D-001/tempDir-001/test-morphlines/solrCellDocumentTypes.conf: 216             "parser" : "org.apache.tika.parser.epub.EpubParser"         },         # /x1/jenkins/jenkins-slave/workspace/Lucene-Solr-Tests-5.x-Java7/solr/build/contrib/solr-map-reduce/test/J0/temp/solr.hadoop.MorphlineMapperTest_40C2758AB522AB4D-001/tempDir-001/test-morphlines/solrCellDocumentTypes.conf: 217         {             # /x1/jenkins/jenkins-slave/workspace/Lucene-Solr-Tests-5.x-Java7/solr/build/contrib/solr-map-reduce/test/J0/temp/solr.hadoop.MorphlineMapperTest_40C2758AB522AB4D-001/tempDir-001/test-morphlines/solrCellDocumentTypes.conf: 217             "parser" : "org.apache.tika.parser.executable.ExecutableParser"         },         # /x1/jenkins/jenkins-slave/workspace/Lucene-Solr-Tests-5.x-Java7/solr/build/contrib/solr-map-reduce/test/J0/temp/solr.hadoop.MorphlineMapperTest_40C2758AB522AB4D-001/tempDir-001/test-morphlines/solrCellDocumentTypes.conf: 218         {             # /x1/jenkins/jenkins-slave/workspace/Lucene-Solr-Tests-5.x-Java7/solr/build/contrib/solr-map-reduce/test/J0/temp/solr.hadoop.MorphlineMapperTest_40C2758AB522AB4D-001/tempDir-001/test-morphlines/solrCellDocumentTypes.conf: 218             "parser" : "org.apache.tika.parser.feed.FeedParser"         },         # /x1/jenkins/jenkins-slave/workspace/Lucene-Solr-Tests-5.x-Java7/solr/build/contrib/solr-map-reduce/test/J0/temp/solr.hadoop.MorphlineMapperTest_40C2758AB522AB4D-001/tempDir-001/test-morphlines/solrCellDocumentTypes.conf: 219         {             # /x1/jenkins/jenkins-slave/workspace/Lucene-Solr-Tests-5.x-Java7/solr/build/contrib/solr-map-reduce/test/J0/temp/solr.hadoop.MorphlineMapperTest_40C2758AB522AB4D-001/tempDir-001/test-morphlines/solrCellDocumentTypes.conf: 219             "parser" : "org.apache.tika.parser.font.AdobeFontMetricParser"         },         # /x1/jenkins/jenkins-slave/workspace/Lucene-Solr-Tests-5.x-Java7/solr/build/contrib/solr-map-reduce/test/J0/temp/solr.hadoop.MorphlineMapperTest_40C2758AB522AB4D-001/tempDir-001/test-morphlines/solrCellDocumentTypes.conf: 220         {             # /x1/jenkins/jenkins-slave/workspace/Lucene-Solr-Tests-5.x-Java7/solr/build/contrib/solr-map-reduce/test/J0/temp/solr.hadoop.MorphlineMapperTest_40C2758AB522AB4D-001/tempDir-001/test-morphlines/solrCellDocumentTypes.conf: 220             "parser" : "org.apache.tika.parser.font.TrueTypeParser"         },         # /x1/jenkins/jenkins-slave/workspace/Lucene-Solr-Tests-5.x-Java7/solr/build/contrib/solr-map-reduce/test/J0/temp/solr.hadoop.MorphlineMapperTest_40C2758AB522AB4D-001/tempDir-001/test-morphlines/solrCellDocumentTypes.conf: 221         {             # /x1/jenkins/jenkins-slave/workspace/Lucene-Solr-Tests-5.x-Java7/solr/build/contrib/solr-map-reduce/test/J0/temp/solr.hadoop.MorphlineMapperTest_40C2758AB522AB4D-001/tempDir-001/test-morphlines/solrCellDocumentTypes.conf: 221             "parser" : "org.apache.tika.parser.xml.XMLParser"         },         # /x1/jenkins/jenkins-slave/workspace/Lucene-Solr-Tests-5.x-Java7/solr/build/contrib/solr-map-reduce/test/J0/temp/solr.hadoop.MorphlineMapperTest_40C2758AB522AB4D-001/tempDir-001/test-morphlines/solrCellDocumentTypes.conf: 222         {             # /x1/jenkins/jenkins-slave/workspace/Lucene-Solr-Tests-5.x-Java7/solr/build/contrib/solr-map-reduce/test/J0/temp/solr.hadoop.MorphlineMapperTest_40C2758AB522AB4D-001/tempDir-001/test-morphlines/solrCellDocumentTypes.conf: 222             "parser" : "org.apache.tika.parser.html.HtmlParser"         },         # /x1/jenkins/jenkins-slave/workspace/Lucene-Solr-Tests-5.x-Java7/solr/build/contrib/solr-map-reduce/test/J0/temp/solr.hadoop.MorphlineMapperTest_40C2758AB522AB4D-001/tempDir-001/test-morphlines/solrCellDocumentTypes.conf: 223         {             # /x1/jenkins/jenkins-slave/workspace/Lucene-Solr-Tests-5.x-Java7/solr/build/contrib/solr-map-reduce/test/J0/temp/solr.hadoop.MorphlineMapperTest_40C2758AB522AB4D-001/tempDir-001/test-morphlines/solrCellDocumentTypes.conf: 223             "parser" : "org.apache.tika.parser.image.ImageParser"         },         # /x1/jenkins/jenkins-slave/workspace/Lucene-Solr-Tests-5.x-Java7/solr/build/contrib/solr-map-reduce/test/J0/temp/solr.hadoop.MorphlineMapperTest_40C2758AB522AB4D-001/tempDir-001/test-morphlines/solrCellDocumentTypes.conf: 224         {             # /x1/jenkins/jenkins-slave/workspace/Lucene-Solr-Tests-5.x-Java7/solr/build/contrib/solr-map-reduce/test/J0/temp/solr.hadoop.MorphlineMapperTest_40C2758AB522AB4D-001/tempDir-001/test-morphlines/solrCellDocumentTypes.conf: 224             "parser" : "org.apache.tika.parser.image.PSDParser"         },         # /x1/jenkins/jenkins-slave/workspace/Lucene-Solr-Tests-5.x-Java7/solr/build/contrib/solr-map-reduce/test/J0/temp/solr.hadoop.MorphlineMapperTest_40C2758AB522AB4D-001/tempDir-001/test-morphlines/solrCellDocumentTypes.conf: 225         {             # /x1/jenkins/jenkins-slave/workspace/Lucene-Solr-Tests-5.x-Java7/solr/build/contrib/solr-map-reduce/test/J0/temp/solr.hadoop.MorphlineMapperTest_40C2758AB522AB4D-001/tempDir-001/test-morphlines/solrCellDocumentTypes.conf: 225             "parser" : "org.apache.tika.parser.image.TiffParser"         },         # /x1/jenkins/jenkins-slave/workspace/Lucene-Solr-Tests-5.x-Java7/solr/build/contrib/solr-map-reduce/test/J0/temp/solr.hadoop.MorphlineMapperTest_40C2758AB522AB4D-001/tempDir-001/test-morphlines/solrCellDocumentTypes.conf: 226         {             # /x1/jenkins/jenkins-slave/workspace/Lucene-Solr-Tests-5.x-Java7/solr/build/contrib/solr-map-reduce/test/J0/temp/solr.hadoop.MorphlineMapperTest_40C2758AB522AB4D-001/tempDir-001/test-morphlines/solrCellDocumentTypes.conf: 226             "parser" : "org.apache.tika.parser.iptc.IptcAnpaParser"         },         # /x1/jenkins/jenkins-slave/workspace/Lucene-Solr-Tests-5.x-Java7/solr/build/contrib/solr-map-reduce/test/J0/temp/solr.hadoop.MorphlineMapperTest_40C2758AB522AB4D-001/tempDir-001/test-morphlines/solrCellDocumentTypes.conf: 227         {             # /x1/jenkins/jenkins-slave/workspace/Lucene-Solr-Tests-5.x-Java7/solr/build/contrib/solr-map-reduce/test/J0/temp/solr.hadoop.MorphlineMapperTest_40C2758AB522AB4D-001/tempDir-001/test-morphlines/solrCellDocumentTypes.conf: 227             "parser" : "org.apache.tika.parser.iwork.IWorkPackageParser"         },         # /x1/jenkins/jenkins-slave/workspace/Lucene-Solr-Tests-5.x-Java7/solr/build/contrib/solr-map-reduce/test/J0/temp/solr.hadoop.MorphlineMapperTest_40C2758AB522AB4D-001/tempDir-001/test-morphlines/solrCellDocumentTypes.conf: 228         {             # /x1/jenkins/jenkins-slave/workspace/Lucene-Solr-Tests-5.x-Java7/solr/build/contrib/solr-map-reduce/test/J0/temp/solr.hadoop.MorphlineMapperTest_40C2758AB522AB4D-001/tempDir-001/test-morphlines/solrCellDocumentTypes.conf: 228             "parser" : "org.apache.tika.parser.jpeg.JpegParser"         },         # /x1/jenkins/jenkins-slave/workspace/Lucene-Solr-Tests-5.x-Java7/solr/build/contrib/solr-map-reduce/test/J0/temp/solr.hadoop.MorphlineMapperTest_40C2758AB522AB4D-001/tempDir-001/test-morphlines/solrCellDocumentTypes.conf: 229         {             # /x1/jenkins/jenkins-slave/workspace/Lucene-Solr-Tests-5.x-Java7/solr/build/contrib/solr-map-reduce/test/J0/temp/solr.hadoop.MorphlineMapperTest_40C2758AB522AB4D-001/tempDir-001/test-morphlines/solrCellDocumentTypes.conf: 229             "parser" : "org.apache.tika.parser.mail.RFC822Parser"         },         # /x1/jenkins/jenkins-slave/workspace/Lucene-Solr-Tests-5.x-Java7/solr/build/contrib/solr-map-reduce/test/J0/temp/solr.hadoop.MorphlineMapperTest_40C2758AB522AB4D-001/tempDir-001/test-morphlines/solrCellDocumentTypes.conf: 230         {             # /x1/jenkins/jenkins-slave/workspace/Lucene-Solr-Tests-5.x-Java7/solr/build/contrib/solr-map-reduce/test/J0/temp/solr.hadoop.MorphlineMapperTest_40C2758AB522AB4D-001/tempDir-001/test-morphlines/solrCellDocumentTypes.conf: 230             "parser" : "org.apache.tika.parser.mbox.MboxParser",             # /x1/jenkins/jenkins-slave/workspace/Lucene-Solr-Tests-5.x-Java7/solr/build/contrib/solr-map-reduce/test/J0/temp/solr.hadoop.MorphlineMapperTest_40C2758AB522AB4D-001/tempDir-001/test-morphlines/solrCellDocumentTypes.conf: 230             "additionalSupportedMimeTypes" : [                 # /x1/jenkins/jenkins-slave/workspace/Lucene-Solr-Tests-5.x-Java7/solr/build/contrib/solr-map-reduce/test/J0/temp/solr.hadoop.MorphlineMapperTest_40C2758AB522AB4D-001/tempDir-001/test-morphlines/solrCellDocumentTypes.conf: 230                 "message/x-emlx"             ]         },         # /x1/jenkins/jenkins-slave/workspace/Lucene-Solr-Tests-5.x-Java7/solr/build/contrib/solr-map-reduce/test/J0/temp/solr.hadoop.MorphlineMapperTest_40C2758AB522AB4D-001/tempDir-001/test-morphlines/solrCellDocumentTypes.conf: 231         {             # /x1/jenkins/jenkins-slave/workspace/Lucene-Solr-Tests-5.x-Java7/solr/build/contrib/solr-map-reduce/test/J0/temp/solr.hadoop.MorphlineMapperTest_40C2758AB522AB4D-001/tempDir-001/test-morphlines/solrCellDocumentTypes.conf: 231             "parser" : "org.apache.tika.parser.microsoft.OfficeParser"         },         # /x1/jenkins/jenkins-slave/workspace/Lucene-Solr-Tests-5.x-Java7/solr/build/contrib/solr-map-reduce/test/J0/temp/solr.hadoop.MorphlineMapperTest_40C2758AB522AB4D-001/tempDir-001/test-morphlines/solrCellDocumentTypes.conf: 232         {             # /x1/jenkins/jenkins-slave/workspace/Lucene-Solr-Tests-5.x-Java7/solr/build/contrib/solr-map-reduce/test/J0/temp/solr.hadoop.MorphlineMapperTest_40C2758AB522AB4D-001/tempDir-001/test-morphlines/solrCellDocumentTypes.conf: 232             "parser" : "org.apache.tika.parser.microsoft.TNEFParser"         },         # /x1/jenkins/jenkins-slave/workspace/Lucene-Solr-Tests-5.x-Java7/solr/build/contrib/solr-map-reduce/test/J0/temp/solr.hadoop.MorphlineMapperTest_40C2758AB522AB4D-001/tempDir-001/test-morphlines/solrCellDocumentTypes.conf: 233         {             # /x1/jenkins/jenkins-slave/workspace/Lucene-Solr-Tests-5.x-Java7/solr/build/contrib/solr-map-reduce/test/J0/temp/solr.hadoop.MorphlineMapperTest_40C2758AB522AB4D-001/tempDir-001/test-morphlines/solrCellDocumentTypes.conf: 233             "parser" : "org.apache.tika.parser.microsoft.ooxml.OOXMLParser"         },         # /x1/jenkins/jenkins-slave/workspace/Lucene-Solr-Tests-5.x-Java7/solr/build/contrib/solr-map-reduce/test/J0/temp/solr.hadoop.MorphlineMapperTest_40C2758AB522AB4D-001/tempDir-001/test-morphlines/solrCellDocumentTypes.conf: 234         {             # /x1/jenkins/jenkins-slave/workspace/Lucene-Solr-Tests-5.x-Java7/solr/build/contrib/solr-map-reduce/test/J0/temp/solr.hadoop.MorphlineMapperTest_40C2758AB522AB4D-001/tempDir-001/test-morphlines/solrCellDocumentTypes.conf: 234             "parser" : "org.apache.tika.parser.mp3.Mp3Parser"         },         # /x1/jenkins/jenkins-slave/workspace/Lucene-Solr-Tests-5.x-Java7/solr/build/contrib/solr-map-reduce/test/J0/temp/solr.hadoop.MorphlineMapperTest_40C2758AB522AB4D-001/tempDir-001/test-morphlines/solrCellDocumentTypes.conf: 235         {             # /x1/jenkins/jenkins-slave/workspace/Lucene-Solr-Tests-5.x-Java7/solr/build/contrib/solr-map-reduce/test/J0/temp/solr.hadoop.MorphlineMapperTest_40C2758AB522AB4D-001/tempDir-001/test-morphlines/solrCellDocumentTypes.conf: 235             "parser" : "org.apache.tika.parser.mp4.MP4Parser"         },         # /x1/jenkins/jenkins-slave/workspace/Lucene-Solr-Tests-5.x-Java7/solr/build/contrib/solr-map-reduce/test/J0/temp/solr.hadoop.MorphlineMapperTest_40C2758AB522AB4D-001/tempDir-001/test-morphlines/solrCellDocumentTypes.conf: 236         {             # /x1/jenkins/jenkins-slave/workspace/Lucene-Solr-Tests-5.x-Java7/solr/build/contrib/solr-map-reduce/test/J0/temp/solr.hadoop.MorphlineMapperTest_40C2758AB522AB4D-001/tempDir-001/test-morphlines/solrCellDocumentTypes.conf: 236             "parser" : "org.apache.tika.parser.hdf.HDFParser"         },         # /x1/jenkins/jenkins-slave/workspace/Lucene-Solr-Tests-5.x-Java7/solr/build/contrib/solr-map-reduce/test/J0/temp/solr.hadoop.MorphlineMapperTest_40C2758AB522AB4D-001/tempDir-001/test-morphlines/solrCellDocumentTypes.conf: 237         {             # /x1/jenkins/jenkins-slave/workspace/Lucene-Solr-Tests-5.x-Java7/solr/build/contrib/solr-map-reduce/test/J0/temp/solr.hadoop.MorphlineMapperTest_40C2758AB522AB4D-001/tempDir-001/test-morphlines/solrCellDocumentTypes.conf: 237             "parser" : "org.apache.tika.parser.netcdf.NetCDFParser"         },         # /x1/jenkins/jenkins-slave/workspace/Lucene-Solr-Tests-5.x-Java7/solr/build/contrib/solr-map-reduce/test/J0/temp/solr.hadoop.MorphlineMapperTest_40C2758AB522AB4D-001/tempDir-001/test-morphlines/solrCellDocumentTypes.conf: 238         {             # /x1/jenkins/jenkins-slave/workspace/Lucene-Solr-Tests-5.x-Java7/solr/build/contrib/solr-map-reduce/test/J0/temp/solr.hadoop.MorphlineMapperTest_40C2758AB522AB4D-001/tempDir-001/test-morphlines/solrCellDocumentTypes.conf: 238             "parser" : "org.apache.tika.parser.odf.OpenDocumentParser"         },         # /x1/jenkins/jenkins-slave/workspace/Lucene-Solr-Tests-5.x-Java7/solr/build/contrib/solr-map-reduce/test/J0/temp/solr.hadoop.MorphlineMapperTest_40C2758AB522AB4D-001/tempDir-001/test-morphlines/solrCellDocumentTypes.conf: 239         {             # /x1/jenkins/jenkins-slave/workspace/Lucene-Solr-Tests-5.x-Java7/solr/build/contrib/solr-map-reduce/test/J0/temp/solr.hadoop.MorphlineMapperTest_40C2758AB522AB4D-001/tempDir-001/test-morphlines/solrCellDocumentTypes.conf: 239             "parser" : "org.apache.tika.parser.pdf.PDFParser"         },         # /x1/jenkins/jenkins-slave/workspace/Lucene-Solr-Tests-5.x-Java7/solr/build/contrib/solr-map-reduce/test/J0/temp/solr.hadoop.MorphlineMapperTest_40C2758AB522AB4D-001/tempDir-001/test-morphlines/solrCellDocumentTypes.conf: 240         {             # /x1/jenkins/jenkins-slave/workspace/Lucene-Solr-Tests-5.x-Java7/solr/build/contrib/solr-map-reduce/test/J0/temp/solr.hadoop.MorphlineMapperTest_40C2758AB522AB4D-001/tempDir-001/test-morphlines/solrCellDocumentTypes.conf: 240             "parser" : "org.apache.tika.parser.pkg.CompressorParser"         },         # /x1/jenkins/jenkins-slave/workspace/Lucene-Solr-Tests-5.x-Java7/solr/build/contrib/solr-map-reduce/test/J0/temp/solr.hadoop.MorphlineMapperTest_40C2758AB522AB4D-001/tempDir-001/test-morphlines/solrCellDocumentTypes.conf: 241         {             # /x1/jenkins/jenkins-slave/workspace/Lucene-Solr-Tests-5.x-Java7/solr/build/contrib/solr-map-reduce/test/J0/temp/solr.hadoop.MorphlineMapperTest_40C2758AB522AB4D-001/tempDir-001/test-morphlines/solrCellDocumentTypes.conf: 241             "parser" : "org.apache.tika.parser.pkg.PackageParser"         },         # /x1/jenkins/jenkins-slave/workspace/Lucene-Solr-Tests-5.x-Java7/solr/build/contrib/solr-map-reduce/test/J0/temp/solr.hadoop.MorphlineMapperTest_40C2758AB522AB4D-001/tempDir-001/test-morphlines/solrCellDocumentTypes.conf: 242         {             # /x1/jenkins/jenkins-slave/workspace/Lucene-Solr-Tests-5.x-Java7/solr/build/contrib/solr-map-reduce/test/J0/temp/solr.hadoop.MorphlineMapperTest_40C2758AB522AB4D-001/tempDir-001/test-morphlines/solrCellDocumentTypes.conf: 242             "parser" : "org.apache.tika.parser.rtf.RTFParser"         },         # /x1/jenkins/jenkins-slave/workspace/Lucene-Solr-Tests-5.x-Java7/solr/build/contrib/solr-map-reduce/test/J0/temp/solr.hadoop.MorphlineMapperTest_40C2758AB522AB4D-001/tempDir-001/test-morphlines/solrCellDocumentTypes.conf: 243         {             # /x1/jenkins/jenkins-slave/workspace/Lucene-Solr-Tests-5.x-Java7/solr/build/contrib/solr-map-reduce/test/J0/temp/solr.hadoop.MorphlineMapperTest_40C2758AB522AB4D-001/tempDir-001/test-morphlines/solrCellDocumentTypes.conf: 243             "parser" : "org.apache.tika.parser.txt.TXTParser"         },         # /x1/jenkins/jenkins-slave/workspace/Lucene-Solr-Tests-5.x-Java7/solr/build/contrib/solr-map-reduce/test/J0/temp/solr.hadoop.MorphlineMapperTest_40C2758AB522AB4D-001/tempDir-001/test-morphlines/solrCellDocumentTypes.conf: 244         {             # /x1/jenkins/jenkins-slave/workspace/Lucene-Solr-Tests-5.x-Java7/solr/build/contrib/solr-map-reduce/test/J0/temp/solr.hadoop.MorphlineMapperTest_40C2758AB522AB4D-001/tempDir-001/test-morphlines/solrCellDocumentTypes.conf: 244             "parser" : "org.apache.tika.parser.video.FLVParser"         },         # /x1/jenkins/jenkins-slave/workspace/Lucene-Solr-Tests-5.x-Java7/solr/build/contrib/solr-map-reduce/test/J0/temp/solr.hadoop.MorphlineMapperTest_40C2758AB522AB4D-001/tempDir-001/test-morphlines/solrCellDocumentTypes.conf: 245         {             # /x1/jenkins/jenkins-slave/workspace/Lucene-Solr-Tests-5.x-Java7/solr/build/contrib/solr-map-reduce/test/J0/temp/solr.hadoop.MorphlineMapperTest_40C2758AB522AB4D-001/tempDir-001/test-morphlines/solrCellDocumentTypes.conf: 245             "parser" : "org.apache.tika.parser.xml.DcXMLParser"         },         # /x1/jenkins/jenkins-slave/workspace/Lucene-Solr-Tests-5.x-Java7/solr/build/contrib/solr-map-reduce/test/J0/temp/solr.hadoop.MorphlineMapperTest_40C2758AB522AB4D-001/tempDir-001/test-morphlines/solrCellDocumentTypes.conf: 246         {             # /x1/jenkins/jenkins-slave/workspace/Lucene-Solr-Tests-5.x-Java7/solr/build/contrib/solr-map-reduce/test/J0/temp/solr.hadoop.MorphlineMapperTest_40C2758AB522AB4D-001/tempDir-001/test-morphlines/solrCellDocumentTypes.conf: 246             "parser" : "org.apache.tika.parser.xml.FictionBookParser"         },         # /x1/jenkins/jenkins-slave/workspace/Lucene-Solr-Tests-5.x-Java7/solr/build/contrib/solr-map-reduce/test/J0/temp/solr.hadoop.MorphlineMapperTest_40C2758AB522AB4D-001/tempDir-001/test-morphlines/solrCellDocumentTypes.conf: 247         {             # /x1/jenkins/jenkins-slave/workspace/Lucene-Solr-Tests-5.x-Java7/solr/build/contrib/solr-map-reduce/test/J0/temp/solr.hadoop.MorphlineMapperTest_40C2758AB522AB4D-001/tempDir-001/test-morphlines/solrCellDocumentTypes.conf: 247             "parser" : "org.apache.tika.parser.chm.ChmParser"         }     ],     # /x1/jenkins/jenkins-slave/workspace/Lucene-Solr-Tests-5.x-Java7/solr/build/contrib/solr-map-reduce/test/J0/temp/solr.hadoop.MorphlineMapperTest_40C2758AB522AB4D-001/tempDir-001/test-morphlines/solrCellDocumentTypes.conf: 160     #  captureAttr : true # default is false     "capture" : [         # /x1/jenkins/jenkins-slave/workspace/Lucene-Solr-Tests-5.x-Java7/solr/build/contrib/solr-map-reduce/test/J0/temp/solr.hadoop.MorphlineMapperTest_40C2758AB522AB4D-001/tempDir-001/test-morphlines/solrCellDocumentTypes.conf: 163         #  twitter feed schema         "user_friends_count",         # /x1/jenkins/jenkins-slave/workspace/Lucene-Solr-Tests-5.x-Java7/solr/build/contrib/solr-map-reduce/test/J0/temp/solr.hadoop.MorphlineMapperTest_40C2758AB522AB4D-001/tempDir-001/test-morphlines/solrCellDocumentTypes.conf: 164         "user_location",         # /x1/jenkins/jenkins-slave/workspace/Lucene-Solr-Tests-5.x-Java7/solr/build/contrib/solr-map-reduce/test/J0/temp/solr.hadoop.MorphlineMapperTest_40C2758AB522AB4D-001/tempDir-001/test-morphlines/solrCellDocumentTypes.conf: 165         "user_description",         # /x1/jenkins/jenkins-slave/workspace/Lucene-Solr-Tests-5.x-Java7/solr/build/contrib/solr-map-reduce/test/J0/temp/solr.hadoop.MorphlineMapperTest_40C2758AB522AB4D-001/tempDir-001/test-morphlines/solrCellDocumentTypes.conf: 166         "user_statuses_count",         # /x1/jenkins/jenkins-slave/workspace/Lucene-Solr-Tests-5.x-Java7/solr/build/contrib/solr-map-reduce/test/J0/temp/solr.hadoop.MorphlineMapperTest_40C2758AB522AB4D-001/tempDir-001/test-morphlines/solrCellDocumentTypes.conf: 167         "user_followers_count",         # /x1/jenkins/jenkins-slave/workspace/Lucene-Solr-Tests-5.x-Java7/solr/build/contrib/solr-map-reduce/test/J0/temp/solr.hadoop.MorphlineMapperTest_40C2758AB522AB4D-001/tempDir-001/test-morphlines/solrCellDocumentTypes.conf: 168         "user_name",         # /x1/jenkins/jenkins-slave/workspace/Lucene-Solr-Tests-5.x-Java7/solr/build/contrib/solr-map-reduce/test/J0/temp/solr.hadoop.MorphlineMapperTest_40C2758AB522AB4D-001/tempDir-001/test-morphlines/solrCellDocumentTypes.conf: 169         "user_screen_name",         # /x1/jenkins/jenkins-slave/workspace/Lucene-Solr-Tests-5.x-Java7/solr/build/contrib/solr-map-reduce/test/J0/temp/solr.hadoop.MorphlineMapperTest_40C2758AB522AB4D-001/tempDir-001/test-morphlines/solrCellDocumentTypes.conf: 170         "created_at",         # /x1/jenkins/jenkins-slave/workspace/Lucene-Solr-Tests-5.x-Java7/solr/build/contrib/solr-map-reduce/test/J0/temp/solr.hadoop.MorphlineMapperTest_40C2758AB522AB4D-001/tempDir-001/test-morphlines/solrCellDocumentTypes.conf: 171         "text",         # /x1/jenkins/jenkins-slave/workspace/Lucene-Solr-Tests-5.x-Java7/solr/build/contrib/solr-map-reduce/test/J0/temp/solr.hadoop.MorphlineMapperTest_40C2758AB522AB4D-001/tempDir-001/test-morphlines/solrCellDocumentTypes.conf: 172         "retweet_count",         # /x1/jenkins/jenkins-slave/workspace/Lucene-Solr-Tests-5.x-Java7/solr/build/contrib/solr-map-reduce/test/J0/temp/solr.hadoop.MorphlineMapperTest_40C2758AB522AB4D-001/tempDir-001/test-morphlines/solrCellDocumentTypes.conf: 173         "retweeted",         # /x1/jenkins/jenkins-slave/workspace/Lucene-Solr-Tests-5.x-Java7/solr/build/contrib/solr-map-reduce/test/J0/temp/solr.hadoop.MorphlineMapperTest_40C2758AB522AB4D-001/tempDir-001/test-morphlines/solrCellDocumentTypes.conf: 174         "in_reply_to_user_id",         # /x1/jenkins/jenkins-slave/workspace/Lucene-Solr-Tests-5.x-Java7/solr/build/contrib/solr-map-reduce/test/J0/temp/solr.hadoop.MorphlineMapperTest_40C2758AB522AB4D-001/tempDir-001/test-morphlines/solrCellDocumentTypes.conf: 175         "source",         # /x1/jenkins/jenkins-slave/workspace/Lucene-Solr-Tests-5.x-Java7/solr/build/contrib/solr-map-reduce/test/J0/temp/solr.hadoop.MorphlineMapperTest_40C2758AB522AB4D-001/tempDir-001/test-morphlines/solrCellDocumentTypes.conf: 176         "in_reply_to_status_id",         # /x1/jenkins/jenkins-slave/workspace/Lucene-Solr-Tests-5.x-Java7/solr/build/contrib/solr-map-reduce/test/J0/temp/solr.hadoop.MorphlineMapperTest_40C2758AB522AB4D-001/tempDir-001/test-morphlines/solrCellDocumentTypes.conf: 177         "media_url_https",         # /x1/jenkins/jenkins-slave/workspace/Lucene-Solr-Tests-5.x-Java7/solr/build/contrib/solr-map-reduce/test/J0/temp/solr.hadoop.MorphlineMapperTest_40C2758AB522AB4D-001/tempDir-001/test-morphlines/solrCellDocumentTypes.conf: 178         "expanded_url",         # /x1/jenkins/jenkins-slave/workspace/Lucene-Solr-Tests-5.x-Java7/solr/build/contrib/solr-map-reduce/test/J0/temp/solr.hadoop.MorphlineMapperTest_40C2758AB522AB4D-001/tempDir-001/test-morphlines/solrCellDocumentTypes.conf: 181         #  file metadata            "file_download_url",         # /x1/jenkins/jenkins-slave/workspace/Lucene-Solr-Tests-5.x-Java7/solr/build/contrib/solr-map-reduce/test/J0/temp/solr.hadoop.MorphlineMapperTest_40C2758AB522AB4D-001/tempDir-001/test-morphlines/solrCellDocumentTypes.conf: 182         "file_upload_url",         # /x1/jenkins/jenkins-slave/workspace/Lucene-Solr-Tests-5.x-Java7/solr/build/contrib/solr-map-reduce/test/J0/temp/solr.hadoop.MorphlineMapperTest_40C2758AB522AB4D-001/tempDir-001/test-morphlines/solrCellDocumentTypes.conf: 183         "file_scheme",         # /x1/jenkins/jenkins-slave/workspace/Lucene-Solr-Tests-5.x-Java7/solr/build/contrib/solr-map-reduce/test/J0/temp/solr.hadoop.MorphlineMapperTest_40C2758AB522AB4D-001/tempDir-001/test-morphlines/solrCellDocumentTypes.conf: 184         "file_host",         # /x1/jenkins/jenkins-slave/workspace/Lucene-Solr-Tests-5.x-Java7/solr/build/contrib/solr-map-reduce/test/J0/temp/solr.hadoop.MorphlineMapperTest_40C2758AB522AB4D-001/tempDir-001/test-morphlines/solrCellDocumentTypes.conf: 185         "file_port",         # /x1/jenkins/jenkins-slave/workspace/Lucene-Solr-Tests-5.x-Java7/solr/build/contrib/solr-map-reduce/test/J0/temp/solr.hadoop.MorphlineMapperTest_40C2758AB522AB4D-001/tempDir-001/test-morphlines/solrCellDocumentTypes.conf: 186         "file_path",         # /x1/jenkins/jenkins-slave/workspace/Lucene-Solr-Tests-5.x-Java7/solr/build/contrib/solr-map-reduce/test/J0/temp/solr.hadoop.MorphlineMapperTest_40C2758AB522AB4D-001/tempDir-001/test-morphlines/solrCellDocumentTypes.conf: 187         "file_name",         # /x1/jenkins/jenkins-slave/workspace/Lucene-Solr-Tests-5.x-Java7/solr/build/contrib/solr-map-reduce/test/J0/temp/solr.hadoop.MorphlineMapperTest_40C2758AB522AB4D-001/tempDir-001/test-morphlines/solrCellDocumentTypes.conf: 188         "file_length",         # /x1/jenkins/jenkins-slave/workspace/Lucene-Solr-Tests-5.x-Java7/solr/build/contrib/solr-map-reduce/test/J0/temp/solr.hadoop.MorphlineMapperTest_40C2758AB522AB4D-001/tempDir-001/test-morphlines/solrCellDocumentTypes.conf: 189         "file_last_modified",         # /x1/jenkins/jenkins-slave/workspace/Lucene-Solr-Tests-5.x-Java7/solr/build/contrib/solr-map-reduce/test/J0/temp/solr.hadoop.MorphlineMapperTest_40C2758AB522AB4D-001/tempDir-001/test-morphlines/solrCellDocumentTypes.conf: 190         "file_owner",         # /x1/jenkins/jenkins-slave/workspace/Lucene-Solr-Tests-5.x-Java7/solr/build/contrib/solr-map-reduce/test/J0/temp/solr.hadoop.MorphlineMapperTest_40C2758AB522AB4D-001/tempDir-001/test-morphlines/solrCellDocumentTypes.conf: 191         "file_group",         # /x1/jenkins/jenkins-slave/workspace/Lucene-Solr-Tests-5.x-Java7/solr/build/contrib/solr-map-reduce/test/J0/temp/solr.hadoop.MorphlineMapperTest_40C2758AB522AB4D-001/tempDir-001/test-morphlines/solrCellDocumentTypes.conf: 192         "file_permissions_user",         # /x1/jenkins/jenkins-slave/workspace/Lucene-Solr-Tests-5.x-Java7/solr/build/contrib/solr-map-reduce/test/J0/temp/solr.hadoop.MorphlineMapperTest_40C2758AB522AB4D-001/tempDir-001/test-morphlines/solrCellDocumentTypes.conf: 193         "file_permissions_group",         # /x1/jenkins/jenkins-slave/workspace/Lucene-Solr-Tests-5.x-Java7/solr/build/contrib/solr-map-reduce/test/J0/temp/solr.hadoop.MorphlineMapperTest_40C2758AB522AB4D-001/tempDir-001/test-morphlines/solrCellDocumentTypes.conf: 194         "file_permissions_other",         # /x1/jenkins/jenkins-slave/workspace/Lucene-Solr-Tests-5.x-Java7/solr/build/contrib/solr-map-reduce/test/J0/temp/solr.hadoop.MorphlineMapperTest_40C2758AB522AB4D-001/tempDir-001/test-morphlines/solrCellDocumentTypes.conf: 195         "file_permissions_stickybit"     ] }

Stack Trace:
org.kitesdk.morphline.api.MorphlineCompilationException: Malformed / non-existent locale:  near: {
    # /x1/jenkins/jenkins-slave/workspace/Lucene-Solr-Tests-5.x-Java7/solr/build/contrib/solr-map-reduce/test/J0/temp/solr.hadoop.MorphlineMapperTest_40C2758AB522AB4D-001/tempDir-001/test-morphlines/solrCellDocumentTypes.conf: 201
    #  various java.text.SimpleDateFormat
    #  xpath : "/xhtml:html/xhtml:body/xhtml:div/descendant:node()"
    "uprefix" : "ignored_",
    # /x1/jenkins/jenkins-slave/workspace/Lucene-Solr-Tests-5.x-Java7/solr/build/contrib/solr-map-reduce/test/J0/temp/solr.hadoop.MorphlineMapperTest_40C2758AB522AB4D-001/tempDir-001/test-morphlines/solrCellDocumentTypes.conf: 198
    "fmap" : {
        # /x1/jenkins/jenkins-slave/workspace/Lucene-Solr-Tests-5.x-Java7/solr/build/contrib/solr-map-reduce/test/J0/temp/solr.hadoop.MorphlineMapperTest_40C2758AB522AB4D-001/tempDir-001/test-morphlines/solrCellDocumentTypes.conf: 198
        "content" : "text",
        # /x1/jenkins/jenkins-slave/workspace/Lucene-Solr-Tests-5.x-Java7/solr/build/contrib/solr-map-reduce/test/J0/temp/solr.hadoop.MorphlineMapperTest_40C2758AB522AB4D-001/tempDir-001/test-morphlines/solrCellDocumentTypes.conf: 198
        "content-type" : "content_type"
    },
    # /x1/jenkins/jenkins-slave/workspace/Lucene-Solr-Tests-5.x-Java7/solr/build/contrib/solr-map-reduce/test/J0/temp/solr.hadoop.MorphlineMapperTest_40C2758AB522AB4D-001/tempDir-001/test-morphlines/solrCellDocumentTypes.conf: 202
    "lowernames" : true,
    # /x1/jenkins/jenkins-slave/workspace/Lucene-Solr-Tests-5.x-Java7/solr/build/contrib/solr-map-reduce/test/J0/temp/solr.hadoop.MorphlineMapperTest_40C2758AB522AB4D-001/tempDir-001/test-morphlines/solrCellDocumentTypes.conf: 158
    "solrLocator" : {
        # /x1/jenkins/jenkins-slave/workspace/Lucene-Solr-Tests-5.x-Java7/solr/build/contrib/solr-map-reduce/test/J0/temp/solr.hadoop.MorphlineMapperTest_40C2758AB522AB4D-001/tempDir-001/test-morphlines/solrCellDocumentTypes.conf: 158
        "collection" : "collection1"
    },
    # /x1/jenkins/jenkins-slave/workspace/Lucene-Solr-Tests-5.x-Java7/solr/build/contrib/solr-map-reduce/test/J0/temp/solr.hadoop.MorphlineMapperTest_40C2758AB522AB4D-001/tempDir-001/test-morphlines/solrCellDocumentTypes.conf: 199
    #  rename "content" field to "text" fields
    "dateFormats" : [
        # /x1/jenkins/jenkins-slave/workspace/Lucene-Solr-Tests-5.x-Java7/solr/build/contrib/solr-map-reduce/test/J0/temp/solr.hadoop.MorphlineMapperTest_40C2758AB522AB4D-001/tempDir-001/test-morphlines/solrCellDocumentTypes.conf: 199
        "yyyy-MM-dd'T'HH:mm:ss",
        # /x1/jenkins/jenkins-slave/workspace/Lucene-Solr-Tests-5.x-Java7/solr/build/contrib/solr-map-reduce/test/J0/temp/solr.hadoop.MorphlineMapperTest_40C2758AB522AB4D-001/tempDir-001/test-morphlines/solrCellDocumentTypes.conf: 199
        "yyyy-MM-dd"
    ],
    # /x1/jenkins/jenkins-slave/workspace/Lucene-Solr-Tests-5.x-Java7/solr/build/contrib/solr-map-reduce/test/J0/temp/solr.hadoop.MorphlineMapperTest_40C2758AB522AB4D-001/tempDir-001/test-morphlines/solrCellDocumentTypes.conf: 207
    #  Tika parsers to be registered. If multiple parsers support the same MIME type, 
    #  the parser is chosen that is closest to the bottom in this list:
    "parsers" : [
        # /x1/jenkins/jenkins-slave/workspace/Lucene-Solr-Tests-5.x-Java7/solr/build/contrib/solr-map-reduce/test/J0/temp/solr.hadoop.MorphlineMapperTest_40C2758AB522AB4D-001/tempDir-001/test-morphlines/solrCellDocumentTypes.conf: 208
        {
            # /x1/jenkins/jenkins-slave/workspace/Lucene-Solr-Tests-5.x-Java7/solr/build/contrib/solr-map-reduce/test/J0/temp/solr.hadoop.MorphlineMapperTest_40C2758AB522AB4D-001/tempDir-001/test-morphlines/solrCellDocumentTypes.conf: 208
            "parser" : "org.apache.tika.parser.asm.ClassParser"
        },
        # /x1/jenkins/jenkins-slave/workspace/Lucene-Solr-Tests-5.x-Java7/solr/build/contrib/solr-map-reduce/test/J0/temp/solr.hadoop.MorphlineMapperTest_40C2758AB522AB4D-001/tempDir-001/test-morphlines/solrCellDocumentTypes.conf: 211
        #  { parser : org.apache.tika.parser.AutoDetectParser }                      
        #  { parser : org.gagravarr.tika.OggParser, additionalSupportedMimeTypes : [audio/ogg] }
        {
            # /x1/jenkins/jenkins-slave/workspace/Lucene-Solr-Tests-5.x-Java7/solr/build/contrib/solr-map-reduce/test/J0/temp/solr.hadoop.MorphlineMapperTest_40C2758AB522AB4D-001/tempDir-001/test-morphlines/solrCellDocumentTypes.conf: 211
            "parser" : "org.gagravarr.tika.FlacParser"
        },
        # /x1/jenkins/jenkins-slave/workspace/Lucene-Solr-Tests-5.x-Java7/solr/build/contrib/solr-map-reduce/test/J0/temp/solr.hadoop.MorphlineMapperTest_40C2758AB522AB4D-001/tempDir-001/test-morphlines/solrCellDocumentTypes.conf: 212
        {
            # /x1/jenkins/jenkins-slave/workspace/Lucene-Solr-Tests-5.x-Java7/solr/build/contrib/solr-map-reduce/test/J0/temp/solr.hadoop.MorphlineMapperTest_40C2758AB522AB4D-001/tempDir-001/test-morphlines/solrCellDocumentTypes.conf: 212
            "parser" : "org.apache.tika.parser.audio.AudioParser"
        },
        # /x1/jenkins/jenkins-slave/workspace/Lucene-Solr-Tests-5.x-Java7/solr/build/contrib/solr-map-reduce/test/J0/temp/solr.hadoop.MorphlineMapperTest_40C2758AB522AB4D-001/tempDir-001/test-morphlines/solrCellDocumentTypes.conf: 213
        {
            # /x1/jenkins/jenkins-slave/workspace/Lucene-Solr-Tests-5.x-Java7/solr/build/contrib/solr-map-reduce/test/J0/temp/solr.hadoop.MorphlineMapperTest_40C2758AB522AB4D-001/tempDir-001/test-morphlines/solrCellDocumentTypes.conf: 213
            "parser" : "org.apache.tika.parser.audio.MidiParser"
        },
        # /x1/jenkins/jenkins-slave/workspace/Lucene-Solr-Tests-5.x-Java7/solr/build/contrib/solr-map-reduce/test/J0/temp/solr.hadoop.MorphlineMapperTest_40C2758AB522AB4D-001/tempDir-001/test-morphlines/solrCellDocumentTypes.conf: 214
        {
            # /x1/jenkins/jenkins-slave/workspace/Lucene-Solr-Tests-5.x-Java7/solr/build/contrib/solr-map-reduce/test/J0/temp/solr.hadoop.MorphlineMapperTest_40C2758AB522AB4D-001/tempDir-001/test-morphlines/solrCellDocumentTypes.conf: 214
            "parser" : "org.apache.tika.parser.crypto.Pkcs7Parser"
        },
        # /x1/jenkins/jenkins-slave/workspace/Lucene-Solr-Tests-5.x-Java7/solr/build/contrib/solr-map-reduce/test/J0/temp/solr.hadoop.MorphlineMapperTest_40C2758AB522AB4D-001/tempDir-001/test-morphlines/solrCellDocumentTypes.conf: 215
        {
            # /x1/jenkins/jenkins-slave/workspace/Lucene-Solr-Tests-5.x-Java7/solr/build/contrib/solr-map-reduce/test/J0/temp/solr.hadoop.MorphlineMapperTest_40C2758AB522AB4D-001/tempDir-001/test-morphlines/solrCellDocumentTypes.conf: 215
            "parser" : "org.apache.tika.parser.dwg.DWGParser"
        },
        # /x1/jenkins/jenkins-slave/workspace/Lucene-Solr-Tests-5.x-Java7/solr/build/contrib/solr-map-reduce/test/J0/temp/solr.hadoop.MorphlineMapperTest_40C2758AB522AB4D-001/tempDir-001/test-morphlines/solrCellDocumentTypes.conf: 216
        {
            # /x1/jenkins/jenkins-slave/workspace/Lucene-Solr-Tests-5.x-Java7/solr/build/contrib/solr-map-reduce/test/J0/temp/solr.hadoop.MorphlineMapperTest_40C2758AB522AB4D-001/tempDir-001/test-morphlines/solrCellDocumentTypes.conf: 216
            "parser" : "org.apache.tika.parser.epub.EpubParser"
        },
        # /x1/jenkins/jenkins-slave/workspace/Lucene-Solr-Tests-5.x-Java7/solr/build/contrib/solr-map-reduce/test/J0/temp/solr.hadoop.MorphlineMapperTest_40C2758AB522AB4D-001/tempDir-001/test-morphlines/solrCellDocumentTypes.conf: 217
        {
            # /x1/jenkins/jenkins-slave/workspace/Lucene-Solr-Tests-5.x-Java7/solr/build/contrib/solr-map-reduce/test/J0/temp/solr.hadoop.MorphlineMapperTest_40C2758AB522AB4D-001/tempDir-001/test-morphlines/solrCellDocumentTypes.conf: 217
            "parser" : "org.apache.tika.parser.executable.ExecutableParser"
        },
        # /x1/jenkins/jenkins-slave/workspace/Lucene-Solr-Tests-5.x-Java7/solr/build/contrib/solr-map-reduce/test/J0/temp/solr.hadoop.MorphlineMapperTest_40C2758AB522AB4D-001/tempDir-001/test-morphlines/solrCellDocumentTypes.conf: 218
        {
            # /x1/jenkins/jenkins-slave/workspace/Lucene-Solr-Tests-5.x-Java7/solr/build/contrib/solr-map-reduce/test/J0/temp/solr.hadoop.MorphlineMapperTest_40C2758AB522AB4D-001/tempDir-001/test-morphlines/solrCellDocumentTypes.conf: 218
            "parser" : "org.apache.tika.parser.feed.FeedParser"
        },
        # /x1/jenkins/jenkins-slave/workspace/Lucene-Solr-Tests-5.x-Java7/solr/build/contrib/solr-map-reduce/test/J0/temp/solr.hadoop.MorphlineMapperTest_40C2758AB522AB4D-001/tempDir-001/test-morphlines/solrCellDocumentTypes.conf: 219
        {
            # /x1/jenkins/jenkins-slave/workspace/Lucene-Solr-Tests-5.x-Java7/solr/build/contrib/solr-map-reduce/test/J0/temp/solr.hadoop.MorphlineMapperTest_40C2758AB522AB4D-001/tempDir-001/test-morphlines/solrCellDocumentTypes.conf: 219
            "parser" : "org.apache.tika.parser.font.AdobeFontMetricParser"
        },
        # /x1/jenkins/jenkins-slave/workspace/Lucene-Solr-Tests-5.x-Java7/solr/build/contrib/solr-map-reduce/test/J0/temp/solr.hadoop.MorphlineMapperTest_40C2758AB522AB4D-001/tempDir-001/test-morphlines/solrCellDocumentTypes.conf: 220
        {
            # /x1/jenkins/jenkins-slave/workspace/Lucene-Solr-Tests-5.x-Java7/solr/build/contrib/solr-map-reduce/test/J0/temp/solr.hadoop.MorphlineMapperTest_40C2758AB522AB4D-001/tempDir-001/test-morphlines/solrCellDocumentTypes.conf: 220
            "parser" : "org.apache.tika.parser.font.TrueTypeParser"
        },
        # /x1/jenkins/jenkins-slave/workspace/Lucene-Solr-Tests-5.x-Java7/solr/build/contrib/solr-map-reduce/test/J0/temp/solr.hadoop.MorphlineMapperTest_40C2758AB522AB4D-001/tempDir-001/test-morphlines/solrCellDocumentTypes.conf: 221
        {
            # /x1/jenkins/jenkins-slave/workspace/Lucene-Solr-Tests-5.x-Java7/solr/build/contrib/solr-map-reduce/test/J0/temp/solr.hadoop.MorphlineMapperTest_40C2758AB522AB4D-001/tempDir-001/test-morphlines/solrCellDocumentTypes.conf: 221
            "parser" : "org.apache.tika.parser.xml.XMLParser"
        },
        # /x1/jenkins/jenkins-slave/workspace/Lucene-Solr-Tests-5.x-Java7/solr/build/contrib/solr-map-reduce/test/J0/temp/solr.hadoop.MorphlineMapperTest_40C2758AB522AB4D-001/tempDir-001/test-morphlines/solrCellDocumentTypes.conf: 222
        {
            # /x1/jenkins/jenkins-slave/workspace/Lucene-Solr-Tests-5.x-Java7/solr/build/contrib/solr-map-reduce/test/J0/temp/solr.hadoop.MorphlineMapperTest_40C2758AB522AB4D-001/tempDir-001/test-morphlines/solrCellDocumentTypes.conf: 222
            "parser" : "org.apache.tika.parser.html.HtmlParser"
        },
        # /x1/jenkins/jenkins-slave/workspace/Lucene-Solr-Tests-5.x-Java7/solr/build/contrib/solr-map-reduce/test/J0/temp/solr.hadoop.MorphlineMapperTest_40C2758AB522AB4D-001/tempDir-001/test-morphlines/solrCellDocumentTypes.conf: 223
        {
            # /x1/jenkins/jenkins-slave/workspace/Lucene-Solr-Tests-5.x-Java7/solr/build/contrib/solr-map-reduce/test/J0/temp/solr.hadoop.MorphlineMapperTest_40C2758AB522AB4D-001/tempDir-001/test-morphlines/solrCellDocumentTypes.conf: 223
            "parser" : "org.apache.tika.parser.image.ImageParser"
        },
        # /x1/jenkins/jenkins-slave/workspace/Lucene-Solr-Tests-5.x-Java7/solr/build/contrib/solr-map-reduce/test/J0/temp/solr.hadoop.MorphlineMapperTest_40C2758AB522AB4D-001/tempDir-001/test-morphlines/solrCellDocumentTypes.conf: 224
        {
            # /x1/jenkins/jenkins-slave/workspace/Lucene-Solr-Tests-5.x-Java7/solr/build/contrib/solr-map-reduce/test/J0/temp/solr.hadoop.MorphlineMapperTest_40C2758AB522AB4D-001/tempDir-001/test-morphlines/solrCellDocumentTypes.conf: 224
            "parser" : "org.apache.tika.parser.image.PSDParser"
        },
        # /x1/jenkins/jenkins-slave/workspace/Lucene-Solr-Tests-5.x-Java7/solr/build/contrib/solr-map-reduce/test/J0/temp/solr.hadoop.MorphlineMapperTest_40C2758AB522AB4D-001/tempDir-001/test-morphlines/solrCellDocumentTypes.conf: 225
        {
            # /x1/jenkins/jenkins-slave/workspace/Lucene-Solr-Tests-5.x-Java7/solr/build/contrib/solr-map-reduce/test/J0/temp/solr.hadoop.MorphlineMapperTest_40C2758AB522AB4D-001/tempDir-001/test-morphlines/solrCellDocumentTypes.conf: 225
            "parser" : "org.apache.tika.parser.image.TiffParser"
        },
        # /x1/jenkins/jenkins-slave/workspace/Lucene-Solr-Tests-5.x-Java7/solr/build/contrib/solr-map-reduce/test/J0/temp/solr.hadoop.MorphlineMapperTest_40C2758AB522AB4D-001/tempDir-001/test-morphlines/solrCellDocumentTypes.conf: 226
        {
            # /x1/jenkins/jenkins-slave/workspace/Lucene-Solr-Tests-5.x-Java7/solr/build/contrib/solr-map-reduce/test/J0/temp/solr.hadoop.MorphlineMapperTest_40C2758AB522AB4D-001/tempDir-001/test-morphlines/solrCellDocumentTypes.conf: 226
            "parser" : "org.apache.tika.parser.iptc.IptcAnpaParser"
        },
        # /x1/jenkins/jenkins-slave/workspace/Lucene-Solr-Tests-5.x-Java7/solr/build/contrib/solr-map-reduce/test/J0/temp/solr.hadoop.MorphlineMapperTest_40C2758AB522AB4D-001/tempDir-001/test-morphlines/solrCellDocumentTypes.conf: 227
        {
            # /x1/jenkins/jenkins-slave/workspace/Lucene-Solr-Tests-5.x-Java7/solr/build/contrib/solr-map-reduce/test/J0/temp/solr.hadoop.MorphlineMapperTest_40C2758AB522AB4D-001/tempDir-001/test-morphlines/solrCellDocumentTypes.conf: 227
            "parser" : "org.apache.tika.parser.iwork.IWorkPackageParser"
        },
        # /x1/jenkins/jenkins-slave/workspace/Lucene-Solr-Tests-5.x-Java7/solr/build/contrib/solr-map-reduce/test/J0/temp/solr.hadoop.MorphlineMapperTest_40C2758AB522AB4D-001/tempDir-001/test-morphlines/solrCellDocumentTypes.conf: 228
        {
            # /x1/jenkins/jenkins-slave/workspace/Lucene-Solr-Tests-5.x-Java7/solr/build/contrib/solr-map-reduce/test/J0/temp/solr.hadoop.MorphlineMapperTest_40C2758AB522AB4D-001/tempDir-001/test-morphlines/solrCellDocumentTypes.conf: 228
            "parser" : "org.apache.tika.parser.jpeg.JpegParser"
        },
        # /x1/jenkins/jenkins-slave/workspace/Lucene-Solr-Tests-5.x-Java7/solr/build/contrib/solr-map-reduce/test/J0/temp/solr.hadoop.MorphlineMapperTest_40C2758AB522AB4D-001/tempDir-001/test-morphlines/solrCellDocumentTypes.conf: 229
        {
            # /x1/jenkins/jenkins-slave/workspace/Lucene-Solr-Tests-5.x-Java7/solr/build/contrib/solr-map-reduce/test/J0/temp/solr.hadoop.MorphlineMapperTest_40C2758AB522AB4D-001/tempDir-001/test-morphlines/solrCellDocumentTypes.conf: 229
            "parser" : "org.apache.tika.parser.mail.RFC822Parser"
        },
        # /x1/jenkins/jenkins-slave/workspace/Lucene-Solr-Tests-5.x-Java7/solr/build/contrib/solr-map-reduce/test/J0/temp/solr.hadoop.MorphlineMapperTest_40C2758AB522AB4D-001/tempDir-001/test-morphlines/solrCellDocumentTypes.conf: 230
        {
            # /x1/jenkins/jenkins-slave/workspace/Lucene-Solr-Tests-5.x-Java7/solr/build/contrib/solr-map-reduce/test/J0/temp/solr.hadoop.MorphlineMapperTest_40C2758AB522AB4D-001/tempDir-001/test-morphlines/solrCellDocumentTypes.conf: 230
            "parser" : "org.apache.tika.parser.mbox.MboxParser",
            # /x1/jenkins/jenkins-slave/workspace/Lucene-Solr-Tests-5.x-Java7/solr/build/contrib/solr-map-reduce/test/J0/temp/solr.hadoop.MorphlineMapperTest_40C2758AB522AB4D-001/tempDir-001/test-morphlines/solrCellDocumentTypes.conf: 230
            "additionalSupportedMimeTypes" : [
                # /x1/jenkins/jenkins-slave/workspace/Lucene-Solr-Tests-5.x-Java7/solr/build/contrib/solr-map-reduce/test/J0/temp/solr.hadoop.MorphlineMapperTest_40C2758AB522AB4D-001/tempDir-001/test-morphlines/solrCellDocumentTypes.conf: 230
                "message/x-emlx"
            ]
        },
        # /x1/jenkins/jenkins-slave/workspace/Lucene-Solr-Tests-5.x-Java7/solr/build/contrib/solr-map-reduce/test/J0/temp/solr.hadoop.MorphlineMapperTest_40C2758AB522AB4D-001/tempDir-001/test-morphlines/solrCellDocumentTypes.conf: 231
        {
            # /x1/jenkins/jenkins-slave/workspace/Lucene-Solr-Tests-5.x-Java7/solr/build/contrib/solr-map-reduce/test/J0/temp/solr.hadoop.MorphlineMapperTest_40C2758AB522AB4D-001/tempDir-001/test-morphlines/solrCellDocumentTypes.conf: 231
            "parser" : "org.apache.tika.parser.microsoft.OfficeParser"
        },
        # /x1/jenkins/jenkins-slave/workspace/Lucene-Solr-Tests-5.x-Java7/solr/build/contrib/solr-map-reduce/test/J0/temp/solr.hadoop.MorphlineMapperTest_40C2758AB522AB4D-001/tempDir-001/test-morphlines/solrCellDocumentTypes.conf: 232
        {
            # /x1/jenkins/jenkins-slave/workspace/Lucene-Solr-Tests-5.x-Java7/solr/build/contrib/solr-map-reduce/test/J0/temp/solr.hadoop.MorphlineMapperTest_40C2758AB522AB4D-001/tempDir-001/test-morphlines/solrCellDocumentTypes.conf: 232
            "parser" : "org.apache.tika.parser.microsoft.TNEFParser"
        },
        # /x1/jenkins/jenkins-slave/workspace/Lucene-Solr-Tests-5.x-Java7/solr/build/contrib/solr-map-reduce/test/J0/temp/solr.hadoop.MorphlineMapperTest_40C2758AB522AB4D-001/tempDir-001/test-morphlines/solrCellDocumentTypes.conf: 233
        {
            # /x1/jenkins/jenkins-slave/workspace/Lucene-Solr-Tests-5.x-Java7/solr/build/contrib/solr-map-reduce/test/J0/temp/solr.hadoop.MorphlineMapperTest_40C2758AB522AB4D-001/tempDir-001/test-morphlines/solrCellDocumentTypes.conf: 233
            "parser" : "org.apache.tika.parser.microsoft.ooxml.OOXMLParser"
        },
        # /x1/jenkins/jenkins-slave/workspace/Lucene-Solr-Tests-5.x-Java7/solr/build/contrib/solr-map-reduce/test/J0/temp/solr.hadoop.MorphlineMapperTest_40C2758AB522AB4D-001/tempDir-001/test-morphlines/solrCellDocumentTypes.conf: 234
        {
            # /x1/jenkins/jenkins-slave/workspace/Lucene-Solr-Tests-5.x-Java7/solr/build/contrib/solr-map-reduce/test/J0/temp/solr.hadoop.MorphlineMapperTest_40C2758AB522AB4D-001/tempDir-001/test-morphlines/solrCellDocumentTypes.conf: 234
            "parser" : "org.apache.tika.parser.mp3.Mp3Parser"
        },
        # /x1/jenkins/jenkins-slave/workspace/Lucene-Solr-Tests-5.x-Java7/solr/build/contrib/solr-map-reduce/test/J0/temp/solr.hadoop.MorphlineMapperTest_40C2758AB522AB4D-001/tempDir-001/test-morphlines/solrCellDocumentTypes.conf: 235
        {
            # /x1/jenkins/jenkins-slave/workspace/Lucene-Solr-Tests-5.x-Java7/solr/build/contrib/solr-map-reduce/test/J0/temp/solr.hadoop.MorphlineMapperTest_40C2758AB522AB4D-001/tempDir-001/test-morphlines/solrCellDocumentTypes.conf: 235
            "parser" : "org.apache.tika.parser.mp4.MP4Parser"
        },
        # /x1/jenkins/jenkins-slave/workspace/Lucene-Solr-Tests-5.x-Java7/solr/build/contrib/solr-map-reduce/test/J0/temp/solr.hadoop.MorphlineMapperTest_40C2758AB522AB4D-001/tempDir-001/test-morphlines/solrCellDocumentTypes.conf: 236
        {
            # /x1/jenkins/jenkins-slave/workspace/Lucene-Solr-Tests-5.x-Java7/solr/build/contrib/solr-map-reduce/test/J0/temp/solr.hadoop.MorphlineMapperTest_40C2758AB522AB4D-001/tempDir-001/test-morphlines/solrCellDocumentTypes.conf: 236
            "parser" : "org.apache.tika.parser.hdf.HDFParser"
        },
        # /x1/jenkins/jenkins-slave/workspace/Lucene-Solr-Tests-5.x-Java7/solr/build/contrib/solr-map-reduce/test/J0/temp/solr.hadoop.MorphlineMapperTest_40C2758AB522AB4D-001/tempDir-001/test-morphlines/solrCellDocumentTypes.conf: 237
        {
            # /x1/jenkins/jenkins-slave/workspace/Lucene-Solr-Tests-5.x-Java7/solr/build/contrib/solr-map-reduce/test/J0/temp/solr.hadoop.MorphlineMapperTest_40C2758AB522AB4D-001/tempDir-001/test-morphlines/solrCellDocumentTypes.conf: 237
            "parser" : "org.apache.tika.parser.netcdf.NetCDFParser"
        },
        # /x1/jenkins/jenkins-slave/workspace/Lucene-Solr-Tests-5.x-Java7/solr/build/contrib/solr-map-reduce/test/J0/temp/solr.hadoop.MorphlineMapperTest_40C2758AB522AB4D-001/tempDir-001/test-morphlines/solrCellDocumentTypes.conf: 238
        {
            # /x1/jenkins/jenkins-slave/workspace/Lucene-Solr-Tests-5.x-Java7/solr/build/contrib/solr-map-reduce/test/J0/temp/solr.hadoop.MorphlineMapperTest_40C2758AB522AB4D-001/tempDir-001/test-morphlines/solrCellDocumentTypes.conf: 238
            "parser" : "org.apache.tika.parser.odf.OpenDocumentParser"
        },
        # /x1/jenkins/jenkins-slave/workspace/Lucene-Solr-Tests-5.x-Java7/solr/build/contrib/solr-map-reduce/test/J0/temp/solr.hadoop.MorphlineMapperTest_40C2758AB522AB4D-001/tempDir-001/test-morphlines/solrCellDocumentTypes.conf: 239
        {
            # /x1/jenkins/jenkins-slave/workspace/Lucene-Solr-Tests-5.x-Java7/solr/build/contrib/solr-map-reduce/test/J0/temp/solr.hadoop.MorphlineMapperTest_40C2758AB522AB4D-001/tempDir-001/test-morphlines/solrCellDocumentTypes.conf: 239
            "parser" : "org.apache.tika.parser.pdf.PDFParser"
        },
        # /x1/jenkins/jenkins-slave/workspace/Lucene-Solr-Tests-5.x-Java7/solr/build/contrib/solr-map-reduce/test/J0/temp/solr.hadoop.MorphlineMapperTest_40C2758AB522AB4D-001/tempDir-001/test-morphlines/solrCellDocumentTypes.conf: 240
        {
            # /x1/jenkins/jenkins-slave/workspace/Lucene-Solr-Tests-5.x-Java7/solr/build/contrib/solr-map-reduce/test/J0/temp/solr.hadoop.MorphlineMapperTest_40C2758AB522AB4D-001/tempDir-001/test-morphlines/solrCellDocumentTypes.conf: 240
            "parser" : "org.apache.tika.parser.pkg.CompressorParser"
        },
        # /x1/jenkins/jenkins-slave/workspace/Lucene-Solr-Tests-5.x-Java7/solr/build/contrib/solr-map-reduce/test/J0/temp/solr.hadoop.MorphlineMapperTest_40C2758AB522AB4D-001/tempDir-001/test-morphlines/solrCellDocumentTypes.conf: 241
        {
            # /x1/jenkins/jenkins-slave/workspace/Lucene-Solr-Tests-5.x-Java7/solr/build/contrib/solr-map-reduce/test/J0/temp/solr.hadoop.MorphlineMapperTest_40C2758AB522AB4D-001/tempDir-001/test-morphlines/solrCellDocumentTypes.conf: 241
            "parser" : "org.apache.tika.parser.pkg.PackageParser"
        },
        # /x1/jenkins/jenkins-slave/workspace/Lucene-Solr-Tests-5.x-Java7/solr/build/contrib/solr-map-reduce/test/J0/temp/solr.hadoop.MorphlineMapperTest_40C2758AB522AB4D-001/tempDir-001/test-morphlines/solrCellDocumentTypes.conf: 242
        {
            # /x1/jenkins/jenkins-slave/workspace/Lucene-Solr-Tests-5.x-Java7/solr/build/contrib/solr-map-reduce/test/J0/temp/solr.hadoop.MorphlineMapperTest_40C2758AB522AB4D-001/tempDir-001/test-morphlines/solrCellDocumentTypes.conf: 242
            "parser" : "org.apache.tika.parser.rtf.RTFParser"
        },
        # /x1/jenkins/jenkins-slave/workspace/Lucene-Solr-Tests-5.x-Java7/solr/build/contrib/solr-map-reduce/test/J0/temp/solr.hadoop.MorphlineMapperTest_40C2758AB522AB4D-001/tempDir-001/test-morphlines/solrCellDocumentTypes.conf: 243
        {
            # /x1/jenkins/jenkins-slave/workspace/Lucene-Solr-Tests-5.x-Java7/solr/build/contrib/solr-map-reduce/test/J0/temp/solr.hadoop.MorphlineMapperTest_40C2758AB522AB4D-001/tempDir-001/test-morphlines/solrCellDocumentTypes.conf: 243
            "parser" : "org.apache.tika.parser.txt.TXTParser"
        },
        # /x1/jenkins/jenkins-slave/workspace/Lucene-Solr-Tests-5.x-Java7/solr/build/contrib/solr-map-reduce/test/J0/temp/solr.hadoop.MorphlineMapperTest_40C2758AB522AB4D-001/tempDir-001/test-morphlines/solrCellDocumentTypes.conf: 244
        {
            # /x1/jenkins/jenkins-slave/workspace/Lucene-Solr-Tests-5.x-Java7/solr/build/contrib/solr-map-reduce/test/J0/temp/solr.hadoop.MorphlineMapperTest_40C2758AB522AB4D-001/tempDir-001/test-morphlines/solrCellDocumentTypes.conf: 244
            "parser" : "org.apache.tika.parser.video.FLVParser"
        },
        # /x1/jenkins/jenkins-slave/workspace/Lucene-Solr-Tests-5.x-Java7/solr/build/contrib/solr-map-reduce/test/J0/temp/solr.hadoop.MorphlineMapperTest_40C2758AB522AB4D-001/tempDir-001/test-morphlines/solrCellDocumentTypes.conf: 245
        {
            # /x1/jenkins/jenkins-slave/workspace/Lucene-Solr-Tests-5.x-Java7/solr/build/contrib/solr-map-reduce/test/J0/temp/solr.hadoop.MorphlineMapperTest_40C2758AB522AB4D-001/tempDir-001/test-morphlines/solrCellDocumentTypes.conf: 245
            "parser" : "org.apache.tika.parser.xml.DcXMLParser"
        },
        # /x1/jenkins/jenkins-slave/workspace/Lucene-Solr-Tests-5.x-Java7/solr/build/contrib/solr-map-reduce/test/J0/temp/solr.hadoop.MorphlineMapperTest_40C2758AB522AB4D-001/tempDir-001/test-morphlines/solrCellDocumentTypes.conf: 246
        {
            # /x1/jenkins/jenkins-slave/workspace/Lucene-Solr-Tests-5.x-Java7/solr/build/contrib/solr-map-reduce/test/J0/temp/solr.hadoop.MorphlineMapperTest_40C2758AB522AB4D-001/tempDir-001/test-morphlines/solrCellDocumentTypes.conf: 246
            "parser" : "org.apache.tika.parser.xml.FictionBookParser"
        },
        # /x1/jenkins/jenkins-slave/workspace/Lucene-Solr-Tests-5.x-Java7/solr/build/contrib/solr-map-reduce/test/J0/temp/solr.hadoop.MorphlineMapperTest_40C2758AB522AB4D-001/tempDir-001/test-morphlines/solrCellDocumentTypes.conf: 247
        {
            # /x1/jenkins/jenkins-slave/workspace/Lucene-Solr-Tests-5.x-Java7/solr/build/contrib/solr-map-reduce/test/J0/temp/solr.hadoop.MorphlineMapperTest_40C2758AB522AB4D-001/tempDir-001/test-morphlines/solrCellDocumentTypes.conf: 247
            "parser" : "org.apache.tika.parser.chm.ChmParser"
        }
    ],
    # /x1/jenkins/jenkins-slave/workspace/Lucene-Solr-Tests-5.x-Java7/solr/build/contrib/solr-map-reduce/test/J0/temp/solr.hadoop.MorphlineMapperTest_40C2758AB522AB4D-001/tempDir-001/test-morphlines/solrCellDocumentTypes.conf: 160
    #  captureAttr : true # default is false
    "capture" : [
        # /x1/jenkins/jenkins-slave/workspace/Lucene-Solr-Tests-5.x-Java7/solr/build/contrib/solr-map-reduce/test/J0/temp/solr.hadoop.MorphlineMapperTest_40C2758AB522AB4D-001/tempDir-001/test-morphlines/solrCellDocumentTypes.conf: 163
        #  twitter feed schema
        "user_friends_count",
        # /x1/jenkins/jenkins-slave/workspace/Lucene-Solr-Tests-5.x-Java7/solr/build/contrib/solr-map-reduce/test/J0/temp/solr.hadoop.MorphlineMapperTest_40C2758AB522AB4D-001/tempDir-001/test-morphlines/solrCellDocumentTypes.conf: 164
        "user_location",
        # /x1/jenkins/jenkins-slave/workspace/Lucene-Solr-Tests-5.x-Java7/solr/build/contrib/solr-map-reduce/test/J0/temp/solr.hadoop.MorphlineMapperTest_40C2758AB522AB4D-001/tempDir-001/test-morphlines/solrCellDocumentTypes.conf: 165
        "user_description",
        # /x1/jenkins/jenkins-slave/workspace/Lucene-Solr-Tests-5.x-Java7/solr/build/contrib/solr-map-reduce/test/J0/temp/solr.hadoop.MorphlineMapperTest_40C2758AB522AB4D-001/tempDir-001/test-morphlines/solrCellDocumentTypes.conf: 166
        "user_statuses_count",
        # /x1/jenkins/jenkins-slave/workspace/Lucene-Solr-Tests-5.x-Java7/solr/build/contrib/solr-map-reduce/test/J0/temp/solr.hadoop.MorphlineMapperTest_40C2758AB522AB4D-001/tempDir-001/test-morphlines/solrCellDocumentTypes.conf: 167
        "user_followers_count",
        # /x1/jenkins/jenkins-slave/workspace/Lucene-Solr-Tests-5.x-Java7/solr/build/contrib/solr-map-reduce/test/J0/temp/solr.hadoop.MorphlineMapperTest_40C2758AB522AB4D-001/tempDir-001/test-morphlines/solrCellDocumentTypes.conf: 168
        "user_name",
        # /x1/jenkins/jenkins-slave/workspace/Lucene-Solr-Tests-5.x-Java7/solr/build/contrib/solr-map-reduce/test/J0/temp/solr.hadoop.MorphlineMapperTest_40C2758AB522AB4D-001/tempDir-001/test-morphlines/solrCellDocumentTypes.conf: 169
        "user_screen_name",
        # /x1/jenkins/jenkins-slave/workspace/Lucene-Solr-Tests-5.x-Java7/solr/build/contrib/solr-map-reduce/test/J0/temp/solr.hadoop.MorphlineMapperTest_40C2758AB522AB4D-001/tempDir-001/test-morphlines/solrCellDocumentTypes.conf: 170
        "created_at",
        # /x1/jenkins/jenkins-slave/workspace/Lucene-Solr-Tests-5.x-Java7/solr/build/contrib/solr-map-reduce/test/J0/temp/solr.hadoop.MorphlineMapperTest_40C2758AB522AB4D-001/tempDir-001/test-morphlines/solrCellDocumentTypes.conf: 171
        "text",
        # /x1/jenkins/jenkins-slave/workspace/Lucene-Solr-Tests-5.x-Java7/solr/build/contrib/solr-map-reduce/test/J0/temp/solr.hadoop.MorphlineMapperTest_40C2758AB522AB4D-001/tempDir-001/test-morphlines/solrCellDocumentTypes.conf: 172
        "retweet_count",
        # /x1/jenkins/jenkins-slave/workspace/Lucene-Solr-Tests-5.x-Java7/solr/build/contrib/solr-map-reduce/test/J0/temp/solr.hadoop.MorphlineMapperTest_40C2758AB522AB4D-001/tempDir-001/test-morphlines/solrCellDocumentTypes.conf: 173
        "retweeted",
        # /x1/jenkins/jenkins-slave/workspace/Lucene-Solr-Tests-5.x-Java7/solr/build/contrib/solr-map-reduce/test/J0/temp/solr.hadoop.MorphlineMapperTest_40C2758AB522AB4D-001/tempDir-001/test-morphlines/solrCellDocumentTypes.conf: 174
        "in_reply_to_user_id",
        # /x1/jenkins/jenkins-slave/workspace/Lucene-Solr-Tests-5.x-Java7/solr/build/contrib/solr-map-reduce/test/J0/temp/solr.hadoop.MorphlineMapperTest_40C2758AB522AB4D-001/tempDir-001/test-morphlines/solrCellDocumentTypes.conf: 175
        "source",
        # /x1/jenkins/jenkins-slave/workspace/Lucene-Solr-Tests-5.x-Java7/solr/build/contrib/solr-map-reduce/test/J0/temp/solr.hadoop.MorphlineMapperTest_40C2758AB522AB4D-001/tempDir-001/test-morphlines/solrCellDocumentTypes.conf: 176
        "in_reply_to_status_id",
        # /x1/jenkins/jenkins-slave/workspace/Lucene-Solr-Tests-5.x-Java7/solr/build/contrib/solr-map-reduce/test/J0/temp/solr.hadoop.MorphlineMapperTest_40C2758AB522AB4D-001/tempDir-001/test-morphlines/solrCellDocumentTypes.conf: 177
        "media_url_https",
        # /x1/jenkins/jenkins-slave/workspace/Lucene-Solr-Tests-5.x-Java7/solr/build/contrib/solr-map-reduce/test/J0/temp/solr.hadoop.MorphlineMapperTest_40C2758AB522AB4D-001/tempDir-001/test-morphlines/solrCellDocumentTypes.conf: 178
        "expanded_url",
        # /x1/jenkins/jenkins-slave/workspace/Lucene-Solr-Tests-5.x-Java7/solr/build/contrib/solr-map-reduce/test/J0/temp/solr.hadoop.MorphlineMapperTest_40C2758AB522AB4D-001/tempDir-001/test-morphlines/solrCellDocumentTypes.conf: 181
        #  file metadata   
        "file_download_url",
        # /x1/jenkins/jenkins-slave/workspace/Lucene-Solr-Tests-5.x-Java7/solr/build/contrib/solr-map-reduce/test/J0/temp/solr.hadoop.MorphlineMapperTest_40C2758AB522AB4D-001/tempDir-001/test-morphlines/solrCellDocumentTypes.conf: 182
        "file_upload_url",
        # /x1/jenkins/jenkins-slave/workspace/Lucene-Solr-Tests-5.x-Java7/solr/build/contrib/solr-map-reduce/test/J0/temp/solr.hadoop.MorphlineMapperTest_40C2758AB522AB4D-001/tempDir-001/test-morphlines/solrCellDocumentTypes.conf: 183
        "file_scheme",
        # /x1/jenkins/jenkins-slave/workspace/Lucene-Solr-Tests-5.x-Java7/solr/build/contrib/solr-map-reduce/test/J0/temp/solr.hadoop.MorphlineMapperTest_40C2758AB522AB4D-001/tempDir-001/test-morphlines/solrCellDocumentTypes.conf: 184
        "file_host",
        # /x1/jenkins/jenkins-slave/workspace/Lucene-Solr-Tests-5.x-Java7/solr/build/contrib/solr-map-reduce/test/J0/temp/solr.hadoop.MorphlineMapperTest_40C2758AB522AB4D-001/tempDir-001/test-morphlines/solrCellDocumentTypes.conf: 185
        "file_port",
        # /x1/jenkins/jenkins-slave/workspace/Lucene-Solr-Tests-5.x-Java7/solr/build/contrib/solr-map-reduce/test/J0/temp/solr.hadoop.MorphlineMapperTest_40C2758AB522AB4D-001/tempDir-001/test-morphlines/solrCellDocumentTypes.conf: 186
        "file_path",
        # /x1/jenkins/jenkins-slave/workspace/Lucene-Solr-Tests-5.x-Java7/solr/build/contrib/solr-map-reduce/test/J0/temp/solr.hadoop.MorphlineMapperTest_40C2758AB522AB4D-001/tempDir-001/test-morphlines/solrCellDocumentTypes.conf: 187
        "file_name",
        # /x1/jenkins/jenkins-slave/workspace/Lucene-Solr-Tests-5.x-Java7/solr/build/contrib/solr-map-reduce/test/J0/temp/solr.hadoop.MorphlineMapperTest_40C2758AB522AB4D-001/tempDir-001/test-morphlines/solrCellDocumentTypes.conf: 188
        "file_length",
        # /x1/jenkins/jenkins-slave/workspace/Lucene-Solr-Tests-5.x-Java7/solr/build/contrib/solr-map-reduce/test/J0/temp/solr.hadoop.MorphlineMapperTest_40C2758AB522AB4D-001/tempDir-001/test-morphlines/solrCellDocumentTypes.conf: 189
        "file_last_modified",
        # /x1/jenkins/jenkins-slave/workspace/Lucene-Solr-Tests-5.x-Java7/solr/build/contrib/solr-map-reduce/test/J0/temp/solr.hadoop.MorphlineMapperTest_40C2758AB522AB4D-001/tempDir-001/test-morphlines/solrCellDocumentTypes.conf: 190
        "file_owner",
        # /x1/jenkins/jenkins-slave/workspace/Lucene-Solr-Tests-5.x-Java7/solr/build/contrib/solr-map-reduce/test/J0/temp/solr.hadoop.MorphlineMapperTest_40C2758AB522AB4D-001/tempDir-001/test-morphlines/solrCellDocumentTypes.conf: 191
        "file_group",
        # /x1/jenkins/jenkins-slave/workspace/Lucene-Solr-Tests-5.x-Java7/solr/build/contrib/solr-map-reduce/test/J0/temp/solr.hadoop.MorphlineMapperTest_40C2758AB522AB4D-001/tempDir-001/test-morphlines/solrCellDocumentTypes.conf: 192
        "file_permissions_user",
        # /x1/jenkins/jenkins-slave/workspace/Lucene-Solr-Tests-5.x-Java7/solr/build/contrib/solr-map-reduce/test/J0/temp/solr.hadoop.MorphlineMapperTest_40C2758AB522AB4D-001/tempDir-001/test-morphlines/solrCellDocumentTypes.conf: 193
        "file_permissions_group",
        # /x1/jenkins/jenkins-slave/workspace/Lucene-Solr-Tests-5.x-Java7/solr/build/contrib/solr-map-reduce/test/J0/temp/solr.hadoop.MorphlineMapperTest_40C2758AB522AB4D-001/tempDir-001/test-morphlines/solrCellDocumentTypes.conf: 194
        "file_permissions_other",
        # /x1/jenkins/jenkins-slave/workspace/Lucene-Solr-Tests-5.x-Java7/solr/build/contrib/solr-map-reduce/test/J0/temp/solr.hadoop.MorphlineMapperTest_40C2758AB522AB4D-001/tempDir-001/test-morphlines/solrCellDocumentTypes.conf: 195
        "file_permissions_stickybit"
    ]
}
	at __randomizedtesting.SeedInfo.seed([40C2758AB522AB4D:8AB60586DE1DE23C]:0)
	at org.apache.solr.morphlines.cell.SolrCellBuilder$SolrCell.getLocale(SolrCellBuilder.java:340)
	at org.apache.solr.morphlines.cell.SolrCellBuilder$SolrCell.<init>(SolrCellBuilder.java:166)
	at org.apache.solr.morphlines.cell.SolrCellBuilder.build(SolrCellBuilder.java:90)
	at org.kitesdk.morphline.base.AbstractCommand.buildCommand(AbstractCommand.java:302)
	at org.kitesdk.morphline.base.AbstractCommand.buildCommandChain(AbstractCommand.java:249)
	at org.kitesdk.morphline.stdlib.TryRulesBuilder$TryRules.<init>(TryRulesBuilder.java:83)
	at org.kitesdk.morphline.stdlib.TryRulesBuilder.build(TryRulesBuilder.java:59)
	at org.kitesdk.morphline.base.AbstractCommand.buildCommand(AbstractCommand.java:302)
	at org.kitesdk.morphline.base.AbstractCommand.buildCommandChain(AbstractCommand.java:249)
	at org.kitesdk.morphline.stdlib.Pipe.<init>(Pipe.java:46)
	at org.kitesdk.morphline.stdlib.PipeBuilder.build(PipeBuilder.java:40)
	at org.kitesdk.morphline.base.Compiler.compile(Compiler.java:126)
	at org.kitesdk.morphline.base.Compiler.compile(Compiler.java:55)
	at org.apache.solr.hadoop.morphline.MorphlineMapRunner.<init>(MorphlineMapRunner.java:158)
	at org.apache.solr.hadoop.morphline.MorphlineMapper.setup(MorphlineMapper.java:76)
	at org.apache.hadoop.mapreduce.Mapper.run(Mapper.java:142)
	at org.apache.hadoop.mrunit.mapreduce.MapDriver.run(MapDriver.java:137)
	at org.apache.solr.hadoop.MorphlineMapperTest.testMapper(MorphlineMapperTest.java:69)
	at sun.reflect.NativeMethodAccessorImpl.invoke0(Native Method)
	at sun.reflect.NativeMethodAccessorImpl.invoke(NativeMethodAccessorImpl.java:57)
	at sun.reflect.DelegatingMethodAccessorImpl.invoke(DelegatingMethodAccessorImpl.java:43)
	at java.lang.reflect.Method.invoke(Method.java:606)
	at com.carrotsearch.randomizedtesting.RandomizedRunner.invoke(RandomizedRunner.java:1764)
	at com.carrotsearch.randomizedtesting.RandomizedRunner$8.evaluate(RandomizedRunner.java:871)
	at com.carrotsearch.randomizedtesting.RandomizedRunner$9.evaluate(RandomizedRunner.java:907)
	at com.carrotsearch.randomizedtesting.RandomizedRunner$10.evaluate(RandomizedRunner.java:921)
	at com.carrotsearch.randomizedtesting.rules.SystemPropertiesRestoreRule$1.evaluate(SystemPropertiesRestoreRule.java:57)
	at org.apache.lucene.util.TestRuleSetupTeardownChained$1.evaluate(TestRuleSetupTeardownChained.java:50)
	at org.apache.lucene.util.AbstractBeforeAfterRule$1.evaluate(AbstractBeforeAfterRule.java:46)
	at org.apache.lucene.util.TestRuleThreadAndTestName$1.evaluate(TestRuleThreadAndTestName.java:49)
	at org.apache.lucene.util.TestRuleIgnoreAfterMaxFailures$1.evaluate(TestRuleIgnoreAfterMaxFailures.java:65)
	at org.apache.lucene.util.TestRuleMarkFailure$1.evaluate(TestRuleMarkFailure.java:48)
	at com.carrotsearch.randomizedtesting.rules.StatementAdapter.evaluate(StatementAdapter.java:36)
	at com.carrotsearch.randomizedtesting.ThreadLeakControl$StatementRunner.run(ThreadLeakControl.java:367)
	at com.carrotsearch.randomizedtesting.ThreadLeakControl.forkTimeoutingTask(ThreadLeakControl.java:809)
	at com.carrotsearch.randomizedtesting.ThreadLeakControl$3.evaluate(ThreadLeakControl.java:460)
	at com.carrotsearch.randomizedtesting.RandomizedRunner.runSingleTest(RandomizedRunner.java:880)
	at com.carrotsearch.randomizedtesting.RandomizedRunner$5.evaluate(RandomizedRunner.java:781)
	at com.carrotsearch.randomizedtesting.RandomizedRunner$6.evaluate(RandomizedRunner.java:816)
	at com.carrotsearch.randomizedtesting.RandomizedRunner$7.evaluate(RandomizedRunner.java:827)
	at com.carrotsearch.randomizedtesting.rules.StatementAdapter.evaluate(StatementAdapter.java:36)
	at com.carrotsearch.randomizedtesting.rules.SystemPropertiesRestoreRule$1.evaluate(SystemPropertiesRestoreRule.java:57)
	at org.apache.lucene.util.AbstractBeforeAfterRule$1.evaluate(AbstractBeforeAfterRule.java:46)
	at com.carrotsearch.randomizedtesting.rules.StatementAdapter.evaluate(StatementAdapter.java:36)
	at org.apache.lucene.util.TestRuleStoreClassName$1.evaluate(TestRuleStoreClassName.java:42)
	at com.carrotsearch.randomizedtesting.rules.NoShadowingOrOverridesOnMethodsRule$1.evaluate(NoShadowingOrOverridesOnMethodsRule.java:40)
	at com.carrotsearch.randomizedtesting.rules.NoShadowingOrOverridesOnMethodsRule$1.evaluate(NoShadowingOrOverridesOnMethodsRule.java:40)
	at com.carrotsearch.randomizedtesting.rules.StatementAdapter.evaluate(StatementAdapter.java:36)
	at com.carrotsearch.randomizedtesting.rules.StatementAdapter.evaluate(StatementAdapter.java:36)
	at com.carrotsearch.randomizedtesting.rules.StatementAdapter.evaluate(StatementAdapter.java:36)
	at org.apache.lucene.util.TestRuleAssertionsRequired$1.evaluate(TestRuleAssertionsRequired.java:54)
	at org.apache.lucene.util.TestRuleMarkFailure$1.evaluate(TestRuleMarkFailure.java:48)
	at org.apache.lucene.util.TestRuleIgnoreAfterMaxFailures$1.evaluate(TestRuleIgnoreAfterMaxFailures.java:65)
	at org.apache.lucene.util.TestRuleIgnoreTestSuites$1.evaluate(TestRuleIgnoreTestSuites.java:55)
	at com.carrotsearch.randomizedtesting.rules.StatementAdapter.evaluate(StatementAdapter.java:36)
	at com.carrotsearch.randomizedtesting.ThreadLeakControl$StatementRunner.run(ThreadLeakControl.java:367)
	at java.lang.Thread.run(Thread.java:745)
Caused by: java.util.IllformedLocaleException: Empty subtag [at index 0]
	at java.util.Locale$Builder.setLanguageTag(Locale.java:2311)
	at org.apache.solr.morphlines.cell.SolrCellBuilder$SolrCell.getLocale(SolrCellBuilder.java:338)
	... 56 more


FAILED:  junit.framework.TestSuite.org.apache.solr.hadoop.MorphlineMapperTest

Error Message:
1 thread leaked from SUITE scope at org.apache.solr.hadoop.MorphlineMapperTest:     1) Thread[id=17, name=Thread-2, state=TIMED_WAITING, group=TGRP-MorphlineMapperTest]         at sun.misc.Unsafe.park(Native Method)         at java.util.concurrent.locks.LockSupport.parkNanos(LockSupport.java:226)         at java.util.concurrent.locks.AbstractQueuedSynchronizer.doAcquireSharedNanos(AbstractQueuedSynchronizer.java:1033)         at java.util.concurrent.locks.AbstractQueuedSynchronizer.tryAcquireSharedNanos(AbstractQueuedSynchronizer.java:1326)         at java.util.concurrent.CountDownLatch.await(CountDownLatch.java:282)         at org.apache.solr.hadoop.HeartBeater.run(HeartBeater.java:109)

Stack Trace:
com.carrotsearch.randomizedtesting.ThreadLeakError: 1 thread leaked from SUITE scope at org.apache.solr.hadoop.MorphlineMapperTest: 
   1) Thread[id=17, name=Thread-2, state=TIMED_WAITING, group=TGRP-MorphlineMapperTest]
        at sun.misc.Unsafe.park(Native Method)
        at java.util.concurrent.locks.LockSupport.parkNanos(LockSupport.java:226)
        at java.util.concurrent.locks.AbstractQueuedSynchronizer.doAcquireSharedNanos(AbstractQueuedSynchronizer.java:1033)
        at java.util.concurrent.locks.AbstractQueuedSynchronizer.tryAcquireSharedNanos(AbstractQueuedSynchronizer.java:1326)
        at java.util.concurrent.CountDownLatch.await(CountDownLatch.java:282)
        at org.apache.solr.hadoop.HeartBeater.run(HeartBeater.java:109)
	at __randomizedtesting.SeedInfo.seed([40C2758AB522AB4D]:0)


FAILED:  junit.framework.TestSuite.org.apache.solr.hadoop.MorphlineMapperTest

Error Message:
There are still zombie threads that couldn't be terminated:    1) Thread[id=17, name=Thread-2, state=TIMED_WAITING, group=TGRP-MorphlineMapperTest]         at sun.misc.Unsafe.park(Native Method)         at java.util.concurrent.locks.LockSupport.parkNanos(LockSupport.java:226)         at java.util.concurrent.locks.AbstractQueuedSynchronizer.doAcquireSharedNanos(AbstractQueuedSynchronizer.java:1033)         at java.util.concurrent.locks.AbstractQueuedSynchronizer.tryAcquireSharedNanos(AbstractQueuedSynchronizer.java:1326)         at java.util.concurrent.CountDownLatch.await(CountDownLatch.java:282)         at org.apache.solr.hadoop.HeartBeater.run(HeartBeater.java:109)

Stack Trace:
com.carrotsearch.randomizedtesting.ThreadLeakError: There are still zombie threads that couldn't be terminated:
   1) Thread[id=17, name=Thread-2, state=TIMED_WAITING, group=TGRP-MorphlineMapperTest]
        at sun.misc.Unsafe.park(Native Method)
        at java.util.concurrent.locks.LockSupport.parkNanos(LockSupport.java:226)
        at java.util.concurrent.locks.AbstractQueuedSynchronizer.doAcquireSharedNanos(AbstractQueuedSynchronizer.java:1033)
        at java.util.concurrent.locks.AbstractQueuedSynchronizer.tryAcquireSharedNanos(AbstractQueuedSynchronizer.java:1326)
        at java.util.concurrent.CountDownLatch.await(CountDownLatch.java:282)
        at org.apache.solr.hadoop.HeartBeater.run(HeartBeater.java:109)
	at __randomizedtesting.SeedInfo.seed([40C2758AB522AB4D]:0)




Build Log:
[...truncated 17880 lines...]
   [junit4] Suite: org.apache.solr.hadoop.MorphlineMapperTest
   [junit4]   2> Creating dataDir: /x1/jenkins/jenkins-slave/workspace/Lucene-Solr-Tests-5.x-Java7/solr/build/contrib/solr-map-reduce/test/J0/temp/solr.hadoop.MorphlineMapperTest_40C2758AB522AB4D-001/init-core-data-001
   [junit4]   2> 0    INFO  (SUITE-MorphlineMapperTest-seed#[40C2758AB522AB4D]-worker) [    ] o.a.s.SolrTestCaseJ4 Randomized ssl (false) and clientAuth (false)
   [junit4]   2> 324  INFO  (TEST-MorphlineMapperTest.testMapper-seed#[40C2758AB522AB4D]) [    ] o.a.s.SolrTestCaseJ4 ###Starting testMapper
   [junit4]   2> 1426 INFO  (TEST-MorphlineMapperTest.testMapper-seed#[40C2758AB522AB4D]) [    ] o.a.h.c.C.deprecation mapred.cache.localArchives is deprecated. Instead, use mapreduce.job.cache.local.archives
   [junit4]   2> 2047 INFO  (TEST-MorphlineMapperTest.testMapper-seed#[40C2758AB522AB4D]) [    ] o.a.s.h.SolrRecordWriter Using this unpacked directory as solr home: temp/mrunit-5561c902-f083-4bd7-aa93-882b875ee524/solr3687890683091626726.zip
   [junit4]   2> 2050 INFO  (TEST-MorphlineMapperTest.testMapper-seed#[40C2758AB522AB4D]) [    ] o.a.s.h.HeartBeater Heart beat reporting class is org.apache.hadoop.mapreduce.Mapper$Context$$EnhancerByMockitoWithCGLIB$$fd42ae83
   [junit4]   2> 2053 INFO  (Thread-2) [    ] o.a.s.h.HeartBeater HeartBeat thread running
   [junit4]   2> 2054 INFO  (Thread-2) [    ] o.a.s.h.HeartBeater heartbeat skipped count 0
   [junit4]   2> 2118 INFO  (TEST-MorphlineMapperTest.testMapper-seed#[40C2758AB522AB4D]) [    ] o.a.s.c.SolrResourceLoader new SolrResourceLoader for directory: '/x1/jenkins/jenkins-slave/workspace/Lucene-Solr-Tests-5.x-Java7/solr/build/contrib/solr-map-reduce/test/J0/temp/mrunit-5561c902-f083-4bd7-aa93-882b875ee524/solr3687890683091626726.zip'
   [junit4]   2> 2124 INFO  (TEST-MorphlineMapperTest.testMapper-seed#[40C2758AB522AB4D]) [    ] o.a.s.c.SolrResourceLoader JNDI not configured for solr (NoInitialContextEx)
   [junit4]   2> 2125 INFO  (TEST-MorphlineMapperTest.testMapper-seed#[40C2758AB522AB4D]) [    ] o.a.s.c.SolrResourceLoader solr home defaulted to 'solr/' (could not find system property or JNDI)
   [junit4]   2> 2951 INFO  (TEST-MorphlineMapperTest.testMapper-seed#[40C2758AB522AB4D]) [    ] o.a.s.c.SolrConfig current version of requestparams : -1
   [junit4]   2> 2983 INFO  (TEST-MorphlineMapperTest.testMapper-seed#[40C2758AB522AB4D]) [    ] o.a.s.c.SolrConfig Adding specified lib dirs to ClassLoader
   [junit4]   2> 2985 WARN  (TEST-MorphlineMapperTest.testMapper-seed#[40C2758AB522AB4D]) [    ] o.a.s.c.SolrConfig Couldn't add files from /x1/jenkins/jenkins-slave/workspace/Lucene-Solr-Tests-5.x-Java7/solr/build/contrib/solr-map-reduce/test/J0/temp/mrunit-5561c902-f083-4bd7-aa93-882b875ee524/solr3687890683091626726.zip/../../../contrib/extraction/lib filtered by .*\.jar to classpath: /x1/jenkins/jenkins-slave/workspace/Lucene-Solr-Tests-5.x-Java7/solr/build/contrib/solr-map-reduce/test/J0/temp/mrunit-5561c902-f083-4bd7-aa93-882b875ee524/solr3687890683091626726.zip/../../../contrib/extraction/lib
   [junit4]   2> 2986 WARN  (TEST-MorphlineMapperTest.testMapper-seed#[40C2758AB522AB4D]) [    ] o.a.s.c.SolrConfig Couldn't add files from /x1/jenkins/jenkins-slave/workspace/Lucene-Solr-Tests-5.x-Java7/solr/build/contrib/solr-map-reduce/test/J0/temp/mrunit-5561c902-f083-4bd7-aa93-882b875ee524/solr3687890683091626726.zip/../../../dist filtered by solr-cell-\d.*\.jar to classpath: /x1/jenkins/jenkins-slave/workspace/Lucene-Solr-Tests-5.x-Java7/solr/build/contrib/solr-map-reduce/test/J0/temp/mrunit-5561c902-f083-4bd7-aa93-882b875ee524/solr3687890683091626726.zip/../../../dist
   [junit4]   2> 2987 WARN  (TEST-MorphlineMapperTest.testMapper-seed#[40C2758AB522AB4D]) [    ] o.a.s.c.SolrConfig Couldn't add files from /x1/jenkins/jenkins-slave/workspace/Lucene-Solr-Tests-5.x-Java7/solr/build/contrib/solr-map-reduce/test/J0/temp/mrunit-5561c902-f083-4bd7-aa93-882b875ee524/solr3687890683091626726.zip/../../../contrib/clustering/lib filtered by .*\.jar to classpath: /x1/jenkins/jenkins-slave/workspace/Lucene-Solr-Tests-5.x-Java7/solr/build/contrib/solr-map-reduce/test/J0/temp/mrunit-5561c902-f083-4bd7-aa93-882b875ee524/solr3687890683091626726.zip/../../../contrib/clustering/lib
   [junit4]   2> 2989 WARN  (TEST-MorphlineMapperTest.testMapper-seed#[40C2758AB522AB4D]) [    ] o.a.s.c.SolrConfig Couldn't add files from /x1/jenkins/jenkins-slave/workspace/Lucene-Solr-Tests-5.x-Java7/solr/build/contrib/solr-map-reduce/test/J0/temp/mrunit-5561c902-f083-4bd7-aa93-882b875ee524/solr3687890683091626726.zip/../../../dist filtered by solr-clustering-\d.*\.jar to classpath: /x1/jenkins/jenkins-slave/workspace/Lucene-Solr-Tests-5.x-Java7/solr/build/contrib/solr-map-reduce/test/J0/temp/mrunit-5561c902-f083-4bd7-aa93-882b875ee524/solr3687890683091626726.zip/../../../dist
   [junit4]   2> 2990 WARN  (TEST-MorphlineMapperTest.testMapper-seed#[40C2758AB522AB4D]) [    ] o.a.s.c.SolrConfig Couldn't add files from /x1/jenkins/jenkins-slave/workspace/Lucene-Solr-Tests-5.x-Java7/solr/build/contrib/solr-map-reduce/test/J0/temp/mrunit-5561c902-f083-4bd7-aa93-882b875ee524/solr3687890683091626726.zip/../../../contrib/langid/lib filtered by .*\.jar to classpath: /x1/jenkins/jenkins-slave/workspace/Lucene-Solr-Tests-5.x-Java7/solr/build/contrib/solr-map-reduce/test/J0/temp/mrunit-5561c902-f083-4bd7-aa93-882b875ee524/solr3687890683091626726.zip/../../../contrib/langid/lib
   [junit4]   2> 2991 WARN  (TEST-MorphlineMapperTest.testMapper-seed#[40C2758AB522AB4D]) [    ] o.a.s.c.SolrConfig Couldn't add files from /x1/jenkins/jenkins-slave/workspace/Lucene-Solr-Tests-5.x-Java7/solr/build/contrib/solr-map-reduce/test/J0/temp/mrunit-5561c902-f083-4bd7-aa93-882b875ee524/solr3687890683091626726.zip/../../../dist filtered by solr-langid-\d.*\.jar to classpath: /x1/jenkins/jenkins-slave/workspace/Lucene-Solr-Tests-5.x-Java7/solr/build/contrib/solr-map-reduce/test/J0/temp/mrunit-5561c902-f083-4bd7-aa93-882b875ee524/solr3687890683091626726.zip/../../../dist
   [junit4]   2> 2992 WARN  (TEST-MorphlineMapperTest.testMapper-seed#[40C2758AB522AB4D]) [    ] o.a.s.c.SolrConfig Couldn't add files from /x1/jenkins/jenkins-slave/workspace/Lucene-Solr-Tests-5.x-Java7/solr/build/contrib/solr-map-reduce/test/J0/temp/mrunit-5561c902-f083-4bd7-aa93-882b875ee524/solr3687890683091626726.zip/../../../contrib/velocity/lib filtered by .*\.jar to classpath: /x1/jenkins/jenkins-slave/workspace/Lucene-Solr-Tests-5.x-Java7/solr/build/contrib/solr-map-reduce/test/J0/temp/mrunit-5561c902-f083-4bd7-aa93-882b875ee524/solr3687890683091626726.zip/../../../contrib/velocity/lib
   [junit4]   2> 2994 WARN  (TEST-MorphlineMapperTest.testMapper-seed#[40C2758AB522AB4D]) [    ] o.a.s.c.SolrConfig Couldn't add files from /x1/jenkins/jenkins-slave/workspace/Lucene-Solr-Tests-5.x-Java7/solr/build/contrib/solr-map-reduce/test/J0/temp/mrunit-5561c902-f083-4bd7-aa93-882b875ee524/solr3687890683091626726.zip/../../../dist filtered by solr-velocity-\d.*\.jar to classpath: /x1/jenkins/jenkins-slave/workspace/Lucene-Solr-Tests-5.x-Java7/solr/build/contrib/solr-map-reduce/test/J0/temp/mrunit-5561c902-f083-4bd7-aa93-882b875ee524/solr3687890683091626726.zip/../../../dist
   [junit4]   2> 2996 WARN  (TEST-MorphlineMapperTest.testMapper-seed#[40C2758AB522AB4D]) [    ] o.a.s.c.SolrConfig Couldn't add files from /non/existent/dir/yields/warning filtered by null to classpath: /non/existent/dir/yields/warning
   [junit4]   2> 3190 INFO  (TEST-MorphlineMapperTest.testMapper-seed#[40C2758AB522AB4D]) [    ] o.a.s.c.SolrConfig Using Lucene MatchVersion: 5.5.0
   [junit4]   2> 3427 INFO  (TEST-MorphlineMapperTest.testMapper-seed#[40C2758AB522AB4D]) [    ] o.a.s.c.SolrConfig Loaded SolrConfig: solrconfig.xml
   [junit4]   2> 3521 INFO  (TEST-MorphlineMapperTest.testMapper-seed#[40C2758AB522AB4D]) [    ] o.a.s.s.IndexSchema [null] Schema name=example
   [junit4]   2> 4639 WARN  (TEST-MorphlineMapperTest.testMapper-seed#[40C2758AB522AB4D]) [    ] o.a.s.c.SolrResourceLoader Solr loaded a deprecated plugin/analysis class [solr.ThaiWordFilterFactory]. Please consult documentation how to replace it accordingly.
   [junit4]   2> 4738 INFO  (TEST-MorphlineMapperTest.testMapper-seed#[40C2758AB522AB4D]) [    ] o.a.s.s.IndexSchema unique key field: id
   [junit4]   2> 4952 INFO  (TEST-MorphlineMapperTest.testMapper-seed#[40C2758AB522AB4D]) [    ] o.a.s.s.FileExchangeRateProvider Reloading exchange rates from file currency.xml
   [junit4]   2> 4968 INFO  (TEST-MorphlineMapperTest.testMapper-seed#[40C2758AB522AB4D]) [    ] o.a.s.s.FileExchangeRateProvider Reloading exchange rates from file currency.xml
   [junit4]   2> 5414 INFO  (TEST-MorphlineMapperTest.testMapper-seed#[40C2758AB522AB4D]) [    ] o.k.m.a.MorphlineContext Importing commands
   [junit4]   2> 7772 INFO  (TEST-MorphlineMapperTest.testMapper-seed#[40C2758AB522AB4D]) [    ] o.k.m.a.MorphlineContext Done importing commands
   [junit4]   2> 11245 WARN  (TEST-MorphlineMapperTest.testMapper-seed#[40C2758AB522AB4D]) [    ] o.a.h.u.NativeCodeLoader Unable to load native-hadoop library for your platform... using builtin-java classes where applicable
   [junit4]   2> 11462 INFO  (TEST-MorphlineMapperTest.testMapper-seed#[40C2758AB522AB4D]) [    ] o.a.s.SolrTestCaseJ4 ###Ending testMapper
   [junit4]   2> NOTE: reproduce with: ant test  -Dtestcase=MorphlineMapperTest -Dtests.method=testMapper -Dtests.seed=40C2758AB522AB4D -Dtests.multiplier=2 -Dtests.slow=true -Dtests.locale=es-ES -Dtests.timezone=MST7MDT -Dtests.asserts=true -Dtests.file.encoding=US-ASCII
   [junit4] ERROR   11.2s J0 | MorphlineMapperTest.testMapper <<<
   [junit4]    > Throwable #1: org.kitesdk.morphline.api.MorphlineCompilationException: Malformed / non-existent locale:  near: {
   [junit4]    >     # /x1/jenkins/jenkins-slave/workspace/Lucene-Solr-Tests-5.x-Java7/solr/build/contrib/solr-map-reduce/test/J0/temp/solr.hadoop.MorphlineMapperTest_40C2758AB522AB4D-001/tempDir-001/test-morphlines/solrCellDocumentTypes.conf: 201
   [junit4]    >     #  various java.text.SimpleDateFormat
   [junit4]    >     #  xpath : "/xhtml:html/xhtml:body/xhtml:div/descendant:node()"
   [junit4]    >     "uprefix" : "ignored_",
   [junit4]    >     # /x1/jenkins/jenkins-slave/workspace/Lucene-Solr-Tests-5.x-Java7/solr/build/contrib/solr-map-reduce/test/J0/temp/solr.hadoop.MorphlineMapperTest_40C2758AB522AB4D-001/tempDir-001/test-morphlines/solrCellDocumentTypes.conf: 198
   [junit4]    >     "fmap" : {
   [junit4]    >         # /x1/jenkins/jenkins-slave/workspace/Lucene-Solr-Tests-5.x-Java7/solr/build/contrib/solr-map-reduce/test/J0/temp/solr.hadoop.MorphlineMapperTest_40C2758AB522AB4D-001/tempDir-001/test-morphlines/solrCellDocumentTypes.conf: 198
   [junit4]    >         "content" : "text",
   [junit4]    >         # /x1/jenkins/jenkins-slave/workspace/Lucene-Solr-Tests-5.x-Java7/solr/build/contrib/solr-map-reduce/test/J0/temp/solr.hadoop.MorphlineMapperTest_40C2758AB522AB4D-001/tempDir-001/test-morphlines/solrCellDocumentTypes.conf: 198
   [junit4]    >         "content-type" : "content_type"
   [junit4]    >     },
   [junit4]    >     # /x1/jenkins/jenkins-slave/workspace/Lucene-Solr-Tests-5.x-Java7/solr/build/contrib/solr-map-reduce/test/J0/temp/solr.hadoop.MorphlineMapperTest_40C2758AB522AB4D-001/tempDir-001/test-morphlines/solrCellDocumentTypes.conf: 202
   [junit4]    >     "lowernames" : true,
   [junit4]    >     # /x1/jenkins/jenkins-slave/workspace/Lucene-Solr-Tests-5.x-Java7/solr/build/contrib/solr-map-reduce/test/J0/temp/solr.hadoop.MorphlineMapperTest_40C2758AB522AB4D-001/tempDir-001/test-morphlines/solrCellDocumentTypes.conf: 158
   [junit4]    >     "solrLocator" : {
   [junit4]    >         # /x1/jenkins/jenkins-slave/workspace/Lucene-Solr-Tests-5.x-Java7/solr/build/contrib/solr-map-reduce/test/J0/temp/solr.hadoop.MorphlineMapperTest_40C2758AB522AB4D-001/tempDir-001/test-morphlines/solrCellDocumentTypes.conf: 158
   [junit4]    >         "collection" : "collection1"
   [junit4]    >     },
   [junit4]    >     # /x1/jenkins/jenkins-slave/workspace/Lucene-Solr-Tests-5.x-Java7/solr/build/contrib/solr-map-reduce/test/J0/temp/solr.hadoop.MorphlineMapperTest_40C2758AB522AB4D-001/tempDir-001/test-morphlines/solrCellDocumentTypes.conf: 199
   [junit4]    >     #  rename "content" field to "text" fields
   [junit4]    >     "dateFormats" : [
   [junit4]    >         # /x1/jenkins/jenkins-slave/workspace/Lucene-Solr-Tests-5.x-Java7/solr/build/contrib/solr-map-reduce/test/J0/temp/solr.hadoop.MorphlineMapperTest_40C2758AB522AB4D-001/tempDir-001/test-morphlines/solrCellDocumentTypes.conf: 199
   [junit4]    >         "yyyy-MM-dd'T'HH:mm:ss",
   [junit4]    >         # /x1/jenkins/jenkins-slave/workspace/Lucene-Solr-Tests-5.x-Java7/solr/build/contrib/solr-map-reduce/test/J0/temp/solr.hadoop.MorphlineMapperTest_40C2758AB522AB4D-001/tempDir-001/test-morphlines/solrCellDocumentTypes.conf: 199
   [junit4]    >         "yyyy-MM-dd"
   [junit4]    >     ],
   [junit4]    >     # /x1/jenkins/jenkins-slave/workspace/Lucene-Solr-Tests-5.x-Java7/solr/build/contrib/solr-map-reduce/test/J0/temp/solr.hadoop.MorphlineMapperTest_40C2758AB522AB4D-001/tempDir-001/test-morphlines/solrCellDocumentTypes.conf: 207
   [junit4]    >     #  Tika parsers to be registered. If multiple parsers support the same MIME type, 
   [junit4]    >     #  the parser is chosen that is closest to the bottom in this list:
   [ju

[...truncated too long message...]

chronizer.doAcquireSharedNanos(AbstractQueuedSynchronizer.java:1033)
   [junit4]   2>         at java.util.concurrent.locks.AbstractQueuedSynchronizer.tryAcquireSharedNanos(AbstractQueuedSynchronizer.java:1326)
   [junit4]   2>         at java.util.concurrent.CountDownLatch.await(CountDownLatch.java:282)
   [junit4]   2>         at org.apache.solr.hadoop.HeartBeater.run(HeartBeater.java:109)
   [junit4]   2> Jan 20, 2016 10:52:44 AM com.carrotsearch.randomizedtesting.ThreadLeakControl tryToInterruptAll
   [junit4]   2> INFO: Starting to interrupt leaked threads:
   [junit4]   2>    1) Thread[id=17, name=Thread-2, state=TIMED_WAITING, group=TGRP-MorphlineMapperTest]
   [junit4]   2> 31627 ERROR (Thread-2) [    ] o.a.s.h.HeartBeater HeartBeat throwable
   [junit4]   2> java.lang.InterruptedException
   [junit4]   2> 	at java.util.concurrent.locks.AbstractQueuedSynchronizer.doAcquireSharedNanos(AbstractQueuedSynchronizer.java:1038)
   [junit4]   2> 	at java.util.concurrent.locks.AbstractQueuedSynchronizer.tryAcquireSharedNanos(AbstractQueuedSynchronizer.java:1326)
   [junit4]   2> 	at java.util.concurrent.CountDownLatch.await(CountDownLatch.java:282)
   [junit4]   2> 	at org.apache.solr.hadoop.HeartBeater.run(HeartBeater.java:109)
   [junit4]   2> 31630 INFO  (Thread-2) [    ] o.a.s.h.HeartBeater heartbeat skipped count 0
   [junit4]   2> 32126 ERROR (Thread-2) [    ] o.a.s.h.HeartBeater HeartBeat throwable
   [junit4]   2> java.lang.InterruptedException
   [junit4]   2> 	at java.util.concurrent.locks.AbstractQueuedSynchronizer.doAcquireSharedNanos(AbstractQueuedSynchronizer.java:1038)
   [junit4]   2> 	at java.util.concurrent.locks.AbstractQueuedSynchronizer.tryAcquireSharedNanos(AbstractQueuedSynchronizer.java:1326)
   [junit4]   2> 	at java.util.concurrent.CountDownLatch.await(CountDownLatch.java:282)
   [junit4]   2> 	at org.apache.solr.hadoop.HeartBeater.run(HeartBeater.java:109)
   [junit4]   2> 32127 INFO  (Thread-2) [    ] o.a.s.h.HeartBeater heartbeat skipped count 0
   [junit4]   2> 32626 ERROR (Thread-2) [    ] o.a.s.h.HeartBeater HeartBeat throwable
   [junit4]   2> java.lang.InterruptedException
   [junit4]   2> 	at java.util.concurrent.locks.AbstractQueuedSynchronizer.doAcquireSharedNanos(AbstractQueuedSynchronizer.java:1038)
   [junit4]   2> 	at java.util.concurrent.locks.AbstractQueuedSynchronizer.tryAcquireSharedNanos(AbstractQueuedSynchronizer.java:1326)
   [junit4]   2> 	at java.util.concurrent.CountDownLatch.await(CountDownLatch.java:282)
   [junit4]   2> 	at org.apache.solr.hadoop.HeartBeater.run(HeartBeater.java:109)
   [junit4]   2> 32627 INFO  (Thread-2) [    ] o.a.s.h.HeartBeater heartbeat skipped count 0
   [junit4]   2> 33126 ERROR (Thread-2) [    ] o.a.s.h.HeartBeater HeartBeat throwable
   [junit4]   2> java.lang.InterruptedException
   [junit4]   2> 	at java.util.concurrent.locks.AbstractQueuedSynchronizer.doAcquireSharedNanos(AbstractQueuedSynchronizer.java:1038)
   [junit4]   2> 	at java.util.concurrent.locks.AbstractQueuedSynchronizer.tryAcquireSharedNanos(AbstractQueuedSynchronizer.java:1326)
   [junit4]   2> 	at java.util.concurrent.CountDownLatch.await(CountDownLatch.java:282)
   [junit4]   2> 	at org.apache.solr.hadoop.HeartBeater.run(HeartBeater.java:109)
   [junit4]   2> 33127 INFO  (Thread-2) [    ] o.a.s.h.HeartBeater heartbeat skipped count 0
   [junit4]   2> 33626 ERROR (Thread-2) [    ] o.a.s.h.HeartBeater HeartBeat throwable
   [junit4]   2> java.lang.InterruptedException
   [junit4]   2> 	at java.util.concurrent.locks.AbstractQueuedSynchronizer.doAcquireSharedNanos(AbstractQueuedSynchronizer.java:1038)
   [junit4]   2> 	at java.util.concurrent.locks.AbstractQueuedSynchronizer.tryAcquireSharedNanos(AbstractQueuedSynchronizer.java:1326)
   [junit4]   2> 	at java.util.concurrent.CountDownLatch.await(CountDownLatch.java:282)
   [junit4]   2> 	at org.apache.solr.hadoop.HeartBeater.run(HeartBeater.java:109)
   [junit4]   2> 33627 INFO  (Thread-2) [    ] o.a.s.h.HeartBeater heartbeat skipped count 0
   [junit4]   2> 34127 ERROR (Thread-2) [    ] o.a.s.h.HeartBeater HeartBeat throwable
   [junit4]   2> java.lang.InterruptedException
   [junit4]   2> 	at java.util.concurrent.locks.AbstractQueuedSynchronizer.doAcquireSharedNanos(AbstractQueuedSynchronizer.java:1038)
   [junit4]   2> 	at java.util.concurrent.locks.AbstractQueuedSynchronizer.tryAcquireSharedNanos(AbstractQueuedSynchronizer.java:1326)
   [junit4]   2> 	at java.util.concurrent.CountDownLatch.await(CountDownLatch.java:282)
   [junit4]   2> 	at org.apache.solr.hadoop.HeartBeater.run(HeartBeater.java:109)
   [junit4]   2> 34127 INFO  (Thread-2) [    ] o.a.s.h.HeartBeater heartbeat skipped count 0
   [junit4]   2> Jan 20, 2016 10:52:47 AM com.carrotsearch.randomizedtesting.ThreadLeakControl tryToInterruptAll
   [junit4]   2> SEVERE: There are still zombie threads that couldn't be terminated:
   [junit4]   2>    1) Thread[id=17, name=Thread-2, state=TIMED_WAITING, group=TGRP-MorphlineMapperTest]
   [junit4]   2>         at sun.misc.Unsafe.park(Native Method)
   [junit4]   2>         at java.util.concurrent.locks.LockSupport.parkNanos(LockSupport.java:226)
   [junit4]   2>         at java.util.concurrent.locks.AbstractQueuedSynchronizer.doAcquireSharedNanos(AbstractQueuedSynchronizer.java:1033)
   [junit4]   2>         at java.util.concurrent.locks.AbstractQueuedSynchronizer.tryAcquireSharedNanos(AbstractQueuedSynchronizer.java:1326)
   [junit4]   2>         at java.util.concurrent.CountDownLatch.await(CountDownLatch.java:282)
   [junit4]   2>         at org.apache.solr.hadoop.HeartBeater.run(HeartBeater.java:109)
   [junit4]   2> NOTE: test params are: codec=FastCompressingStoredFields(storedFieldsFormat=CompressingStoredFieldsFormat(compressionMode=FAST, chunkSize=7, maxDocsPerChunk=129, blockSize=3), termVectorsFormat=CompressingTermVectorsFormat(compressionMode=FAST, chunkSize=7, blockSize=3)), sim=DefaultSimilarity, locale=es-ES, timezone=MST7MDT
   [junit4]   2> NOTE: Linux 3.13.0-52-generic amd64/Oracle Corporation 1.7.0_80 (64-bit)/cpus=4,threads=2,free=259335112,total=318242816
   [junit4]   2> NOTE: All tests run in this JVM: [MorphlineReducerTest, MorphlineBasicMiniMRTest, MorphlineGoLiveMiniMRTest, MorphlineMapperTest]
   [junit4]   2> NOTE: reproduce with: ant test  -Dtestcase=MorphlineMapperTest -Dtests.seed=40C2758AB522AB4D -Dtests.multiplier=2 -Dtests.slow=true -Dtests.locale=es-ES -Dtests.timezone=MST7MDT -Dtests.asserts=true -Dtests.file.encoding=US-ASCII
   [junit4] ERROR   0.00s J0 | MorphlineMapperTest (suite) <<<
   [junit4]    > Throwable #1: com.carrotsearch.randomizedtesting.ThreadLeakError: 1 thread leaked from SUITE scope at org.apache.solr.hadoop.MorphlineMapperTest: 
   [junit4]    >    1) Thread[id=17, name=Thread-2, state=TIMED_WAITING, group=TGRP-MorphlineMapperTest]
   [junit4]    >         at sun.misc.Unsafe.park(Native Method)
   [junit4]    >         at java.util.concurrent.locks.LockSupport.parkNanos(LockSupport.java:226)
   [junit4]    >         at java.util.concurrent.locks.AbstractQueuedSynchronizer.doAcquireSharedNanos(AbstractQueuedSynchronizer.java:1033)
   [junit4]    >         at java.util.concurrent.locks.AbstractQueuedSynchronizer.tryAcquireSharedNanos(AbstractQueuedSynchronizer.java:1326)
   [junit4]    >         at java.util.concurrent.CountDownLatch.await(CountDownLatch.java:282)
   [junit4]    >         at org.apache.solr.hadoop.HeartBeater.run(HeartBeater.java:109)
   [junit4]    > 	at __randomizedtesting.SeedInfo.seed([40C2758AB522AB4D]:0)Throwable #2: com.carrotsearch.randomizedtesting.ThreadLeakError: There are still zombie threads that couldn't be terminated:
   [junit4]    >    1) Thread[id=17, name=Thread-2, state=TIMED_WAITING, group=TGRP-MorphlineMapperTest]
   [junit4]    >         at sun.misc.Unsafe.park(Native Method)
   [junit4]    >         at java.util.concurrent.locks.LockSupport.parkNanos(LockSupport.java:226)
   [junit4]    >         at java.util.concurrent.locks.AbstractQueuedSynchronizer.doAcquireSharedNanos(AbstractQueuedSynchronizer.java:1033)
   [junit4]    >         at java.util.concurrent.locks.AbstractQueuedSynchronizer.tryAcquireSharedNanos(AbstractQueuedSynchronizer.java:1326)
   [junit4]    >         at java.util.concurrent.CountDownLatch.await(CountDownLatch.java:282)
   [junit4]    >         at org.apache.solr.hadoop.HeartBeater.run(HeartBeater.java:109)
   [junit4]    > 	at __randomizedtesting.SeedInfo.seed([40C2758AB522AB4D]:0)
   [junit4] Completed [7/7 (1!)] on J0 in 35.68s, 1 test, 3 errors <<< FAILURES!

[...truncated 12 lines...]
BUILD FAILED
/x1/jenkins/jenkins-slave/workspace/Lucene-Solr-Tests-5.x-Java7/build.xml:794: The following error occurred while executing this line:
/x1/jenkins/jenkins-slave/workspace/Lucene-Solr-Tests-5.x-Java7/build.xml:738: The following error occurred while executing this line:
/x1/jenkins/jenkins-slave/workspace/Lucene-Solr-Tests-5.x-Java7/build.xml:59: The following error occurred while executing this line:
/x1/jenkins/jenkins-slave/workspace/Lucene-Solr-Tests-5.x-Java7/solr/build.xml:253: The following error occurred while executing this line:
/x1/jenkins/jenkins-slave/workspace/Lucene-Solr-Tests-5.x-Java7/solr/common-build.xml:469: The following error occurred while executing this line:
/x1/jenkins/jenkins-slave/workspace/Lucene-Solr-Tests-5.x-Java7/solr/common-build.xml:534: The following error occurred while executing this line:
/x1/jenkins/jenkins-slave/workspace/Lucene-Solr-Tests-5.x-Java7/lucene/common-build.xml:1444: The following error occurred while executing this line:
/x1/jenkins/jenkins-slave/workspace/Lucene-Solr-Tests-5.x-Java7/lucene/common-build.xml:1000: There were test failures: 7 suites, 35 tests, 2 suite-level errors, 1 error, 5 ignored (4 assumptions) [seed: 40C2758AB522AB4D]

Total time: 70 minutes 53 seconds
Build step 'Invoke Ant' marked build as failure
Archiving artifacts
Recording test results
Email was triggered for: Failure - Any
Sending email for trigger: Failure - Any



Mime
View raw message