lucene-dev mailing list archives

Site index · List index
Message view « Date » · « Thread »
Top « Date » · « Thread »
From Policeman Jenkins Server <jenk...@thetaphi.de>
Subject [JENKINS] Lucene-Solr-5.x-Linux (64bit/jdk1.7.0_80) - Build # 15246 - Failure!
Date Wed, 13 Jan 2016 13:59:30 GMT
Build: http://jenkins.thetaphi.de/job/Lucene-Solr-5.x-Linux/15246/
Java: 64bit/jdk1.7.0_80 -XX:-UseCompressedOops -XX:+UseParallelGC

1 tests failed.
FAILED:  org.apache.solr.core.TestDynamicLoading.testDynamicLoading

Error Message:
Could not get expected value  'X val changed' for path 'x' full output: {   "responseHeader":{     "status":0,     "QTime":0},   "params":{"wt":"json"},   "context":{     "webapp":"/btoh/u",     "path":"/test1",     "httpMethod":"GET"},   "class":"org.apache.solr.core.BlobStoreTestRequestHandler",   "x":"X val"}

Stack Trace:
java.lang.AssertionError: Could not get expected value  'X val changed' for path 'x' full output: {
  "responseHeader":{
    "status":0,
    "QTime":0},
  "params":{"wt":"json"},
  "context":{
    "webapp":"/btoh/u",
    "path":"/test1",
    "httpMethod":"GET"},
  "class":"org.apache.solr.core.BlobStoreTestRequestHandler",
  "x":"X val"}
	at __randomizedtesting.SeedInfo.seed([29057B3087694A32:F148566770B4EF92]:0)
	at org.junit.Assert.fail(Assert.java:93)
	at org.junit.Assert.assertTrue(Assert.java:43)
	at org.apache.solr.core.TestSolrConfigHandler.testForResponseElement(TestSolrConfigHandler.java:458)
	at org.apache.solr.core.TestDynamicLoading.testDynamicLoading(TestDynamicLoading.java:257)
	at sun.reflect.NativeMethodAccessorImpl.invoke0(Native Method)
	at sun.reflect.NativeMethodAccessorImpl.invoke(NativeMethodAccessorImpl.java:57)
	at sun.reflect.DelegatingMethodAccessorImpl.invoke(DelegatingMethodAccessorImpl.java:43)
	at java.lang.reflect.Method.invoke(Method.java:606)
	at com.carrotsearch.randomizedtesting.RandomizedRunner.invoke(RandomizedRunner.java:1764)
	at com.carrotsearch.randomizedtesting.RandomizedRunner$8.evaluate(RandomizedRunner.java:871)
	at com.carrotsearch.randomizedtesting.RandomizedRunner$9.evaluate(RandomizedRunner.java:907)
	at com.carrotsearch.randomizedtesting.RandomizedRunner$10.evaluate(RandomizedRunner.java:921)
	at org.apache.solr.BaseDistributedSearchTestCase$ShardsRepeatRule$ShardsFixedStatement.callStatement(BaseDistributedSearchTestCase.java:965)
	at org.apache.solr.BaseDistributedSearchTestCase$ShardsRepeatRule$ShardsStatement.evaluate(BaseDistributedSearchTestCase.java:940)
	at com.carrotsearch.randomizedtesting.rules.SystemPropertiesRestoreRule$1.evaluate(SystemPropertiesRestoreRule.java:57)
	at org.apache.lucene.util.TestRuleSetupTeardownChained$1.evaluate(TestRuleSetupTeardownChained.java:50)
	at org.apache.lucene.util.AbstractBeforeAfterRule$1.evaluate(AbstractBeforeAfterRule.java:46)
	at org.apache.lucene.util.TestRuleThreadAndTestName$1.evaluate(TestRuleThreadAndTestName.java:49)
	at org.apache.lucene.util.TestRuleIgnoreAfterMaxFailures$1.evaluate(TestRuleIgnoreAfterMaxFailures.java:65)
	at org.apache.lucene.util.TestRuleMarkFailure$1.evaluate(TestRuleMarkFailure.java:48)
	at com.carrotsearch.randomizedtesting.rules.StatementAdapter.evaluate(StatementAdapter.java:36)
	at com.carrotsearch.randomizedtesting.ThreadLeakControl$StatementRunner.run(ThreadLeakControl.java:367)
	at com.carrotsearch.randomizedtesting.ThreadLeakControl.forkTimeoutingTask(ThreadLeakControl.java:809)
	at com.carrotsearch.randomizedtesting.ThreadLeakControl$3.evaluate(ThreadLeakControl.java:460)
	at com.carrotsearch.randomizedtesting.RandomizedRunner.runSingleTest(RandomizedRunner.java:880)
	at com.carrotsearch.randomizedtesting.RandomizedRunner$5.evaluate(RandomizedRunner.java:781)
	at com.carrotsearch.randomizedtesting.RandomizedRunner$6.evaluate(RandomizedRunner.java:816)
	at com.carrotsearch.randomizedtesting.RandomizedRunner$7.evaluate(RandomizedRunner.java:827)
	at com.carrotsearch.randomizedtesting.rules.StatementAdapter.evaluate(StatementAdapter.java:36)
	at com.carrotsearch.randomizedtesting.rules.SystemPropertiesRestoreRule$1.evaluate(SystemPropertiesRestoreRule.java:57)
	at org.apache.lucene.util.AbstractBeforeAfterRule$1.evaluate(AbstractBeforeAfterRule.java:46)
	at com.carrotsearch.randomizedtesting.rules.StatementAdapter.evaluate(StatementAdapter.java:36)
	at org.apache.lucene.util.TestRuleStoreClassName$1.evaluate(TestRuleStoreClassName.java:42)
	at com.carrotsearch.randomizedtesting.rules.NoShadowingOrOverridesOnMethodsRule$1.evaluate(NoShadowingOrOverridesOnMethodsRule.java:40)
	at com.carrotsearch.randomizedtesting.rules.NoShadowingOrOverridesOnMethodsRule$1.evaluate(NoShadowingOrOverridesOnMethodsRule.java:40)
	at com.carrotsearch.randomizedtesting.rules.StatementAdapter.evaluate(StatementAdapter.java:36)
	at com.carrotsearch.randomizedtesting.rules.StatementAdapter.evaluate(StatementAdapter.java:36)
	at com.carrotsearch.randomizedtesting.rules.StatementAdapter.evaluate(StatementAdapter.java:36)
	at org.apache.lucene.util.TestRuleAssertionsRequired$1.evaluate(TestRuleAssertionsRequired.java:54)
	at org.apache.lucene.util.TestRuleMarkFailure$1.evaluate(TestRuleMarkFailure.java:48)
	at org.apache.lucene.util.TestRuleIgnoreAfterMaxFailures$1.evaluate(TestRuleIgnoreAfterMaxFailures.java:65)
	at org.apache.lucene.util.TestRuleIgnoreTestSuites$1.evaluate(TestRuleIgnoreTestSuites.java:55)
	at com.carrotsearch.randomizedtesting.rules.StatementAdapter.evaluate(StatementAdapter.java:36)
	at com.carrotsearch.randomizedtesting.ThreadLeakControl$StatementRunner.run(ThreadLeakControl.java:367)
	at java.lang.Thread.run(Thread.java:745)




Build Log:
[...truncated 10528 lines...]
   [junit4] Suite: org.apache.solr.core.TestDynamicLoading
   [junit4]   2> Creating dataDir: /home/jenkins/workspace/Lucene-Solr-5.x-Linux/solr/build/solr-core/test/J2/temp/solr.core.TestDynamicLoading_29057B3087694A32-001/init-core-data-001
   [junit4]   2> 699545 INFO  (SUITE-TestDynamicLoading-seed#[29057B3087694A32]-worker) [    ] o.a.s.SolrTestCaseJ4 Randomized ssl (false) and clientAuth (false)
   [junit4]   2> 699545 INFO  (SUITE-TestDynamicLoading-seed#[29057B3087694A32]-worker) [    ] o.a.s.BaseDistributedSearchTestCase Setting hostContext system property: /btoh/u
   [junit4]   2> 699549 INFO  (TEST-TestDynamicLoading.testDynamicLoading-seed#[29057B3087694A32]) [    ] o.a.s.c.ZkTestServer STARTING ZK TEST SERVER
   [junit4]   2> 699549 INFO  (Thread-1242) [    ] o.a.s.c.ZkTestServer client port:0.0.0.0/0.0.0.0:0
   [junit4]   2> 699549 INFO  (Thread-1242) [    ] o.a.s.c.ZkTestServer Starting server
   [junit4]   2> 699649 INFO  (TEST-TestDynamicLoading.testDynamicLoading-seed#[29057B3087694A32]) [    ] o.a.s.c.ZkTestServer start zk server on port:35861
   [junit4]   2> 699649 INFO  (TEST-TestDynamicLoading.testDynamicLoading-seed#[29057B3087694A32]) [    ] o.a.s.c.c.SolrZkClient Using default ZkCredentialsProvider
   [junit4]   2> 699650 INFO  (TEST-TestDynamicLoading.testDynamicLoading-seed#[29057B3087694A32]) [    ] o.a.s.c.c.ConnectionManager Waiting for client to connect to ZooKeeper
   [junit4]   2> 699655 INFO  (zkCallback-441-thread-1) [    ] o.a.s.c.c.ConnectionManager Watcher org.apache.solr.common.cloud.ConnectionManager@3d2dfb3e name:ZooKeeperConnection Watcher:127.0.0.1:35861 got event WatchedEvent state:SyncConnected type:None path:null path:null type:None
   [junit4]   2> 699655 INFO  (TEST-TestDynamicLoading.testDynamicLoading-seed#[29057B3087694A32]) [    ] o.a.s.c.c.ConnectionManager Client is connected to ZooKeeper
   [junit4]   2> 699655 INFO  (TEST-TestDynamicLoading.testDynamicLoading-seed#[29057B3087694A32]) [    ] o.a.s.c.c.SolrZkClient Using default ZkACLProvider
   [junit4]   2> 699655 INFO  (TEST-TestDynamicLoading.testDynamicLoading-seed#[29057B3087694A32]) [    ] o.a.s.c.c.SolrZkClient makePath: /solr
   [junit4]   2> 699685 INFO  (TEST-TestDynamicLoading.testDynamicLoading-seed#[29057B3087694A32]) [    ] o.a.s.c.c.SolrZkClient Using default ZkCredentialsProvider
   [junit4]   2> 699686 INFO  (TEST-TestDynamicLoading.testDynamicLoading-seed#[29057B3087694A32]) [    ] o.a.s.c.c.ConnectionManager Waiting for client to connect to ZooKeeper
   [junit4]   2> 699686 INFO  (zkCallback-442-thread-1) [    ] o.a.s.c.c.ConnectionManager Watcher org.apache.solr.common.cloud.ConnectionManager@36001b name:ZooKeeperConnection Watcher:127.0.0.1:35861/solr got event WatchedEvent state:SyncConnected type:None path:null path:null type:None
   [junit4]   2> 699686 INFO  (TEST-TestDynamicLoading.testDynamicLoading-seed#[29057B3087694A32]) [    ] o.a.s.c.c.ConnectionManager Client is connected to ZooKeeper
   [junit4]   2> 699686 INFO  (TEST-TestDynamicLoading.testDynamicLoading-seed#[29057B3087694A32]) [    ] o.a.s.c.c.SolrZkClient Using default ZkACLProvider
   [junit4]   2> 699686 INFO  (TEST-TestDynamicLoading.testDynamicLoading-seed#[29057B3087694A32]) [    ] o.a.s.c.c.SolrZkClient makePath: /collections/collection1
   [junit4]   2> 699688 INFO  (TEST-TestDynamicLoading.testDynamicLoading-seed#[29057B3087694A32]) [    ] o.a.s.c.c.SolrZkClient makePath: /collections/collection1/shards
   [junit4]   2> 699689 INFO  (TEST-TestDynamicLoading.testDynamicLoading-seed#[29057B3087694A32]) [    ] o.a.s.c.c.SolrZkClient makePath: /collections/control_collection
   [junit4]   2> 699690 INFO  (TEST-TestDynamicLoading.testDynamicLoading-seed#[29057B3087694A32]) [    ] o.a.s.c.c.SolrZkClient makePath: /collections/control_collection/shards
   [junit4]   2> 699690 INFO  (TEST-TestDynamicLoading.testDynamicLoading-seed#[29057B3087694A32]) [    ] o.a.s.c.AbstractZkTestCase put /home/jenkins/workspace/Lucene-Solr-5.x-Linux/solr/core/src/test-files/solr/collection1/conf/solrconfig-tlog.xml to /configs/conf1/solrconfig.xml
   [junit4]   2> 699690 INFO  (TEST-TestDynamicLoading.testDynamicLoading-seed#[29057B3087694A32]) [    ] o.a.s.c.c.SolrZkClient makePath: /configs/conf1/solrconfig.xml
   [junit4]   2> 699692 INFO  (TEST-TestDynamicLoading.testDynamicLoading-seed#[29057B3087694A32]) [    ] o.a.s.c.AbstractZkTestCase put /home/jenkins/workspace/Lucene-Solr-5.x-Linux/solr/core/src/test-files/solr/collection1/conf/schema.xml to /configs/conf1/schema.xml
   [junit4]   2> 699692 INFO  (TEST-TestDynamicLoading.testDynamicLoading-seed#[29057B3087694A32]) [    ] o.a.s.c.c.SolrZkClient makePath: /configs/conf1/schema.xml
   [junit4]   2> 699693 INFO  (TEST-TestDynamicLoading.testDynamicLoading-seed#[29057B3087694A32]) [    ] o.a.s.c.AbstractZkTestCase put /home/jenkins/workspace/Lucene-Solr-5.x-Linux/solr/core/src/test-files/solr/collection1/conf/solrconfig.snippet.randomindexconfig.xml to /configs/conf1/solrconfig.snippet.randomindexconfig.xml
   [junit4]   2> 699693 INFO  (TEST-TestDynamicLoading.testDynamicLoading-seed#[29057B3087694A32]) [    ] o.a.s.c.c.SolrZkClient makePath: /configs/conf1/solrconfig.snippet.randomindexconfig.xml
   [junit4]   2> 699694 INFO  (TEST-TestDynamicLoading.testDynamicLoading-seed#[29057B3087694A32]) [    ] o.a.s.c.AbstractZkTestCase put /home/jenkins/workspace/Lucene-Solr-5.x-Linux/solr/core/src/test-files/solr/collection1/conf/stopwords.txt to /configs/conf1/stopwords.txt
   [junit4]   2> 699694 INFO  (TEST-TestDynamicLoading.testDynamicLoading-seed#[29057B3087694A32]) [    ] o.a.s.c.c.SolrZkClient makePath: /configs/conf1/stopwords.txt
   [junit4]   2> 699695 INFO  (TEST-TestDynamicLoading.testDynamicLoading-seed#[29057B3087694A32]) [    ] o.a.s.c.AbstractZkTestCase put /home/jenkins/workspace/Lucene-Solr-5.x-Linux/solr/core/src/test-files/solr/collection1/conf/protwords.txt to /configs/conf1/protwords.txt
   [junit4]   2> 699695 INFO  (TEST-TestDynamicLoading.testDynamicLoading-seed#[29057B3087694A32]) [    ] o.a.s.c.c.SolrZkClient makePath: /configs/conf1/protwords.txt
   [junit4]   2> 699695 INFO  (TEST-TestDynamicLoading.testDynamicLoading-seed#[29057B3087694A32]) [    ] o.a.s.c.AbstractZkTestCase put /home/jenkins/workspace/Lucene-Solr-5.x-Linux/solr/core/src/test-files/solr/collection1/conf/currency.xml to /configs/conf1/currency.xml
   [junit4]   2> 699695 INFO  (TEST-TestDynamicLoading.testDynamicLoading-seed#[29057B3087694A32]) [    ] o.a.s.c.c.SolrZkClient makePath: /configs/conf1/currency.xml
   [junit4]   2> 699696 INFO  (TEST-TestDynamicLoading.testDynamicLoading-seed#[29057B3087694A32]) [    ] o.a.s.c.AbstractZkTestCase put /home/jenkins/workspace/Lucene-Solr-5.x-Linux/solr/core/src/test-files/solr/collection1/conf/enumsConfig.xml to /configs/conf1/enumsConfig.xml
   [junit4]   2> 699696 INFO  (TEST-TestDynamicLoading.testDynamicLoading-seed#[29057B3087694A32]) [    ] o.a.s.c.c.SolrZkClient makePath: /configs/conf1/enumsConfig.xml
   [junit4]   2> 699697 INFO  (TEST-TestDynamicLoading.testDynamicLoading-seed#[29057B3087694A32]) [    ] o.a.s.c.AbstractZkTestCase put /home/jenkins/workspace/Lucene-Solr-5.x-Linux/solr/core/src/test-files/solr/collection1/conf/open-exchange-rates.json to /configs/conf1/open-exchange-rates.json
   [junit4]   2> 699698 INFO  (TEST-TestDynamicLoading.testDynamicLoading-seed#[29057B3087694A32]) [    ] o.a.s.c.c.SolrZkClient makePath: /configs/conf1/open-exchange-rates.json
   [junit4]   2> 699699 INFO  (TEST-TestDynamicLoading.testDynamicLoading-seed#[29057B3087694A32]) [    ] o.a.s.c.AbstractZkTestCase put /home/jenkins/workspace/Lucene-Solr-5.x-Linux/solr/core/src/test-files/solr/collection1/conf/mapping-ISOLatin1Accent.txt to /configs/conf1/mapping-ISOLatin1Accent.txt
   [junit4]   2> 699699 INFO  (TEST-TestDynamicLoading.testDynamicLoading-seed#[29057B3087694A32]) [    ] o.a.s.c.c.SolrZkClient makePath: /configs/conf1/mapping-ISOLatin1Accent.txt
   [junit4]   2> 699700 INFO  (TEST-TestDynamicLoading.testDynamicLoading-seed#[29057B3087694A32]) [    ] o.a.s.c.AbstractZkTestCase put /home/jenkins/workspace/Lucene-Solr-5.x-Linux/solr/core/src/test-files/solr/collection1/conf/old_synonyms.txt to /configs/conf1/old_synonyms.txt
   [junit4]   2> 699700 INFO  (TEST-TestDynamicLoading.testDynamicLoading-seed#[29057B3087694A32]) [    ] o.a.s.c.c.SolrZkClient makePath: /configs/conf1/old_synonyms.txt
   [junit4]   2> 699702 INFO  (TEST-TestDynamicLoading.testDynamicLoading-seed#[29057B3087694A32]) [    ] o.a.s.c.AbstractZkTestCase put /home/jenkins/workspace/Lucene-Solr-5.x-Linux/solr/core/src/test-files/solr/collection1/conf/synonyms.txt to /configs/conf1/synonyms.txt
   [junit4]   2> 699702 INFO  (TEST-TestDynamicLoading.testDynamicLoading-seed#[29057B3087694A32]) [    ] o.a.s.c.c.SolrZkClient makePath: /configs/conf1/synonyms.txt
   [junit4]   2> 699762 INFO  (TEST-TestDynamicLoading.testDynamicLoading-seed#[29057B3087694A32]) [    ] o.a.s.SolrTestCaseJ4 Writing core.properties file to /home/jenkins/workspace/Lucene-Solr-5.x-Linux/solr/build/solr-core/test/J2/temp/solr.core.TestDynamicLoading_29057B3087694A32-001/control-001/cores/collection1
   [junit4]   2> 699763 INFO  (TEST-TestDynamicLoading.testDynamicLoading-seed#[29057B3087694A32]) [    ] o.e.j.s.Server jetty-9.2.13.v20150730
   [junit4]   2> 699764 INFO  (TEST-TestDynamicLoading.testDynamicLoading-seed#[29057B3087694A32]) [    ] o.e.j.s.h.ContextHandler Started o.e.j.s.ServletContextHandler@a6b9d9e{/btoh/u,null,AVAILABLE}
   [junit4]   2> 699766 INFO  (TEST-TestDynamicLoading.testDynamicLoading-seed#[29057B3087694A32]) [    ] o.e.j.s.ServerConnector Started ServerConnector@34285c66{HTTP/1.1}{127.0.0.1:34267}
   [junit4]   2> 699767 INFO  (TEST-TestDynamicLoading.testDynamicLoading-seed#[29057B3087694A32]) [    ] o.e.j.s.Server Started @701541ms
   [junit4]   2> 699767 INFO  (TEST-TestDynamicLoading.testDynamicLoading-seed#[29057B3087694A32]) [    ] o.a.s.c.s.e.JettySolrRunner Jetty properties: {solr.data.dir=/home/jenkins/workspace/Lucene-Solr-5.x-Linux/solr/build/solr-core/test/J2/temp/solr.core.TestDynamicLoading_29057B3087694A32-001/tempDir-001/control/data, hostPort=34267, hostContext=/btoh/u, coreRootDirectory=/home/jenkins/workspace/Lucene-Solr-5.x-Linux/solr/build/solr-core/test/J2/../../../../../../../../../home/jenkins/workspace/Lucene-Solr-5.x-Linux/solr/build/solr-core/test/J2/temp/solr.core.TestDynamicLoading_29057B3087694A32-001/control-001/cores}
   [junit4]   2> 699767 INFO  (TEST-TestDynamicLoading.testDynamicLoading-seed#[29057B3087694A32]) [    ] o.a.s.s.SolrDispatchFilter SolrDispatchFilter.init(): sun.misc.Launcher$AppClassLoader@4e0add57
   [junit4]   2> 699767 INFO  (TEST-TestDynamicLoading.testDynamicLoading-seed#[29057B3087694A32]) [    ] o.a.s.c.SolrResourceLoader new SolrResourceLoader for directory: '/home/jenkins/workspace/Lucene-Solr-5.x-Linux/solr/build/solr-core/test/J2/temp/solr.core.TestDynamicLoading_29057B3087694A32-001/control-001'
   [junit4]   2> 699767 INFO  (TEST-TestDynamicLoading.testDynamicLoading-seed#[29057B3087694A32]) [    ] o.a.s.c.SolrResourceLoader JNDI not configured for solr (NoInitialContextEx)
   [junit4]   2> 699767 INFO  (TEST-TestDynamicLoading.testDynamicLoading-seed#[29057B3087694A32]) [    ] o.a.s.c.SolrResourceLoader solr home defaulted to 'solr/' (could not find system property or JNDI)
   [junit4]   2> 699767 INFO  (TEST-TestDynamicLoading.testDynamicLoading-seed#[29057B3087694A32]) [    ] o.a.s.c.c.SolrZkClient Using default ZkCredentialsProvider
   [junit4]   2> 699768 INFO  (TEST-TestDynamicLoading.testDynamicLoading-seed#[29057B3087694A32]) [    ] o.a.s.c.c.ConnectionManager Waiting for client to connect to ZooKeeper
   [junit4]   2> 699769 INFO  (zkCallback-443-thread-1) [    ] o.a.s.c.c.ConnectionManager Watcher org.apache.solr.common.cloud.ConnectionManager@27827296 name:ZooKeeperConnection Watcher:127.0.0.1:35861/solr got event WatchedEvent state:SyncConnected type:None path:null path:null type:None
   [junit4]   2> 699769 INFO  (TEST-TestDynamicLoading.testDynamicLoading-seed#[29057B3087694A32]) [    ] o.a.s.c.c.ConnectionManager Client is connected to ZooKeeper
   [junit4]   2> 699769 INFO  (TEST-TestDynamicLoading.testDynamicLoading-seed#[29057B3087694A32]) [    ] o.a.s.c.c.SolrZkClient Using default ZkACLProvider
   [junit4]   2> 699770 INFO  (TEST-TestDynamicLoading.testDynamicLoading-seed#[29057B3087694A32]) [    ] o.a.s.s.SolrDispatchFilter Loading solr.xml from SolrHome (not found in ZooKeeper)
   [junit4]   2> 699770 INFO  (TEST-TestDynamicLoading.testDynamicLoading-seed#[29057B3087694A32]) [    ] o.a.s.c.SolrXmlConfig Loading container configuration from /home/jenkins/workspace/Lucene-Solr-5.x-Linux/solr/build/solr-core/test/J2/temp/solr.core.TestDynamicLoading_29057B3087694A32-001/control-001/solr.xml
   [junit4]   2> 699780 INFO  (TEST-TestDynamicLoading.testDynamicLoading-seed#[29057B3087694A32]) [    ] o.a.s.c.CorePropertiesLocator Config-defined core root directory: /home/jenkins/workspace/Lucene-Solr-5.x-Linux/solr/build/solr-core/test/J2/../../../../../../../../../home/jenkins/workspace/Lucene-Solr-5.x-Linux/solr/build/solr-core/test/J2/temp/solr.core.TestDynamicLoading_29057B3087694A32-001/control-001/cores
   [junit4]   2> 699780 INFO  (TEST-TestDynamicLoading.testDynamicLoading-seed#[29057B3087694A32]) [    ] o.a.s.c.CoreContainer New CoreContainer 1918423009
   [junit4]   2> 699780 INFO  (TEST-TestDynamicLoading.testDynamicLoading-seed#[29057B3087694A32]) [    ] o.a.s.c.CoreContainer Loading cores into CoreContainer [instanceDir=/home/jenkins/workspace/Lucene-Solr-5.x-Linux/solr/build/solr-core/test/J2/temp/solr.core.TestDynamicLoading_29057B3087694A32-001/control-001]
   [junit4]   2> 699781 WARN  (TEST-TestDynamicLoading.testDynamicLoading-seed#[29057B3087694A32]) [    ] o.a.s.c.CoreContainer Couldn't add files from /home/jenkins/workspace/Lucene-Solr-5.x-Linux/solr/build/solr-core/test/J2/temp/solr.core.TestDynamicLoading_29057B3087694A32-001/control-001/lib to classpath: /home/jenkins/workspace/Lucene-Solr-5.x-Linux/solr/build/solr-core/test/J2/temp/solr.core.TestDynamicLoading_29057B3087694A32-001/control-001/lib
   [junit4]   2> 699781 INFO  (TEST-TestDynamicLoading.testDynamicLoading-seed#[29057B3087694A32]) [    ] o.a.s.h.c.HttpShardHandlerFactory created with socketTimeout : 90000,urlScheme : ,connTimeout : 15000,maxConnectionsPerHost : 20,maxConnections : 10000,corePoolSize : 0,maximumPoolSize : 2147483647,maxThreadIdleTime : 5,sizeOfQueue : -1,fairnessPolicy : false,useRetries : false,
   [junit4]   2> 699782 INFO  (TEST-TestDynamicLoading.testDynamicLoading-seed#[29057B3087694A32]) [    ] o.a.s.u.UpdateShardHandler Creating UpdateShardHandler HTTP client with params: socketTimeout=340000&connTimeout=45000&retry=true
   [junit4]   2> 699782 INFO  (TEST-TestDynamicLoading.testDynamicLoading-seed#[29057B3087694A32]) [    ] o.a.s.l.LogWatcher SLF4J impl is org.slf4j.impl.Log4jLoggerFactory
   [junit4]   2> 699782 INFO  (TEST-TestDynamicLoading.testDynamicLoading-seed#[29057B3087694A32]) [    ] o.a.s.l.LogWatcher Registering Log Listener [Log4j (org.slf4j.impl.Log4jLoggerFactory)]
   [junit4]   2> 699795 INFO  (TEST-TestDynamicLoading.testDynamicLoading-seed#[29057B3087694A32]) [    ] o.a.s.c.ZkContainer Zookeeper client=127.0.0.1:35861/solr
   [junit4]   2> 699795 INFO  (TEST-TestDynamicLoading.testDynamicLoading-seed#[29057B3087694A32]) [    ] o.a.s.c.ZkController zkHost includes chroot
   [junit4]   2> 699795 INFO  (TEST-TestDynamicLoading.testDynamicLoading-seed#[29057B3087694A32]) [    ] o.a.s.c.c.SolrZkClient Using default ZkCredentialsProvider
   [junit4]   2> 699795 INFO  (TEST-TestDynamicLoading.testDynamicLoading-seed#[29057B3087694A32]) [    ] o.a.s.c.c.ConnectionManager Waiting for client to connect to ZooKeeper
   [junit4]   2> 699797 INFO  (zkCallback-445-thread-1) [    ] o.a.s.c.c.ConnectionManager Watcher org.apache.solr.common.cloud.ConnectionManager@6209ced5 name:ZooKeeperConnection Watcher:127.0.0.1:35861 got event WatchedEvent state:SyncConnected type:None path:null path:null type:None
   [junit4]   2> 699798 INFO  (TEST-TestDynamicLoading.testDynamicLoading-seed#[29057B3087694A32]) [    ] o.a.s.c.c.ConnectionManager Client is connected to ZooKeeper
   [junit4]   2> 699798 INFO  (TEST-TestDynamicLoading.testDynamicLoading-seed#[29057B3087694A32]) [    ] o.a.s.c.c.SolrZkClient Using default ZkACLProvider
   [junit4]   2> 699799 INFO  (TEST-TestDynamicLoading.testDynamicLoading-seed#[29057B3087694A32]) [n:127.0.0.1:34267_btoh%2Fu    ] o.a.s.c.c.ConnectionManager Waiting for client to connect to ZooKeeper
   [junit4]   2> 699800 INFO  (zkCallback-446-thread-1-processing-n:127.0.0.1:34267_btoh%2Fu) [n:127.0.0.1:34267_btoh%2Fu    ] o.a.s.c.c.ConnectionManager Watcher org.apache.solr.common.cloud.ConnectionManager@9d87e31 name:ZooKeeperConnection Watcher:127.0.0.1:35861/solr got event WatchedEvent state:SyncConnected type:None path:null path:null type:None
   [junit4]   2> 699800 INFO  (TEST-TestDynamicLoading.testDynamicLoading-seed#[29057B3087694A32]) [n:127.0.0.1:34267_btoh%2Fu    ] o.a.s.c.c.ConnectionManager Client is connected to ZooKeeper
   [junit4]   2> 699801 INFO  (TEST-TestDynamicLoading.testDynamicLoading-seed#[29057B3087694A32]) [n:127.0.0.1:34267_btoh%2Fu    ] o.a.s.c.c.SolrZkClient makePath: /overseer/queue
   [junit4]   2> 699802 INFO  (TEST-TestDynamicLoading.testDynamicLoading-seed#[29057B3087694A32]) [n:127.0.0.1:34267_btoh%2Fu    ] o.a.s.c.c.SolrZkClient makePath: /overseer/collection-queue-work
   [junit4]   2> 699804 INFO  (TEST-TestDynamicLoading.testDynamicLoading-seed#[29057B3087694A32]) [n:127.0.0.1:34267_btoh%2Fu    ] o.a.s.c.c.SolrZkClient makePath: /overseer/collection-map-running
   [junit4]   2> 699805 INFO  (TEST-TestDynamicLoading.testDynamicLoading-seed#[29057B3087694A32]) [n:127.0.0.1:34267_btoh%2Fu    ] o.a.s.c.c.SolrZkClient makePath: /overseer/collection-map-completed
   [junit4]   2> 699806 INFO  (TEST-TestDynamicLoading.testDynamicLoading-seed#[29057B3087694A32]) [n:127.0.0.1:34267_btoh%2Fu    ] o.a.s.c.c.SolrZkClient makePath: /overseer/collection-map-failure
   [junit4]   2> 699807 INFO  (TEST-TestDynamicLoading.testDynamicLoading-seed#[29057B3087694A32]) [n:127.0.0.1:34267_btoh%2Fu    ] o.a.s.c.c.SolrZkClient makePath: /live_nodes
   [junit4]   2> 699808 INFO  (TEST-TestDynamicLoading.testDynamicLoading-seed#[29057B3087694A32]) [n:127.0.0.1:34267_btoh%2Fu    ] o.a.s.c.c.SolrZkClient makePath: /aliases.json
   [junit4]   2> 699809 INFO  (TEST-TestDynamicLoading.testDynamicLoading-seed#[29057B3087694A32]) [n:127.0.0.1:34267_btoh%2Fu    ] o.a.s.c.c.SolrZkClient makePath: /clusterstate.json
   [junit4]   2> 699810 INFO  (TEST-TestDynamicLoading.testDynamicLoading-seed#[29057B3087694A32]) [n:127.0.0.1:34267_btoh%2Fu    ] o.a.s.c.c.SolrZkClient makePath: /security.json
   [junit4]   2> 699810 INFO  (TEST-TestDynamicLoading.testDynamicLoading-seed#[29057B3087694A32]) [n:127.0.0.1:34267_btoh%2Fu    ] o.a.s.c.ZkController Register node as live in ZooKeeper:/live_nodes/127.0.0.1:34267_btoh%2Fu
   [junit4]   2> 699810 INFO  (TEST-TestDynamicLoading.testDynamicLoading-seed#[29057B3087694A32]) [n:127.0.0.1:34267_btoh%2Fu    ] o.a.s.c.c.SolrZkClient makePath: /live_nodes/127.0.0.1:34267_btoh%2Fu
   [junit4]   2> 699811 INFO  (TEST-TestDynamicLoading.testDynamicLoading-seed#[29057B3087694A32]) [n:127.0.0.1:34267_btoh%2Fu    ] o.a.s.c.c.SolrZkClient makePath: /overseer_elect
   [junit4]   2> 699812 INFO  (TEST-TestDynamicLoading.testDynamicLoading-seed#[29057B3087694A32]) [n:127.0.0.1:34267_btoh%2Fu    ] o.a.s.c.c.SolrZkClient makePath: /overseer_elect/election
   [junit4]   2> 699813 INFO  (TEST-TestDynamicLoading.testDynamicLoading-seed#[29057B3087694A32]) [n:127.0.0.1:34267_btoh%2Fu    ] o.a.s.c.Overseer Overseer (id=null) closing
   [junit4]   2> 699813 INFO  (TEST-TestDynamicLoading.testDynamicLoading-seed#[29057B3087694A32]) [n:127.0.0.1:34267_btoh%2Fu    ] o.a.s.c.LeaderElector Joined leadership election with path: /overseer_elect/election/95203636531298308-127.0.0.1:34267_btoh%2Fu-n_0000000000
   [junit4]   2> 699813 INFO  (TEST-TestDynamicLoading.testDynamicLoading-seed#[29057B3087694A32]) [n:127.0.0.1:34267_btoh%2Fu    ] o.a.s.c.OverseerElectionContext I am going to be the leader 127.0.0.1:34267_btoh%2Fu
   [junit4]   2> 699813 INFO  (TEST-TestDynamicLoading.testDynamicLoading-seed#[29057B3087694A32]) [n:127.0.0.1:34267_btoh%2Fu    ] o.a.s.c.c.SolrZkClient makePath: /overseer_elect/leader
   [junit4]   2> 699814 INFO  (TEST-TestDynamicLoading.testDynamicLoading-seed#[29057B3087694A32]) [n:127.0.0.1:34267_btoh%2Fu    ] o.a.s.c.Overseer Overseer (id=95203636531298308-127.0.0.1:34267_btoh%2Fu-n_0000000000) starting
   [junit4]   2> 699815 INFO  (TEST-TestDynamicLoading.testDynamicLoading-seed#[29057B3087694A32]) [n:127.0.0.1:34267_btoh%2Fu    ] o.a.s.c.c.SolrZkClient makePath: /overseer/queue-work
   [junit4]   2> 699818 INFO  (TEST-TestDynamicLoading.testDynamicLoading-seed#[29057B3087694A32]) [n:127.0.0.1:34267_btoh%2Fu    ] o.a.s.c.OverseerAutoReplicaFailoverThread Starting OverseerAutoReplicaFailoverThread autoReplicaFailoverWorkLoopDelay=10000 autoReplicaFailoverWaitAfterExpiration=30000 autoReplicaFailoverBadNodeExpiration=60000
   [junit4]   2> 699818 INFO  (OverseerCollectionConfigSetProcessor-95203636531298308-127.0.0.1:34267_btoh%2Fu-n_0000000000) [n:127.0.0.1:34267_btoh%2Fu    ] o.a.s.c.OverseerTaskProcessor Process current queue of overseer operations
   [junit4]   2> 699818 INFO  (TEST-TestDynamicLoading.testDynamicLoading-seed#[29057B3087694A32]) [n:127.0.0.1:34267_btoh%2Fu    ] o.a.s.c.c.ZkStateReader Updating cluster state from ZooKeeper... 
   [junit4]   2> 699819 INFO  (OverseerStateUpdate-95203636531298308-127.0.0.1:34267_btoh%2Fu-n_0000000000) [n:127.0.0.1:34267_btoh%2Fu    ] o.a.s.c.Overseer Starting to work on the main queue
   [junit4]   2> 699839 INFO  (TEST-TestDynamicLoading.testDynamicLoading-seed#[29057B3087694A32]) [n:127.0.0.1:34267_btoh%2Fu    ] o.a.s.c.CoreContainer Security conf doesn't exist. Skipping setup for authorization module.
   [junit4]   2> 699839 INFO  (TEST-TestDynamicLoading.testDynamicLoading-seed#[29057B3087694A32]) [n:127.0.0.1:34267_btoh%2Fu    ] o.a.s.c.CoreContainer No authentication plugin used.
   [junit4]   2> 699840 INFO  (TEST-TestDynamicLoading.testDynamicLoading-seed#[29057B3087694A32]) [n:127.0.0.1:34267_btoh%2Fu    ] o.a.s.c.CorePropertiesLocator Looking for core definitions underneath /home/jenkins/workspace/Lucene-Solr-5.x-Linux/solr/build/solr-core/test/J2/../../../../../../../../../home/jenkins/workspace/Lucene-Solr-5.x-Linux/solr/build/solr-core/test/J2/temp/solr.core.TestDynamicLoading_29057B3087694A32-001/control-001/cores
   [junit4]   2> 699840 INFO  (TEST-TestDynamicLoading.testDynamicLoading-seed#[29057B3087694A32]) [n:127.0.0.1:34267_btoh%2Fu    ] o.a.s.c.CoreDescriptor Created CoreDescriptor: {name=collection1, configSetProperties=configsetprops.json, dataDir=data/, shard=, config=solrconfig.xml, collection=control_collection, coreNodeName=, schema=schema.xml, loadOnStartup=true, transient=false}
   [junit4]   2> 699840 INFO  (TEST-TestDynamicLoading.testDynamicLoading-seed#[29057B3087694A32]) [n:127.0.0.1:34267_btoh%2Fu    ] o.a.s.c.CorePropertiesLocator Found core collection1 in /home/jenkins/workspace/Lucene-Solr-5.x-Linux/solr/build/solr-core/test/J2/../../../../../../../../../home/jenkins/workspace/Lucene-Solr-5.x-Linux/solr/build/solr-core/test/J2/temp/solr.core.TestDynamicLoading_29057B3087694A32-001/control-001/cores/collection1
   [junit4]   2> 699841 INFO  (TEST-TestDynamicLoading.testDynamicLoading-seed#[29057B3087694A32]) [n:127.0.0.1:34267_btoh%2Fu    ] o.a.s.c.CorePropertiesLocator Found 1 core definitions
   [junit4]   2> 699842 INFO  (TEST-TestDynamicLoading.testDynamicLoading-seed#[29057B3087694A32]) [n:127.0.0.1:34267_btoh%2Fu    ] o.a.s.s.SolrDispatchFilter user.dir=/home/jenkins/workspace/Lucene-Solr-5.x-Linux/solr/build/solr-core/test/J2
   [junit4]   2> 699842 INFO  (TEST-TestDynamicLoading.testDynamicLoading-seed#[29057B3087694A32]) [n:127.0.0.1:34267_btoh%2Fu    ] o.a.s.s.SolrDispatchFilter SolrDispatchFilter.init() done
   [junit4]   2> 699842 INFO  (coreLoadExecutor-1609-thread-1-processing-n:127.0.0.1:34267_btoh%2Fu) [n:127.0.0.1:34267_btoh%2Fu c:control_collection   x:collection1] o.a.s.c.ZkController publishing state=down
   [junit4]   2> 699842 INFO  (coreLoadExecutor-1609-thread-1-processing-n:127.0.0.1:34267_btoh%2Fu) [n:127.0.0.1:34267_btoh%2Fu c:control_collection   x:collection1] o.a.s.c.ZkController numShards not found on descriptor - reading it from system property
   [junit4]   2> 699843 INFO  (coreLoadExecutor-1609-thread-1-processing-n:127.0.0.1:34267_btoh%2Fu) [n:127.0.0.1:34267_btoh%2Fu c:control_collection   x:collection1] o.a.s.c.ZkController look for our core node name
   [junit4]   2> 699844 INFO  (OverseerStateUpdate-95203636531298308-127.0.0.1:34267_btoh%2Fu-n_0000000000) [n:127.0.0.1:34267_btoh%2Fu    ] o.a.s.c.Overseer processMessage: queueSize: 1, message = {
   [junit4]   2>   "numShards":"1",
   [junit4]   2>   "collection":"control_collection",
   [junit4]   2>   "node_name":"127.0.0.1:34267_btoh%2Fu",
   [junit4]   2>   "operation":"state",
   [junit4]   2>   "roles":null,
   [junit4]   2>   "shard":null,
   [junit4]   2>   "core":"collection1",
   [junit4]   2>   "base_url":"http://127.0.0.1:34267/btoh/u",
   [junit4]   2>   "state":"down"} current state version: 0
   [junit4]   2> 699845 INFO  (OverseerStateUpdate-95203636531298308-127.0.0.1:34267_btoh%2Fu-n_0000000000) [n:127.0.0.1:34267_btoh%2Fu    ] o.a.s.c.o.ReplicaMutator Update state numShards=1 message={
   [junit4]   2>   "numShards":"1",
   [junit4]   2>   "collection":"control_collection",
   [junit4]   2>   "node_name":"127.0.0.1:34267_btoh%2Fu",
   [junit4]   2>   "operation":"state",
   [junit4]   2>   "roles":null,
   [junit4]   2>   "shard":null,
   [junit4]   2>   "core":"collection1",
   [junit4]   2>   "base_url":"http://127.0.0.1:34267/btoh/u",
   [junit4]   2>   "state":"down"}
   [junit4]   2> 699845 INFO  (OverseerStateUpdate-95203636531298308-127.0.0.1:34267_btoh%2Fu-n_0000000000) [n:127.0.0.1:34267_btoh%2Fu    ] o.a.s.c.o.ClusterStateMutator building a new cName: control_collection
   [junit4]   2> 699845 INFO  (OverseerStateUpdate-95203636531298308-127.0.0.1:34267_btoh%2Fu-n_0000000000) [n:127.0.0.1:34267_btoh%2Fu    ] o.a.s.c.o.ReplicaMutator Assigning new node to shard shard=shard1
   [junit4]   2> 699847 INFO  (zkCallback-446-thread-1-processing-n:127.0.0.1:34267_btoh%2Fu) [n:127.0.0.1:34267_btoh%2Fu    ] o.a.s.c.c.ZkStateReader A cluster state change: [WatchedEvent state:SyncConnected type:NodeDataChanged path:/clusterstate.json], has occurred - updating... (live nodes size: [1])
   [junit4]   2> 700843 INFO  (coreLoadExecutor-1609-thread-1-processing-n:127.0.0.1:34267_btoh%2Fu) [n:127.0.0.1:34267_btoh%2Fu c:control_collection   x:collection1] o.a.s.c.ZkController waiting to find shard id in clusterstate for collection1
   [junit4]   2> 700843 INFO  (coreLoadExecutor-1609-thread-1-processing-n:127.0.0.1:34267_btoh%2Fu) [n:127.0.0.1:34267_btoh%2Fu c:control_collection   x:collection1] o.a.s.c.ZkController Check for collection zkNode:control_collection
   [junit4]   2> 700843 INFO  (coreLoadExecutor-1609-thread-1-processing-n:127.0.0.1:34267_btoh%2Fu) [n:127.0.0.1:34267_btoh%2Fu c:control_collection   x:collection1] o.a.s.c.ZkController Collection zkNode exists
   [junit4]   2> 700843 INFO  (coreLoadExecutor-1609-thread-1-processing-n:127.0.0.1:34267_btoh%2Fu) [n:127.0.0.1:34267_btoh%2Fu c:control_collection   x:collection1] o.a.s.c.c.ZkStateReader Load collection config from: [/collections/control_collection]
   [junit4]   2> 700843 INFO  (coreLoadExecutor-1609-thread-1-processing-n:127.0.0.1:34267_btoh%2Fu) [n:127.0.0.1:34267_btoh%2Fu c:control_collection   x:collection1] o.a.s.c.c.ZkStateReader path=[/collections/control_collection] [configName]=[conf1] specified config exists in ZooKeeper
   [junit4]   2> 700843 INFO  (coreLoadExecutor-1609-thread-1-processing-n:127.0.0.1:34267_btoh%2Fu) [n:127.0.0.1:34267_btoh%2Fu c:control_collection   x:collection1] o.a.s.c.SolrResourceLoader new SolrResourceLoader for directory: '/home/jenkins/workspace/Lucene-Solr-5.x-Linux/solr/build/solr-core/test/J2/temp/solr.core.TestDynamicLoading_29057B3087694A32-001/control-001/cores/collection1'
   [junit4]   2> 700843 INFO  (coreLoadExecutor-1609-thread-1-processing-n:127.0.0.1:34267_btoh%2Fu) [n:127.0.0.1:34267_btoh%2Fu c:control_collection   x:collection1] o.a.s.c.SolrResourceLoader JNDI not configured for solr (NoInitialContextEx)
   [junit4]   2> 700844 INFO  (coreLoadExecutor-1609-thread-1-processing-n:127.0.0.1:34267_btoh%2Fu) [n:127.0.0.1:34267_btoh%2Fu c:control_collection   x:collection1] o.a.s.c.SolrResourceLoader solr home defaulted to 'solr/' (could not find system property or JNDI)
   [junit4]   2> 700844 INFO  (coreLoadExecutor-1609-thread-1-processing-n:127.0.0.1:34267_btoh%2Fu) [n:127.0.0.1:34267_btoh%2Fu c:control_collection   x:collection1] o.a.s.c.Config loaded config solrconfig.xml with version 0 
   [junit4]   2> 700848 INFO  (coreLoadExecutor-1609-thread-1-processing-n:127.0.0.1:34267_btoh%2Fu) [n:127.0.0.1:34267_btoh%2Fu c:control_collection   x:collection1] o.a.s.c.SolrConfig current version of requestparams : -1
   [junit4]   2> 700857 INFO  (coreLoadExecutor-1609-thread-1-processing-n:127.0.0.1:34267_btoh%2Fu) [n:127.0.0.1:34267_btoh%2Fu c:control_collection   x:collection1] o.a.s.c.SolrConfig Using Lucene MatchVersion: 5.5.0
   [junit4]   2> 700873 INFO  (coreLoadExecutor-1609-thread-1-processing-n:127.0.0.1:34267_btoh%2Fu) [n:127.0.0.1:34267_btoh%2Fu c:control_collection   x:collection1] o.a.s.c.SolrConfig Loaded SolrConfig: solrconfig.xml
   [junit4]   2> 700879 INFO  (coreLoadExecutor-1609-thread-1-processing-n:127.0.0.1:34267_btoh%2Fu) [n:127.0.0.1:34267_btoh%2Fu c:control_collection   x:collection1] o.a.s.s.IndexSchema [collection1] Schema name=test
   [junit4]   2> 701046 INFO  (coreLoadExecutor-1609-thread-1-processing-n:127.0.0.1:34267_btoh%2Fu) [n:127.0.0.1:34267_btoh%2Fu c:control_collection   x:collection1] o.a.s.s.OpenExchangeRatesOrgProvider Initialized with rates=open-exchange-rates.json, refreshInterval=1440.
   [junit4]   2> 701052 INFO  (coreLoadExecutor-1609-thread-1-processing-n:127.0.0.1:34267_btoh%2Fu) [n:127.0.0.1:34267_btoh%2Fu c:control_collection   x:collection1] o.a.s.s.IndexSchema default search field in schema is text
   [junit4]   2> 701054 INFO  (coreLoadExecutor-1609-thread-1-processing-n:127.0.0.1:34267_btoh%2Fu) [n:127.0.0.1:34267_btoh%2Fu c:control_collection   x:collection1] o.a.s.s.IndexSchema unique key field: id
   [junit4]   2> 701059 INFO  (coreLoadExecutor-1609-thread-1-processing-n:127.0.0.1:34267_btoh%2Fu) [n:127.0.0.1:34267_btoh%2Fu c:control_collection   x:collection1] o.a.s.s.FileExchangeRateProvider Reloading exchange rates from file currency.xml
   [junit4]   2> 701061 INFO  (coreLoadExecutor-1609-thread-1-processing-n:127.0.0.1:34267_btoh%2Fu) [n:127.0.0.1:34267_btoh%2Fu c:control_collection   x:collection1] o.a.s.s.FileExchangeRateProvider Reloading exchange rates from file currency.xml
   [junit4]   2> 701063 INFO  (coreLoadExecutor-1609-thread-1-processing-n:127.0.0.1:34267_btoh%2Fu) [n:127.0.0.1:34267_btoh%2Fu c:control_collection   x:collection1] o.a.s.s.OpenExchangeRatesOrgProvider Reloading exchange rates from open-exchange-rates.json
   [junit4]   2> 701064 INFO  (coreLoadExecutor-1609-thread-1-processing-n:127.0.0.1:34267_btoh%2Fu) [n:127.0.0.1:34267_btoh%2Fu c:control_collection   x:collection1] o.a.s.s.OpenExchangeRatesOrgProvider Reloading exchange rates from open-exchange-rates.json
   [junit4]   2> 701064 INFO  (coreLoadExecutor-1609-thread-1-processing-n:127.0.0.1:34267_btoh%2Fu) [n:127.0.0.1:34267_btoh%2Fu c:control_collection   x:collection1] o.a.s.c.ConfigSetProperties Did not find ConfigSet properties, assuming default properties: Can't find resource 'configsetprops.json' in classpath or '/configs/conf1', cwd=/home/jenkins/workspace/Lucene-Solr-5.x-Linux/solr/build/solr-core/test/J2
   [junit4]   2> 701064 INFO  (coreLoadExecutor-1609-thread-1-processing-n:127.0.0.1:34267_btoh%2Fu) [n:127.0.0.1:34267_btoh%2Fu c:control_collection   x:collection1] o.a.s.c.CoreContainer Creating SolrCore 'collection1' using configuration from collection control_collection
   [junit4]   2> 701065 INFO  (coreLoadExecutor-1609-thread-1-processing-n:127.0.0.1:34267_btoh%2Fu) [n:127.0.0.1:34267_btoh%2Fu c:control_collection s:shard1 r:core_node1 x:collection1] o.a.s.c.SolrCore org.apache.solr.core.MockDirectoryFactory
   [junit4]   2> 701065 INFO  (coreLoadExecutor-1609-thread-1-processing-n:127.0.0.1:34267_btoh%2Fu) [n:127.0.0.1:34267_btoh%2Fu c:control_collection s:shard1 r:core_node1 x:collection1] o.a.s.c.SolrCore [[collection1] ] Opening new SolrCore at [/home/jenkins/workspace/Lucene-Solr-5.x-Linux/solr/build/solr-core/test/J2/temp/solr.core.TestDynamicLoading_29057B3087694A32-001/control-001/cores/collection1], dataDir=[/home/jenkins/workspace/Lucene-Solr-5.x-Linux/solr/build/solr-core/test/J2/../../../../../../../../../home/jenkins/workspace/Lucene-Solr-5.x-Linux/solr/build/solr-core/test/J2/temp/solr.core.TestDynamicLoading_29057B3087694A32-001/control-001/cores/collection1/data/]
   [junit4]   2> 701065 INFO  (coreLoadExecutor-1609-thread-1-processing-n:127.0.0.1:34267_btoh%2Fu) [n:127.0.0.1:34267_btoh%2Fu c:control_collection s:shard1 r:core_node1 x:collection1] o.a.s.c.JmxMonitoredMap JMX monitoring is enabled. Adding Solr mbeans to JMX Server: com.sun.jmx.mbeanserver.JmxMBeanServer@1dfe57a2
   [junit4]   2> 701065 INFO  (coreLoadExecutor-1609-thread-1-processing-n:127.0.0.1:34267_btoh%2Fu) [n:127.0.0.1:34267_btoh%2Fu c:control_collection s:shard1 r:core_node1 x:collection1] o.a.s.c.CachingDirectoryFactory return new directory for /home/jenkins/workspace/Lucene-Solr-5.x-Linux/solr/build/solr-core/test/J2/../../../../../../../../../home/jenkins/workspace/Lucene-Solr-5.x-Linux/solr/build/solr-core/test/J2/temp/solr.core.TestDynamicLoading_29057B3087694A32-001/control-001/cores/collection1/data
   [junit4]   2> 701065 INFO  (coreLoadExecutor-1609-thread-1-processing-n:127.0.0.1:34267_btoh%2Fu) [n:127.0.0.1:34267_btoh%2Fu c:control_collection s:shard1 r:core_node1 x:collection1] o.a.s.c.SolrCore New index directory detected: old=null new=/home/jenkins/workspace/Lucene-Solr-5.x-Linux/solr/build/solr-core/test/J2/../../../../../../../../../home/jenkins/workspace/Lucene-Solr-5.x-Linux/solr/build/solr-core/test/J2/temp/solr.core.TestDynamicLoading_29057B3087694A32-001/control-001/cores/collection1/data/index/
   [junit4]   2> 701065 WARN  (coreLoadExecutor-1609-thread-1-processing-n:127.0.0.1:34267_btoh%2Fu) [n:127.0.0.1:34267_btoh%2Fu c:control_collection s:shard1 r:core_node1 x:collection1] o.a.s.c.SolrCore [collection1] Solr index directory '/home/jenkins/workspace/Lucene-Solr-5.x-Linux/solr/build/solr-core/test/J2/../../../../../../../../../home/jenkins/workspace/Lucene-Solr-5.x-Linux/solr/build/solr-core/test/J2/temp/solr.core.TestDynamicLoading_29057B3087694A32-001/control-001/cores/collection1/data/index' doesn't exist. Creating new index...
   [junit4]   2> 701066 INFO  (coreLoadExecutor-1609-thread-1-processing-n:127.0.0.1:34267_btoh%2Fu) [n:127.0.0.1:34267_btoh%2Fu c:control_collection s:shard1 r:core_node1 x:collection1] o.a.s.c.CachingDirectoryFactory return new directory for /home/jenkins/workspace/Lucene-Solr-5.x-Linux/solr/build/solr-core/test/J2/../../../../../../../../../home/jenkins/workspace/Lucene-Solr-5.x-Linux/solr/build/solr-core/test/J2/temp/solr.core.TestDynamicLoading_29057B3087694A32-001/control-001/cores/collection1/data/index
   [junit4]   2> 701066 INFO  (coreLoadExecutor-1609-thread-1-processing-n:127.0.0.1:34267_btoh%2Fu) [n:127.0.0.1:34267_btoh%2Fu c:control_collection s:shard1 r:core_node1 x:collection1] o.a.s.u.RandomMergePolicy RandomMergePolicy wrapping class org.apache.lucene.index.TieredMergePolicy: [TieredMergePolicy: maxMergeAtOnce=33, maxMergeAtOnceExplicit=40, maxMergedSegmentMB=36.341796875, floorSegmentMB=0.478515625, forceMergeDeletesPctAllowed=24.450173144659274, segmentsPerTier=18.0, maxCFSSegmentSizeMB=8.796093022207999E12, noCFSRatio=0.5283975032922685
   [junit4]   2> 701066 INFO  (coreLoadExecutor-1609-thread-1-processing-n:127.0.0.1:34267_btoh%2Fu) [n:127.0.0.1:34267_btoh%2Fu c:control_collection s:shard1 r:core_node1 x:collection1] o.a.s.c.SolrDeletionPolicy SolrDeletionPolicy.onCommit: commits: num=1
   [junit4]   2> 	commit{dir=MockDirectoryWrapper(RAMDirectory@20fe3273 lockFactory=org.apache.lucene.store.SingleInstanceLockFactory@10a22cf1),segFN=segments_1,generation=1}
   [junit4]   2> 701066 INFO  (coreLoadExecutor-1609-thread-1-processing-n:127.0.0.1:34267_btoh%2Fu) [n:127.0.0.1:34267_btoh%2Fu c:control_collection s:shard1 r:core_node1 x:collection1] o.a.s.c.SolrDeletionPolicy newest commit generation = 1
   [junit4]   2> 701066 INFO  (OldIndexDirectoryCleanupThreadForCore-collection1) [n:127.0.0.1:34267_btoh%2Fu c:control_collection s:shard1 r:core_node1 x:collection1] o.a.s.c.SolrCore Looking for old index directories to cleanup for core collection1 in /home/jenkins/workspace/Lucene-Solr-5.x-Linux/solr/build/solr-core/test/J2/../../../../../../../../../home/jenkins/workspace/Lucene-Solr-5.x-Linux/solr/build/solr-core/test/J2/temp/solr.core.TestDynamicLoading_29057B3087694A32-001/control-001/cores/collection1/data/
   [junit4]   2> 701067 WARN  (OldIndexDirectoryCleanupThreadForCore-collection1) [n:127.0.0.1:34267_btoh%2Fu c:control_collection s:shard1 r:core_node1 x:collection1] o.a.s.c.DirectoryFactory /home/jenkins/workspace/Lucene-Solr-5.x-Linux/solr/build/solr-core/test/J2/../../../../../../../../../home/jenkins/workspace/Lucene-Solr-5.x-Linux/solr/build/solr-core/test/J2/temp/solr.core.TestDynamicLoading_29057B3087694A32-001/control-001/cores/collection1/data/ does not point to a valid data directory; skipping clean-up of old index directories.
   [junit4]   2> 701070 INFO  (coreLoadExecutor-1609-thread-1-processing-n:127.0.0.1:34267_btoh%2Fu) [n:127.0.0.1:34267_btoh%2Fu c:control_collection s:shard1 r:core_node1 x:collection1] o.a.s.u.p.UpdateRequestProcessorChain creating updateRequestProcessorChain "nodistrib"
   [junit4]   2> 701070 INFO  (coreLoadExecutor-1609-thread-1-processing-n:127.0.0.1:34267_btoh%2Fu) [n:127.0.0.1:34267_btoh%2Fu c:control_collection s:shard1 r:core_node1 x:collection1] o.a.s.u.p.UpdateRequestProcessorChain creating updateRequestProcessorChain "dedupe"
   [junit4]   2> 701070 INFO  (coreLoadExecutor-1609-thread-1-processing-n:127.0.0.1:34267_btoh%2Fu) [n:127.0.0.1:34267_btoh%2Fu c:control_collection s:shard1 r:core_node1 x:collection1] o.a.s.u.p.UpdateRequestProcessorChain inserting DistributedUpdateProcessorFactory into updateRequestProcessorChain "dedupe"
   [junit4]   2> 701070 INFO  (coreLoadExecutor-1609-thread-1-processing-n:127.0.0.1:34267_btoh%2Fu) [n:127.0.0.1:34267_btoh%2Fu c:control_collection s:shard1 r:core_node1 x:collection1] o.a.s.u.p.UpdateRequestProcessorChain creating updateRequestProcessorChain "stored_sig"
   [junit4]   2> 701070 INFO  (coreLoadExecutor-1609-thread-1-processing-n:127.0.0.1:34267_btoh%2Fu) [n:127.0.0.1:34267_btoh%2Fu c:control_collection s:shard1 r:core_node1 x:collection1] o.a.s.u.p.UpdateRequestProcessorChain inserting DistributedUpdateProcessorFactory into updateRequestProcessorChain "stored_sig"
   [junit4]   2> 701070 INFO  (coreLoadExecutor-1609-thread-1-processing-n:127.0.0.1:34267_btoh%2Fu) [n:127.0.0.1:34267_btoh%2Fu c:control_collection s:shard1 r:core_node1 x:collection1] o.a.s.u.p.UpdateRequestProcessorChain creating updateRequestProcessorChain "distrib-dup-test-chain-explicit"
   [junit4]   2> 701070 INFO  (coreLoadExecutor-1609-thread-1-processing-n:127.0.0.1:34267_btoh%2Fu) [n:127.0.0.1:34267_btoh%2Fu c:control_collection s:shard1 r:core_node1 x:collection1] o.a.s.u.p.UpdateRequestProcessorChain creating updateRequestProcessorChain "distrib-dup-test-chain-implicit"
   [junit4]   2> 701071 INFO  (coreLoadExecutor-1609-thread-1-processing-n:127.0.0.1:34267_btoh%2Fu) [n:127.0.0.1:34267_btoh%2Fu c:control_collection s:shard1 r:core_node1 x:collection1] o.a.s.u.p.UpdateRequestProcessorChain inserting DistributedUpdateProcessorFactory into updateRequestProcessorChain "distrib-dup-test-chain-implicit"
   [junit4]   2> 701071 INFO  (coreLoadExecutor-1609-thread-1-processing-n:127.0.0.1:34267_btoh%2Fu) [n:127.0.0.1:34267_btoh%2Fu c:control_collection s:shard1 r:core_node1 x:collection1] o.a.s.c.SolrCore no updateRequestProcessorChain defined as default, creating implicit default
   [junit4]   2> 701071 WARN  (coreLoadExecutor-1609-thread-1-processing-n:127.0.0.1:34267_btoh%2Fu) [n:127.0.0.1:34267_btoh%2Fu c:control_collection s:shard1 r:core_node1 x:collection1] o.a.s.c.RequestHandlers INVALID paramSet a in requestHandler {type = requestHandler,name = /dump,class = DumpRequestHandler,args = {defaults={a=A,b=B}}}
   [junit4]   2> 701073 INFO  (coreLoadExecutor-1609-thread-1-processing-n:127.0.0.1:34267_btoh%2Fu) [n:127.0.0.1:34267_btoh%2Fu c:control_collection s:shard1 r:core_node1 x:collection1] o.a.s.h.l.XMLLoader xsltCacheLifetimeSeconds=60
   [junit4]   2> 701074 INFO  (coreLoadExecutor-1609-thread-1-processing-n:127.0.0.1:34267_btoh%2Fu) [n:127.0.0.1:34267_btoh%2Fu c:control_collection s:shard1 r:core_node1 x:collection1] o.a.s.h.l.XMLLoader xsltCacheLifetimeSeconds=60
   [junit4]   2> 701075 INFO  (coreLoadExecutor-1609-thread-1-processing-n:127.0.0.1:34267_btoh%2Fu) [n:127.0.0.1:34267_btoh%2Fu c:control_collection s:shard1 r:core_node1 x:collection1] o.a.s.h.l.XMLLoader xsltCacheLifetimeSeconds=60
   [junit4]   2> 701075 INFO  (coreLoadExecutor-1609-thread-1-processing-n:127.0.0.1:34267_btoh%2Fu) [n:127.0.0.1:34267_btoh%2Fu c:control_collection s:shard1 r:core_node1 x:collection1] o.a.s.h.l.XMLLoader xsltCacheLifetimeSeconds=60
   [junit4]   2> 701078 INFO  (coreLoadExecutor-1609-thread-1-processing-n:127.0.0.1:34267_btoh%2Fu) [n:127.0.0.1:34267_btoh%2Fu c:control_collection s:shard1 r:core_node1 x:collection1] o.a.s.c.RequestHandlers Registered paths: /admin/threads,/admin/ping,/admin/mbeans,/config,/dump,/admin/file,/admin/luke,/admin/system,/update/csv,/admin/plugins,standard,/replication,/admin/logging,/update/json/docs,/admin/properties,/get,/schema,/update,/update/json,/admin/segments
   [junit4]   2> 701079 INFO  (coreLoadExecutor-1609-thread-1-processing-n:127.0.0.1:34267_btoh%2Fu) [n:127.0.0.1:34267_btoh%2Fu c:control_collection s:shard1 r:core_node1 x:collection1] o.a.s.c.SolrCore Using default statsCache cache: org.apache.solr.search.stats.LocalStatsCache
   [junit4]   2> 701079 INFO  (coreLoadExecutor-1609-thread-1-processing-n:127.0.0.1:34267_btoh%2Fu) [n:127.0.0.1:34267_btoh%2Fu c:control_collection s:shard1 r:core_node1 x:collection1] o.a.s.u.UpdateHandler Using UpdateLog implementation: org.apache.solr.update.UpdateLog
   [junit4]   2> 701079 INFO  (coreLoadExecutor-1609-thread-1-processing-n:127.0.0.1:34267_btoh%2Fu) [n:127.0.0.1:34267_btoh%2Fu c:control_collection s:shard1 r:core_node1 x:collection1] o.a.s.u.UpdateLog Initializing UpdateLog: dataDir= defaultSyncLevel=FLUSH numRecordsToKeep=100 maxNumLogsToKeep=10 numVersionBuckets=65536
   [junit4]   2> 701080 INFO  (coreLoadExecutor-1609-thread-1-processing-n:127.0.0.1:34267_btoh%2Fu) [n:127.0.0.1:34267_btoh%2Fu c:control_collection s:shard1 r:core_node1 x:collection1] o.a.s.u.CommitTracker Hard AutoCommit: disabled
   [junit4]   2> 701080 INFO  (coreLoadExecutor-1609-thread-1-processing-n:127.0.0.1:34267_btoh%2Fu) [n:127.0.0.1:34267_btoh%2Fu c:control_collection s:shard1 r:core_node1 x:collection1] o.a.s.u.CommitTracker Soft AutoCommit: disabled
   [junit4]   2> 701080 INFO  (coreLoadExecutor-1609-thread-1-processing-n:127.0.0.1:34267_btoh%2Fu) [n:127.0.0.1:34267_btoh%2Fu c:control_collection s:shard1 r:core_node1 x:collection1] o.a.s.u.RandomMergePolicy RandomMergePolicy wrapping class org.apache.lucene.index.LogDocMergePolicy: [LogDocMergePolicy: minMergeSize=1000, mergeFactor=33, maxMergeSize=9223372036854775807, maxMergeSizeForForcedMerge=9223372036854775807, calibrateSizeByDeletes=true, maxMergeDocs=2147483647, maxCFSSegmentSizeMB=8.796093022207999E12, noCFSRatio=0.22306312619068944]
   [junit4]   2> 701080 INFO  (coreLoadExecutor-1609-thread-1-processing-n:127.0.0.1:34267_btoh%2Fu) [n:127.0.0.1:34267_btoh%2Fu c:control_collection s:shard1 r:core_node1 x:collection1] o.a.s.c.SolrDeletionPolicy SolrDeletionPolicy.onInit: commits: num=1
   [junit4]   2> 	commit{dir=MockDirectoryWrapper(RAMDirectory@20fe3273 lockFactory=org.apache.lucene.store.SingleInstanceLockFactory@10a22cf1),segFN=segments_1,generation=1}
   [junit4]   2> 701081 INFO  (coreLoadExecutor-1609-thread-1-processing-n:127.0.0.1:34267_btoh%2Fu) [n:127.0.0.1:34267_btoh%2Fu c:control_collection s:shard1 r:core_node1 x:collection1] o.a.s.c.SolrDeletionPolicy newest commit generation = 1
   [junit4]   2> 701081 INFO  (coreLoadExecutor-1609-thread-1-processing-n:127.0.0.1:34267_btoh%2Fu) [n:127.0.0.1:34267_btoh%2Fu c:control_collection s:shard1 r:core_node1 x:collection1] o.a.s.s.SolrIndexSearcher Opening Searcher@525dd17[collection1] main
   [junit4]   2> 701081 INFO  (coreLoadExecutor-1609-thread-1-processing-n:127.0.0.1:34267_btoh%2Fu) [n:127.0.0.1:34267_btoh%2Fu c:control_collection s:shard1 r:core_node1 x:collection1] o.a.s.c.c.ZkStateReader Load collection config from: [/collections/control_collection]
   [junit4]   2> 701081 INFO  (coreLoadExecutor-1609-thread-1-processing-n:127.0.0.1:34267_btoh%2Fu) [n:127.0.0.1:34267_btoh%2Fu c:control_collection s:shard1 r:core_node1 x:collection1] o.a.s.c.c.ZkStateReader path=[/collections/control_collection] [configName]=[conf1] specified config exists in ZooKeeper
   [junit4]   2> 701081 INFO  (coreLoadExecutor-1609-thread-1-processing-n:127.0.0.1:34267_btoh%2Fu) [n:127.0.0.1:34267_btoh%2Fu c:control_collection s:shard1 r:core_node1 x:collection1] o.a.s.r.ManagedResourceStorage Setting up ZooKeeper-based storage for the RestManager with znodeBase: /configs/conf1
   [junit4]   2> 701081 INFO  (coreLoadExecutor-1609-thread-1-processing-n:127.0.0.1:34267_btoh%2Fu) [n:127.0.0.1:34267_btoh%2Fu c:control_collection s:shard1 r:core_node1 x:collection1] o.a.s.r.ManagedResourceStorage Configured ZooKeeperStorageIO with znodeBase: /configs/conf1
   [junit4]   2> 701081 INFO  (coreLoadExecutor-1609-thread-1-processing-n:127.0.0.1:34267_btoh%2Fu) [n:127.0.0.1:34267_btoh%2Fu c:control_collection s:shard1 r:core_node1 x:collection1] o.a.s.r.RestManager Initializing RestManager with initArgs: {}
   [junit4]   2> 701081 INFO  (coreLoadExecutor-1609-thread-1-processing-n:127.0.0.1:34267_btoh%2Fu) [n:127.0.0.1:34267_btoh%2Fu c:control_collection s:shard1 r:core_node1 x:collection1] o.a.s.r.ManagedResourceStorage Reading _rest_managed.json using ZooKeeperStorageIO:path=/configs/conf1
   [junit4]   2> 701082 INFO  (coreLoadExecutor-1609-thread-1-processing-n:127.0.0.1:34267_btoh%2Fu) [n:127.0.0.1:34267_btoh%2Fu c:control_collection s:shard1 r:core_node1 x:collection1] o.a.s.r.ManagedResourceStorage No data found for znode /configs/conf1/_rest_managed.json
   [junit4]   2> 701082 INFO  (coreLoadExecutor-1609-thread-1-processing-n:127.0.0.1:34267_btoh%2Fu) [n:127.0.0.1:34267_btoh%2Fu c:control_collection s:shard1 r:core_node1 x:collection1] o.a.s.r.ManagedResourceStorage Loaded null at path _rest_managed.json using ZooKeeperStorageIO:path=/configs/conf1
   [junit4]   2> 701082 INFO  (coreLoadExecutor-1609-thread-1-processing-n:127.0.0.1:34267_btoh%2Fu) [n:127.0.0.1:34267_btoh%2Fu c:control_collection s:shard1 r:core_node1 x:collection1] o.a.s.r.RestManager Initializing 0 registered ManagedResources
   [junit4]   2> 701082 INFO  (coreLoadExecutor-1609-thread-1-processing-n:127.0.0.1:34267_btoh%2Fu) [n:127.0.0.1:34267_btoh%2Fu c:control_collection s:shard1 r:core_node1 x:collection1] o.a.s.h.ReplicationHandler Commits will be reserved for  10000
   [junit4]   2> 701082 INFO  (searcherExecutor-1610-thread-1-processing-c:control_collection n:127.0.0.1:34267_btoh%2Fu s:shard1 r:core_node1 x:collection1) [n:127.0.0.1:34267_btoh%2Fu c:control_collection s:shard1 r:core_node1 x:collection1] o.a.s.c.SolrCore [collection1] Registered new searcher Searcher@525dd17[collection1] main{ExitableDirectoryReader(UninvertingDirectoryReader())}
   [junit4]   2> 701082 INFO  (coreLoadExecutor-1609-thread-1-processing-n:127.0.0.1:34267_btoh%2Fu) [n:127.0.0.1:34267_btoh%2Fu c:control_collection s:shard1 r:core_node1 x:collection1] o.a.s.u.UpdateLog Looking up max value of version field to seed version buckets
   [junit4]   2> 701082 INFO  (coreLoadExecutor-1609-thread-1-processing-n:127.0.0.1:34267_btoh%2Fu) [n:127.0.0.1:34267_btoh%2Fu c:control_collection s:shard1 r:core_node1 x:collection1] o.a.s.u.VersionInfo Refreshing highest value of _version_ for 65536 version buckets from index
   [junit4]   2> 701082 INFO  (coreLoadExecutor-1609-thread-1-processing-n:127.0.0.1:34267_btoh%2Fu) [n:127.0.0.1:34267_btoh%2Fu c:control_collection s:shard1 r:core_node1 x:collection1] o.a.s.u.VersionInfo No terms found for _version_, cannot seed version bucket highest value from index
   [junit4]   2> 701082 INFO  (coreLoadExecutor-1609-thread-1-processing-n:127.0.0.1:34267_btoh%2Fu) [n:127.0.0.1:34267_btoh%2Fu c:control_collection s:shard1 r:core_node1 x:collection1] o.a.s.u.UpdateLog Could not find max version in index or recent updates, using new clock 1523258186106142720
   [junit4]   2> 701084 INFO  (coreLoadExecutor-1609-thread-1-processing-n:127.0.0.1:34267_btoh%2Fu) [n:127.0.0.1:34267_btoh%2Fu c:control_collection s:shard1 r:core_node1 x:collection1] o.a.s.u.UpdateLog Took 1.0ms to seed version buckets with highest version 1523258186106142720
   [junit4]   2> 701084 INFO  (coreLoadExecutor-1609-thread-1-processing-n:127.0.0.1:34267_btoh%2Fu) [n:127.0.0.1:34267_btoh%2Fu c:control_collection s:shard1 r:core_node1 x:collection1] o.a.s.c.ZkController watch zkdir /configs/conf1
   [junit4]   2> 701084 INFO  (coreLoadExecutor-1609-thread-1-processing-n:127.0.0.1:34267_btoh%2Fu) [n:127.0.0.1:34267_btoh%2Fu c:control_collection s:shard1 r:core_node1 x:collection1] o.a.s.c.CoreContainer registering core: collection1
   [junit4]   2> 701085 INFO  (coreZkRegister-1603-thread-1-processing-c:control_collection n:127.0.0.1:34267_btoh%2Fu s:shard1 r:core_node1 x:collection1) [n:127.0.0.1:34267_btoh%2Fu c:control_collection s:shard1 r:core_node1 x:collection1] o.a.s.c.ZkController Register replica - core:collection1 address:http://127.0.0.1:34267/btoh/u collection:control_collection shard:shard1
   [junit4]   2> 701085 INFO  (coreZkRegister-1603-thread-1-processing-c:control_collection n:127.0.0.1:34267_btoh%2Fu s:shard1 r:core_node1 x:collection1) [n:127.0.0.1:34267_btoh%2Fu c:control_collection s:shard1 r:core_node1 x:collection1] o.a.s.c.c.SolrZkClient makePath: /collections/control_collection/leader_elect/shard1/election
   [junit4]   2> 701086 INFO  (coreZkRegister-1603-thread-1-processing-c:control_collection n:127.0.0.1:34267_btoh%2Fu s:shard1 r:core_node1 x:collection1) [n:127.0.0.1:34267_btoh%2Fu c:control_collection s:shard1 r:core_node1 x:collection1] o.a.s.c.LeaderElector Joined leadership election with path: /collections/control_collection/leader_elect/shard1/election/95203636531298308-core_node1-n_0000000000
   [junit4]   2> 701087 INFO  (coreZkRegister-1603-thread-1-processing-c:control_collection n:127.0.0.1:34267_btoh%2Fu s:shard1 r:core_node1 x:collection1) [n:127.0.0.1:34267_btoh%2Fu c:control_collection s:shard1 r:core_node1 x:collection1] o.a.s.c.ShardLeaderElectionContext Running the leader process for shard=shard1 and weAreReplacement=false and leaderVoteWait=10000
   [junit4]   2> 701087 INFO  (coreZkRegister-1603-thread-1-processing-c:control_collection n:127.0.0.1:34267_btoh%2Fu s:shard1 r:core_node1 x:collection1) [n:127.0.0.1:34267_btoh%2Fu c:control_collection s:shard1 r:core_node1 x:collection1] o.a.s.c.ShardLeaderElectionContext Enough replicas found to continue.
   [junit4]   2> 701087 INFO  (coreZkRegister-1603-thread-1-processing-c:control_collection n:127.0.0.1:34267_btoh%2Fu s:shard1 r:core_node1 x:collection1) [n:127.0.0.1:34267_btoh%2Fu c:control_collection s:shard1 r:core_node1 x:collection1] o.a.s.c.ShardLeaderElectionContext I may be the new leader - try and sync
   [junit4]   2> 701088 INFO  (coreZkRegister-1603-thread-1-processing-c:control_collection n:127.0.0.1:34267_btoh%2Fu s:shard1 r:core_node1 x:collection1) [n:127.0.0.1:34267_btoh%2Fu c:control_collection s:shard1 r:core_node1 x:collection1] o.a.s.c.SyncStrategy Sync replicas to http://127.0.0.1:34267/btoh/u/collection1/
   [junit4]   2> 701088 INFO  (coreZkRegister-1603-thread-1-processing-c:control_collection n:127.0.0.1:34267_btoh%2Fu s:shard1 r:core_node1 x:collection1) [n:127.0.0.1:34267_btoh%2Fu c:control_collection s:shard1 r:core_node1 x:collection1] o.a.s.c.SyncStrategy Sync Success - now sync replicas to me
   [junit4]   2> 701088 INFO  (coreZkRegister-1603-thread-1-processing-c:control_collection n:127.0.0.1:34267_btoh%2Fu s:shard1 r:core_node1 x:collection1) [n:127.0.0.1:34267_btoh%2Fu c:control_collection s:shard1 r:core_node1 x:collection1] o.a.s.c.SyncStrategy http://127.0.0.1:34267/btoh/u/collection1/ has no replicas
   [junit4]   2> 701088 INFO  (OverseerStateUpdate-95203636531298308-127.0.0.1:34267_btoh%2Fu-n_0000000000) [n:127.0.0.1:34267_btoh%2Fu    ] o.a.s.c.Overseer processMessage: queueSize: 1, message = {
   [junit4]   2>   "operation":"leader",
   [junit4]   2>   "shard":"shard1",
   [junit4]   2>   "collection":"control_collection"} current state version: 1
   [junit4]   2> 701088 INFO  (coreZkRegister-1603-thread-1-processing-c:control_collection n:127.0.0.1:34267_btoh%2Fu s:shard1 r:core_node1 x:collection1) [n:127.0.0.1:34267_btoh%2Fu c:control_collection s:shard1 r:core_node1 x:collection1] o.a.s.c.c.SolrZkClient makePath: /collections/control_collection/leaders/shard1
   [junit4]   2> 701089 INFO  (coreZkRegister-1603-thread-1-processing-c:control_collection n:127.0.0.1:34267_btoh%2Fu s:shard1 r:core_node1 x:collection1) [n:127.0.0.1:34267_btoh%2Fu c:control_collection s:shard1 r:core_node1 x:collection1] o.a.s.c.ShardLeaderElectionContextBase Creating leader registration node
   [junit4]   2> 701090 INFO  (coreZkRegister-1603-thread-1-processing-c:control_collection n:127.0.0.1:34267_btoh%2Fu s:shard1 r:core_node1 x:collection1) [n:127.0.0.1:34267_btoh%2Fu c:control_collection s:shard1 r:core_node1 x:collection1] o.a.s.c.ShardLeaderElectionContext I am the new leader: http://127.0.0.1:34267/btoh/u/collection1/ shard1
   [junit4]   2> 701090 INFO  (OverseerStateUpdate-95203636531298308-127.0.0.1:34267_btoh%2Fu-n_0000000000) [n:127.0.0.1:34267_btoh%2Fu    ] o.a.s.c.Overseer processMessage: queueSize: 1, message = {
   [junit4]   2>   "operation":"leader",
   [junit4]   2>   "shard":"shard1",
   [junit4]   2>   "collection":"control_collection",
   [junit4]   2>   "base_url":"http://127.0.0.1:34267/btoh/u",
   [junit4]   2>   "core":"collection1",
   [junit4]   2>   "state":"active"} current state version: 1
   [junit4]   2> 701191 INFO  (zkCallback-446-thread-1-processing-n:127.0.0.1:34267_btoh%2Fu) [n:127.0.0.1:34267_btoh%2Fu    ] o.a.s.c.c.ZkStateReader A cluster state change: [WatchedEvent state:SyncConnected type:NodeDataChanged path:/clusterstate.json], has occurred - updating... (live nodes size: [1])
   [junit4]   2> 701242 INFO  (coreZkRegister-1603-thread-1-processing-c:control_collection n:127.0.0.1:34267_btoh%2Fu s:shard1 r:core_node1 x:collection1) [n:127.0.0.1:34267_btoh%2Fu c:control_collection s:shard1 r:core_node1 x:collection1] o.a.s.c.ZkController We are http://127.0.0.1:34267/btoh/u/collection1/ and leader is http://127.0.0.1:34267/btoh/u/collection1/
   [junit4]   2> 701242 INFO  (coreZkRegister-1603-thread-1-processing-c:control_collection n:127.0.0.1:34267_btoh%2Fu s:shard1 r:core_node1 x:collection1) [n:127.0.0.1:34267_btoh%2Fu c:control_collection s:shard1 r:core_node1 x:collection1] o.a.s.c.ZkController No LogReplay needed for core=collection1 baseURL=http://127.0.0.1:34267/btoh/u
   [junit4]   2> 701242 INFO  (coreZkRegister-1603-thread-1-processing-c:control_collection n:127.0.0.1:34267_btoh%2Fu s:shard1 r:core_node1 x:collection1) [n:127.0.0.1:34267_btoh%2Fu c:control_collection s:shard1 r:core_node1 x:collection1] o.a.s.c.ZkController I am the leader, no recovery necessary
   [junit4]   2> 701242 INFO  (coreZkRegister-1603-thread-1-processing-c:control_collection n:127.0.0.1:34267_btoh%2Fu s:shard1 r:core_node1 x:collection1) [n:127.0.0.1:34267_btoh%2Fu c:control_collection s:shard1 r:core_node1 x:collection1] o.a.s.c.ZkController publishing state=active
   [junit4]   2> 701242 INFO  (coreZkRegister-1603-thread-1-processing-c:control_collection n:127.0.0.1:34267_btoh%2Fu s:shard1 r:core_node1 x:collection1) [n:127.0.0.1:34267_btoh%2Fu c:control_collection s:shard1 r:core_node1 x:collection1] o.a.s.c.ZkController numShards not found on descriptor - reading it from system property
   [junit4]   2> 701243 INFO  (OverseerStateUpdate-95203636531298308-127.0.0.1:34267_btoh%2Fu-n_0000000000) [n:127.0.0.1:34267_btoh%2Fu    ] o.a.s.c.Overseer processMessage: queueSize: 1, message = {
   [junit4]   2>   "numShards":"1",
   [junit4]   2>   "collection":"control_collection",
   [junit4]   2>   "node_name":"127.0.0.1:34267_btoh%2Fu",
   [junit4]   2>   "operation":"state",
   [junit4]   2>   "roles":null,
   [junit4]   2>   "shard":"shard1",
   [junit4]   2>   "core":"collection1",
   [junit4]   2>   "base_url":"http://127.0.0.1:34267/btoh/u",
   [junit4]   2>   "core_node_name":"core_node1",
   [junit4]   2>   "state":"active"} current state version: 2
   [junit4]   2> 701243 INFO  (OverseerStateUpdate-95203636531298308-127.0.0.1:34267_btoh%2Fu-n_0000000000) [n:127.0.0.1:34267_btoh%2Fu    ] o.a.s.c.o.ReplicaMutator Update state numShards=1 message={
   [junit4]   2>   "numShards":"1",
   [junit4]   2>   "collection":"control_collection",
   [junit4]   2>   "node_name":"127.0.0.1:34267_btoh%2Fu",
   [junit4]   2>   "operation":"state",
   [junit4]   2>   "roles":null,
   [junit4]   2>   "shard":"shard1",
   [junit4]   2>   "core":"collection1",
   [junit4]   2>   "base_url":"http://127.0.0.1:34267/btoh/u",
   [junit4]   2>   "core_node_name":"core_node1",
   [junit4]   2>   "state":"active"}
   [junit4]   2> 701343 INFO  (TEST-TestDynamicLoading.testDynamicLoading-seed#[29057B3087694A32]) [    ] o.a.s.c.c.SolrZkClient Using default ZkCredentialsProvider
   [junit4]   2> 701343 INFO  (TEST-TestDynamicLoading.testDynamicLoading-seed#[29057B3087694A32]) [    ] o.a.s.c.c.ConnectionManager Waiting for client to connect to ZooKeeper
   [junit4]   2> 701345 INFO  (zkCallback-446-thread-2-processing-n:127.0.0.1:34267_btoh%2Fu) [n:127.0.0.1:34267_btoh%2Fu    ] o.a.s.c.c.ZkStateReader A cluster state change: [WatchedEvent state:SyncConnected type:NodeDataChanged path:/clusterstate.json], has occurred - updating... (live nodes size: [1])
   [junit4]   2> 701345 INFO  (zkCallback-448-thread-1) [    ] o.a.s.c.c.ConnectionManager Watcher org.apache.solr.common.cloud.ConnectionManager@2ba0cc7f name:ZooKeeperConnection Watcher:127.0.0.1:35861/solr got event WatchedEvent state:SyncConnected type:None path:null path:null type:None
   [junit4]   2> 701345 INFO  (TEST-TestDynamicLoading.testDynamicLoading-seed#[29057B3087694A32]) [    ] o.a.s.c.c.ConnectionManager Client is connected to ZooKeeper
   [junit4]   2> 701345 INFO  (TEST-TestDynamicLoading.testDynamicLoading-seed#[29057B3087694A32]) [    ] o.a.s.c.c.SolrZkClient Using default ZkACLProvider
   [junit4]   2> 701345 INFO  (TEST-TestDynamicLoading.testDynamicLoading-seed#[29057B3087694A32]) [    ] o.a.s.c.c.ZkStateReader Updating cluster state from ZooKeeper... 
   [junit4]   2> 701346 INFO  (TEST-TestDynamicLoading.testDynamicLoading-seed#[29057B3087694A32]) [    ] o.a.s.c.ChaosMonkey monkey: init - expire sessions:false cause connection loss:false
   [junit4]   2> 701346 INFO  (TEST-TestDynamicLoading.testDynamicLoading-seed#[29057B3087694A32]) [    ] o.a.s.c.AbstractFullDistribZkTestBase Creating collection1 with stateFormat=2
   [junit4]   2> 701346 INFO  (TEST-TestDynamicLoading.testDynamicLoading-seed#[29057B3087694A32]) [    ] o.a.s.c.c.SolrZkClient Using default ZkCredentialsProvider
   [junit4]   2> 701346 INFO  (TEST-TestDynamicLoading.testDynamicLoading-seed#[29057B3087694A32]) [    ] o.a.s.c.c.ConnectionManager Waiting for client to connect to ZooKeeper
   [junit4]   2> 701347 INFO  (zkCallback-449-thread-1) [    ] o.a.s.c.c.ConnectionManager Watcher org.apache.solr.common.cloud.ConnectionManager@70657339 name:ZooKeeperConnection Watcher:127.0.0.1:35861/solr got event WatchedEvent state:SyncConnected type:None path:null path:null type:None
   [junit4]   2> 701347 INFO  (TEST-TestDynamicLoading.testDynamicLoading-seed#[29057B3087694A32]) [    ] o.a.s.c.c.ConnectionManager Client is connected to ZooKeeper
   [junit4]   2> 701347 INFO  (TEST-TestDynamicLoading.testDynamicLoading-seed#[29057B3087694A32]) [    ] o.a.s.c.c.SolrZkClient Using default ZkACLProvider
   [junit4]   2> 701354 INFO  (OverseerStateUpdate-95203636531298308-127.0.0.1:34267_btoh%2Fu-n_0000000000) [n:127.0.0.1:34267_btoh%2Fu    ] o.a.s.c.Overseer processMessage: queueSize: 1, message = {
   [junit4]   2>   "operation":"create",
   [junit4]   2>   "name":"collection1",
   [junit4]   2>   "numShards":"2",
   [junit4]   2>   "stateFormat":"2"} current state version: 3
   [junit4]   2> 701354 INFO  (OverseerStateUpdate-95203636531298308-127.0.0.1:34267_btoh%2Fu-n_0000000000) [n:127.0.0.1:34267_btoh%2Fu    ] o.a.s.c.o.ClusterStateMutator building a new cName: collection1
   [junit4]   2> 701455 INFO  (OverseerStateUpdate-95203636531298308-127.0.0.1:34267_btoh%2Fu-n_0000000000) [n:127.0.0.1:34267_btoh%2Fu    ] o.a.s.c.o.ZkStateWriter going to create_collection /collections/collection1/state.json
   [junit4]   2> 701473 INFO  (TEST-TestDynamicLoading.testDynamicLoading-seed#[29057B3087694A32]) [    ] o.a.s.SolrTestCaseJ4 Writing core.properties file to /home/jenkins/workspace/Lucene-Solr-5.x-Linux/solr/build/solr-core/test/J2/temp/solr.core.TestDynamicLoading_29057B3087694A32-001/shard-1-001/cores/collection1
   [junit4]   2> 701474 INFO  (TEST-TestDynamicLoading.testDynamicLoading-seed#[29057B3087694A32]) [    ] o.a.s.c.AbstractFullDistribZkTestBase create jetty 1 in directory /home/jenkins/workspace/Lucene-Solr-5.x-Linux/solr/build/solr-core/test/J2/temp/solr.core.TestDynamicLoading_29057B3087694A32-001/shard-1-001
   [junit4]   2> 701474 INFO  (TEST-TestDynamicLoading.testDynamicLoading-seed#[29057B3087694A32]) [    ] o.e.j.s.Server jetty-9.2.13.v20150730
   [junit4]   2> 701475 INFO  (TEST-TestDynamicLoading.testDynamicLoading-seed#[29057B3087694A32]) [    ] o.e.j.s.h.ContextHandler Started o.e.j.s.ServletContextHandler@54ffc7bc{/btoh/u,null,AVAILABLE}
   [junit4]   2> 701476 INFO  (TEST-TestDynamicLoading.testDynamicLoading-seed#[29057B3087694A32]) [    ] o.e.j.s.ServerConnector Started ServerConnector@3a61dbb9{HTTP/1.1}{127.0.0.1:37662}
   [junit4]   2> 701476 INFO  (TEST-TestDynamicLoading.testDynamicLoading-seed#[29057B3087694A32]) [    ] o.e.j.s.Server Started @703251ms
   [junit4]   2> 701476 INFO  (TEST-TestDynamicLoading.testDynamicLoading-seed#[29057B3087694A32]) [    ] o.a.s.c.s.e.JettySolrRunner Jetty properties: {solrconfig=solrconfig.xml, hostContext=/btoh/u, coreRootDirectory=/home/jenkins/workspace/Lucene-Solr-5.x-Linux/solr/build/solr-core/test/J2/temp/solr.core.TestDynamicLoading_29057B3087694A32-001/shard-1-001/cores, hostPort=37662, solr.data.dir=/home/jenkins/workspace/Lucene-Solr-5.x-Linux/solr/build/solr-core/test/J2/temp/solr.core.TestDynamicLoading_29057B3087694A32-001/tempDir-001/jetty1}
   [junit4]   2> 701476 INFO  (TEST-TestDynamicLoading.testDynamicLoading-seed#[29057B3087694A32]) [    ] o.a.s.s.SolrDispatchFilter SolrDispatchFilter.init(): sun.misc.Launcher$AppClassLoader@4e0add57
   [junit4]   2> 701476 INFO  (TEST-TestDynamicLoading.testDynamicLoading-seed#[29057B3087694A32]) [    ] o.a.s.c.SolrResourceLoader new SolrResourceLoader for directory: '/home/jenkins/workspace/Lucene-Solr-5.x-Linux/solr/build/solr-core/test/J2/temp/solr.core.TestDynamicLoading_29057B3087694A32-001/shard-1-001'
   [junit4]   2> 701476 INFO  (TEST-TestDynamicLoading.testDynamicLoading-seed#[29057B3087694A32]) [    ] o.a.s.c.SolrResourceLoader JNDI not configured for solr (NoInitialContextEx)
   [junit4]   2> 701476 INFO  (TEST-TestDynamicLoading.testDynamicLoading-seed#[29057B3087694A32]) [    ] o.a.s.c.SolrResourceLoader solr home defaulted to 'solr/' (could not find system property or JNDI)
   [junit4]   2> 701477 INFO  (TEST-TestDynamicLoading.testDynamicLoading-seed#[29057B3087694A32]) [    ] o.a.s.c.c.SolrZkClient Using default ZkCredentialsProvider
   [junit4]   2> 701477 INFO  (TEST-TestDynamicLoading.testDynamicLoading-seed#[29057B3087694A32]) [    ] o.a.s.c.c.ConnectionManager Waiting for client to connect to ZooKeeper
   [junit4]   2> 701491 INFO  (zkCallback-450-thread-1) [    ] o.a.s.c.c.ConnectionManager Watcher org.apache.solr.common.cloud.ConnectionManager@596bf20b name:ZooKeeperConnection Watcher:127.0.0.1:35861/solr got event WatchedEvent state:SyncConnected type:None path:null path:null type:None
   [junit4]   2> 701491 INFO  (TEST-TestDynamicLoading.testDynamicLoading-seed#[29057B3087694A32]) [    ] o.a.s.c.c.ConnectionManager Client is connected to ZooKeeper
   [junit4]   2> 701492 INFO  (TEST-TestDynamicLoading.testDynamicLoading-seed#[29057B3087694A32]) [    ] o.a.s.c.c.SolrZkClient Using default ZkACLProvider
   [junit4]   2> 701492 INFO  (TEST-TestDynamicLoading.testDynamicLoading-seed#[29057B3087694A32]) [    ] o.a.s.s.SolrDispatchFilter Loading solr.xml from SolrHome (not found in ZooKeeper)
   [junit4]   2> 701492 INFO  (TEST-TestDynamicLoading.testDynamicLoading-seed#[29057B3087694A32]) [    ] o.a.s.c.SolrXmlConfig Loading container configuration from /home/jenkins/workspace/Lucene-Solr-5.x-Linux/solr/build/solr-core/test/J2/temp/solr.core.TestDynamicLoading_29057B3087694A32-001/shard-1-001/solr.xml
   [junit4]   2> 701501 INFO  (TEST-TestDynamicLoading.testDynamicLoading-seed#[29057B3087694A32]) [    ] o.a.s.c.CorePropertiesLocator Config-defined core root directory: /home/jenkins/workspace/Lucene-Solr-5.x-Linux/solr/build/solr-core/test/J2/temp/solr.core.TestDynamicLoading_29057B3087694A32-001/shard-1-001/cores
   [junit4]   2> 701501 INFO  (TEST-TestDynamicLoading.testDynamicLoading-seed#[29057B3087694A32]) [    ] o.a.s.c.CoreContainer New CoreContainer 1062757677
   [junit4]   2> 701501 INFO  (TEST-TestDynamicLoading.testDynamicLoading-seed#[29057B3087694A32]) [    ] o.a.s.c.CoreContainer Loading cores into CoreContainer [instanceDir=/home/jenkins/workspace/Lucene-Solr-5.x-Linux/solr/build/solr-core/test/J2/temp/solr.core.TestDynamicLoading_29057B3087694A32-001/shard-1-001]
   [junit4]   2> 701501 WARN  (TEST-TestDynamicLoading.testDynamicLoading-seed#[29057B3087694A32]) [    ] o.a.s.c.CoreContainer Couldn't add files from /home/jenkins/workspace/Lucene-Solr-5.x-Linux/solr/build/solr-core/test/J2/temp/solr.core.TestDynamicLoading_29057B3087694A32-001/shard-1-001/lib to classpath: /home/jenkins/workspace/Lucene-Solr-5.x-Linux/solr/build/solr-core/test/J2/temp/solr.core.TestDynamicLoading_29057B3087694A32-001/shard-1-001/lib
   [junit4]   2> 701501 INFO  (TEST-TestDynamicLoading.testDynamicLoading-seed#[29057B3087694A32]) [    ] o.a.s.h.c.HttpShardHandlerFactory created with socketTimeout : 90000,urlScheme : ,connTimeout : 15000,maxConnectionsPerHost : 20,maxConnections : 10000,corePoolSize : 0,maximumPoolSize : 2147483647,maxThreadIdleTime : 5,sizeOfQueue : -1,fairnessPolicy : false,useRetries : false,
   [junit4]   2> 701502 INFO  (TEST-TestDynamicLoading.testDynamicLoading-seed#[29057B3087694A32]) [    ] o.a.s.u.UpdateShardHandler Creating UpdateShardHandler HTTP client with params: socketTimeout=340000&connTimeout=45000&retry=true
   [junit4]   2> 701503 INFO  (TEST-TestDynamicLoading.testDynamicLoading-seed#[29057B3087694A32]) [    ] o.a.s.l.LogWatcher SLF4J impl is org.slf4j.impl.Log4jLoggerFactory
   [junit4]   2> 701503 INFO  (TEST-TestDynamicLoading.testDynamicLoading-seed#[29057B3087694A32]) [    ] o.a.s.l.LogWatcher Registering Log Listener [Log4j (org.slf4j.impl.Log4jLoggerFactory)]
   [junit4]   2> 701503 INFO  (TEST-TestDynamicLoading.testDynamicLoading-seed#[29057B3087694A32]) [    ] o.a.s.c.ZkContainer Zookeeper client=127.0.0.1:35861/solr
   [junit4]   2> 701503 INFO  (TEST-TestDynamicLoading.testDynamicLoading-seed#[29057B3087694A32]) [    ] o.a.s.c.ZkController zkHost includes chroot
   [junit4]   2> 701503 INFO  (TEST-TestDynamicLoading.testDynamicLoading-seed#[29057B3087694A32]) [    ] o.a.s.c.c.SolrZkClient Using default ZkCredentialsProvider
   [junit4]   2> 701503 INFO  (TEST-TestDynamicLoading.testDynamicLoading-seed#[29057B3087694A32]) [    ] o.a.s.c.c.ConnectionManager Waiting for client to connect to ZooKeeper
   [junit4]   2> 701513 INFO  (zkCallback-452-thread-1) [    ] o.a.s.c.c.ConnectionManager Watcher org.apache.solr.common.cloud.ConnectionManager@7cd78e5d name:ZooKeeperConnection Watcher:127.0.0.1:35861 got event WatchedEvent state:SyncConnected type:None path:null path:null type:None
   [junit4]   2> 701513 INFO  (TEST-TestDynamicLoading.testDynamicLoading-seed#[29057B3087694A32]) [    ] o.a.s.c.c.ConnectionManager Client is connected to ZooKeeper
   [junit4]   2> 701513 INFO  (TEST-TestDynamicLoading.testDynamicLoading-seed#[29057B3087694A32]) [    ] o.a.s.c.c.SolrZkClient Using default ZkACLProvider
   [junit4]   2> 701514 INFO  (TEST-TestDynamicLoading.testDynamicLoading-seed#[29057B3087694A32]) [n:127.0.0.1:37662_btoh%2Fu    ] o.a.s.c.c.ConnectionManager Waiting for client to connect to ZooKeeper
   [junit4]   2> 701515 INFO  (zkCallback-453-thread-1-processing-n:127.0.0.1:37662_btoh%2Fu) [n:127.0.0.1:37662_btoh%2Fu    ] o.a.s.c.c.ConnectionManager Watcher org.apache.solr.common.cloud.ConnectionManager@f6aad76 name:ZooKeeperConnection Watcher:127.0.0.1:35861/solr got event WatchedEvent state:SyncConnected type:None path:null path:null type:None
   [junit4]   2> 701515 INFO  (TEST-TestDynamicLoading.testDynamicLoading-seed#[29057B3087694A32]) [n:127.0.0.1:37662_btoh%2Fu    ] o.a.s.c.c.ConnectionManager Client is connected to ZooKeeper
   [junit4]   2> 701517 INFO  (TEST-TestDynamicLoading.testDynamicLoading-seed#[29057B3087694A32]) [n:127.0.0.1:37662_btoh%2Fu    ] o.a.s.c.c.ZkStateReader Updating cluster state from ZooKeeper... 
   [junit4]   2> 702519 INFO  (TEST-TestDynamicLoading.testDynamicLoading-seed#[29057B3087694A32]) [n:127.0.0.1:37662_btoh%2Fu    ] o.a.s.c.ZkController Register node as live in ZooKeeper:/live_nodes/127.0.0.1:37662_btoh%2Fu
   [junit4]   2> 702519 INFO  (TEST-TestDynamicLoading.testDynamicLoading-seed#[29057B3087694A32]) [n:127.0.0.1:37662_btoh%2Fu    ] o.a.s.c.c.SolrZkClient makePath: /live_nodes/127.0.0.1:37662_btoh%2Fu
   [junit4]   2> 702520 INFO  (zkCallback-453-thread-1-processing-n:127.0.0.1:37662_btoh%2Fu) [n:127.0.0.1:37662_btoh%2Fu    ] o.a.s.c.c.ZkStateReader A live node change: [WatchedEvent state:SyncConnected type:NodeChildrenChanged path:/live_nodes], has occurred - updating... (live nodes size: [1])
   [junit4]   2> 702520 INFO  (zkCallback-446-thread-2-processing-n:127.0.0.1:34267_btoh%2Fu) [n:127.0.0.1:34267_btoh%2Fu    ] o.a.s.c.c.ZkStateReader A live node change: [WatchedEvent state:SyncConnected type:NodeChildrenChanged path:/live_nodes], has occurred - updating... (live nodes size: [1])
   [junit4]   2> 702520 INFO  (zkCallback-448-thread-1) [    ] o.a.s.c.c.ZkStateReader A live node change: [WatchedEvent state:SyncConnected type:NodeChildrenChanged path:/live_nodes], has occurred - updating... (live nodes size: [1])
   [junit4]   2> 702521 INFO  (TEST-TestDynamicLoading.testDynamicLoading-seed#[29057B3087694A32]) [n:127.0.0.1:37662_btoh%2Fu    ] o.a.s.c.Overseer Overseer (id=null) closing
   [junit4]   2> 702521 INFO  (TEST-TestDynamicLoading.testDynamicLoading-seed#[29057B3087694A32]) [n:127.0.0.1:37662_btoh%2Fu    ] o.a.s.c.LeaderElector Joined leadership election with path: /overseer_elect/election/95203636531298313-127.0.0.1:37662_btoh%2Fu-n_0000000001
   [junit4]   2> 702521 INFO  (TEST-TestDynamicLoading.testDynamicLoading-seed#[29057B3087694A32]) [n:127.0.0.1:37662_btoh%2Fu    ] o.a.s.c.LeaderElector Watching path /overseer_elect/election/95203636531298308-127.0.0.1:34267_btoh%2Fu-n_0000000000 to know if I could be the leader
   [junit4]   2> 702532 INFO  (TEST-TestDynamicLoading.testDynamicLoading-seed#[29057B3087694A32]) [n:127.0.0.1:37662_btoh%2Fu    ] o.a.s.c.CoreContainer Security conf doesn't exist. Skipping setup for authorization module.
   [junit4]   2> 702532 INFO  (TEST-TestDynamicLoading.testDynamicLoading-seed#[29057B3087694A32]) [n:127.0.0.1:37662_btoh%2Fu    ] o.a.s.c.CoreContainer No authentication plugin used.
   [junit4]   2> 702533 INFO  (TEST-TestDynamicLoading.testDynamicLoading-seed#[29057B3087694A32]) [n:127.0.0.1:37662_btoh%2Fu    ] o.a.s.c.CorePropertiesLocator Looking for core definitions underneath /home/jenkins/workspace/Lucene-Solr-5.x-Linux/solr/build/solr-core/test/J2/temp/solr.core.TestDynamicLoading_29057B3087694A32-001/shard-1-001/cores
   [junit4]   2> 702533 INFO  (TEST-TestDynamicLoading.testDynamicLoading-seed#[29057B3087694A32]) [n:127.0.0.1:37662_btoh%2Fu    ] o.a.s.c.CoreDescriptor Created CoreDescriptor: {name=collection1, coreNodeName=, transient=false, loadOnStartup=true, schema=schema.xml, shard=, collection=collection1, dataDir=data/, configSetProperties=configsetprops.json, config=solrconfig.xml}
   [junit4]   2> 702534 INFO  (TEST-TestDynamicLoading.testDynamicLoading-seed#[29057B3087694A32]) [n:127.0.0.1:37662_btoh%2Fu    ] o.a.s.c.CorePropertiesLocator Found core collection1 in /home/jenkins/workspace/Lucene-Solr-5.x-Linux/solr/build/solr-core/test/J2/temp/solr.core.TestDynamicLoading_29057B3087694A32-001/shard-1-001/cores/collection1
   [junit4]   2> 702534 INFO  (TEST-TestDynamicLoading.testDynamicLoading-seed#[29057B3087694A32]) [n:127.0.0.1:37662_btoh%2Fu    ] o.a.s.c.CorePropertiesLocator Found 1 core definitions
   [junit4]   2> 702534 INFO  (TEST-TestDynamicLoading.testDynamicLoading-seed#[29057B3087694A32]) [n:127.0.0.1:37662_btoh%2Fu    ] o.a.s.s.SolrDispatchFilter user.dir=/home/jenkins/workspace/Lucene-Solr-5.x-Linux/solr/build/solr-core/test/J2
   [junit4]   2> 702534 INFO  (TEST-TestDynamicLoading.testDynamicLoading-seed#[29057B3087694A32]) [n:127.0.0.1:37662_btoh%2Fu    ] o.a.s.s.SolrDispatchFilter SolrDispatchFilter.init() done
   [junit4]   2> 702534 INFO  (coreLoadExecutor-1620-thread-1-processing-n:127.0.0.1:37662_btoh%2Fu) [n:127.0.0.1:37662_btoh%2Fu c:collection1   x:collection1] o.a.s.c.ZkController publishing state=down
   [junit4]   2> 702534 INFO  (coreLoadExecutor-1620-thread-1-processing-n:127.0.0.1:37662_btoh%2Fu) [n:127.0.0.1:37662_btoh%2Fu c:collection1   x:collection1] o.a.s.c.ZkController numShards not found on descriptor - reading it from system property
   [junit4]   2> 702535 INFO  (coreLoadExecutor-1620-thread-1-processing-n:127.0.0.1:37662_btoh%2Fu) [n:127.0.0.1:37662_btoh%2Fu c:collection1   x:collection1] o.a.s.c.ZkController Registering watch for collection collection1
   [junit4]   2> 702535 INFO  (coreLoadExecutor-1620-thread-1-processing-n:127.0.0.1:37662_btoh%2Fu) [n:127.0.0.1:37662_btoh%2Fu c:collection1   x:collection1] o.a.s.c.c.ZkStateReader addZkWatch [collection1]
   [junit4]   2> 702535 INFO  (OverseerStateUpdate-95203636531298308-127.0.0.1:34267_btoh%2Fu-n_0000000000) [n:127.0.0.1:34267_btoh%2Fu    ] o.a.s.c.Overseer processMessage: queueSize: 1, message = {
   [junit4]   2>   "numShards":"2",
   [junit4]   2>   "collection":"collection1",
   [junit4]   2>   "node_name":"127.0.0.1:37662_btoh%2Fu",
   [junit4]   2>   "operation":"state",
   [junit4]   2>   "roles":null,
   [junit4]   2>   "shard":null,
   [junit4]   2>   "core":"collection1",
   [junit4]   2>   "base_url":"http://127.0.0.1:37662/btoh/u",
   [junit4]   2>   "state":"down"} current state version: 3
   [junit4]   2> 702535 INFO  (coreLoadExecutor-1620-thread-1-processing-n:127.0.0.1:37662_btoh%2Fu) [n:127.0.0.1:37662_btoh%2Fu c:collection1   x:collection1] o.a.s.c.c.ZkStateReader Add data for [collection1] ver [0]
   [junit4]   2> 702535 INFO  (coreLoadExecutor-1620-thread-1-processing-n:127.0.0.1:37662_btoh%2Fu) [n:127.0.0.1:37662_btoh%2Fu c:collection1   x:collection1] o.a.s.c.ZkController look for our core node name
   [junit4]   2> 702535 INFO  (OverseerStateUpdate-95203636531298308-127.0.0.1:34267_btoh%2Fu-n_0000000000) [n:127.0.0.1:34267_btoh%2Fu    ] o.a.s.c.o.ReplicaMutator Update state numShards=2 message={
   [junit4]   2>   "numShards":"2",
   [junit4]   2>   "collection":"collection1",
   [junit4]   2>   "node_name":"127.0.0.1:37662_btoh%2Fu",
   [junit4]   2>   "operation":"state",
   [junit4]   2>   "roles":null,
   [junit4]   2>   "shard":null,
   [junit4]   2>   "core":"collection1",
   [junit4]   2>   "base_url":"http://127.0.0.1:37662/btoh/u",
   [junit4]   2>   "state":"down"}
   [junit4]   2> 702535 INFO  (OverseerStateUpdate-95203636531298308-127.0.0.1:34267_btoh%2Fu-n_0000000000) [n:127.0.0.1:34267_btoh%2Fu    ] o.a.s.c.o.ReplicaMutator Collection already exists with numShards=2
   [junit4]   2> 702536 INFO  (OverseerStateUpdate-95203636531298308-127.0.0.1:34267_btoh%2Fu-n_0000000000) [n:127.0.0.1:34267_btoh%2Fu    ] o.a.s.c.o.ReplicaMutator Assigning new node to shard shard=shard1
   [junit4]   2> 702637 INFO  (OverseerStateUpdate-95203636531298308-127.0.0.1:34267_btoh%2Fu-n_0000000000) [n:127.0.0.1:34267_btoh%2Fu    ] o.a.s.c.o.ZkStateWriter going to update_collection /collections/collection1/state.json version: 0
   [junit4]   2> 702637 INFO  (zkCallback-453-thread-1-processing-n:127.0.0.1:37662_btoh%2Fu) [n:127.0.0.1:37662_btoh%2Fu    ] o.a.s.c.c.ZkStateReader A cluster state change: [WatchedEvent state:SyncConnected type:NodeDataChanged path:/collections/collection1/state.json] for collection [collection1] has occurred - updating... (live nodes size: [2])
   [junit4]   2> 702638 INFO  (zkCallback-453-thread-1-processing-n:127.0.0.1:37662_btoh%2Fu) [n:127.0.0.1:37662_btoh%2Fu    ] o.a.s.c.c.ZkStateReader Updating data for [collection1] from [0] to [1]
   [junit4]   2> 703535 INFO  (coreLoadExecutor-1620-thread-1-processing-n:127.0.0.1:37662_btoh%2Fu) [n:127.0.0.1:37662_btoh%2Fu c:collection1   x:collection1] o.a.s.c.ZkController waiting to find shard id in clusterstate for collection1
   [junit4]   2> 703536 INFO  (coreLoadExecutor-1620-thread-1-processing-n:127.0.0.1:37662_btoh%2Fu) [n:127.0.0.1:37662_btoh%2Fu c:collection1   x:collection1] o.a.s.c.ZkController Check for collection zkNode:collection1
   [junit4]   2> 703536 INFO  (coreLoadExecutor-1620-thread-1-processing-n:127.0.0.1:37662_btoh%2Fu) [n:127.0.0.1:37662_btoh%2Fu c:collection1   x:collection1] o.a.s.c.ZkController Collection zkNode exists
   [junit4]   2> 703536 INFO  (coreLoadExecutor-1620-thread-1-processing-n:127.0.0.1:37662_btoh%2Fu) [n:127.0.0.1:37662_btoh%2Fu c:collection1   x:collection1] o.a.s.c.c.ZkStateReader Load collection config from: [/collections/collection1]
   [junit4]   2> 703536 INFO  (coreLoadExecutor-1620-thread-1-processing-n:127.0.0.1:37662_btoh%2Fu) [n:127.0.0.1:37662_btoh%2Fu c:collection1   x:collection1] o.a.s.c.c.ZkStateReader path=[/collections/collection1] [configName]=[conf1] specified config exists in ZooKeeper
   [junit4]   2> 703536 INFO  (coreLoadExecutor-1620-thread-1-processing-n:127.0.0.1:37662_btoh%2Fu) [n:127.0.0.1:37662_btoh%2Fu c:collection1   x:collection1] o.a.s.c.SolrResourceLoader new SolrResourceLoader for directory: '/home/jenkins/workspace/Lucene-Solr-5.x-Linux/solr/build/solr-core/test/J2/temp/solr.core.TestDynamicLoading_29057B3087694A32-001/shard-1-001/cores/collection1'
   [junit4]   2> 703536 INFO  (coreLoadExecutor-1620-thread-1-processing-n:127.0.0.1:37662_btoh%2Fu) [n:127.0.0.1:37662_btoh%2Fu c:collection1   x:collection1] o.a.s.c.SolrResourceLoader JNDI not configured for solr (NoInitialContextEx)
   [junit4]   2> 703536 INFO  (coreLoadExecutor-1620-thread-1-processing-n:127.0.0.1:37662_btoh%2Fu) [n:127.0.0.1:37662_btoh%2Fu c:collection1   x:collection1] o.a.s.c.SolrResourceLoader solr home defaulted to 'solr/' (could not find system property or JNDI)
   [junit4]   2> 703537 INFO  (coreLoadExecutor-1620-thread-1-processing-n:127.0.0.1:37662_btoh%2Fu) [n:127.0.0.1:37662_btoh%2Fu c:collection1   x:collection1] o.a.s.c.Config loaded config solrconfig.xml with version 0 
   [junit4]   2> 703542 INFO  (coreLoadExecutor-1620-thread-1-processing-n:127.0.0.1:37662_btoh%2Fu) [n:127.0.0.1:37662_btoh%2Fu c:collection1   x:collection1] o.a.s.c.SolrConfig current version of requestparams : -1
   [junit4]   2> 703550 INFO  (coreLoadExecutor-1620-thread-1-processing-n:127.0.0.1:37662_btoh%2Fu) [n:127.0.0.1:37662_btoh%2Fu c:collection1   x:collection1] o.a.s.c.SolrConfig Using Lucene MatchVersion: 5.5.0
   [junit4]   2> 703567 INFO  (coreLoadExecutor-1620-thread-1-processing-n:127.0.0.1:37662_btoh%2Fu) [n:127.0.0.1:37662_btoh%2Fu c:collection1   x:collection1] o.a.s.c.SolrConfig Loaded SolrConfig: solrconfig.xml
   [junit4]   2> 703572 INFO  (coreLoadExecutor-1620-thread-1-processing-n:127.0.0.1:37662_btoh%2Fu) [n:127.0.0.1:37662_btoh%2Fu c:collection1   x:collection1] o.a.s.s.IndexSchema [collection1] Schema name=test
   [junit4]   2> 703733 INFO  (coreLoadExecutor-1620-thread-1-processing-n:127.0.0.1:37662_btoh%2Fu) [n:127.0.0.1:37662_btoh%2Fu c:collection1   x:collection1] o.a.s.s.OpenExchangeRatesOrgProvider Initialized with rates=open-exchange-rates.json, refreshInterval=1440.
   [junit4]   2> 703738 INFO  (coreLoadExecutor-1620-thread-1-processing-n:127.0.0.1:37662_btoh%2Fu) [n:127.0.0.1:37662_btoh%2Fu c:collection1   x:collection1] o.a.s.s.IndexSchema default search field in schema is text
   [junit4]   2> 703739 INFO  (coreLoadExecutor-1620-thread-1-processing-n:127.0.0.1:37662_btoh%2Fu) [n:127.0.0.1:37662_btoh%2Fu c:collection1   x:collection1] o.a.s.s.IndexSchema unique key field: id
   [junit4]   2> 703744 INFO  (coreLoadExecutor-1620-thread-1-processing-n:127.0.0.1:37662_btoh%2Fu) [n:127.0.0.1:37662_btoh%2Fu c:collection1   x:collection1] o.a.s.s.FileExchangeRateProvider Reloading exchange rates from file currency.xml
   [junit4]   2> 703746 INFO  (coreLoadExecutor-1620-thread-1-processing-n:127.0.0.1:37662_btoh%2Fu) [n:127.0.0.1:37662_btoh%2Fu c:collection1   x:collection1] o.a.s.s.FileExchangeRateProvider Reloading exchange rates from file currency.xml
   [junit4]   2> 703747 INFO  (coreLoadExecutor-1620-thread-1-processing-n:127.0.0.1:37662_btoh%2Fu) [n:127.0.0.1:37662_btoh%2Fu c:collection1   x:collection1] o.a.s.s.OpenExchangeRatesOrgProvider Reloading exchange rates from open-exchange-rates.json
   [junit4]   2> 703747 INFO  (coreLoadExecutor-1620-thread-1-processing-n:127.0.0.1:37662_btoh%2Fu) [n:127.0.0.1:37662_btoh%2Fu c:collection1   x:collection1] o.a.s.s.OpenExchangeRatesOrgProvider Reloading exchange rates from open-exchange-rates.json
   [junit4]   2> 703748 INFO  (coreLoadExecutor-1620-thread-1-processing-n:127.0.0.1:37662_btoh%2Fu) [n:127.0.0.1:37662_btoh%2Fu c:collection1   x:collection1] o.a.s.c.ConfigSetProperties Did not find ConfigSet properties, assuming default properties: Can't find resource 'configsetprops.json' in classpath or '/configs/conf1', cwd=/home/jenkins/workspace/Lucene-Solr-5.x-Linux/solr/build/solr-core/test/J2
   [junit4]   2> 703748 INFO  (coreLoadExecutor-1620-thread-1-processing-n:127.0.0.1:37662_btoh%2Fu) [n:127.0.0.1:37662_btoh%2Fu c:collection1   x:collection1] o.a.s.c.CoreContainer Creating SolrCore 'collection1' using configuration from collection collection1
   [junit4]   2> 703748 INFO  (coreLoadExecutor-1620-thread-1-processing-n:127.0.0.1:37662_btoh%2Fu) [n:127.0.0.1:37662_btoh%2Fu c:collection1 s:shard1 r:core_node1 x:collection1] o.a.s.c.SolrCore org.apache.solr.core.MockDirectoryFactory
   [junit4]   2> 703749 INFO  (coreLoadExecutor-1620-thread-1-processing-n:127.0.0.1:37662_btoh%2Fu) [n:127.0.0.1:37662_btoh%2Fu c:collection1 s:shard1 r:core_node1 x:collection1] o.a.

[...truncated too long message...]

/cores/collection1/data
   [junit4]   2> 754227 INFO  (zkCallback-466-thread-1-processing-n:127.0.0.1:33498_btoh%2Fu) [n:127.0.0.1:33498_btoh%2Fu c:collection1 s:shard2 r:core_node4 x:collection1] o.a.s.c.ShardLeaderElectionContextBase No version found for ephemeral leader parent node, won't remove previous leader registration.
   [junit4]   2> 754228 INFO  (zkCallback-466-thread-1-processing-n:127.0.0.1:33498_btoh%2Fu) [n:127.0.0.1:33498_btoh%2Fu c:collection1 s:shard2 r:core_node4 x:collection1] o.a.s.c.ElectionContext Canceling election /collections/collection1/leader_elect/shard2/election/95203636531298322-core_node4-n_0000000001
   [junit4]   2> 754228 WARN  (zkCallback-466-thread-1-processing-n:127.0.0.1:33498_btoh%2Fu) [n:127.0.0.1:33498_btoh%2Fu c:collection1 s:shard2 r:core_node4 x:collection1] o.a.s.c.LeaderElector 
   [junit4]   2> org.apache.zookeeper.KeeperException$SessionExpiredException: KeeperErrorCode = Session expired for /collections/collection1/leader_elect/shard2/election/95203636531298322-core_node4-n_0000000001
   [junit4]   2> 	at org.apache.zookeeper.KeeperException.create(KeeperException.java:127)
   [junit4]   2> 	at org.apache.zookeeper.KeeperException.create(KeeperException.java:51)
   [junit4]   2> 	at org.apache.zookeeper.ZooKeeper.delete(ZooKeeper.java:873)
   [junit4]   2> 	at org.apache.solr.common.cloud.SolrZkClient$2.execute(SolrZkClient.java:244)
   [junit4]   2> 	at org.apache.solr.common.cloud.SolrZkClient$2.execute(SolrZkClient.java:241)
   [junit4]   2> 	at org.apache.solr.common.cloud.ZkCmdExecutor.retryOperation(ZkCmdExecutor.java:61)
   [junit4]   2> 	at org.apache.solr.common.cloud.SolrZkClient.delete(SolrZkClient.java:241)
   [junit4]   2> 	at org.apache.solr.cloud.ElectionContext.cancelElection(ElectionContext.java:87)
   [junit4]   2> 	at org.apache.solr.cloud.ShardLeaderElectionContextBase.cancelElection(ElectionContext.java:167)
   [junit4]   2> 	at org.apache.solr.cloud.ShardLeaderElectionContext.cancelElection(ElectionContext.java:269)
   [junit4]   2> 	at org.apache.solr.cloud.ShardLeaderElectionContext.runLeaderProcess(ElectionContext.java:445)
   [junit4]   2> 	at org.apache.solr.cloud.LeaderElector.runIamLeaderProcess(LeaderElector.java:198)
   [junit4]   2> 	at org.apache.solr.cloud.LeaderElector.checkIfIamLeader(LeaderElector.java:158)
   [junit4]   2> 	at org.apache.solr.cloud.LeaderElector.access$200(LeaderElector.java:59)
   [junit4]   2> 	at org.apache.solr.cloud.LeaderElector$ElectionWatcher.process(LeaderElector.java:389)
   [junit4]   2> 	at org.apache.solr.common.cloud.SolrZkClient$3$1.run(SolrZkClient.java:264)
   [junit4]   2> 	at java.util.concurrent.Executors$RunnableAdapter.call(Executors.java:471)
   [junit4]   2> 	at java.util.concurrent.FutureTask.run(FutureTask.java:262)
   [junit4]   2> 	at org.apache.solr.common.util.ExecutorUtil$MDCAwareThreadPoolExecutor$1.run(ExecutorUtil.java:232)
   [junit4]   2> 	at java.util.concurrent.ThreadPoolExecutor.runWorker(ThreadPoolExecutor.java:1145)
   [junit4]   2> 	at java.util.concurrent.ThreadPoolExecutor$Worker.run(ThreadPoolExecutor.java:615)
   [junit4]   2> 	at java.lang.Thread.run(Thread.java:745)
   [junit4]   2> 755722 WARN  (zkCallback-466-thread-3-processing-n:127.0.0.1:33498_btoh%2Fu) [n:127.0.0.1:33498_btoh%2Fu    ] o.a.s.c.c.ZkStateReader ZooKeeper watch triggered, but Solr cannot talk to ZK: [KeeperErrorCode = Session expired for /live_nodes]
   [junit4]   2> 755724 INFO  (TEST-TestDynamicLoading.testDynamicLoading-seed#[29057B3087694A32]) [    ] o.e.j.s.ServerConnector Stopped ServerConnector@10dfc5be{HTTP/1.1}{127.0.0.1:0}
   [junit4]   2> 755725 INFO  (TEST-TestDynamicLoading.testDynamicLoading-seed#[29057B3087694A32]) [    ] o.e.j.s.h.ContextHandler Stopped o.e.j.s.ServletContextHandler@6c6d3fec{/btoh/u,null,UNAVAILABLE}
   [junit4]   2> 755726 INFO  (TEST-TestDynamicLoading.testDynamicLoading-seed#[29057B3087694A32]) [n:127.0.0.1:33498_btoh%2Fu c:.system s:shard1 r:core_node2 x:.system_shard1_replica1] o.a.s.c.ZkTestServer connecting to 127.0.0.1:35861 35861
   [junit4]   2> 756018 INFO  (Thread-1242) [    ] o.a.s.c.ZkTestServer connecting to 127.0.0.1:35861 35861
   [junit4]   2> 756019 WARN  (Thread-1242) [    ] o.a.s.c.ZkTestServer Watch limit violations: 
   [junit4]   2> Maximum concurrent create/delete watches above limit:
   [junit4]   2> 
   [junit4]   2> 	40	/solr/configs/conf1
   [junit4]   2> 	6	/solr/aliases.json
   [junit4]   2> 	5	/solr/security.json
   [junit4]   2> 	2	/solr/configs/.system
   [junit4]   2> 
   [junit4]   2> Maximum concurrent data watches above limit:
   [junit4]   2> 
   [junit4]   2> 	6	/solr/clusterstate.json
   [junit4]   2> 	4	/solr/collections/collection1/state.json
   [junit4]   2> 	2	/solr/collections/.system/state.json
   [junit4]   2> 
   [junit4]   2> Maximum concurrent children watches above limit:
   [junit4]   2> 
   [junit4]   2> 	6	/solr/live_nodes
   [junit4]   2> 	6	/solr/collections
   [junit4]   2> 	5	/solr/overseer/collection-queue-work
   [junit4]   2> 	4	/solr/overseer/queue
   [junit4]   2> 	2	/solr/overseer/queue-work
   [junit4]   2> 
   [junit4]   2> NOTE: reproduce with: ant test  -Dtestcase=TestDynamicLoading -Dtests.method=testDynamicLoading -Dtests.seed=29057B3087694A32 -Dtests.multiplier=3 -Dtests.slow=true -Dtests.locale=fr_BE -Dtests.timezone=US/Samoa -Dtests.asserts=true -Dtests.file.encoding=UTF-8
   [junit4] FAILURE 56.5s J2 | TestDynamicLoading.testDynamicLoading <<<
   [junit4]    > Throwable #1: java.lang.AssertionError: Could not get expected value  'X val changed' for path 'x' full output: {
   [junit4]    >   "responseHeader":{
   [junit4]    >     "status":0,
   [junit4]    >     "QTime":0},
   [junit4]    >   "params":{"wt":"json"},
   [junit4]    >   "context":{
   [junit4]    >     "webapp":"/btoh/u",
   [junit4]    >     "path":"/test1",
   [junit4]    >     "httpMethod":"GET"},
   [junit4]    >   "class":"org.apache.solr.core.BlobStoreTestRequestHandler",
   [junit4]    >   "x":"X val"}
   [junit4]    > 	at __randomizedtesting.SeedInfo.seed([29057B3087694A32:F148566770B4EF92]:0)
   [junit4]    > 	at org.apache.solr.core.TestSolrConfigHandler.testForResponseElement(TestSolrConfigHandler.java:458)
   [junit4]    > 	at org.apache.solr.core.TestDynamicLoading.testDynamicLoading(TestDynamicLoading.java:257)
   [junit4]    > 	at org.apache.solr.BaseDistributedSearchTestCase$ShardsRepeatRule$ShardsFixedStatement.callStatement(BaseDistributedSearchTestCase.java:965)
   [junit4]    > 	at org.apache.solr.BaseDistributedSearchTestCase$ShardsRepeatRule$ShardsStatement.evaluate(BaseDistributedSearchTestCase.java:940)
   [junit4]    > 	at java.lang.Thread.run(Thread.java:745)
   [junit4]   2> 756022 INFO  (SUITE-TestDynamicLoading-seed#[29057B3087694A32]-worker) [n:127.0.0.1:33498_btoh%2Fu c:.system s:shard1 r:core_node2 x:.system_shard1_replica1] o.a.s.SolrTestCaseJ4 ###deleteCore
   [junit4]   2> NOTE: leaving temporary files on disk at: /home/jenkins/workspace/Lucene-Solr-5.x-Linux/solr/build/solr-core/test/J2/temp/solr.core.TestDynamicLoading_29057B3087694A32-001
   [junit4]   2> NOTE: test params are: codec=CheapBastard, sim=DefaultSimilarity, locale=fr_BE, timezone=US/Samoa
   [junit4]   2> NOTE: Linux 3.19.0-42-generic amd64/Oracle Corporation 1.7.0_80 (64-bit)/cpus=12,threads=1,free=278108392,total=505413632
   [junit4]   2> NOTE: All tests run in this JVM: [TestSearcherReuse, TestRawResponseWriter, TestConfigSetImmutable, PrimitiveFieldTypeTest, MigrateRouteKeyTest, HdfsCollectionsAPIDistributedZkTest, TestHighFrequencyDictionaryFactory, TestJmxIntegration, SparseHLLTest, CurrencyFieldXmlFileTest, ResponseHeaderTest, XmlUpdateRequestHandlerTest, BasicAuthIntegrationTest, OverseerStatusTest, TestJmxMonitoredMap, TestSolrDeletionPolicy1, TestDocBasedVersionConstraints, DocValuesMultiTest, CoreAdminHandlerTest, TestSort, TestRestoreCore, TestCopyFieldCollectionResource, TriLevelCompositeIdRoutingTest, OverseerTest, TestXIncludeConfig, TestMinMaxOnMultiValuedField, FieldAnalysisRequestHandlerTest, TestStressReorder, InfoHandlerTest, TestIndexSearcher, TestPostingsSolrHighlighter, ShardSplitTest, TestExactSharedStatsCache, SuggestComponentContextFilterQueryTest, LukeRequestHandlerTest, TestOverriddenPrefixQueryForCustomFieldType, SimpleCollectionCreateDeleteTest, TestExpandComponent, CleanupOldIndexTest, TestStressRecovery, RegexBoostProcessorTest, TestPerFieldSimilarity, TestDynamicFieldResource, JavabinLoaderTest, TestJsonRequest, UnloadDistributedZkTest, QueryParsingTest, BadComponentTest, DateMathParserTest, SpatialRPTFieldTypeTest, TestIndexingPerformance, TestTolerantSearch, TestDynamicLoading]
   [junit4] Completed [210/564 (1!)] on J2 in 56.51s, 1 test, 1 failure <<< FAILURES!

[...truncated 1123 lines...]
BUILD FAILED
/home/jenkins/workspace/Lucene-Solr-5.x-Linux/build.xml:794: The following error occurred while executing this line:
/home/jenkins/workspace/Lucene-Solr-5.x-Linux/build.xml:738: The following error occurred while executing this line:
/home/jenkins/workspace/Lucene-Solr-5.x-Linux/build.xml:59: The following error occurred while executing this line:
/home/jenkins/workspace/Lucene-Solr-5.x-Linux/solr/build.xml:233: The following error occurred while executing this line:
/home/jenkins/workspace/Lucene-Solr-5.x-Linux/solr/common-build.xml:532: The following error occurred while executing this line:
/home/jenkins/workspace/Lucene-Solr-5.x-Linux/lucene/common-build.xml:1444: The following error occurred while executing this line:
/home/jenkins/workspace/Lucene-Solr-5.x-Linux/lucene/common-build.xml:1000: There were test failures: 564 suites (7 ignored), 2253 tests, 1 failure, 83 ignored (39 assumptions) [seed: 29057B3087694A32]

Total time: 55 minutes 23 seconds
Build step 'Invoke Ant' marked build as failure
Archiving artifacts
[WARNINGS] Skipping publisher since build result is FAILURE
Recording test results
Email was triggered for: Failure - Any
Sending email for trigger: Failure - Any



Mime
View raw message