lucene-dev mailing list archives

Site index · List index
Message view « Date » · « Thread »
Top « Date » · « Thread »
From Policeman Jenkins Server <jenk...@thetaphi.de>
Subject [JENKINS] Lucene-Solr-trunk-Linux (32bit/jdk1.8.0_66) - Build # 15672 - Failure!
Date Wed, 27 Jan 2016 13:33:25 GMT
Build: http://jenkins.thetaphi.de/job/Lucene-Solr-trunk-Linux/15672/
Java: 32bit/jdk1.8.0_66 -client -XX:+UseParallelGC

1 tests failed.
FAILED:  org.apache.solr.cloud.DistribDocExpirationUpdateProcessorTest.test

Error Message:
Exactly one shard should have changed, instead: [shard2, shard1] nodes=([core_node3(shard2), core_node2(shard1), core_node4(shard1)]) expected:<1> but was:<2>

Stack Trace:
java.lang.AssertionError: Exactly one shard should have changed, instead: [shard2, shard1] nodes=([core_node3(shard2), core_node2(shard1), core_node4(shard1)]) expected:<1> but was:<2>
	at __randomizedtesting.SeedInfo.seed([ACE55CC4219844FB:24B1631E8F642903]:0)
	at org.junit.Assert.fail(Assert.java:93)
	at org.junit.Assert.failNotEquals(Assert.java:647)
	at org.junit.Assert.assertEquals(Assert.java:128)
	at org.junit.Assert.assertEquals(Assert.java:472)
	at org.apache.solr.cloud.DistribDocExpirationUpdateProcessorTest.test(DistribDocExpirationUpdateProcessorTest.java:118)
	at sun.reflect.NativeMethodAccessorImpl.invoke0(Native Method)
	at sun.reflect.NativeMethodAccessorImpl.invoke(NativeMethodAccessorImpl.java:62)
	at sun.reflect.DelegatingMethodAccessorImpl.invoke(DelegatingMethodAccessorImpl.java:43)
	at java.lang.reflect.Method.invoke(Method.java:497)
	at com.carrotsearch.randomizedtesting.RandomizedRunner.invoke(RandomizedRunner.java:1764)
	at com.carrotsearch.randomizedtesting.RandomizedRunner$8.evaluate(RandomizedRunner.java:871)
	at com.carrotsearch.randomizedtesting.RandomizedRunner$9.evaluate(RandomizedRunner.java:907)
	at com.carrotsearch.randomizedtesting.RandomizedRunner$10.evaluate(RandomizedRunner.java:921)
	at org.apache.solr.BaseDistributedSearchTestCase$ShardsRepeatRule$ShardsFixedStatement.callStatement(BaseDistributedSearchTestCase.java:965)
	at org.apache.solr.BaseDistributedSearchTestCase$ShardsRepeatRule$ShardsStatement.evaluate(BaseDistributedSearchTestCase.java:940)
	at com.carrotsearch.randomizedtesting.rules.SystemPropertiesRestoreRule$1.evaluate(SystemPropertiesRestoreRule.java:57)
	at org.apache.lucene.util.TestRuleSetupTeardownChained$1.evaluate(TestRuleSetupTeardownChained.java:50)
	at org.apache.lucene.util.AbstractBeforeAfterRule$1.evaluate(AbstractBeforeAfterRule.java:46)
	at org.apache.lucene.util.TestRuleThreadAndTestName$1.evaluate(TestRuleThreadAndTestName.java:49)
	at org.apache.lucene.util.TestRuleIgnoreAfterMaxFailures$1.evaluate(TestRuleIgnoreAfterMaxFailures.java:65)
	at org.apache.lucene.util.TestRuleMarkFailure$1.evaluate(TestRuleMarkFailure.java:48)
	at com.carrotsearch.randomizedtesting.rules.StatementAdapter.evaluate(StatementAdapter.java:36)
	at com.carrotsearch.randomizedtesting.ThreadLeakControl$StatementRunner.run(ThreadLeakControl.java:367)
	at com.carrotsearch.randomizedtesting.ThreadLeakControl.forkTimeoutingTask(ThreadLeakControl.java:809)
	at com.carrotsearch.randomizedtesting.ThreadLeakControl$3.evaluate(ThreadLeakControl.java:460)
	at com.carrotsearch.randomizedtesting.RandomizedRunner.runSingleTest(RandomizedRunner.java:880)
	at com.carrotsearch.randomizedtesting.RandomizedRunner$5.evaluate(RandomizedRunner.java:781)
	at com.carrotsearch.randomizedtesting.RandomizedRunner$6.evaluate(RandomizedRunner.java:816)
	at com.carrotsearch.randomizedtesting.RandomizedRunner$7.evaluate(RandomizedRunner.java:827)
	at com.carrotsearch.randomizedtesting.rules.StatementAdapter.evaluate(StatementAdapter.java:36)
	at com.carrotsearch.randomizedtesting.rules.SystemPropertiesRestoreRule$1.evaluate(SystemPropertiesRestoreRule.java:57)
	at org.apache.lucene.util.AbstractBeforeAfterRule$1.evaluate(AbstractBeforeAfterRule.java:46)
	at com.carrotsearch.randomizedtesting.rules.StatementAdapter.evaluate(StatementAdapter.java:36)
	at org.apache.lucene.util.TestRuleStoreClassName$1.evaluate(TestRuleStoreClassName.java:42)
	at com.carrotsearch.randomizedtesting.rules.NoShadowingOrOverridesOnMethodsRule$1.evaluate(NoShadowingOrOverridesOnMethodsRule.java:40)
	at com.carrotsearch.randomizedtesting.rules.NoShadowingOrOverridesOnMethodsRule$1.evaluate(NoShadowingOrOverridesOnMethodsRule.java:40)
	at com.carrotsearch.randomizedtesting.rules.StatementAdapter.evaluate(StatementAdapter.java:36)
	at com.carrotsearch.randomizedtesting.rules.StatementAdapter.evaluate(StatementAdapter.java:36)
	at com.carrotsearch.randomizedtesting.rules.StatementAdapter.evaluate(StatementAdapter.java:36)
	at org.apache.lucene.util.TestRuleAssertionsRequired$1.evaluate(TestRuleAssertionsRequired.java:54)
	at org.apache.lucene.util.TestRuleMarkFailure$1.evaluate(TestRuleMarkFailure.java:48)
	at org.apache.lucene.util.TestRuleIgnoreAfterMaxFailures$1.evaluate(TestRuleIgnoreAfterMaxFailures.java:65)
	at org.apache.lucene.util.TestRuleIgnoreTestSuites$1.evaluate(TestRuleIgnoreTestSuites.java:55)
	at com.carrotsearch.randomizedtesting.rules.StatementAdapter.evaluate(StatementAdapter.java:36)
	at com.carrotsearch.randomizedtesting.ThreadLeakControl$StatementRunner.run(ThreadLeakControl.java:367)
	at java.lang.Thread.run(Thread.java:745)




Build Log:
[...truncated 11019 lines...]
   [junit4] Suite: org.apache.solr.cloud.DistribDocExpirationUpdateProcessorTest
   [junit4]   2> Creating dataDir: /home/jenkins/workspace/Lucene-Solr-trunk-Linux/solr/build/solr-core/test/J2/temp/solr.cloud.DistribDocExpirationUpdateProcessorTest_ACE55CC4219844FB-001/init-core-data-001
   [junit4]   2> 896459 INFO  (SUITE-DistribDocExpirationUpdateProcessorTest-seed#[ACE55CC4219844FB]-worker) [    ] o.a.s.SolrTestCaseJ4 Randomized ssl (false) and clientAuth (true)
   [junit4]   2> 896459 INFO  (SUITE-DistribDocExpirationUpdateProcessorTest-seed#[ACE55CC4219844FB]-worker) [    ] o.a.s.BaseDistributedSearchTestCase Setting hostContext system property: /
   [junit4]   2> 896462 INFO  (TEST-DistribDocExpirationUpdateProcessorTest.test-seed#[ACE55CC4219844FB]) [    ] o.a.s.c.ZkTestServer STARTING ZK TEST SERVER
   [junit4]   2> 896463 INFO  (Thread-2223) [    ] o.a.s.c.ZkTestServer client port:0.0.0.0/0.0.0.0:0
   [junit4]   2> 896463 INFO  (Thread-2223) [    ] o.a.s.c.ZkTestServer Starting server
   [junit4]   2> 896563 INFO  (TEST-DistribDocExpirationUpdateProcessorTest.test-seed#[ACE55CC4219844FB]) [    ] o.a.s.c.ZkTestServer start zk server on port:46705
   [junit4]   2> 896563 INFO  (TEST-DistribDocExpirationUpdateProcessorTest.test-seed#[ACE55CC4219844FB]) [    ] o.a.s.c.c.SolrZkClient Using default ZkCredentialsProvider
   [junit4]   2> 896563 INFO  (TEST-DistribDocExpirationUpdateProcessorTest.test-seed#[ACE55CC4219844FB]) [    ] o.a.s.c.c.ConnectionManager Waiting for client to connect to ZooKeeper
   [junit4]   2> 896566 INFO  (zkCallback-775-thread-1) [    ] o.a.s.c.c.ConnectionManager Watcher org.apache.solr.common.cloud.ConnectionManager@1c7a62e name:ZooKeeperConnection Watcher:127.0.0.1:46705 got event WatchedEvent state:SyncConnected type:None path:null path:null type:None
   [junit4]   2> 896566 INFO  (TEST-DistribDocExpirationUpdateProcessorTest.test-seed#[ACE55CC4219844FB]) [    ] o.a.s.c.c.ConnectionManager Client is connected to ZooKeeper
   [junit4]   2> 896566 INFO  (TEST-DistribDocExpirationUpdateProcessorTest.test-seed#[ACE55CC4219844FB]) [    ] o.a.s.c.c.SolrZkClient Using default ZkACLProvider
   [junit4]   2> 896566 INFO  (TEST-DistribDocExpirationUpdateProcessorTest.test-seed#[ACE55CC4219844FB]) [    ] o.a.s.c.c.SolrZkClient makePath: /solr
   [junit4]   2> 896568 INFO  (TEST-DistribDocExpirationUpdateProcessorTest.test-seed#[ACE55CC4219844FB]) [    ] o.a.s.c.c.SolrZkClient Using default ZkCredentialsProvider
   [junit4]   2> 896569 INFO  (TEST-DistribDocExpirationUpdateProcessorTest.test-seed#[ACE55CC4219844FB]) [    ] o.a.s.c.c.ConnectionManager Waiting for client to connect to ZooKeeper
   [junit4]   2> 896570 INFO  (zkCallback-776-thread-1) [    ] o.a.s.c.c.ConnectionManager Watcher org.apache.solr.common.cloud.ConnectionManager@17737e4 name:ZooKeeperConnection Watcher:127.0.0.1:46705/solr got event WatchedEvent state:SyncConnected type:None path:null path:null type:None
   [junit4]   2> 896570 INFO  (TEST-DistribDocExpirationUpdateProcessorTest.test-seed#[ACE55CC4219844FB]) [    ] o.a.s.c.c.ConnectionManager Client is connected to ZooKeeper
   [junit4]   2> 896570 INFO  (TEST-DistribDocExpirationUpdateProcessorTest.test-seed#[ACE55CC4219844FB]) [    ] o.a.s.c.c.SolrZkClient Using default ZkACLProvider
   [junit4]   2> 896571 INFO  (TEST-DistribDocExpirationUpdateProcessorTest.test-seed#[ACE55CC4219844FB]) [    ] o.a.s.c.c.SolrZkClient makePath: /collections/collection1
   [junit4]   2> 896572 INFO  (TEST-DistribDocExpirationUpdateProcessorTest.test-seed#[ACE55CC4219844FB]) [    ] o.a.s.c.c.SolrZkClient makePath: /collections/collection1/shards
   [junit4]   2> 896573 INFO  (TEST-DistribDocExpirationUpdateProcessorTest.test-seed#[ACE55CC4219844FB]) [    ] o.a.s.c.c.SolrZkClient makePath: /collections/control_collection
   [junit4]   2> 896574 INFO  (TEST-DistribDocExpirationUpdateProcessorTest.test-seed#[ACE55CC4219844FB]) [    ] o.a.s.c.c.SolrZkClient makePath: /collections/control_collection/shards
   [junit4]   2> 896575 INFO  (TEST-DistribDocExpirationUpdateProcessorTest.test-seed#[ACE55CC4219844FB]) [    ] o.a.s.c.AbstractZkTestCase put /home/jenkins/workspace/Lucene-Solr-trunk-Linux/solr/core/src/test-files/solr/collection1/conf/solrconfig-doc-expire-update-processor.xml to /configs/conf1/solrconfig.xml
   [junit4]   2> 896575 INFO  (TEST-DistribDocExpirationUpdateProcessorTest.test-seed#[ACE55CC4219844FB]) [    ] o.a.s.c.c.SolrZkClient makePath: /configs/conf1/solrconfig.xml
   [junit4]   2> 896576 INFO  (TEST-DistribDocExpirationUpdateProcessorTest.test-seed#[ACE55CC4219844FB]) [    ] o.a.s.c.AbstractZkTestCase put /home/jenkins/workspace/Lucene-Solr-trunk-Linux/solr/core/src/test-files/solr/collection1/conf/schema15.xml to /configs/conf1/schema.xml
   [junit4]   2> 896576 INFO  (TEST-DistribDocExpirationUpdateProcessorTest.test-seed#[ACE55CC4219844FB]) [    ] o.a.s.c.c.SolrZkClient makePath: /configs/conf1/schema.xml
   [junit4]   2> 896578 INFO  (TEST-DistribDocExpirationUpdateProcessorTest.test-seed#[ACE55CC4219844FB]) [    ] o.a.s.c.AbstractZkTestCase put /home/jenkins/workspace/Lucene-Solr-trunk-Linux/solr/core/src/test-files/solr/collection1/conf/solrconfig.snippet.randomindexconfig.xml to /configs/conf1/solrconfig.snippet.randomindexconfig.xml
   [junit4]   2> 896578 INFO  (TEST-DistribDocExpirationUpdateProcessorTest.test-seed#[ACE55CC4219844FB]) [    ] o.a.s.c.c.SolrZkClient makePath: /configs/conf1/solrconfig.snippet.randomindexconfig.xml
   [junit4]   2> 896578 INFO  (TEST-DistribDocExpirationUpdateProcessorTest.test-seed#[ACE55CC4219844FB]) [    ] o.a.s.c.AbstractZkTestCase put /home/jenkins/workspace/Lucene-Solr-trunk-Linux/solr/core/src/test-files/solr/collection1/conf/stopwords.txt to /configs/conf1/stopwords.txt
   [junit4]   2> 896579 INFO  (TEST-DistribDocExpirationUpdateProcessorTest.test-seed#[ACE55CC4219844FB]) [    ] o.a.s.c.c.SolrZkClient makePath: /configs/conf1/stopwords.txt
   [junit4]   2> 896579 INFO  (TEST-DistribDocExpirationUpdateProcessorTest.test-seed#[ACE55CC4219844FB]) [    ] o.a.s.c.AbstractZkTestCase put /home/jenkins/workspace/Lucene-Solr-trunk-Linux/solr/core/src/test-files/solr/collection1/conf/protwords.txt to /configs/conf1/protwords.txt
   [junit4]   2> 896580 INFO  (TEST-DistribDocExpirationUpdateProcessorTest.test-seed#[ACE55CC4219844FB]) [    ] o.a.s.c.c.SolrZkClient makePath: /configs/conf1/protwords.txt
   [junit4]   2> 896581 INFO  (TEST-DistribDocExpirationUpdateProcessorTest.test-seed#[ACE55CC4219844FB]) [    ] o.a.s.c.AbstractZkTestCase put /home/jenkins/workspace/Lucene-Solr-trunk-Linux/solr/core/src/test-files/solr/collection1/conf/currency.xml to /configs/conf1/currency.xml
   [junit4]   2> 896581 INFO  (TEST-DistribDocExpirationUpdateProcessorTest.test-seed#[ACE55CC4219844FB]) [    ] o.a.s.c.c.SolrZkClient makePath: /configs/conf1/currency.xml
   [junit4]   2> 896582 INFO  (TEST-DistribDocExpirationUpdateProcessorTest.test-seed#[ACE55CC4219844FB]) [    ] o.a.s.c.AbstractZkTestCase put /home/jenkins/workspace/Lucene-Solr-trunk-Linux/solr/core/src/test-files/solr/collection1/conf/enumsConfig.xml to /configs/conf1/enumsConfig.xml
   [junit4]   2> 896582 INFO  (TEST-DistribDocExpirationUpdateProcessorTest.test-seed#[ACE55CC4219844FB]) [    ] o.a.s.c.c.SolrZkClient makePath: /configs/conf1/enumsConfig.xml
   [junit4]   2> 896583 INFO  (TEST-DistribDocExpirationUpdateProcessorTest.test-seed#[ACE55CC4219844FB]) [    ] o.a.s.c.AbstractZkTestCase put /home/jenkins/workspace/Lucene-Solr-trunk-Linux/solr/core/src/test-files/solr/collection1/conf/open-exchange-rates.json to /configs/conf1/open-exchange-rates.json
   [junit4]   2> 896583 INFO  (TEST-DistribDocExpirationUpdateProcessorTest.test-seed#[ACE55CC4219844FB]) [    ] o.a.s.c.c.SolrZkClient makePath: /configs/conf1/open-exchange-rates.json
   [junit4]   2> 896584 INFO  (TEST-DistribDocExpirationUpdateProcessorTest.test-seed#[ACE55CC4219844FB]) [    ] o.a.s.c.AbstractZkTestCase put /home/jenkins/workspace/Lucene-Solr-trunk-Linux/solr/core/src/test-files/solr/collection1/conf/mapping-ISOLatin1Accent.txt to /configs/conf1/mapping-ISOLatin1Accent.txt
   [junit4]   2> 896585 INFO  (TEST-DistribDocExpirationUpdateProcessorTest.test-seed#[ACE55CC4219844FB]) [    ] o.a.s.c.c.SolrZkClient makePath: /configs/conf1/mapping-ISOLatin1Accent.txt
   [junit4]   2> 896585 INFO  (TEST-DistribDocExpirationUpdateProcessorTest.test-seed#[ACE55CC4219844FB]) [    ] o.a.s.c.AbstractZkTestCase put /home/jenkins/workspace/Lucene-Solr-trunk-Linux/solr/core/src/test-files/solr/collection1/conf/old_synonyms.txt to /configs/conf1/old_synonyms.txt
   [junit4]   2> 896586 INFO  (TEST-DistribDocExpirationUpdateProcessorTest.test-seed#[ACE55CC4219844FB]) [    ] o.a.s.c.c.SolrZkClient makePath: /configs/conf1/old_synonyms.txt
   [junit4]   2> 896587 INFO  (TEST-DistribDocExpirationUpdateProcessorTest.test-seed#[ACE55CC4219844FB]) [    ] o.a.s.c.AbstractZkTestCase put /home/jenkins/workspace/Lucene-Solr-trunk-Linux/solr/core/src/test-files/solr/collection1/conf/synonyms.txt to /configs/conf1/synonyms.txt
   [junit4]   2> 896587 INFO  (TEST-DistribDocExpirationUpdateProcessorTest.test-seed#[ACE55CC4219844FB]) [    ] o.a.s.c.c.SolrZkClient makePath: /configs/conf1/synonyms.txt
   [junit4]   2> 896651 INFO  (TEST-DistribDocExpirationUpdateProcessorTest.test-seed#[ACE55CC4219844FB]) [    ] o.a.s.SolrTestCaseJ4 Writing core.properties file to /home/jenkins/workspace/Lucene-Solr-trunk-Linux/solr/build/solr-core/test/J2/temp/solr.cloud.DistribDocExpirationUpdateProcessorTest_ACE55CC4219844FB-001/control-001/cores/collection1
   [junit4]   2> 896652 INFO  (TEST-DistribDocExpirationUpdateProcessorTest.test-seed#[ACE55CC4219844FB]) [    ] o.e.j.s.Server jetty-9.2.13.v20150730
   [junit4]   2> 896653 INFO  (TEST-DistribDocExpirationUpdateProcessorTest.test-seed#[ACE55CC4219844FB]) [    ] o.e.j.s.h.ContextHandler Started o.e.j.s.ServletContextHandler@168f23{/,null,AVAILABLE}
   [junit4]   2> 896654 INFO  (TEST-DistribDocExpirationUpdateProcessorTest.test-seed#[ACE55CC4219844FB]) [    ] o.e.j.s.ServerConnector Started ServerConnector@18f1508{HTTP/1.1}{127.0.0.1:46802}
   [junit4]   2> 896654 INFO  (TEST-DistribDocExpirationUpdateProcessorTest.test-seed#[ACE55CC4219844FB]) [    ] o.e.j.s.Server Started @897923ms
   [junit4]   2> 896654 INFO  (TEST-DistribDocExpirationUpdateProcessorTest.test-seed#[ACE55CC4219844FB]) [    ] o.a.s.c.s.e.JettySolrRunner Jetty properties: {solr.data.dir=/home/jenkins/workspace/Lucene-Solr-trunk-Linux/solr/build/solr-core/test/J2/temp/solr.cloud.DistribDocExpirationUpdateProcessorTest_ACE55CC4219844FB-001/tempDir-001/control/data, hostContext=/, hostPort=46802, coreRootDirectory=/home/jenkins/workspace/Lucene-Solr-trunk-Linux/solr/build/solr-core/test/J2/temp/solr.cloud.DistribDocExpirationUpdateProcessorTest_ACE55CC4219844FB-001/control-001/cores}
   [junit4]   2> 896655 INFO  (TEST-DistribDocExpirationUpdateProcessorTest.test-seed#[ACE55CC4219844FB]) [    ] o.a.s.s.SolrDispatchFilter SolrDispatchFilter.init(): sun.misc.Launcher$AppClassLoader@e2f2a
   [junit4]   2> 896655 INFO  (TEST-DistribDocExpirationUpdateProcessorTest.test-seed#[ACE55CC4219844FB]) [    ] o.a.s.c.SolrResourceLoader new SolrResourceLoader for directory: '/home/jenkins/workspace/Lucene-Solr-trunk-Linux/solr/build/solr-core/test/J2/temp/solr.cloud.DistribDocExpirationUpdateProcessorTest_ACE55CC4219844FB-001/control-001'
   [junit4]   2> 896655 INFO  (TEST-DistribDocExpirationUpdateProcessorTest.test-seed#[ACE55CC4219844FB]) [    ] o.a.s.c.SolrResourceLoader JNDI not configured for solr (NoInitialContextEx)
   [junit4]   2> 896655 INFO  (TEST-DistribDocExpirationUpdateProcessorTest.test-seed#[ACE55CC4219844FB]) [    ] o.a.s.c.SolrResourceLoader solr home defaulted to 'solr/' (could not find system property or JNDI)
   [junit4]   2> 896655 INFO  (TEST-DistribDocExpirationUpdateProcessorTest.test-seed#[ACE55CC4219844FB]) [    ] o.a.s.c.c.SolrZkClient Using default ZkCredentialsProvider
   [junit4]   2> 896656 INFO  (TEST-DistribDocExpirationUpdateProcessorTest.test-seed#[ACE55CC4219844FB]) [    ] o.a.s.c.c.ConnectionManager Waiting for client to connect to ZooKeeper
   [junit4]   2> 896657 INFO  (zkCallback-777-thread-1) [    ] o.a.s.c.c.ConnectionManager Watcher org.apache.solr.common.cloud.ConnectionManager@13d3781 name:ZooKeeperConnection Watcher:127.0.0.1:46705/solr got event WatchedEvent state:SyncConnected type:None path:null path:null type:None
   [junit4]   2> 896657 INFO  (TEST-DistribDocExpirationUpdateProcessorTest.test-seed#[ACE55CC4219844FB]) [    ] o.a.s.c.c.ConnectionManager Client is connected to ZooKeeper
   [junit4]   2> 896657 INFO  (TEST-DistribDocExpirationUpdateProcessorTest.test-seed#[ACE55CC4219844FB]) [    ] o.a.s.c.c.SolrZkClient Using default ZkACLProvider
   [junit4]   2> 896658 INFO  (TEST-DistribDocExpirationUpdateProcessorTest.test-seed#[ACE55CC4219844FB]) [    ] o.a.s.s.SolrDispatchFilter Loading solr.xml from SolrHome (not found in ZooKeeper)
   [junit4]   2> 896658 INFO  (TEST-DistribDocExpirationUpdateProcessorTest.test-seed#[ACE55CC4219844FB]) [    ] o.a.s.c.SolrXmlConfig Loading container configuration from /home/jenkins/workspace/Lucene-Solr-trunk-Linux/solr/build/solr-core/test/J2/temp/solr.cloud.DistribDocExpirationUpdateProcessorTest_ACE55CC4219844FB-001/control-001/solr.xml
   [junit4]   2> 896667 INFO  (TEST-DistribDocExpirationUpdateProcessorTest.test-seed#[ACE55CC4219844FB]) [    ] o.a.s.c.CorePropertiesLocator Config-defined core root directory: /home/jenkins/workspace/Lucene-Solr-trunk-Linux/solr/build/solr-core/test/J2/temp/solr.cloud.DistribDocExpirationUpdateProcessorTest_ACE55CC4219844FB-001/control-001/cores
   [junit4]   2> 896667 INFO  (TEST-DistribDocExpirationUpdateProcessorTest.test-seed#[ACE55CC4219844FB]) [    ] o.a.s.c.CoreContainer New CoreContainer 27248698
   [junit4]   2> 896667 INFO  (TEST-DistribDocExpirationUpdateProcessorTest.test-seed#[ACE55CC4219844FB]) [    ] o.a.s.c.CoreContainer Loading cores into CoreContainer [instanceDir=/home/jenkins/workspace/Lucene-Solr-trunk-Linux/solr/build/solr-core/test/J2/temp/solr.cloud.DistribDocExpirationUpdateProcessorTest_ACE55CC4219844FB-001/control-001]
   [junit4]   2> 896667 WARN  (TEST-DistribDocExpirationUpdateProcessorTest.test-seed#[ACE55CC4219844FB]) [    ] o.a.s.c.CoreContainer Couldn't add files from /home/jenkins/workspace/Lucene-Solr-trunk-Linux/solr/build/solr-core/test/J2/temp/solr.cloud.DistribDocExpirationUpdateProcessorTest_ACE55CC4219844FB-001/control-001/lib to classpath: /home/jenkins/workspace/Lucene-Solr-trunk-Linux/solr/build/solr-core/test/J2/temp/solr.cloud.DistribDocExpirationUpdateProcessorTest_ACE55CC4219844FB-001/control-001/lib
   [junit4]   2> 896667 INFO  (TEST-DistribDocExpirationUpdateProcessorTest.test-seed#[ACE55CC4219844FB]) [    ] o.a.s.h.c.HttpShardHandlerFactory created with socketTimeout : 90000,urlScheme : ,connTimeout : 15000,maxConnectionsPerHost : 20,maxConnections : 10000,corePoolSize : 0,maximumPoolSize : 2147483647,maxThreadIdleTime : 5,sizeOfQueue : -1,fairnessPolicy : false,useRetries : false,
   [junit4]   2> 896668 INFO  (TEST-DistribDocExpirationUpdateProcessorTest.test-seed#[ACE55CC4219844FB]) [    ] o.a.s.u.UpdateShardHandler Creating UpdateShardHandler HTTP client with params: socketTimeout=340000&connTimeout=45000&retry=true
   [junit4]   2> 896669 INFO  (TEST-DistribDocExpirationUpdateProcessorTest.test-seed#[ACE55CC4219844FB]) [    ] o.a.s.l.LogWatcher SLF4J impl is org.slf4j.impl.Log4jLoggerFactory
   [junit4]   2> 896669 INFO  (TEST-DistribDocExpirationUpdateProcessorTest.test-seed#[ACE55CC4219844FB]) [    ] o.a.s.l.LogWatcher Registering Log Listener [Log4j (org.slf4j.impl.Log4jLoggerFactory)]
   [junit4]   2> 896669 INFO  (TEST-DistribDocExpirationUpdateProcessorTest.test-seed#[ACE55CC4219844FB]) [    ] o.a.s.c.ZkContainer Zookeeper client=127.0.0.1:46705/solr
   [junit4]   2> 896669 INFO  (TEST-DistribDocExpirationUpdateProcessorTest.test-seed#[ACE55CC4219844FB]) [    ] o.a.s.c.ZkController zkHost includes chroot
   [junit4]   2> 896669 INFO  (TEST-DistribDocExpirationUpdateProcessorTest.test-seed#[ACE55CC4219844FB]) [    ] o.a.s.c.c.SolrZkClient Using default ZkCredentialsProvider
   [junit4]   2> 896670 INFO  (TEST-DistribDocExpirationUpdateProcessorTest.test-seed#[ACE55CC4219844FB]) [    ] o.a.s.c.c.ConnectionManager Waiting for client to connect to ZooKeeper
   [junit4]   2> 896671 INFO  (zkCallback-780-thread-1) [    ] o.a.s.c.c.ConnectionManager Watcher org.apache.solr.common.cloud.ConnectionManager@edd713 name:ZooKeeperConnection Watcher:127.0.0.1:46705 got event WatchedEvent state:SyncConnected type:None path:null path:null type:None
   [junit4]   2> 896671 INFO  (TEST-DistribDocExpirationUpdateProcessorTest.test-seed#[ACE55CC4219844FB]) [    ] o.a.s.c.c.ConnectionManager Client is connected to ZooKeeper
   [junit4]   2> 896671 INFO  (TEST-DistribDocExpirationUpdateProcessorTest.test-seed#[ACE55CC4219844FB]) [    ] o.a.s.c.c.SolrZkClient Using default ZkACLProvider
   [junit4]   2> 896673 INFO  (TEST-DistribDocExpirationUpdateProcessorTest.test-seed#[ACE55CC4219844FB]) [n:127.0.0.1:46802_    ] o.a.s.c.c.ConnectionManager Waiting for client to connect to ZooKeeper
   [junit4]   2> 896673 INFO  (zkCallback-781-thread-1-processing-n:127.0.0.1:46802_) [n:127.0.0.1:46802_    ] o.a.s.c.c.ConnectionManager Watcher org.apache.solr.common.cloud.ConnectionManager@cb4956 name:ZooKeeperConnection Watcher:127.0.0.1:46705/solr got event WatchedEvent state:SyncConnected type:None path:null path:null type:None
   [junit4]   2> 896673 INFO  (TEST-DistribDocExpirationUpdateProcessorTest.test-seed#[ACE55CC4219844FB]) [n:127.0.0.1:46802_    ] o.a.s.c.c.ConnectionManager Client is connected to ZooKeeper
   [junit4]   2> 896674 INFO  (TEST-DistribDocExpirationUpdateProcessorTest.test-seed#[ACE55CC4219844FB]) [n:127.0.0.1:46802_    ] o.a.s.c.c.SolrZkClient makePath: /overseer/queue
   [junit4]   2> 896675 INFO  (TEST-DistribDocExpirationUpdateProcessorTest.test-seed#[ACE55CC4219844FB]) [n:127.0.0.1:46802_    ] o.a.s.c.c.SolrZkClient makePath: /overseer/collection-queue-work
   [junit4]   2> 896677 INFO  (TEST-DistribDocExpirationUpdateProcessorTest.test-seed#[ACE55CC4219844FB]) [n:127.0.0.1:46802_    ] o.a.s.c.c.SolrZkClient makePath: /overseer/collection-map-running
   [junit4]   2> 896678 INFO  (TEST-DistribDocExpirationUpdateProcessorTest.test-seed#[ACE55CC4219844FB]) [n:127.0.0.1:46802_    ] o.a.s.c.c.SolrZkClient makePath: /overseer/collection-map-completed
   [junit4]   2> 896679 INFO  (TEST-DistribDocExpirationUpdateProcessorTest.test-seed#[ACE55CC4219844FB]) [n:127.0.0.1:46802_    ] o.a.s.c.c.SolrZkClient makePath: /overseer/collection-map-failure
   [junit4]   2> 896679 INFO  (TEST-DistribDocExpirationUpdateProcessorTest.test-seed#[ACE55CC4219844FB]) [n:127.0.0.1:46802_    ] o.a.s.c.c.SolrZkClient makePath: /live_nodes
   [junit4]   2> 896681 INFO  (TEST-DistribDocExpirationUpdateProcessorTest.test-seed#[ACE55CC4219844FB]) [n:127.0.0.1:46802_    ] o.a.s.c.c.SolrZkClient makePath: /aliases.json
   [junit4]   2> 896681 INFO  (TEST-DistribDocExpirationUpdateProcessorTest.test-seed#[ACE55CC4219844FB]) [n:127.0.0.1:46802_    ] o.a.s.c.c.SolrZkClient makePath: /clusterstate.json
   [junit4]   2> 896682 INFO  (TEST-DistribDocExpirationUpdateProcessorTest.test-seed#[ACE55CC4219844FB]) [n:127.0.0.1:46802_    ] o.a.s.c.c.SolrZkClient makePath: /security.json
   [junit4]   2> 896682 INFO  (TEST-DistribDocExpirationUpdateProcessorTest.test-seed#[ACE55CC4219844FB]) [n:127.0.0.1:46802_    ] o.a.s.c.ZkController Register node as live in ZooKeeper:/live_nodes/127.0.0.1:46802_
   [junit4]   2> 896682 INFO  (TEST-DistribDocExpirationUpdateProcessorTest.test-seed#[ACE55CC4219844FB]) [n:127.0.0.1:46802_    ] o.a.s.c.c.SolrZkClient makePath: /live_nodes/127.0.0.1:46802_
   [junit4]   2> 896683 INFO  (TEST-DistribDocExpirationUpdateProcessorTest.test-seed#[ACE55CC4219844FB]) [n:127.0.0.1:46802_    ] o.a.s.c.c.SolrZkClient makePath: /overseer_elect
   [junit4]   2> 896684 INFO  (TEST-DistribDocExpirationUpdateProcessorTest.test-seed#[ACE55CC4219844FB]) [n:127.0.0.1:46802_    ] o.a.s.c.c.SolrZkClient makePath: /overseer_elect/election
   [junit4]   2> 896684 INFO  (TEST-DistribDocExpirationUpdateProcessorTest.test-seed#[ACE55CC4219844FB]) [n:127.0.0.1:46802_    ] o.a.s.c.Overseer Overseer (id=null) closing
   [junit4]   2> 896685 INFO  (TEST-DistribDocExpirationUpdateProcessorTest.test-seed#[ACE55CC4219844FB]) [n:127.0.0.1:46802_    ] o.a.s.c.LeaderElector Joined leadership election with path: /overseer_elect/election/95282835642515460-127.0.0.1:46802_-n_0000000000
   [junit4]   2> 896685 INFO  (TEST-DistribDocExpirationUpdateProcessorTest.test-seed#[ACE55CC4219844FB]) [n:127.0.0.1:46802_    ] o.a.s.c.OverseerElectionContext I am going to be the leader 127.0.0.1:46802_
   [junit4]   2> 896685 INFO  (TEST-DistribDocExpirationUpdateProcessorTest.test-seed#[ACE55CC4219844FB]) [n:127.0.0.1:46802_    ] o.a.s.c.c.SolrZkClient makePath: /overseer_elect/leader
   [junit4]   2> 896686 INFO  (TEST-DistribDocExpirationUpdateProcessorTest.test-seed#[ACE55CC4219844FB]) [n:127.0.0.1:46802_    ] o.a.s.c.Overseer Overseer (id=95282835642515460-127.0.0.1:46802_-n_0000000000) starting
   [junit4]   2> 896687 INFO  (TEST-DistribDocExpirationUpdateProcessorTest.test-seed#[ACE55CC4219844FB]) [n:127.0.0.1:46802_    ] o.a.s.c.c.SolrZkClient makePath: /overseer/queue-work
   [junit4]   2> 896690 INFO  (TEST-DistribDocExpirationUpdateProcessorTest.test-seed#[ACE55CC4219844FB]) [n:127.0.0.1:46802_    ] o.a.s.c.OverseerAutoReplicaFailoverThread Starting OverseerAutoReplicaFailoverThread autoReplicaFailoverWorkLoopDelay=10000 autoReplicaFailoverWaitAfterExpiration=30000 autoReplicaFailoverBadNodeExpiration=60000
   [junit4]   2> 896690 INFO  (OverseerCollectionConfigSetProcessor-95282835642515460-127.0.0.1:46802_-n_0000000000) [n:127.0.0.1:46802_    ] o.a.s.c.OverseerTaskProcessor Process current queue of overseer operations
   [junit4]   2> 896690 INFO  (TEST-DistribDocExpirationUpdateProcessorTest.test-seed#[ACE55CC4219844FB]) [n:127.0.0.1:46802_    ] o.a.s.c.c.ZkStateReader Updating cluster state from ZooKeeper... 
   [junit4]   2> 896691 INFO  (OverseerStateUpdate-95282835642515460-127.0.0.1:46802_-n_0000000000) [n:127.0.0.1:46802_    ] o.a.s.c.Overseer Starting to work on the main queue
   [junit4]   2> 896719 INFO  (TEST-DistribDocExpirationUpdateProcessorTest.test-seed#[ACE55CC4219844FB]) [n:127.0.0.1:46802_    ] o.a.s.c.CoreContainer Security conf doesn't exist. Skipping setup for authorization module.
   [junit4]   2> 896719 INFO  (TEST-DistribDocExpirationUpdateProcessorTest.test-seed#[ACE55CC4219844FB]) [n:127.0.0.1:46802_    ] o.a.s.c.CoreContainer No authentication plugin used.
   [junit4]   2> 896720 INFO  (TEST-DistribDocExpirationUpdateProcessorTest.test-seed#[ACE55CC4219844FB]) [n:127.0.0.1:46802_    ] o.a.s.c.CorePropertiesLocator Looking for core definitions underneath /home/jenkins/workspace/Lucene-Solr-trunk-Linux/solr/build/solr-core/test/J2/temp/solr.cloud.DistribDocExpirationUpdateProcessorTest_ACE55CC4219844FB-001/control-001/cores
   [junit4]   2> 896721 INFO  (TEST-DistribDocExpirationUpdateProcessorTest.test-seed#[ACE55CC4219844FB]) [n:127.0.0.1:46802_    ] o.a.s.c.CoreDescriptor Created CoreDescriptor: {name=collection1, config=solrconfig.xml, transient=false, schema=schema.xml, loadOnStartup=true, configSetProperties=configsetprops.json, collection=control_collection, coreNodeName=, dataDir=data/, shard=}
   [junit4]   2> 896721 INFO  (TEST-DistribDocExpirationUpdateProcessorTest.test-seed#[ACE55CC4219844FB]) [n:127.0.0.1:46802_    ] o.a.s.c.CorePropertiesLocator Found core collection1 in /home/jenkins/workspace/Lucene-Solr-trunk-Linux/solr/build/solr-core/test/J2/temp/solr.cloud.DistribDocExpirationUpdateProcessorTest_ACE55CC4219844FB-001/control-001/cores/collection1
   [junit4]   2> 896721 INFO  (TEST-DistribDocExpirationUpdateProcessorTest.test-seed#[ACE55CC4219844FB]) [n:127.0.0.1:46802_    ] o.a.s.c.CorePropertiesLocator Found 1 core definitions
   [junit4]   2> 896722 INFO  (TEST-DistribDocExpirationUpdateProcessorTest.test-seed#[ACE55CC4219844FB]) [n:127.0.0.1:46802_    ] o.a.s.s.SolrDispatchFilter user.dir=/home/jenkins/workspace/Lucene-Solr-trunk-Linux/solr/build/solr-core/test/J2
   [junit4]   2> 896722 INFO  (TEST-DistribDocExpirationUpdateProcessorTest.test-seed#[ACE55CC4219844FB]) [n:127.0.0.1:46802_    ] o.a.s.s.SolrDispatchFilter SolrDispatchFilter.init() done
   [junit4]   2> 896722 INFO  (coreLoadExecutor-2322-thread-1-processing-n:127.0.0.1:46802_) [n:127.0.0.1:46802_ c:control_collection   x:collection1] o.a.s.c.ZkController publishing state=down
   [junit4]   2> 896722 INFO  (coreLoadExecutor-2322-thread-1-processing-n:127.0.0.1:46802_) [n:127.0.0.1:46802_ c:control_collection   x:collection1] o.a.s.c.ZkController numShards not found on descriptor - reading it from system property
   [junit4]   2> 896723 INFO  (OverseerStateUpdate-95282835642515460-127.0.0.1:46802_-n_0000000000) [n:127.0.0.1:46802_    ] o.a.s.c.Overseer processMessage: queueSize: 1, message = {
   [junit4]   2>   "core":"collection1",
   [junit4]   2>   "roles":null,
   [junit4]   2>   "base_url":"http://127.0.0.1:46802",
   [junit4]   2>   "node_name":"127.0.0.1:46802_",
   [junit4]   2>   "numShards":"1",
   [junit4]   2>   "state":"down",
   [junit4]   2>   "shard":null,
   [junit4]   2>   "collection":"control_collection",
   [junit4]   2>   "operation":"state"} current state version: 0
   [junit4]   2> 896723 INFO  (coreLoadExecutor-2322-thread-1-processing-n:127.0.0.1:46802_) [n:127.0.0.1:46802_ c:control_collection   x:collection1] o.a.s.c.ZkController look for our core node name
   [junit4]   2> 896724 INFO  (OverseerStateUpdate-95282835642515460-127.0.0.1:46802_-n_0000000000) [n:127.0.0.1:46802_    ] o.a.s.c.o.ReplicaMutator Update state numShards=1 message={
   [junit4]   2>   "core":"collection1",
   [junit4]   2>   "roles":null,
   [junit4]   2>   "base_url":"http://127.0.0.1:46802",
   [junit4]   2>   "node_name":"127.0.0.1:46802_",
   [junit4]   2>   "numShards":"1",
   [junit4]   2>   "state":"down",
   [junit4]   2>   "shard":null,
   [junit4]   2>   "collection":"control_collection",
   [junit4]   2>   "operation":"state"}
   [junit4]   2> 896724 INFO  (OverseerStateUpdate-95282835642515460-127.0.0.1:46802_-n_0000000000) [n:127.0.0.1:46802_    ] o.a.s.c.o.ClusterStateMutator building a new cName: control_collection
   [junit4]   2> 896725 INFO  (OverseerStateUpdate-95282835642515460-127.0.0.1:46802_-n_0000000000) [n:127.0.0.1:46802_    ] o.a.s.c.o.ReplicaMutator Assigning new node to shard shard=shard1
   [junit4]   2> 896726 INFO  (zkCallback-781-thread-1-processing-n:127.0.0.1:46802_) [n:127.0.0.1:46802_    ] o.a.s.c.c.ZkStateReader A cluster state change: [WatchedEvent state:SyncConnected type:NodeDataChanged path:/clusterstate.json], has occurred - updating... (live nodes size: [1])
   [junit4]   2> 897724 INFO  (coreLoadExecutor-2322-thread-1-processing-n:127.0.0.1:46802_) [n:127.0.0.1:46802_ c:control_collection   x:collection1] o.a.s.c.ZkController waiting to find shard id in clusterstate for collection1
   [junit4]   2> 897724 INFO  (coreLoadExecutor-2322-thread-1-processing-n:127.0.0.1:46802_) [n:127.0.0.1:46802_ c:control_collection   x:collection1] o.a.s.c.ZkController Check for collection zkNode:control_collection
   [junit4]   2> 897725 INFO  (coreLoadExecutor-2322-thread-1-processing-n:127.0.0.1:46802_) [n:127.0.0.1:46802_ c:control_collection   x:collection1] o.a.s.c.ZkController Collection zkNode exists
   [junit4]   2> 897725 INFO  (coreLoadExecutor-2322-thread-1-processing-n:127.0.0.1:46802_) [n:127.0.0.1:46802_ c:control_collection   x:collection1] o.a.s.c.c.ZkStateReader Load collection config from: [/collections/control_collection]
   [junit4]   2> 897725 INFO  (coreLoadExecutor-2322-thread-1-processing-n:127.0.0.1:46802_) [n:127.0.0.1:46802_ c:control_collection   x:collection1] o.a.s.c.c.ZkStateReader path=[/collections/control_collection] [configName]=[conf1] specified config exists in ZooKeeper
   [junit4]   2> 897725 INFO  (coreLoadExecutor-2322-thread-1-processing-n:127.0.0.1:46802_) [n:127.0.0.1:46802_ c:control_collection   x:collection1] o.a.s.c.SolrResourceLoader new SolrResourceLoader for directory: '/home/jenkins/workspace/Lucene-Solr-trunk-Linux/solr/build/solr-core/test/J2/temp/solr.cloud.DistribDocExpirationUpdateProcessorTest_ACE55CC4219844FB-001/control-001/cores/collection1'
   [junit4]   2> 897725 INFO  (coreLoadExecutor-2322-thread-1-processing-n:127.0.0.1:46802_) [n:127.0.0.1:46802_ c:control_collection   x:collection1] o.a.s.c.SolrResourceLoader JNDI not configured for solr (NoInitialContextEx)
   [junit4]   2> 897725 INFO  (coreLoadExecutor-2322-thread-1-processing-n:127.0.0.1:46802_) [n:127.0.0.1:46802_ c:control_collection   x:collection1] o.a.s.c.SolrResourceLoader solr home defaulted to 'solr/' (could not find system property or JNDI)
   [junit4]   2> 897726 INFO  (coreLoadExecutor-2322-thread-1-processing-n:127.0.0.1:46802_) [n:127.0.0.1:46802_ c:control_collection   x:collection1] o.a.s.c.Config loaded config solrconfig.xml with version 0 
   [junit4]   2> 897734 INFO  (coreLoadExecutor-2322-thread-1-processing-n:127.0.0.1:46802_) [n:127.0.0.1:46802_ c:control_collection   x:collection1] o.a.s.c.SolrConfig current version of requestparams : -1
   [junit4]   2> 897738 INFO  (coreLoadExecutor-2322-thread-1-processing-n:127.0.0.1:46802_) [n:127.0.0.1:46802_ c:control_collection   x:collection1] o.a.s.c.SolrConfig Using Lucene MatchVersion: 6.0.0
   [junit4]   2> 897745 INFO  (coreLoadExecutor-2322-thread-1-processing-n:127.0.0.1:46802_) [n:127.0.0.1:46802_ c:control_collection   x:collection1] o.a.s.c.SolrConfig Loaded SolrConfig: solrconfig.xml
   [junit4]   2> 897774 INFO  (coreLoadExecutor-2322-thread-1-processing-n:127.0.0.1:46802_) [n:127.0.0.1:46802_ c:control_collection   x:collection1] o.a.s.s.IndexSchema [collection1] Schema name=test
   [junit4]   2> 897857 INFO  (coreLoadExecutor-2322-thread-1-processing-n:127.0.0.1:46802_) [n:127.0.0.1:46802_ c:control_collection   x:collection1] o.a.s.s.IndexSchema default search field in schema is text
   [junit4]   2> 897858 INFO  (coreLoadExecutor-2322-thread-1-processing-n:127.0.0.1:46802_) [n:127.0.0.1:46802_ c:control_collection   x:collection1] o.a.s.s.IndexSchema unique key field: id
   [junit4]   2> 897859 INFO  (coreLoadExecutor-2322-thread-1-processing-n:127.0.0.1:46802_) [n:127.0.0.1:46802_ c:control_collection   x:collection1] o.a.s.s.FileExchangeRateProvider Reloading exchange rates from file currency.xml
   [junit4]   2> 897862 INFO  (coreLoadExecutor-2322-thread-1-processing-n:127.0.0.1:46802_) [n:127.0.0.1:46802_ c:control_collection   x:collection1] o.a.s.s.FileExchangeRateProvider Reloading exchange rates from file currency.xml
   [junit4]   2> 897880 INFO  (coreLoadExecutor-2322-thread-1-processing-n:127.0.0.1:46802_) [n:127.0.0.1:46802_ c:control_collection   x:collection1] o.a.s.c.ConfigSetProperties Did not find ConfigSet properties, assuming default properties: Can't find resource 'configsetprops.json' in classpath or '/configs/conf1', cwd=/home/jenkins/workspace/Lucene-Solr-trunk-Linux/solr/build/solr-core/test/J2
   [junit4]   2> 897881 INFO  (coreLoadExecutor-2322-thread-1-processing-n:127.0.0.1:46802_) [n:127.0.0.1:46802_ c:control_collection   x:collection1] o.a.s.c.CoreContainer Creating SolrCore 'collection1' using configuration from collection control_collection
   [junit4]   2> 897881 INFO  (coreLoadExecutor-2322-thread-1-processing-n:127.0.0.1:46802_) [n:127.0.0.1:46802_ c:control_collection s:shard1 r:core_node1 x:collection1] o.a.s.c.SolrCore org.apache.solr.core.MockDirectoryFactory
   [junit4]   2> 897881 INFO  (coreLoadExecutor-2322-thread-1-processing-n:127.0.0.1:46802_) [n:127.0.0.1:46802_ c:control_collection s:shard1 r:core_node1 x:collection1] o.a.s.c.SolrCore [[collection1] ] Opening new SolrCore at [/home/jenkins/workspace/Lucene-Solr-trunk-Linux/solr/build/solr-core/test/J2/temp/solr.cloud.DistribDocExpirationUpdateProcessorTest_ACE55CC4219844FB-001/control-001/cores/collection1], dataDir=[/home/jenkins/workspace/Lucene-Solr-trunk-Linux/solr/build/solr-core/test/J2/temp/solr.cloud.DistribDocExpirationUpdateProcessorTest_ACE55CC4219844FB-001/control-001/cores/collection1/data/]
   [junit4]   2> 897881 INFO  (coreLoadExecutor-2322-thread-1-processing-n:127.0.0.1:46802_) [n:127.0.0.1:46802_ c:control_collection s:shard1 r:core_node1 x:collection1] o.a.s.c.SolrCore JMX monitoring not detected for core: collection1
   [junit4]   2> 897882 INFO  (coreLoadExecutor-2322-thread-1-processing-n:127.0.0.1:46802_) [n:127.0.0.1:46802_ c:control_collection s:shard1 r:core_node1 x:collection1] o.a.s.c.CachingDirectoryFactory return new directory for /home/jenkins/workspace/Lucene-Solr-trunk-Linux/solr/build/solr-core/test/J2/temp/solr.cloud.DistribDocExpirationUpdateProcessorTest_ACE55CC4219844FB-001/control-001/cores/collection1/data
   [junit4]   2> 897882 INFO  (coreLoadExecutor-2322-thread-1-processing-n:127.0.0.1:46802_) [n:127.0.0.1:46802_ c:control_collection s:shard1 r:core_node1 x:collection1] o.a.s.c.SolrCore New index directory detected: old=null new=/home/jenkins/workspace/Lucene-Solr-trunk-Linux/solr/build/solr-core/test/J2/temp/solr.cloud.DistribDocExpirationUpdateProcessorTest_ACE55CC4219844FB-001/control-001/cores/collection1/data/index/
   [junit4]   2> 897882 WARN  (coreLoadExecutor-2322-thread-1-processing-n:127.0.0.1:46802_) [n:127.0.0.1:46802_ c:control_collection s:shard1 r:core_node1 x:collection1] o.a.s.c.SolrCore [collection1] Solr index directory '/home/jenkins/workspace/Lucene-Solr-trunk-Linux/solr/build/solr-core/test/J2/temp/solr.cloud.DistribDocExpirationUpdateProcessorTest_ACE55CC4219844FB-001/control-001/cores/collection1/data/index' doesn't exist. Creating new index...
   [junit4]   2> 897882 INFO  (coreLoadExecutor-2322-thread-1-processing-n:127.0.0.1:46802_) [n:127.0.0.1:46802_ c:control_collection s:shard1 r:core_node1 x:collection1] o.a.s.c.CachingDirectoryFactory return new directory for /home/jenkins/workspace/Lucene-Solr-trunk-Linux/solr/build/solr-core/test/J2/temp/solr.cloud.DistribDocExpirationUpdateProcessorTest_ACE55CC4219844FB-001/control-001/cores/collection1/data/index
   [junit4]   2> 897883 INFO  (coreLoadExecutor-2322-thread-1-processing-n:127.0.0.1:46802_) [n:127.0.0.1:46802_ c:control_collection s:shard1 r:core_node1 x:collection1] o.a.s.u.RandomMergePolicy RandomMergePolicy wrapping class org.apache.lucene.index.LogByteSizeMergePolicy: [LogByteSizeMergePolicy: minMergeSize=1677721, mergeFactor=49, maxMergeSize=2147483648, maxMergeSizeForForcedMerge=9223372036854775807, calibrateSizeByDeletes=true, maxMergeDocs=2147483647, maxCFSSegmentSizeMB=8.796093022207999E12, noCFSRatio=0.5109955774658371]
   [junit4]   2> 897884 INFO  (coreLoadExecutor-2322-thread-1-processing-n:127.0.0.1:46802_) [n:127.0.0.1:46802_ c:control_collection s:shard1 r:core_node1 x:collection1] o.a.s.c.SolrDeletionPolicy SolrDeletionPolicy.onCommit: commits: num=1
   [junit4]   2> 	commit{dir=MockDirectoryWrapper(RAMDirectory@1c7ba8f lockFactory=org.apache.lucene.store.SingleInstanceLockFactory@57f0f9),segFN=segments_1,generation=1}
   [junit4]   2> 897884 INFO  (coreLoadExecutor-2322-thread-1-processing-n:127.0.0.1:46802_) [n:127.0.0.1:46802_ c:control_collection s:shard1 r:core_node1 x:collection1] o.a.s.c.SolrDeletionPolicy newest commit generation = 1
   [junit4]   2> 897884 INFO  (OldIndexDirectoryCleanupThreadForCore-collection1) [n:127.0.0.1:46802_ c:control_collection s:shard1 r:core_node1 x:collection1] o.a.s.c.SolrCore Looking for old index directories to cleanup for core collection1 in /home/jenkins/workspace/Lucene-Solr-trunk-Linux/solr/build/solr-core/test/J2/temp/solr.cloud.DistribDocExpirationUpdateProcessorTest_ACE55CC4219844FB-001/control-001/cores/collection1/data/
   [junit4]   2> 897884 WARN  (OldIndexDirectoryCleanupThreadForCore-collection1) [n:127.0.0.1:46802_ c:control_collection s:shard1 r:core_node1 x:collection1] o.a.s.c.DirectoryFactory /home/jenkins/workspace/Lucene-Solr-trunk-Linux/solr/build/solr-core/test/J2/temp/solr.cloud.DistribDocExpirationUpdateProcessorTest_ACE55CC4219844FB-001/control-001/cores/collection1/data/ does not point to a valid data directory; skipping clean-up of old index directories.
   [junit4]   2> 897887 INFO  (coreLoadExecutor-2322-thread-1-processing-n:127.0.0.1:46802_) [n:127.0.0.1:46802_ c:control_collection s:shard1 r:core_node1 x:collection1] o.a.s.u.p.UpdateRequestProcessorChain creating updateRequestProcessorChain "convert-ttl-defaults"
   [junit4]   2> 897897 INFO  (coreLoadExecutor-2322-thread-1-processing-n:127.0.0.1:46802_) [n:127.0.0.1:46802_ c:control_collection s:shard1 r:core_node1 x:collection1] o.a.s.u.p.UpdateRequestProcessorChain creating updateRequestProcessorChain "convert-ttl-field"
   [junit4]   2> 897897 INFO  (coreLoadExecutor-2322-thread-1-processing-n:127.0.0.1:46802_) [n:127.0.0.1:46802_ c:control_collection s:shard1 r:core_node1 x:collection1] o.a.s.u.p.UpdateRequestProcessorChain creating updateRequestProcessorChain "convert-ttl-param"
   [junit4]   2> 897897 INFO  (coreLoadExecutor-2322-thread-1-processing-n:127.0.0.1:46802_) [n:127.0.0.1:46802_ c:control_collection s:shard1 r:core_node1 x:collection1] o.a.s.u.p.UpdateRequestProcessorChain creating updateRequestProcessorChain "convert-ttl-field-with-param-default"
   [junit4]   2> 897897 INFO  (coreLoadExecutor-2322-thread-1-processing-n:127.0.0.1:46802_) [n:127.0.0.1:46802_ c:control_collection s:shard1 r:core_node1 x:collection1] o.a.s.u.p.UpdateRequestProcessorChain creating updateRequestProcessorChain "scheduled-delete" (default)
   [junit4]   2> 897907 INFO  (coreLoadExecutor-2322-thread-1-processing-n:127.0.0.1:46802_) [n:127.0.0.1:46802_ c:control_collection s:shard1 r:core_node1 x:collection1] o.a.s.u.p.UpdateRequestProcessorChain inserting DistributedUpdateProcessorFactory into updateRequestProcessorChain "scheduled-delete" (default)
   [junit4]   2> 897910 INFO  (coreLoadExecutor-2322-thread-1-processing-n:127.0.0.1:46802_) [n:127.0.0.1:46802_ c:control_collection s:shard1 r:core_node1 x:collection1] o.a.s.h.l.XMLLoader xsltCacheLifetimeSeconds=60
   [junit4]   2> 897911 INFO  (coreLoadExecutor-2322-thread-1-processing-n:127.0.0.1:46802_) [n:127.0.0.1:46802_ c:control_collection s:shard1 r:core_node1 x:collection1] o.a.s.h.l.XMLLoader xsltCacheLifetimeSeconds=60
   [junit4]   2> 897912 INFO  (coreLoadExecutor-2322-thread-1-processing-n:127.0.0.1:46802_) [n:127.0.0.1:46802_ c:control_collection s:shard1 r:core_node1 x:collection1] o.a.s.h.l.XMLLoader xsltCacheLifetimeSeconds=60
   [junit4]   2> 897914 INFO  (coreLoadExecutor-2322-thread-1-processing-n:127.0.0.1:46802_) [n:127.0.0.1:46802_ c:control_collection s:shard1 r:core_node1 x:collection1] o.a.s.h.l.XMLLoader xsltCacheLifetimeSeconds=60
   [junit4]   2> 897916 INFO  (coreLoadExecutor-2322-thread-1-processing-n:127.0.0.1:46802_) [n:127.0.0.1:46802_ c:control_collection s:shard1 r:core_node1 x:collection1] o.a.s.c.RequestHandlers Registered paths: /admin/mbeans,,/update/csv,/sql,/update/json/docs,/admin/luke,/export,/select,/admin/segments,/get,/admin/system,/replication,/admin/properties,/config,/stream,/schema,/admin/plugins,/admin/logging,/update/json,/admin/threads,/admin/ping,/update,/admin/file
   [junit4]   2> 897917 INFO  (coreLoadExecutor-2322-thread-1-processing-n:127.0.0.1:46802_) [n:127.0.0.1:46802_ c:control_collection s:shard1 r:core_node1 x:collection1] o.a.s.c.SolrCore Using default statsCache cache: org.apache.solr.search.stats.LocalStatsCache
   [junit4]   2> 897917 INFO  (coreLoadExecutor-2322-thread-1-processing-n:127.0.0.1:46802_) [n:127.0.0.1:46802_ c:control_collection s:shard1 r:core_node1 x:collection1] o.a.s.u.UpdateHandler Using UpdateLog implementation: org.apache.solr.update.UpdateLog
   [junit4]   2> 897917 INFO  (coreLoadExecutor-2322-thread-1-processing-n:127.0.0.1:46802_) [n:127.0.0.1:46802_ c:control_collection s:shard1 r:core_node1 x:collection1] o.a.s.u.UpdateLog Initializing UpdateLog: dataDir= defaultSyncLevel=FLUSH numRecordsToKeep=100 maxNumLogsToKeep=10 numVersionBuckets=65536
   [junit4]   2> 897945 INFO  (coreLoadExecutor-2322-thread-1-processing-n:127.0.0.1:46802_) [n:127.0.0.1:46802_ c:control_collection s:shard1 r:core_node1 x:collection1] o.a.s.u.CommitTracker Hard AutoCommit: disabled
   [junit4]   2> 897945 INFO  (coreLoadExecutor-2322-thread-1-processing-n:127.0.0.1:46802_) [n:127.0.0.1:46802_ c:control_collection s:shard1 r:core_node1 x:collection1] o.a.s.u.CommitTracker Soft AutoCommit: disabled
   [junit4]   2> 897945 INFO  (coreLoadExecutor-2322-thread-1-processing-n:127.0.0.1:46802_) [n:127.0.0.1:46802_ c:control_collection s:shard1 r:core_node1 x:collection1] o.a.s.u.RandomMergePolicy RandomMergePolicy wrapping class org.apache.lucene.index.TieredMergePolicy: [TieredMergePolicy: maxMergeAtOnce=35, maxMergeAtOnceExplicit=34, maxMergedSegmentMB=28.8388671875, floorSegmentMB=1.2265625, forceMergeDeletesPctAllowed=21.19441381013168, segmentsPerTier=12.0, maxCFSSegmentSizeMB=8.796093022207999E12, noCFSRatio=0.46938747259621283
   [junit4]   2> 897945 INFO  (coreLoadExecutor-2322-thread-1-processing-n:127.0.0.1:46802_) [n:127.0.0.1:46802_ c:control_collection s:shard1 r:core_node1 x:collection1] o.a.s.c.SolrDeletionPolicy SolrDeletionPolicy.onInit: commits: num=1
   [junit4]   2> 	commit{dir=MockDirectoryWrapper(RAMDirectory@1c7ba8f lockFactory=org.apache.lucene.store.SingleInstanceLockFactory@57f0f9),segFN=segments_1,generation=1}
   [junit4]   2> 897946 INFO  (coreLoadExecutor-2322-thread-1-processing-n:127.0.0.1:46802_) [n:127.0.0.1:46802_ c:control_collection s:shard1 r:core_node1 x:collection1] o.a.s.c.SolrDeletionPolicy newest commit generation = 1
   [junit4]   2> 897946 INFO  (coreLoadExecutor-2322-thread-1-processing-n:127.0.0.1:46802_) [n:127.0.0.1:46802_ c:control_collection s:shard1 r:core_node1 x:collection1] o.a.s.s.SolrIndexSearcher Opening [Searcher@b6fc5f[collection1] main]
   [junit4]   2> 897946 INFO  (coreLoadExecutor-2322-thread-1-processing-n:127.0.0.1:46802_) [n:127.0.0.1:46802_ c:control_collection s:shard1 r:core_node1 x:collection1] o.a.s.c.c.ZkStateReader Load collection config from: [/collections/control_collection]
   [junit4]   2> 897946 INFO  (coreLoadExecutor-2322-thread-1-processing-n:127.0.0.1:46802_) [n:127.0.0.1:46802_ c:control_collection s:shard1 r:core_node1 x:collection1] o.a.s.c.c.ZkStateReader path=[/collections/control_collection] [configName]=[conf1] specified config exists in ZooKeeper
   [junit4]   2> 897946 INFO  (coreLoadExecutor-2322-thread-1-processing-n:127.0.0.1:46802_) [n:127.0.0.1:46802_ c:control_collection s:shard1 r:core_node1 x:collection1] o.a.s.r.ManagedResourceStorage Setting up ZooKeeper-based storage for the RestManager with znodeBase: /configs/conf1
   [junit4]   2> 897947 INFO  (coreLoadExecutor-2322-thread-1-processing-n:127.0.0.1:46802_) [n:127.0.0.1:46802_ c:control_collection s:shard1 r:core_node1 x:collection1] o.a.s.r.ManagedResourceStorage Configured ZooKeeperStorageIO with znodeBase: /configs/conf1
   [junit4]   2> 897947 INFO  (coreLoadExecutor-2322-thread-1-processing-n:127.0.0.1:46802_) [n:127.0.0.1:46802_ c:control_collection s:shard1 r:core_node1 x:collection1] o.a.s.r.RestManager Initializing RestManager with initArgs: {}
   [junit4]   2> 897947 INFO  (coreLoadExecutor-2322-thread-1-processing-n:127.0.0.1:46802_) [n:127.0.0.1:46802_ c:control_collection s:shard1 r:core_node1 x:collection1] o.a.s.r.ManagedResourceStorage Reading _rest_managed.json using ZooKeeperStorageIO:path=/configs/conf1
   [junit4]   2> 897947 INFO  (coreLoadExecutor-2322-thread-1-processing-n:127.0.0.1:46802_) [n:127.0.0.1:46802_ c:control_collection s:shard1 r:core_node1 x:collection1] o.a.s.r.ManagedResourceStorage No data found for znode /configs/conf1/_rest_managed.json
   [junit4]   2> 897947 INFO  (coreLoadExecutor-2322-thread-1-processing-n:127.0.0.1:46802_) [n:127.0.0.1:46802_ c:control_collection s:shard1 r:core_node1 x:collection1] o.a.s.r.ManagedResourceStorage Loaded null at path _rest_managed.json using ZooKeeperStorageIO:path=/configs/conf1
   [junit4]   2> 897947 INFO  (coreLoadExecutor-2322-thread-1-processing-n:127.0.0.1:46802_) [n:127.0.0.1:46802_ c:control_collection s:shard1 r:core_node1 x:collection1] o.a.s.r.RestManager Initializing 0 registered ManagedResources
   [junit4]   2> 897949 INFO  (coreLoadExecutor-2322-thread-1-processing-n:127.0.0.1:46802_) [n:127.0.0.1:46802_ c:control_collection s:shard1 r:core_node1 x:collection1] o.a.s.h.ReplicationHandler Commits will be reserved for  10000
   [junit4]   2> 897950 INFO  (searcherExecutor-2323-thread-1-processing-n:127.0.0.1:46802_ x:collection1 s:shard1 c:control_collection r:core_node1) [n:127.0.0.1:46802_ c:control_collection s:shard1 r:core_node1 x:collection1] o.a.s.c.SolrCore [collection1] Registered new searcher Searcher@b6fc5f[collection1] main{ExitableDirectoryReader(UninvertingDirectoryReader())}
   [junit4]   2> 897950 INFO  (coreLoadExecutor-2322-thread-1-processing-n:127.0.0.1:46802_) [n:127.0.0.1:46802_ c:control_collection s:shard1 r:core_node1 x:collection1] o.a.s.u.UpdateLog Looking up max value of version field to seed version buckets
   [junit4]   2> 897950 INFO  (coreLoadExecutor-2322-thread-1-processing-n:127.0.0.1:46802_) [n:127.0.0.1:46802_ c:control_collection s:shard1 r:core_node1 x:collection1] o.a.s.u.VersionInfo Refreshing highest value of _version_ for 65536 version buckets from index
   [junit4]   2> 897950 INFO  (coreLoadExecutor-2322-thread-1-processing-n:127.0.0.1:46802_) [n:127.0.0.1:46802_ c:control_collection s:shard1 r:core_node1 x:collection1] o.a.s.u.VersionInfo No terms found for _version_, cannot seed version bucket highest value from index
   [junit4]   2> 897950 INFO  (coreLoadExecutor-2322-thread-1-processing-n:127.0.0.1:46802_) [n:127.0.0.1:46802_ c:control_collection s:shard1 r:core_node1 x:collection1] o.a.s.u.UpdateLog Could not find max version in index or recent updates, using new clock 1524525371838431232
   [junit4]   2> 897951 INFO  (coreLoadExecutor-2322-thread-1-processing-n:127.0.0.1:46802_) [n:127.0.0.1:46802_ c:control_collection s:shard1 r:core_node1 x:collection1] o.a.s.u.UpdateLog Took 1.0ms to seed version buckets with highest version 1524525371838431232
   [junit4]   2> 897952 INFO  (coreLoadExecutor-2322-thread-1-processing-n:127.0.0.1:46802_) [n:127.0.0.1:46802_ c:control_collection s:shard1 r:core_node1 x:collection1] o.a.s.c.ZkController watch zkdir /configs/conf1
   [junit4]   2> 897952 INFO  (coreLoadExecutor-2322-thread-1-processing-n:127.0.0.1:46802_) [n:127.0.0.1:46802_ c:control_collection s:shard1 r:core_node1 x:collection1] o.a.s.c.CoreContainer registering core: collection1
   [junit4]   2> 897952 INFO  (coreZkRegister-2316-thread-1-processing-n:127.0.0.1:46802_ x:collection1 s:shard1 c:control_collection r:core_node1) [n:127.0.0.1:46802_ c:control_collection s:shard1 r:core_node1 x:collection1] o.a.s.c.ZkController Register replica - core:collection1 address:http://127.0.0.1:46802 collection:control_collection shard:shard1
   [junit4]   2> 897953 INFO  (coreZkRegister-2316-thread-1-processing-n:127.0.0.1:46802_ x:collection1 s:shard1 c:control_collection r:core_node1) [n:127.0.0.1:46802_ c:control_collection s:shard1 r:core_node1 x:collection1] o.a.s.c.c.SolrZkClient makePath: /collections/control_collection/leader_elect/shard1/election
   [junit4]   2> 897954 INFO  (coreZkRegister-2316-thread-1-processing-n:127.0.0.1:46802_ x:collection1 s:shard1 c:control_collection r:core_node1) [n:127.0.0.1:46802_ c:control_collection s:shard1 r:core_node1 x:collection1] o.a.s.c.LeaderElector Joined leadership election with path: /collections/control_collection/leader_elect/shard1/election/95282835642515460-core_node1-n_0000000000
   [junit4]   2> 897954 INFO  (coreZkRegister-2316-thread-1-processing-n:127.0.0.1:46802_ x:collection1 s:shard1 c:control_collection r:core_node1) [n:127.0.0.1:46802_ c:control_collection s:shard1 r:core_node1 x:collection1] o.a.s.c.ShardLeaderElectionContext Running the leader process for shard=shard1 and weAreReplacement=false and leaderVoteWait=10000
   [junit4]   2> 897955 INFO  (coreZkRegister-2316-thread-1-processing-n:127.0.0.1:46802_ x:collection1 s:shard1 c:control_collection r:core_node1) [n:127.0.0.1:46802_ c:control_collection s:shard1 r:core_node1 x:collection1] o.a.s.c.ShardLeaderElectionContext Enough replicas found to continue.
   [junit4]   2> 897955 INFO  (coreZkRegister-2316-thread-1-processing-n:127.0.0.1:46802_ x:collection1 s:shard1 c:control_collection r:core_node1) [n:127.0.0.1:46802_ c:control_collection s:shard1 r:core_node1 x:collection1] o.a.s.c.ShardLeaderElectionContext I may be the new leader - try and sync
   [junit4]   2> 897955 INFO  (coreZkRegister-2316-thread-1-processing-n:127.0.0.1:46802_ x:collection1 s:shard1 c:control_collection r:core_node1) [n:127.0.0.1:46802_ c:control_collection s:shard1 r:core_node1 x:collection1] o.a.s.c.SyncStrategy Sync replicas to http://127.0.0.1:46802/collection1/
   [junit4]   2> 897955 INFO  (OverseerStateUpdate-95282835642515460-127.0.0.1:46802_-n_0000000000) [n:127.0.0.1:46802_    ] o.a.s.c.Overseer processMessage: queueSize: 1, message = {
   [junit4]   2>   "operation":"leader",
   [junit4]   2>   "shard":"shard1",
   [junit4]   2>   "collection":"control_collection"} current state version: 1
   [junit4]   2> 897955 INFO  (coreZkRegister-2316-thread-1-processing-n:127.0.0.1:46802_ x:collection1 s:shard1 c:control_collection r:core_node1) [n:127.0.0.1:46802_ c:control_collection s:shard1 r:core_node1 x:collection1] o.a.s.c.SyncStrategy Sync Success - now sync replicas to me
   [junit4]   2> 897955 INFO  (coreZkRegister-2316-thread-1-processing-n:127.0.0.1:46802_ x:collection1 s:shard1 c:control_collection r:core_node1) [n:127.0.0.1:46802_ c:control_collection s:shard1 r:core_node1 x:collection1] o.a.s.c.SyncStrategy http://127.0.0.1:46802/collection1/ has no replicas
   [junit4]   2> 897956 INFO  (coreZkRegister-2316-thread-1-processing-n:127.0.0.1:46802_ x:collection1 s:shard1 c:control_collection r:core_node1) [n:127.0.0.1:46802_ c:control_collection s:shard1 r:core_node1 x:collection1] o.a.s.c.c.SolrZkClient makePath: /collections/control_collection/leaders/shard1
   [junit4]   2> 897957 INFO  (coreZkRegister-2316-thread-1-processing-n:127.0.0.1:46802_ x:collection1 s:shard1 c:control_collection r:core_node1) [n:127.0.0.1:46802_ c:control_collection s:shard1 r:core_node1 x:collection1] o.a.s.c.ShardLeaderElectionContextBase Creating leader registration node
   [junit4]   2> 897958 INFO  (coreZkRegister-2316-thread-1-processing-n:127.0.0.1:46802_ x:collection1 s:shard1 c:control_collection r:core_node1) [n:127.0.0.1:46802_ c:control_collection s:shard1 r:core_node1 x:collection1] o.a.s.c.ShardLeaderElectionContext I am the new leader: http://127.0.0.1:46802/collection1/ shard1
   [junit4]   2> 897959 INFO  (OverseerStateUpdate-95282835642515460-127.0.0.1:46802_-n_0000000000) [n:127.0.0.1:46802_    ] o.a.s.c.Overseer processMessage: queueSize: 1, message = {
   [junit4]   2>   "operation":"leader",
   [junit4]   2>   "shard":"shard1",
   [junit4]   2>   "collection":"control_collection",
   [junit4]   2>   "base_url":"http://127.0.0.1:46802",
   [junit4]   2>   "core":"collection1",
   [junit4]   2>   "state":"active"} current state version: 1
   [junit4]   2> 898060 INFO  (zkCallback-781-thread-1-processing-n:127.0.0.1:46802_) [n:127.0.0.1:46802_    ] o.a.s.c.c.ZkStateReader A cluster state change: [WatchedEvent state:SyncConnected type:NodeDataChanged path:/clusterstate.json], has occurred - updating... (live nodes size: [1])
   [junit4]   2> 898109 INFO  (coreZkRegister-2316-thread-1-processing-n:127.0.0.1:46802_ x:collection1 s:shard1 c:control_collection r:core_node1) [n:127.0.0.1:46802_ c:control_collection s:shard1 r:core_node1 x:collection1] o.a.s.c.ZkController We are http://127.0.0.1:46802/collection1/ and leader is http://127.0.0.1:46802/collection1/
   [junit4]   2> 898109 INFO  (coreZkRegister-2316-thread-1-processing-n:127.0.0.1:46802_ x:collection1 s:shard1 c:control_collection r:core_node1) [n:127.0.0.1:46802_ c:control_collection s:shard1 r:core_node1 x:collection1] o.a.s.c.ZkController No LogReplay needed for core=collection1 baseURL=http://127.0.0.1:46802
   [junit4]   2> 898109 INFO  (coreZkRegister-2316-thread-1-processing-n:127.0.0.1:46802_ x:collection1 s:shard1 c:control_collection r:core_node1) [n:127.0.0.1:46802_ c:control_collection s:shard1 r:core_node1 x:collection1] o.a.s.c.ZkController I am the leader, no recovery necessary
   [junit4]   2> 898109 INFO  (coreZkRegister-2316-thread-1-processing-n:127.0.0.1:46802_ x:collection1 s:shard1 c:control_collection r:core_node1) [n:127.0.0.1:46802_ c:control_collection s:shard1 r:core_node1 x:collection1] o.a.s.c.ZkController publishing state=active
   [junit4]   2> 898109 INFO  (coreZkRegister-2316-thread-1-processing-n:127.0.0.1:46802_ x:collection1 s:shard1 c:control_collection r:core_node1) [n:127.0.0.1:46802_ c:control_collection s:shard1 r:core_node1 x:collection1] o.a.s.c.ZkController numShards not found on descriptor - reading it from system property
   [junit4]   2> 898110 INFO  (OverseerStateUpdate-95282835642515460-127.0.0.1:46802_-n_0000000000) [n:127.0.0.1:46802_    ] o.a.s.c.Overseer processMessage: queueSize: 1, message = {
   [junit4]   2>   "core":"collection1",
   [junit4]   2>   "core_node_name":"core_node1",
   [junit4]   2>   "roles":null,
   [junit4]   2>   "base_url":"http://127.0.0.1:46802",
   [junit4]   2>   "node_name":"127.0.0.1:46802_",
   [junit4]   2>   "numShards":"1",
   [junit4]   2>   "state":"active",
   [junit4]   2>   "shard":"shard1",
   [junit4]   2>   "collection":"control_collection",
   [junit4]   2>   "operation":"state"} current state version: 2
   [junit4]   2> 898111 INFO  (OverseerStateUpdate-95282835642515460-127.0.0.1:46802_-n_0000000000) [n:127.0.0.1:46802_    ] o.a.s.c.o.ReplicaMutator Update state numShards=1 message={
   [junit4]   2>   "core":"collection1",
   [junit4]   2>   "core_node_name":"core_node1",
   [junit4]   2>   "roles":null,
   [junit4]   2>   "base_url":"http://127.0.0.1:46802",
   [junit4]   2>   "node_name":"127.0.0.1:46802_",
   [junit4]   2>   "numShards":"1",
   [junit4]   2>   "state":"active",
   [junit4]   2>   "shard":"shard1",
   [junit4]   2>   "collection":"control_collection",
   [junit4]   2>   "operation":"state"}
   [junit4]   2> 898213 INFO  (zkCallback-781-thread-1-processing-n:127.0.0.1:46802_) [n:127.0.0.1:46802_    ] o.a.s.c.c.ZkStateReader A cluster state change: [WatchedEvent state:SyncConnected type:NodeDataChanged path:/clusterstate.json], has occurred - updating... (live nodes size: [1])
   [junit4]   2> 898223 INFO  (TEST-DistribDocExpirationUpdateProcessorTest.test-seed#[ACE55CC4219844FB]) [    ] o.a.s.c.c.SolrZkClient Using default ZkCredentialsProvider
   [junit4]   2> 898224 INFO  (TEST-DistribDocExpirationUpdateProcessorTest.test-seed#[ACE55CC4219844FB]) [    ] o.a.s.c.c.ConnectionManager Waiting for client to connect to ZooKeeper
   [junit4]   2> 898225 INFO  (zkCallback-783-thread-1) [    ] o.a.s.c.c.ConnectionManager Watcher org.apache.solr.common.cloud.ConnectionManager@1f3bb95 name:ZooKeeperConnection Watcher:127.0.0.1:46705/solr got event WatchedEvent state:SyncConnected type:None path:null path:null type:None
   [junit4]   2> 898225 INFO  (TEST-DistribDocExpirationUpdateProcessorTest.test-seed#[ACE55CC4219844FB]) [    ] o.a.s.c.c.ConnectionManager Client is connected to ZooKeeper
   [junit4]   2> 898226 INFO  (TEST-DistribDocExpirationUpdateProcessorTest.test-seed#[ACE55CC4219844FB]) [    ] o.a.s.c.c.SolrZkClient Using default ZkACLProvider
   [junit4]   2> 898226 INFO  (TEST-DistribDocExpirationUpdateProcessorTest.test-seed#[ACE55CC4219844FB]) [    ] o.a.s.c.c.ZkStateReader Updating cluster state from ZooKeeper... 
   [junit4]   2> 898227 INFO  (TEST-DistribDocExpirationUpdateProcessorTest.test-seed#[ACE55CC4219844FB]) [    ] o.a.s.c.ChaosMonkey monkey: init - expire sessions:false cause connection loss:false
   [junit4]   2> 898227 INFO  (TEST-DistribDocExpirationUpdateProcessorTest.test-seed#[ACE55CC4219844FB]) [    ] o.a.s.c.AbstractFullDistribZkTestBase Creating collection1 with stateFormat=2
   [junit4]   2> 898227 INFO  (TEST-DistribDocExpirationUpdateProcessorTest.test-seed#[ACE55CC4219844FB]) [    ] o.a.s.c.c.SolrZkClient Using default ZkCredentialsProvider
   [junit4]   2> 898227 INFO  (TEST-DistribDocExpirationUpdateProcessorTest.test-seed#[ACE55CC4219844FB]) [    ] o.a.s.c.c.ConnectionManager Waiting for client to connect to ZooKeeper
   [junit4]   2> 898228 INFO  (zkCallback-784-thread-1) [    ] o.a.s.c.c.ConnectionManager Watcher org.apache.solr.common.cloud.ConnectionManager@792f9d name:ZooKeeperConnection Watcher:127.0.0.1:46705/solr got event WatchedEvent state:SyncConnected type:None path:null path:null type:None
   [junit4]   2> 898228 INFO  (TEST-DistribDocExpirationUpdateProcessorTest.test-seed#[ACE55CC4219844FB]) [    ] o.a.s.c.c.ConnectionManager Client is connected to ZooKeeper
   [junit4]   2> 898228 INFO  (TEST-DistribDocExpirationUpdateProcessorTest.test-seed#[ACE55CC4219844FB]) [    ] o.a.s.c.c.SolrZkClient Using default ZkACLProvider
   [junit4]   2> 898231 INFO  (OverseerStateUpdate-95282835642515460-127.0.0.1:46802_-n_0000000000) [n:127.0.0.1:46802_    ] o.a.s.c.Overseer processMessage: queueSize: 1, message = {
   [junit4]   2>   "operation":"create",
   [junit4]   2>   "name":"collection1",
   [junit4]   2>   "numShards":"2",
   [junit4]   2>   "stateFormat":"2"} current state version: 3
   [junit4]   2> 898231 INFO  (OverseerStateUpdate-95282835642515460-127.0.0.1:46802_-n_0000000000) [n:127.0.0.1:46802_    ] o.a.s.c.o.ClusterStateMutator building a new cName: collection1
   [junit4]   2> 898343 INFO  (TEST-DistribDocExpirationUpdateProcessorTest.test-seed#[ACE55CC4219844FB]) [    ] o.a.s.SolrTestCaseJ4 Writing core.properties file to /home/jenkins/workspace/Lucene-Solr-trunk-Linux/solr/build/solr-core/test/J2/temp/solr.cloud.DistribDocExpirationUpdateProcessorTest_ACE55CC4219844FB-001/shard-1-001/cores/collection1
   [junit4]   2> 898343 INFO  (TEST-DistribDocExpirationUpdateProcessorTest.test-seed#[ACE55CC4219844FB]) [    ] o.a.s.c.AbstractFullDistribZkTestBase create jetty 1 in directory /home/jenkins/workspace/Lucene-Solr-trunk-Linux/solr/build/solr-core/test/J2/temp/solr.cloud.DistribDocExpirationUpdateProcessorTest_ACE55CC4219844FB-001/shard-1-001
   [junit4]   2> 898344 INFO  (TEST-DistribDocExpirationUpdateProcessorTest.test-seed#[ACE55CC4219844FB]) [    ] o.e.j.s.Server jetty-9.2.13.v20150730
   [junit4]   2> 898345 INFO  (TEST-DistribDocExpirationUpdateProcessorTest.test-seed#[ACE55CC4219844FB]) [    ] o.e.j.s.h.ContextHandler Started o.e.j.s.ServletContextHandler@dbfbcf{/,null,AVAILABLE}
   [junit4]   2> 898345 INFO  (TEST-DistribDocExpirationUpdateProcessorTest.test-seed#[ACE55CC4219844FB]) [    ] o.e.j.s.ServerConnector Started ServerConnector@1d10161{HTTP/1.1}{127.0.0.1:56806}
   [junit4]   2> 898345 INFO  (TEST-DistribDocExpirationUpdateProcessorTest.test-seed#[ACE55CC4219844FB]) [    ] o.e.j.s.Server Started @899614ms
   [junit4]   2> 898346 INFO  (TEST-DistribDocExpirationUpdateProcessorTest.test-seed#[ACE55CC4219844FB]) [    ] o.a.s.c.s.e.JettySolrRunner Jetty properties: {solr.data.dir=/home/jenkins/workspace/Lucene-Solr-trunk-Linux/solr/build/solr-core/test/J2/temp/solr.cloud.DistribDocExpirationUpdateProcessorTest_ACE55CC4219844FB-001/tempDir-001/jetty1, solrconfig=solrconfig.xml, hostContext=/, hostPort=56806, coreRootDirectory=/home/jenkins/workspace/Lucene-Solr-trunk-Linux/solr/build/solr-core/test/J2/../../../../../../../../../home/jenkins/workspace/Lucene-Solr-trunk-Linux/solr/build/solr-core/test/J2/temp/solr.cloud.DistribDocExpirationUpdateProcessorTest_ACE55CC4219844FB-001/shard-1-001/cores}
   [junit4]   2> 898346 INFO  (TEST-DistribDocExpirationUpdateProcessorTest.test-seed#[ACE55CC4219844FB]) [    ] o.a.s.s.SolrDispatchFilter SolrDispatchFilter.init(): sun.misc.Launcher$AppClassLoader@e2f2a
   [junit4]   2> 898346 INFO  (TEST-DistribDocExpirationUpdateProcessorTest.test-seed#[ACE55CC4219844FB]) [    ] o.a.s.c.SolrResourceLoader new SolrResourceLoader for directory: '/home/jenkins/workspace/Lucene-Solr-trunk-Linux/solr/build/solr-core/test/J2/temp/solr.cloud.DistribDocExpirationUpdateProcessorTest_ACE55CC4219844FB-001/shard-1-001'
   [junit4]   2> 898346 INFO  (TEST-DistribDocExpirationUpdateProcessorTest.test-seed#[ACE55CC4219844FB]) [    ] o.a.s.c.SolrResourceLoader JNDI not configured for solr (NoInitialContextEx)
   [junit4]   2> 898346 INFO  (TEST-DistribDocExpirationUpdateProcessorTest.test-seed#[ACE55CC4219844FB]) [    ] o.a.s.c.SolrResourceLoader solr home defaulted to 'solr/' (could not find system property or JNDI)
   [junit4]   2> 898346 INFO  (TEST-DistribDocExpirationUpdateProcessorTest.test-seed#[ACE55CC4219844FB]) [    ] o.a.s.c.c.SolrZkClient Using default ZkCredentialsProvider
   [junit4]   2> 898347 INFO  (TEST-DistribDocExpirationUpdateProcessorTest.test-seed#[ACE55CC4219844FB]) [    ] o.a.s.c.c.ConnectionManager Waiting for client to connect to ZooKeeper
   [junit4]   2> 898348 INFO  (zkCallback-785-thread-1) [    ] o.a.s.c.c.ConnectionManager Watcher org.apache.solr.common.cloud.ConnectionManager@58b074 name:ZooKeeperConnection Watcher:127.0.0.1:46705/solr got event WatchedEvent state:SyncConnected type:None path:null path:null type:None
   [junit4]   2> 898348 INFO  (TEST-DistribDocExpirationUpdateProcessorTest.test-seed#[ACE55CC4219844FB]) [    ] o.a.s.c.c.ConnectionManager Client is connected to ZooKeeper
   [junit4]   2> 898348 INFO  (TEST-DistribDocExpirationUpdateProcessorTest.test-seed#[ACE55CC4219844FB]) [    ] o.a.s.c.c.SolrZkClient Using default ZkACLProvider
   [junit4]   2> 898349 INFO  (TEST-DistribDocExpirationUpdateProcessorTest.test-seed#[ACE55CC4219844FB]) [    ] o.a.s.s.SolrDispatchFilter Loading solr.xml from SolrHome (not found in ZooKeeper)
   [junit4]   2> 898349 INFO  (TEST-DistribDocExpirationUpdateProcessorTest.test-seed#[ACE55CC4219844FB]) [    ] o.a.s.c.SolrXmlConfig Loading container configuration from /home/jenkins/workspace/Lucene-Solr-trunk-Linux/solr/build/solr-core/test/J2/temp/solr.cloud.DistribDocExpirationUpdateProcessorTest_ACE55CC4219844FB-001/shard-1-001/solr.xml
   [junit4]   2> 898355 INFO  (TEST-DistribDocExpirationUpdateProcessorTest.test-seed#[ACE55CC4219844FB]) [    ] o.a.s.c.CorePropertiesLocator Config-defined core root directory: /home/jenkins/workspace/Lucene-Solr-trunk-Linux/solr/build/solr-core/test/J2/../../../../../../../../../home/jenkins/workspace/Lucene-Solr-trunk-Linux/solr/build/solr-core/test/J2/temp/solr.cloud.DistribDocExpirationUpdateProcessorTest_ACE55CC4219844FB-001/shard-1-001/cores
   [junit4]   2> 898355 INFO  (TEST-DistribDocExpirationUpdateProcessorTest.test-seed#[ACE55CC4219844FB]) [    ] o.a.s.c.CoreContainer New CoreContainer 4400222
   [junit4]   2> 898355 INFO  (TEST-DistribDocExpirationUpdateProcessorTest.test-seed#[ACE55CC4219844FB]) [    ] o.a.s.c.CoreContainer Loading cores into CoreContainer [instanceDir=/home/jenkins/workspace/Lucene-Solr-trunk-Linux/solr/build/solr-core/test/J2/temp/solr.cloud.DistribDocExpirationUpdateProcessorTest_ACE55CC4219844FB-001/shard-1-001]
   [junit4]   2> 898355 WARN  (TEST-DistribDocExpirationUpdateProcessorTest.test-seed#[ACE55CC4219844FB]) [    ] o.a.s.c.CoreContainer Couldn't add files from /home/jenkins/workspace/Lucene-Solr-trunk-Linux/solr/build/solr-core/test/J2/temp/solr.cloud.DistribDocExpirationUpdateProcessorTest_ACE55CC4219844FB-001/shard-1-001/lib to classpath: /home/jenkins/workspace/Lucene-Solr-trunk-Linux/solr/build/solr-core/test/J2/temp/solr.cloud.DistribDocExpirationUpdateProcessorTest_ACE55CC4219844FB-001/shard-1-001/lib
   [junit4]   2> 898356 INFO  (TEST-DistribDocExpirationUpdateProcessorTest.test-seed#[ACE55CC4219844FB]) [    ] o.a.s.h.c.HttpShardHandlerFactory created with socketTimeout : 90000,urlScheme : ,connTimeout : 15000,maxConnectionsPerHost : 20,maxConnections : 10000,corePoolSize : 0,maximumPoolSize : 2147483647,maxThreadIdleTime : 5,sizeOfQueue : -1,fairnessPolicy : false,useRetries : false,
   [junit4]   2> 898357 INFO  (TEST-DistribDocExpirationUpdateProcessorTest.test-seed#[ACE55CC4219844FB]) [    ] o.a.s.u.UpdateShardHandler Creating UpdateShardHandler HTTP client with params: socketTimeout=340000&connTimeout=45000&retry=true
   [junit4]   2> 898357 INFO  (TEST-DistribDocExpirationUpdateProcessorTest.test-seed#[ACE55CC4219844FB]) [    ] o.a.s.l.LogWatcher SLF4J impl is org.slf4j.impl.Log4jLoggerFactory
   [junit4]   2> 898358 INFO  (TEST-DistribDocExpirationUpdateProcessorTest.test-seed#[ACE55CC4219844FB]) [    ] o.a.s.l.LogWatcher Registering Log Listener [Log4j (org.slf4j.impl.Log4jLoggerFactory)]
   [junit4]   2> 898358 INFO  (TEST-DistribDocExpirationUpdateProcessorTest.test-seed#[ACE55CC4219844FB]) [    ] o.a.s.c.ZkContainer Zookeeper client=127.0.0.1:46705/solr
   [junit4]   2> 898358 INFO  (TEST-DistribDocExpirationUpdateProcessorTest.test-seed#[ACE55CC4219844FB]) [    ] o.a.s.c.ZkController zkHost includes chroot
   [junit4]   2> 898358 INFO  (TEST-DistribDocExpirationUpdateProcessorTest.test-seed#[ACE55CC4219844FB]) [    ] o.a.s.c.c.SolrZkClient Using default ZkCredentialsProvider
   [junit4]   2> 898358 INFO  (TEST-DistribDocExpirationUpdateProcessorTest.test-seed#[ACE55CC4219844FB]) [    ] o.a.s.c.c.ConnectionManager Waiting for client to connect to ZooKeeper
   [junit4]   2> 898362 INFO  (OverseerStateUpdate-95282835642515460-127.0.0.1:46802_-n_0000000000) [n:127.0.0.1:46802_    ] o.a.s.c.o.ZkStateWriter going to create_collection /collections/collection1/state.json
   [junit4]   2> 898363 INFO  (zkCallback-788-thread-1) [    ] o.a.s.c.c.ConnectionManager Watcher org.apache.solr.common.cloud.ConnectionManager@1782617 name:ZooKeeperConnection Watcher:127.0.0.1:46705 got event WatchedEvent state:SyncConnected type:None path:null path:null type:None
   [junit4]   2> 898363 INFO  (TEST-DistribDocExpirationUpdateProcessorTest.test-seed#[ACE55CC4219844FB]) [    ] o.a.s.c.c.ConnectionManager Client is connected to ZooKeeper
   [junit4]   2> 898363 INFO  (TEST-DistribDocExpirationUpdateProcessorTest.test-seed#[ACE55CC4219844FB]) [    ] o.a.s.c.c.SolrZkClient Using default ZkACLProvider
   [junit4]   2> 898364 INFO  (TEST-DistribDocExpirationUpdateProcessorTest.test-seed#[ACE55CC4219844FB]) [n:127.0.0.1:56806_    ] o.a.s.c.c.ConnectionManager Waiting for client to connect to ZooKeeper
   [junit4]   2> 898365 INFO  (zkCallback-789-thread-1-processing-n:127.0.0.1:56806_) [n:127.0.0.1:56806_    ] o.a.s.c.c.ConnectionManager Watcher org.apache.solr.common.cloud.ConnectionManager@13f60ee name:ZooKeeperConnection Watcher:127.0.0.1:46705/solr got event WatchedEvent state:SyncConnected type:None path:null path:null type:None
   [junit4]   2> 898365 INFO  (TEST-DistribDocExpirationUpdateProcessorTest.test-seed#[ACE55CC4219844FB]) [n:127.0.0.1:56806_    ] o.a.s.c.c.ConnectionManager Client is connected to ZooKeeper
   [junit4]   2> 898367 INFO  (TEST-DistribDocExpirationUpdateProcessorTest.test-seed#[ACE55CC4219844FB]) [n:127.0.0.1:56806_    ] o.a.s.c.c.ZkStateReader Updating cluster state from ZooKeeper... 
   [junit4]   2> 899370 INFO  (TEST-DistribDocExpirationUpdateProcessorTest.test-seed#[ACE55CC4219844FB]) [n:127.0.0.1:56806_    ] o.a.s.c.ZkController Register node as live in ZooKeeper:/live_nodes/127.0.0.1:56806_
   [junit4]   2> 899371 INFO  (TEST-DistribDocExpirationUpdateProcessorTest.test-seed#[ACE55CC4219844FB]) [n:127.0.0.1:56806_    ] o.a.s.c.c.SolrZkClient makePath: /live_nodes/127.0.0.1:56806_
   [junit4]   2> 899371 INFO  (zkCallback-789-thread-1-processing-n:127.0.0.1:56806_) [n:127.0.0.1:56806_    ] o.a.s.c.c.ZkStateReader A live node change: [WatchedEvent state:SyncConnected type:NodeChildrenChanged path:/live_nodes], has occurred - updating... (live nodes size: [1])
   [junit4]   2> 899371 INFO  (zkCallback-781-thread-1-processing-n:127.0.0.1:46802_) [n:127.0.0.1:46802_    ] o.a.s.c.c.ZkStateReader A live node change: [WatchedEvent state:SyncConnected type:NodeChildrenChanged path:/live_nodes], has occurred - updating... (live nodes size: [1])
   [junit4]   2> 899371 INFO  (zkCallback-783-thread-1) [    ] o.a.s.c.c.ZkStateReader A live node change: [WatchedEvent state:SyncConnected type:NodeChildrenChanged path:/live_nodes], has occurred - updating... (live nodes size: [1])
   [junit4]   2> 899372 INFO  (TEST-DistribDocExpirationUpdateProcessorTest.test-seed#[ACE55CC4219844FB]) [n:127.0.0.1:56806_    ] o.a.s.c.Overseer Overseer (id=null) closing
   [junit4]   2> 899372 INFO  (TEST-DistribDocExpirationUpdateProcessorTest.test-seed#[ACE55CC4219844FB]) [n:127.0.0.1:56806_    ] o.a.s.c.LeaderElector Joined leadership election with path: /overseer_elect/election/95282835642515465-127.0.0.1:56806_-n_0000000001
   [junit4]   2> 899372 INFO  (TEST-DistribDocExpirationUpdateProcessorTest.test-seed#[ACE55CC4219844FB]) [n:127.0.0.1:56806_    ] o.a.s.c.LeaderElector Watching path /overseer_elect/election/95282835642515460-127.0.0.1:46802_-n_0000000000 to know if I could be the leader
   [junit4]   2> 899390 INFO  (TEST-DistribDocExpirationUpdateProcessorTest.test-seed#[ACE55CC4219844FB]) [n:127.0.0.1:56806_    ] o.a.s.c.CoreContainer Security conf doesn't exist. Skipping setup for authorization module.
   [junit4]   2> 899390 INFO  (TEST-DistribDocExpirationUpdateProcessorTest.test-seed#[ACE55CC4219844FB]) [n:127.0.0.1:56806_    ] o.a.s.c.CoreContainer No authentication plugin used.
   [junit4]   2> 899391 INFO  (TEST-DistribDocExpirationUpdateProcessorTest.test-seed#[ACE55CC4219844FB]) [n:127.0.0.1:56806_    ] o.a.s.c.CorePropertiesLocator Looking for core definitions underneath /home/jenkins/workspace/Lucene-Solr-trunk-Linux/solr/build/solr-core/test/J2/../../../../../../../../../home/jenkins/workspace/Lucene-Solr-trunk-Linux/solr/build/solr-core/test/J2/temp/solr.cloud.DistribDocExpirationUpdateProcessorTest_ACE55CC4219844FB-001/shard-1-001/cores
   [junit4]   2> 899391 INFO  (TEST-DistribDocExpirationUpdateProcessorTest.test-seed#[ACE55CC4219844FB]) [n:127.0.0.1:56806_    ] o.a.s.c.CoreDescriptor Created CoreDescriptor: {name=collection1, config=solrconfig.xml, transient=false, schema=schema.xml, loadOnStartup=true, configSetProperties=configsetprops.json, collection=collection1, coreNodeName=, dataDir=data/, shard=}
   [junit4]   2> 899391 INFO  (TEST-DistribDocExpirationUpdateProcessorTest.test-seed#[ACE55CC4219844FB]) [n:127.0.0.1:56806_    ] o.a.s.c.CorePropertiesLocator Found core collection1 in /home/jenkins/workspace/Lucene-Solr-trunk-Linux/solr/build/solr-core/test/J2/../../../../../../../../../home/jenkins/workspace/Lucene-Solr-trunk-Linux/solr/build/solr-core/test/J2/temp/solr.cloud.DistribDocExpirationUpdateProcessorTest_ACE55CC4219844FB-001/shard-1-001/cores/collection1
   [junit4]   2> 899391 INFO  (TEST-DistribDocExpirationUpdateProcessorTest.test-seed#[ACE55CC4219844FB]) [n:127.0.0.1:56806_    ] o.a.s.c.CorePropertiesLocator Found 1 core definitions
   [junit4]   2> 899392 INFO  (TEST-DistribDocExpirationUpdateProcessorTest.test-seed#[ACE55CC4219844FB]) [n:127.0.0.1:56806_    ] o.a.s.s.SolrDispatchFilter user.dir=/home/jenkins/workspace/Lucene-Solr-trunk-Linux/solr/build/solr-core/test/J2
   [junit4]   2> 899392 INFO  (TEST-DistribDocExpirationUpdateProcessorTest.test-seed#[ACE55CC4219844FB]) [n:127.0.0.1:56806_    ] o.a.s.s.SolrDispatchFilter SolrDispatchFilter.init() done
   [junit4]   2> 899393 INFO  (coreLoadExecutor-2334-thread-1-processing-n:127.0.0.1:56806_) [n:127.0.0.1:56806_ c:collection1   x:collection1] o.a.s.c.ZkController publishing state=down
   [junit4]   2> 899393 INFO  (coreLoadExecutor-2334-thread-1-processing-n:127.0.0.1:56806_) [n:127.0.0.1:56806_ c:collection1   x:collection1] o.a.s.c.ZkController numShards not found on descriptor - reading it from system property
   [junit4]   2> 899406 INFO  (coreLoadExecutor-2334-thread-1-processing-n:127.0.0.1:56806_) [n:127.0.0.1:56806_ c:collection1   x:collection1] o.a.s.c.ZkController Registering watch for collection collection1
   [junit4]   2> 899406 INFO  (coreLoadExecutor-2334-thread-1-processing-n:127.0.0.1:56806_) [n:127.0.0.1:56806_ c:collection1   x:collection1] o.a.s.c.c.ZkStateReader addZkWatch [collection1]
   [junit4]   2> 899406 INFO  (OverseerStateUpdate-95282835642515460-127.0.0.1:46802_-n_0000000000) [n:127.0.0.1:46802_    ] o.a.s.c.Overseer processMessage: queueSize: 1, message = {
   [junit4]   2>   "core":"collection1",
   [junit4]   2>   "roles":null,
   [junit4]   2>   "base_url":"http://127.0.0.1:56806",
   [junit4]   2>   "node_name":"127.0.0.1:56806_",
   [junit4]   2>   "numShards":"2",
   [junit4]   2>   "state":"down",
   [junit4]   2>   "shard":null,
   [junit4]   2>   "collection":"collection1",
   [junit4]   2>   "operation":"state"} current state version: 3
   [junit4]   2> 899406 INFO  (coreLoadExecutor-2334-thread-1-processing-n:127.0.0.1:56806_) [n:127.0.0.1:56806_ c:collection1   x:collection1] o.a.s.c.c.ZkStateReader Add data for [collection1] ver [0]
   [junit4]   2> 899406 INFO  (coreLoadExecutor-2334-thread-1-processing-n:127.0.0.1:56806_) [n:127.0.0.1:56806_ c:collection1   x:collection1] o.a.s.c.ZkController look for our core node name
   [junit4]   2> 899406 INFO  (OverseerStateUpdate-95282835642515460-127.0.0.1:46802_-n_0000000000) [n:127.0.0.1:46802_    ] o.a.s.c.o.ReplicaMutator Update state numShards=2 message={
   [junit4]   2>   "core":"collection1",
   [junit4]   2>   "roles":null,
   [junit4]   2>   "base_url":"http://127.0.0.1:56806",
   [junit4]   2>   "node_name":"127.0.0.1:56806_",
   [junit4]   2>   "numShards":"2",
   [junit4]   2>   "state":"down",
   [junit4]   2>   "shard":null,
   [junit4]   2>   "collection":"collection1",
   [junit4]   2>   "operation":"state"}
   [junit4]   2> 899407 INFO  (OverseerStateUpdate-95282835642515460-127.0.0.1:46802_-n_0000000000) [n:127.0.0.1:46802_    ] o.a.s.c.o.ReplicaMutator Collection already exists with numShards=2
   [junit4]   2> 899407 INFO  (OverseerStateUpdate-95282835642515460-127.0.0.1:46802_-n_0000000000) [n:127.0.0.1:46802_    ] o.a.s.c.o.ReplicaMutator Assigning new node to shard shard=shard2
   [junit4]   2> 899508 INFO  (OverseerStateUpdate-95282835642515460-127.0.0.1:46802_-n_0000000000) [n:127.0.0.1:46802_    ] o.a.s.c.o.ZkStateWriter going to update_collection /collections/collection1/state.json version: 0
   [junit4]   2> 899509 INFO  (zkCallback-789-thread-1-processing-n:127.0.0.1:56806_) [n:127.0.0.1:56806_    ] o.a.s.c.c.ZkStateReader A cluster state change: [WatchedEvent state:SyncConnected type:NodeDataChanged path:/collections/collection1/state.json] for collection [collection1] has occurred - updating... (live nodes size: [2])
   [junit4]   2> 899509 INFO  (zkCallback-789-thread-1-processing-n:127.0.0.1:56806_) [n:127.0.0.1:56806_    ] o.a.s.c.c.ZkStateReader Updating data for [collection1] from [0] to [1]
   [junit4]   2> 900406 INFO  (coreLoadExecutor-2334-thread-1-processing-n:127.0.0.1:56806_) [n:127.0.0.1:56806_ c:collection1   x:collection1] o.a.s.c.ZkController waiting to find shard id in clusterstate for collection1
   [junit4]   2> 900407 INFO  (coreLoadExecutor-2334-thread-1-processing-n:127.0.0.1:56806_) [n:127.0.0.1:56806_ c:collection1   x:collection1] o.a.s.c.ZkController Check for collection zkNode:collection1
   [junit4]   2> 900407 INFO  (coreLoadExecutor-2334-thread-1-processing-n:127.0.0.1:56806_) [n:127.0.0.1:56806_ c:collection1   x:collection1] o.a.s.c.ZkController Collection zkNode exists
   [junit4]   2> 900407 INFO  (coreLoadExecutor-2334-thread-1-processing-n:127.0.0.1:56806_) [n:127.0.0.1:56806_ c:collection1   x:collection1] o.a.s.c.c.ZkStateReader Load collection config from: [/collections/collection1]
   [junit4]   2> 900407 INFO  (coreLoadExecutor-2334-thread-1-processing-n:127.0.0.1:56806_) [n:127.0.0.1:56806_ c:collection1   x:collection1] o.a.s.c.c.ZkStateReader path=[/collections/collection1] [configName]=[conf1] specified config exists in ZooKeeper
   [junit4]   2> 900407 INFO  (coreLoadExecutor-2334-thread-1-processing-n:127.0.0.1:56806_) [n:127.0.0.1:56806_ c:collection1   x:collection1] o.a.s.c.SolrResourceLoader new SolrResourceLoader for directory: '/home/jenkins/workspace/Lucene-Solr-trunk-Linux/solr/build/solr-core/test/J2/temp/solr.cloud.DistribDocExpirationUpdateProcessorTest_ACE55CC4219844FB-001/shard-1-001/cores/collection1'
   [junit4]   2> 900408 INFO  (coreLoadExecutor-2334-thread-1-processing-n:127.0.0.1:56806_) [n:127.0.0.1:56806_ c:collection1   x:collection1] o.a.s.c.SolrResourceLoader JNDI not configured for solr (NoInitialContextEx)
   [junit4]   2> 900408 INFO  (coreLoadExecutor-2334-thread-1-processing-n:127.0.0.1:56806_) [n:127.0.0.1:56806_ c:collection1   x:collection1] o.a.s.c.SolrResourceLoader solr home defaulted to 'solr/' (could not find system property or JNDI)
   [junit4]   2> 900409 INFO  (coreLoadExecutor-2334-thread-1-processing-n:127.0.0.1:56806_) [n:127.0.0.1:56806_ c:collection1   x:collection1] o.a.s.c.Config loaded config solrconfig.xml with version 0 
   [junit4]   2> 900416 INFO  (coreLoadExecutor-2334-thread-1-processing-n:127.0.0.1:56806_) [n:127.0.0.1:56806_ c:collection1   x:collection1] o.a.s.c.SolrConfig current version of requestparams : -1
   [junit4]   2> 900422 INFO  (coreLoadExecutor-2334-thread-1-processing-n:127.0.0.1:56806_) [n:127.0.0.1:56806_ c:collection1   x:collection1] o.a.s.c.SolrConfig Using Lucene MatchVersion: 6.0.0
   [junit4]   2> 900433 INFO  (coreLoadExecutor-2334-thread-1-processing-n:127.0.0.1:56806_) [n:127.0.0.1:56806_ c:collection1   x:collection1] o.a.s.c.SolrConfig Loaded SolrConfig: solrconfig.xml
   [junit4]   2> 900444 INFO  (coreLoadExecutor-2334-thread-1-processing-n:127.0.0.1:56806_) [n:127.0.0.1:56806_ c:collection1   x:collection1] o.a.s.s.IndexSchema [collection1] Schema name=test
   [junit4]   2> 900570 INFO  (coreLoadExecutor-2334-thread-1-processing-n:127.0.0.1:56806_) [n:127.0.0.1:56806_ c:collection1   x:collection1] o.a.s.s.IndexSchema default search field in schema is text
   [junit4]   2> 900571 INFO  (coreLoadExecutor-2334-thread-1-processing-n:127.0.0.1:56806_) [n:127.0.0.1:56806_ c:collection1   x:collection1] o.a.s.s.IndexSchema unique key field: id
   [junit4]   2> 900572 INFO  (coreLoadExecutor-2334-thread-1-processing-n:127.0.0.1:56806_) [n:127.0.0.1:56806_ c:collection1   x:collection1] o.a.s.s.FileExchangeRateProvider Reloading exchange rates from file currency.xml
   [junit4]   2> 900575 INFO  (coreLoadExecutor-2334-thread-1-processing-n:127.0.0.1:56806_) [n:127.0.0.1:56806_ c:collection1   x:collection1] o.a.s.s.FileExchangeRateProvider Reloading exchange rates from file currency.xml
   [junit4]   2> 900591 INFO  (coreLoadExecutor-2334-thread-1-processing-n:127.0.0.1:56806_) [n:127.0.0.1:56806_ c:collection1   x:collection1] o.a.s.c.ConfigSetProperties Did not find ConfigSet properties, assuming default properties: Can't find resource 'configsetprops.json' in classpath or '/configs/conf1', cwd=/home/jenkins/workspace/Lucene-Solr-trunk-Linux/solr/build/solr-core/test/J2
   [junit4]   2> 900591 INFO  (coreLoadExecutor-2334-thread-1-processing-n:127.0.0.1:56806_) [n:127.0.0.1:56806_ c:collection1   x:collection1] o.a.s.c.CoreContainer Creating SolrCore 'collection1' using configuration from collection collection1
   [junit4]   2> 900591 INFO  (coreLoadExecutor-2334-thread-1-processing-n:127.0.0.1:56806_) [n:127.0.0.1:56806_ c:collection1 s:shard2 r:core_node1 x:collection1] o.a.s.c.SolrCore org.apache.solr.core.MockDirectoryFactory
   [junit4]   2> 900591 INFO  (coreLoadExecutor-2334-thread-1-processing-n:127.0.0.1:56806_) [n:127.0.0.1:56806_ c:collection1 s:shard2 r:core_node1 x:collection1] o.a.s.c.SolrCore [[collection1] ] Opening new SolrCore at [/home/jenkins/workspace/Lucene-Solr-trunk-Linux/solr/build/solr-core/test/J2/temp/solr.cloud.DistribDocExpirationUpdateProcessorTest_ACE55CC4219844FB-001/shard-1-001/cores/collection1], dataDir=[/home/jenkins/workspace/Lucene-Solr-trunk-Linux/solr/build/solr-core/test/J2/../../../../../../../../../home/jenkins/workspace/Lucene-Solr-trunk-Linux/solr/build/solr-core/test/J2/temp/solr.cloud.DistribDocExpirationUpdateProcessorTest_ACE55CC4219844FB-001/shard-1-001/cores/collection1/data/]
   [junit4]   2> 900591 INFO  (coreLoadExecutor-2334-thread-1-processing-n:127.0.0.1:56806_) [n:127.0.0.1:56806_ c:collection1 s:shard2 r:core_node1 x:collection1] o.a.s.c.SolrCore JMX monitoring not detected for core: collection1
   [junit4]   2> 900592 INFO  (coreLoadExecutor-2334-thread-1-processing-n:127.0.0.1:56806_) [n:127.0.0.1:56806_ c:collection1 s:shard2 r:core_node1 x:collection1] o.a.s.c.CachingDirectoryFactory return new directory for /home/jenkins/workspace/Lucene-Solr-trunk-Linux/solr/build/solr-core/test/J2/../../../../../../../../../home/jenkins/workspace/Lucene-Solr-trunk-Linux/solr/build/solr-core/test/J2/temp/solr.cloud.DistribDocExpirationUpdateProcessorTest_ACE55CC4219844FB-001/shard-1-001/cores/collection1/data
   [junit4]   2> 900592 INFO  (coreLoadExecutor-2334-thread-1-processing-n:127.0.0.1:56806_) [n:127.0.0.1:56806_ c:collection1 s:shard2 r:core_node1 x:collection1] o.a.s.c.SolrCore New index directory detected: old=null new=/home/jenkins/workspace/Lucene-Solr-trunk-Linux/solr/build/solr-core/test/J2/../../../../../../../../../home/jenkins/workspace/Lucene-Solr-trunk-Linux/solr/build/solr-core/test/J2/temp/solr.cloud.DistribDocExpirationUpdateProcessorTest_ACE55CC4219844FB-001/shard-1-001/cores/collection1/data/index/
   [junit4]   2> 900592 WARN  (coreLoadExecutor-2334-thread-1-processing-n:127.0.0.1:56806_) [n:127.0.0.1:56806_ c:collection1 s:shard2 r:core_node1 x:collection1] o.a.s.c.SolrCore [collection1] Solr index directory '/home/jenkins/workspace/Lucene-Solr-trunk-Linux/solr/build/solr-core/test/J2/../../../../../../../../../home/jenkins/workspace/Lucene-Solr-trunk-Linux/solr/build/solr-core/test/J2/temp/solr.cloud.DistribDocExpirationUpdateProcessorTest_ACE55CC4219844FB-001/shard-1-001/cores/collection1/data/index' doesn't exist. Creating new index...
   [junit4]   2> 900592 INFO  (coreLoadExecutor-2334-thread-1-processing-n:127.0.0.1:56806_) [n:127.0.0.1:56806_ c:collection1 s:shard2 r:core_node1 x:collection1] o.a.s.c.CachingDirectoryFactory return new directory for /home/jenkins/workspace/Lucene-Solr-trunk-Linux/solr/build/solr-core/test/J2/../../../../../../../../../home/jenkins/workspace/Lucene-Solr-trunk-Linux/solr/build/solr-core/test/J2/temp/solr.cloud.DistribDocExpirationUpdateProcessorTest_ACE55CC4219844FB-001/shard-1-001/cores/collection1/data/index
   [junit4]   2> 900593 INFO  (coreLoadExecutor-2334-thread-1-processing-n:127.0.0.1:56806_) [n:127.0.0.1:56806_ c:collection1 s:shard2 r:core_node1 x:collection1] o.a.s.u.RandomMergePolicy RandomMergePolicy wrapping class org.apache.lucene.index.LogByteSizeMergePolicy: [LogByteSizeMergePolicy: minMergeSize=1677721, mergeFactor=49, maxMergeSize=2147483648, maxMergeSizeForForcedMerge=9223372036854775807, calibrateSizeByDeletes=true, maxMergeDocs=2147483647, maxCFSSegmentSizeMB=8.796093022207999E12, noCFSRatio=0.5109955774658371]
   [junit4]   2> 900593 INFO  (coreLoadExecutor-2334-thread-1-processing-n:127.0.0.1:56806_) [n:127.0.0.1:56806_ c:collection1 s:shard2 r:core_node1 x:collection1] o.a.s.c.SolrDeletionPolicy SolrDeletionPolicy.onCommit: commits: num=1
   [junit4]   2> 	commit{dir=MockDirectoryWrapper(RAMDirectory@aa1762 lockFactory=org.apache.lucene.store.SingleInstanceLockFactory@a320e1),segFN=segments_1,generation=1}
   [junit4]   2> 900593 INFO  (coreLoadExecutor-2334-thread-1-processing-n:127.0.0.1:56806_) [n:127.0.0.1:56806_ c:collection1 s:shard2 r:core_node1 x:collection1] o.a.s.c.SolrDeletionPolicy newest commit generation = 1
   [junit4]   2> 900593 INFO  (OldIndexDirectoryCleanupThreadForCore-collection1) [n:127.0.0.1:56806_ c:collection1 s:shard2 r:core_node1 x:collection1] o.a.s.c.SolrCore Looking for old index directories to cleanup for core collection1 in /home/jenkins/workspace/Lucene-Solr-trunk-Linux/solr/build/solr-core/test/J2/../../../../../../../../../home/jenkins/workspace/Lucene-Solr-trunk-Linux/solr/build/solr-core/test/J2/temp/solr.cloud.DistribDocExpirationUpdateProcessorTest_ACE55CC4219844FB-001/shard-1-001/cores/collection1/data/
   [junit4]   2> 900594 WARN  (OldIndexDirectoryCleanupThreadForCore-collection1) [n:127.0.0.1:56806_ c:collection1 s:shard2 r:core_node1 x:colle

[...truncated too long message...]

 r:core_node4 x:collection1] o.a.s.c.CachingDirectoryFactory Closing MockDirectoryFactory - 2 directories currently being tracked
   [junit4]   2> 956913 INFO  (zkCallback-805-thread-2-processing-n:127.0.0.1:56498_) [n:127.0.0.1:56498_ c:collection1 s:shard1 r:core_node4 x:collection1] o.a.s.c.CachingDirectoryFactory looking to close /home/jenkins/workspace/Lucene-Solr-trunk-Linux/solr/build/solr-core/test/J2/../../../../../../../../../home/jenkins/workspace/Lucene-Solr-trunk-Linux/solr/build/solr-core/test/J2/temp/solr.cloud.DistribDocExpirationUpdateProcessorTest_ACE55CC4219844FB-001/shard-4-001/cores/collection1/data [CachedDir<<refCount=0;path=/home/jenkins/workspace/Lucene-Solr-trunk-Linux/solr/build/solr-core/test/J2/../../../../../../../../../home/jenkins/workspace/Lucene-Solr-trunk-Linux/solr/build/solr-core/test/J2/temp/solr.cloud.DistribDocExpirationUpdateProcessorTest_ACE55CC4219844FB-001/shard-4-001/cores/collection1/data;done=false>>]
   [junit4]   2> 956913 INFO  (zkCallback-805-thread-2-processing-n:127.0.0.1:56498_) [n:127.0.0.1:56498_ c:collection1 s:shard1 r:core_node4 x:collection1] o.a.s.c.CachingDirectoryFactory Closing directory: /home/jenkins/workspace/Lucene-Solr-trunk-Linux/solr/build/solr-core/test/J2/../../../../../../../../../home/jenkins/workspace/Lucene-Solr-trunk-Linux/solr/build/solr-core/test/J2/temp/solr.cloud.DistribDocExpirationUpdateProcessorTest_ACE55CC4219844FB-001/shard-4-001/cores/collection1/data
   [junit4]   2> 956913 INFO  (zkCallback-805-thread-2-processing-n:127.0.0.1:56498_) [n:127.0.0.1:56498_ c:collection1 s:shard1 r:core_node4 x:collection1] o.a.s.c.CachingDirectoryFactory looking to close /home/jenkins/workspace/Lucene-Solr-trunk-Linux/solr/build/solr-core/test/J2/../../../../../../../../../home/jenkins/workspace/Lucene-Solr-trunk-Linux/solr/build/solr-core/test/J2/temp/solr.cloud.DistribDocExpirationUpdateProcessorTest_ACE55CC4219844FB-001/shard-4-001/cores/collection1/data/index [CachedDir<<refCount=0;path=/home/jenkins/workspace/Lucene-Solr-trunk-Linux/solr/build/solr-core/test/J2/../../../../../../../../../home/jenkins/workspace/Lucene-Solr-trunk-Linux/solr/build/solr-core/test/J2/temp/solr.cloud.DistribDocExpirationUpdateProcessorTest_ACE55CC4219844FB-001/shard-4-001/cores/collection1/data/index;done=false>>]
   [junit4]   2> 956913 INFO  (zkCallback-805-thread-2-processing-n:127.0.0.1:56498_) [n:127.0.0.1:56498_ c:collection1 s:shard1 r:core_node4 x:collection1] o.a.s.c.CachingDirectoryFactory Closing directory: /home/jenkins/workspace/Lucene-Solr-trunk-Linux/solr/build/solr-core/test/J2/../../../../../../../../../home/jenkins/workspace/Lucene-Solr-trunk-Linux/solr/build/solr-core/test/J2/temp/solr.cloud.DistribDocExpirationUpdateProcessorTest_ACE55CC4219844FB-001/shard-4-001/cores/collection1/data/index
   [junit4]   2> 956914 INFO  (TEST-DistribDocExpirationUpdateProcessorTest.test-seed#[ACE55CC4219844FB]) [    ] o.e.j.s.ServerConnector Stopped ServerConnector@bdb822{HTTP/1.1}{127.0.0.1:0}
   [junit4]   2> 956914 INFO  (TEST-DistribDocExpirationUpdateProcessorTest.test-seed#[ACE55CC4219844FB]) [    ] o.e.j.s.h.ContextHandler Stopped o.e.j.s.ServletContextHandler@10b8e91{/,null,UNAVAILABLE}
   [junit4]   2> 956915 INFO  (TEST-DistribDocExpirationUpdateProcessorTest.test-seed#[ACE55CC4219844FB]) [n:127.0.0.1:56498_ c:collection1 s:shard1 r:core_node4 x:collection1] o.a.s.c.ZkTestServer connecting to 127.0.0.1:46705 46705
   [junit4]   2> 956941 INFO  (Thread-2223) [    ] o.a.s.c.ZkTestServer connecting to 127.0.0.1:46705 46705
   [junit4]   2> 956941 WARN  (Thread-2223) [    ] o.a.s.c.ZkTestServer Watch limit violations: 
   [junit4]   2> Maximum concurrent create/delete watches above limit:
   [junit4]   2> 
   [junit4]   2> 	6	/solr/aliases.json
   [junit4]   2> 	5	/solr/security.json
   [junit4]   2> 	5	/solr/configs/conf1
   [junit4]   2> 
   [junit4]   2> Maximum concurrent data watches above limit:
   [junit4]   2> 
   [junit4]   2> 	6	/solr/clusterstate.json
   [junit4]   2> 	4	/solr/collections/collection1/state.json
   [junit4]   2> 
   [junit4]   2> Maximum concurrent children watches above limit:
   [junit4]   2> 
   [junit4]   2> 	6	/solr/live_nodes
   [junit4]   2> 	6	/solr/collections
   [junit4]   2> 	3	/solr/overseer/queue
   [junit4]   2> 	3	/solr/overseer/collection-queue-work
   [junit4]   2> 	2	/solr/overseer/queue-work
   [junit4]   2> 
   [junit4]   2> NOTE: reproduce with: ant test  -Dtestcase=DistribDocExpirationUpdateProcessorTest -Dtests.method=test -Dtests.seed=ACE55CC4219844FB -Dtests.multiplier=3 -Dtests.slow=true -Dtests.locale=zh -Dtests.timezone=Asia/Baghdad -Dtests.asserts=true -Dtests.file.encoding=ISO-8859-1
   [junit4] FAILURE 60.5s J2 | DistribDocExpirationUpdateProcessorTest.test <<<
   [junit4]    > Throwable #1: java.lang.AssertionError: Exactly one shard should have changed, instead: [shard2, shard1] nodes=([core_node3(shard2), core_node2(shard1), core_node4(shard1)]) expected:<1> but was:<2>
   [junit4]    > 	at __randomizedtesting.SeedInfo.seed([ACE55CC4219844FB:24B1631E8F642903]:0)
   [junit4]    > 	at org.apache.solr.cloud.DistribDocExpirationUpdateProcessorTest.test(DistribDocExpirationUpdateProcessorTest.java:118)
   [junit4]    > 	at org.apache.solr.BaseDistributedSearchTestCase$ShardsRepeatRule$ShardsFixedStatement.callStatement(BaseDistributedSearchTestCase.java:965)
   [junit4]    > 	at org.apache.solr.BaseDistributedSearchTestCase$ShardsRepeatRule$ShardsStatement.evaluate(BaseDistributedSearchTestCase.java:940)
   [junit4]    > 	at java.lang.Thread.run(Thread.java:745)
   [junit4]   2> 956945 INFO  (SUITE-DistribDocExpirationUpdateProcessorTest-seed#[ACE55CC4219844FB]-worker) [n:127.0.0.1:56498_ c:collection1 s:shard1 r:core_node4 x:collection1] o.a.s.SolrTestCaseJ4 ###deleteCore
   [junit4]   2> NOTE: leaving temporary files on disk at: /home/jenkins/workspace/Lucene-Solr-trunk-Linux/solr/build/solr-core/test/J2/temp/solr.cloud.DistribDocExpirationUpdateProcessorTest_ACE55CC4219844FB-001
   [junit4]   2> Jan 27, 2016 1:19:10 PM com.carrotsearch.randomizedtesting.ThreadLeakControl checkThreadLeaks
   [junit4]   2> WARNING: Will linger awaiting termination of 2 leaked thread(s).
   [junit4]   2> NOTE: test params are: codec=Asserting(Lucene60): {_version_=Lucene50(blocksize=128), eXpField_tdt=Lucene50(blocksize=128), tTl_s=Lucene50(blocksize=128), id=PostingsFormat(name=Asserting)}, docValues:{}, sim=RandomSimilarity(queryNorm=false,coord=crazy): {}, locale=zh, timezone=Asia/Baghdad
   [junit4]   2> NOTE: Linux 3.19.0-47-generic i386/Oracle Corporation 1.8.0_66 (32-bit)/cpus=12,threads=1,free=158620080,total=292814848
   [junit4]   2> NOTE: All tests run in this JVM: [FullSolrCloudDistribCmdsTest, TestSolrDeletionPolicy1, ShardSplitTest, TestCollectionAPI, SuggesterWFSTTest, TestJmxMonitoredMap, AnalyticsQueryTest, AutoCommitTest, DistributedVersionInfoTest, TestExactSharedStatsCache, TestSweetSpotSimilarityFactory, XmlUpdateRequestHandlerTest, TestRemoveLastDynamicCopyField, TestHdfsUpdateLog, FieldMutatingUpdateProcessorTest, BasicDistributedZk2Test, TestHashQParserPlugin, RemoteQueryErrorTest, TestCollationFieldDocValues, TestManagedSchemaDynamicFieldResource, TestLeaderInitiatedRecoveryThread, DistributedQueryComponentOptimizationTest, BlockJoinFacetSimpleTest, TestStressReorder, TestSearcherReuse, SuggesterTSTTest, TestManagedResourceStorage, HdfsDirectoryFactoryTest, MigrateRouteKeyTest, BaseCdcrDistributedZkTest, ConcurrentDeleteAndCreateCollectionTest, LukeRequestHandlerTest, CollectionStateFormat2Test, TestElisionMultitermQuery, SuggesterTest, TestInitParams, SimpleCollectionCreateDeleteTest, RecoveryZkTest, CheckHdfsIndexTest, BadComponentTest, TestRestoreCore, TestIndexingPerformance, ShowFileRequestHandlerTest, OverseerStatusTest, TestShardHandlerFactory, TestCollationField, TestFieldResource, TestSchemaSimilarityResource, TestConfigSetImmutable, CleanupOldIndexTest, TestSolrQueryParserDefaultOperatorResource, TestCSVResponseWriter, TestSolrXml, CircularListTest, DirectUpdateHandlerTest, ChangedSchemaMergeTest, QueryParsingTest, TestFuzzyAnalyzedSuggestions, TestPerFieldSimilarity, SimpleMLTQParserTest, RequestHandlersTest, DirectSolrConnectionTest, ExplicitHLLTest, TermVectorComponentDistributedTest, ClusterStateTest, ZkStateWriterTest, DistributedFacetPivotSmallTest, TestDynamicFieldCollectionResource, FieldAnalysisRequestHandlerTest, HdfsThreadLeakTest, LeaderFailoverAfterPartitionTest, TestSearchPerf, BadIndexSchemaTest, StatelessScriptUpdateProcessorFactoryTest, TestPostingsSolrHighlighter, DeleteReplicaTest, TestFastWriter, DistribDocExpirationUpdateProcessorTest]
   [junit4] Completed [248/577 (1!)] on J2 in 60.77s, 1 test, 1 failure <<< FAILURES!

[...truncated 1029 lines...]
BUILD FAILED
/home/jenkins/workspace/Lucene-Solr-trunk-Linux/build.xml:740: The following error occurred while executing this line:
/home/jenkins/workspace/Lucene-Solr-trunk-Linux/build.xml:684: The following error occurred while executing this line:
/home/jenkins/workspace/Lucene-Solr-trunk-Linux/build.xml:59: The following error occurred while executing this line:
/home/jenkins/workspace/Lucene-Solr-trunk-Linux/solr/build.xml:233: The following error occurred while executing this line:
/home/jenkins/workspace/Lucene-Solr-trunk-Linux/solr/common-build.xml:524: The following error occurred while executing this line:
/home/jenkins/workspace/Lucene-Solr-trunk-Linux/lucene/common-build.xml:1457: The following error occurred while executing this line:
/home/jenkins/workspace/Lucene-Solr-trunk-Linux/lucene/common-build.xml:1014: There were test failures: 577 suites (8 ignored), 2317 tests, 1 failure, 114 ignored (70 assumptions) [seed: ACE55CC4219844FB]

Total time: 55 minutes 33 seconds
Build step 'Invoke Ant' marked build as failure
Archiving artifacts
[WARNINGS] Skipping publisher since build result is FAILURE
Recording test results
Email was triggered for: Failure - Any
Sending email for trigger: Failure - Any



Mime
View raw message