lucene-dev mailing list archives

Site index · List index
Message view « Date » · « Thread »
Top « Date » · « Thread »
From Policeman Jenkins Server <jenk...@thetaphi.de>
Subject [JENKINS-EA] Lucene-Solr-trunk-Linux (32bit/jdk-9-ea+95) - Build # 15534 - Still Failing!
Date Tue, 12 Jan 2016 23:20:22 GMT
Build: http://jenkins.thetaphi.de/job/Lucene-Solr-trunk-Linux/15534/
Java: 32bit/jdk-9-ea+95 -server -XX:+UseSerialGC -XX:-CompactStrings

1 tests failed.
FAILED:  org.apache.solr.cloud.HttpPartitionTest.test

Error Message:
Didn't see all replicas for shard shard1 in c8n_1x2 come up within 30000 ms! ClusterState: {   "collection1":{     "replicationFactor":"1",     "shards":{       "shard1":{         "range":"80000000-ffffffff",         "state":"active",         "replicas":{"core_node2":{             "core":"collection1",             "base_url":"http://127.0.0.1:54946/zz",             "node_name":"127.0.0.1:54946_zz",             "state":"active",             "leader":"true"}}},       "shard2":{         "range":"0-7fffffff",         "state":"active",         "replicas":{           "core_node1":{             "core":"collection1",             "base_url":"http://127.0.0.1:37497/zz",             "node_name":"127.0.0.1:37497_zz",             "state":"active",             "leader":"true"},           "core_node3":{             "core":"collection1",             "base_url":"http://127.0.0.1:60847/zz",             "node_name":"127.0.0.1:60847_zz",             "state":"active"}}}},     "router":{"name":"compositeId"},     "maxShardsPerNode":"1",     "autoAddReplicas":"false",     "autoCreated":"true"},   "control_collection":{     "replicationFactor":"1",     "shards":{"shard1":{         "range":"80000000-7fffffff",         "state":"active",         "replicas":{"core_node1":{             "core":"collection1",             "base_url":"http://127.0.0.1:38659/zz",             "node_name":"127.0.0.1:38659_zz",             "state":"active",             "leader":"true"}}}},     "router":{"name":"compositeId"},     "maxShardsPerNode":"1",     "autoAddReplicas":"false",     "autoCreated":"true"},   "c8n_1x2":{     "replicationFactor":"2",     "shards":{"shard1":{         "range":"80000000-7fffffff",         "state":"active",         "replicas":{           "core_node1":{             "core":"c8n_1x2_shard1_replica1",             "base_url":"http://127.0.0.1:38659/zz",             "node_name":"127.0.0.1:38659_zz",             "state":"active",             "leader":"true"},           "core_node2":{             "core":"c8n_1x2_shard1_replica2",             "base_url":"http://127.0.0.1:37497/zz",             "node_name":"127.0.0.1:37497_zz",             "state":"recovering"}}}},     "router":{"name":"compositeId"},     "maxShardsPerNode":"1",     "autoAddReplicas":"false"},   "collMinRf_1x3":{     "replicationFactor":"3",     "shards":{"shard1":{         "range":"80000000-7fffffff",         "state":"active",         "replicas":{           "core_node1":{             "core":"collMinRf_1x3_shard1_replica1",             "base_url":"http://127.0.0.1:60847/zz",             "node_name":"127.0.0.1:60847_zz",             "state":"active",             "leader":"true"},           "core_node2":{             "core":"collMinRf_1x3_shard1_replica3",             "base_url":"http://127.0.0.1:38659/zz",             "node_name":"127.0.0.1:38659_zz",             "state":"active"},           "core_node3":{             "core":"collMinRf_1x3_shard1_replica2",             "base_url":"http://127.0.0.1:54946/zz",             "node_name":"127.0.0.1:54946_zz",             "state":"active"}}}},     "router":{"name":"compositeId"},     "maxShardsPerNode":"1",     "autoAddReplicas":"false"}}

Stack Trace:
java.lang.AssertionError: Didn't see all replicas for shard shard1 in c8n_1x2 come up within 30000 ms! ClusterState: {
  "collection1":{
    "replicationFactor":"1",
    "shards":{
      "shard1":{
        "range":"80000000-ffffffff",
        "state":"active",
        "replicas":{"core_node2":{
            "core":"collection1",
            "base_url":"http://127.0.0.1:54946/zz",
            "node_name":"127.0.0.1:54946_zz",
            "state":"active",
            "leader":"true"}}},
      "shard2":{
        "range":"0-7fffffff",
        "state":"active",
        "replicas":{
          "core_node1":{
            "core":"collection1",
            "base_url":"http://127.0.0.1:37497/zz",
            "node_name":"127.0.0.1:37497_zz",
            "state":"active",
            "leader":"true"},
          "core_node3":{
            "core":"collection1",
            "base_url":"http://127.0.0.1:60847/zz",
            "node_name":"127.0.0.1:60847_zz",
            "state":"active"}}}},
    "router":{"name":"compositeId"},
    "maxShardsPerNode":"1",
    "autoAddReplicas":"false",
    "autoCreated":"true"},
  "control_collection":{
    "replicationFactor":"1",
    "shards":{"shard1":{
        "range":"80000000-7fffffff",
        "state":"active",
        "replicas":{"core_node1":{
            "core":"collection1",
            "base_url":"http://127.0.0.1:38659/zz",
            "node_name":"127.0.0.1:38659_zz",
            "state":"active",
            "leader":"true"}}}},
    "router":{"name":"compositeId"},
    "maxShardsPerNode":"1",
    "autoAddReplicas":"false",
    "autoCreated":"true"},
  "c8n_1x2":{
    "replicationFactor":"2",
    "shards":{"shard1":{
        "range":"80000000-7fffffff",
        "state":"active",
        "replicas":{
          "core_node1":{
            "core":"c8n_1x2_shard1_replica1",
            "base_url":"http://127.0.0.1:38659/zz",
            "node_name":"127.0.0.1:38659_zz",
            "state":"active",
            "leader":"true"},
          "core_node2":{
            "core":"c8n_1x2_shard1_replica2",
            "base_url":"http://127.0.0.1:37497/zz",
            "node_name":"127.0.0.1:37497_zz",
            "state":"recovering"}}}},
    "router":{"name":"compositeId"},
    "maxShardsPerNode":"1",
    "autoAddReplicas":"false"},
  "collMinRf_1x3":{
    "replicationFactor":"3",
    "shards":{"shard1":{
        "range":"80000000-7fffffff",
        "state":"active",
        "replicas":{
          "core_node1":{
            "core":"collMinRf_1x3_shard1_replica1",
            "base_url":"http://127.0.0.1:60847/zz",
            "node_name":"127.0.0.1:60847_zz",
            "state":"active",
            "leader":"true"},
          "core_node2":{
            "core":"collMinRf_1x3_shard1_replica3",
            "base_url":"http://127.0.0.1:38659/zz",
            "node_name":"127.0.0.1:38659_zz",
            "state":"active"},
          "core_node3":{
            "core":"collMinRf_1x3_shard1_replica2",
            "base_url":"http://127.0.0.1:54946/zz",
            "node_name":"127.0.0.1:54946_zz",
            "state":"active"}}}},
    "router":{"name":"compositeId"},
    "maxShardsPerNode":"1",
    "autoAddReplicas":"false"}}
	at __randomizedtesting.SeedInfo.seed([74A05DFD49F5F752:FCF46227E7099AAA]:0)
	at org.junit.Assert.fail(Assert.java:93)
	at org.apache.solr.cloud.AbstractFullDistribZkTestBase.ensureAllReplicasAreActive(AbstractFullDistribZkTestBase.java:1864)
	at org.apache.solr.cloud.HttpPartitionTest.testRf2(HttpPartitionTest.java:349)
	at org.apache.solr.cloud.HttpPartitionTest.test(HttpPartitionTest.java:109)
	at sun.reflect.NativeMethodAccessorImpl.invoke0(Native Method)
	at sun.reflect.NativeMethodAccessorImpl.invoke(NativeMethodAccessorImpl.java:62)
	at sun.reflect.DelegatingMethodAccessorImpl.invoke(DelegatingMethodAccessorImpl.java:43)
	at java.lang.reflect.Method.invoke(Method.java:520)
	at com.carrotsearch.randomizedtesting.RandomizedRunner.invoke(RandomizedRunner.java:1764)
	at com.carrotsearch.randomizedtesting.RandomizedRunner$8.evaluate(RandomizedRunner.java:871)
	at com.carrotsearch.randomizedtesting.RandomizedRunner$9.evaluate(RandomizedRunner.java:907)
	at com.carrotsearch.randomizedtesting.RandomizedRunner$10.evaluate(RandomizedRunner.java:921)
	at org.apache.solr.BaseDistributedSearchTestCase$ShardsRepeatRule$ShardsFixedStatement.callStatement(BaseDistributedSearchTestCase.java:965)
	at org.apache.solr.BaseDistributedSearchTestCase$ShardsRepeatRule$ShardsStatement.evaluate(BaseDistributedSearchTestCase.java:940)
	at com.carrotsearch.randomizedtesting.rules.SystemPropertiesRestoreRule$1.evaluate(SystemPropertiesRestoreRule.java:57)
	at org.apache.lucene.util.TestRuleSetupTeardownChained$1.evaluate(TestRuleSetupTeardownChained.java:50)
	at org.apache.lucene.util.AbstractBeforeAfterRule$1.evaluate(AbstractBeforeAfterRule.java:46)
	at org.apache.lucene.util.TestRuleThreadAndTestName$1.evaluate(TestRuleThreadAndTestName.java:49)
	at org.apache.lucene.util.TestRuleIgnoreAfterMaxFailures$1.evaluate(TestRuleIgnoreAfterMaxFailures.java:65)
	at org.apache.lucene.util.TestRuleMarkFailure$1.evaluate(TestRuleMarkFailure.java:48)
	at com.carrotsearch.randomizedtesting.rules.StatementAdapter.evaluate(StatementAdapter.java:36)
	at com.carrotsearch.randomizedtesting.ThreadLeakControl$StatementRunner.run(ThreadLeakControl.java:367)
	at com.carrotsearch.randomizedtesting.ThreadLeakControl.forkTimeoutingTask(ThreadLeakControl.java:809)
	at com.carrotsearch.randomizedtesting.ThreadLeakControl$3.evaluate(ThreadLeakControl.java:460)
	at com.carrotsearch.randomizedtesting.RandomizedRunner.runSingleTest(RandomizedRunner.java:880)
	at com.carrotsearch.randomizedtesting.RandomizedRunner$5.evaluate(RandomizedRunner.java:781)
	at com.carrotsearch.randomizedtesting.RandomizedRunner$6.evaluate(RandomizedRunner.java:816)
	at com.carrotsearch.randomizedtesting.RandomizedRunner$7.evaluate(RandomizedRunner.java:827)
	at com.carrotsearch.randomizedtesting.rules.StatementAdapter.evaluate(StatementAdapter.java:36)
	at com.carrotsearch.randomizedtesting.rules.SystemPropertiesRestoreRule$1.evaluate(SystemPropertiesRestoreRule.java:57)
	at org.apache.lucene.util.AbstractBeforeAfterRule$1.evaluate(AbstractBeforeAfterRule.java:46)
	at com.carrotsearch.randomizedtesting.rules.StatementAdapter.evaluate(StatementAdapter.java:36)
	at org.apache.lucene.util.TestRuleStoreClassName$1.evaluate(TestRuleStoreClassName.java:42)
	at com.carrotsearch.randomizedtesting.rules.NoShadowingOrOverridesOnMethodsRule$1.evaluate(NoShadowingOrOverridesOnMethodsRule.java:40)
	at com.carrotsearch.randomizedtesting.rules.NoShadowingOrOverridesOnMethodsRule$1.evaluate(NoShadowingOrOverridesOnMethodsRule.java:40)
	at com.carrotsearch.randomizedtesting.rules.StatementAdapter.evaluate(StatementAdapter.java:36)
	at com.carrotsearch.randomizedtesting.rules.StatementAdapter.evaluate(StatementAdapter.java:36)
	at com.carrotsearch.randomizedtesting.rules.StatementAdapter.evaluate(StatementAdapter.java:36)
	at org.apache.lucene.util.TestRuleAssertionsRequired$1.evaluate(TestRuleAssertionsRequired.java:54)
	at org.apache.lucene.util.TestRuleMarkFailure$1.evaluate(TestRuleMarkFailure.java:48)
	at org.apache.lucene.util.TestRuleIgnoreAfterMaxFailures$1.evaluate(TestRuleIgnoreAfterMaxFailures.java:65)
	at org.apache.lucene.util.TestRuleIgnoreTestSuites$1.evaluate(TestRuleIgnoreTestSuites.java:55)
	at com.carrotsearch.randomizedtesting.rules.StatementAdapter.evaluate(StatementAdapter.java:36)
	at com.carrotsearch.randomizedtesting.ThreadLeakControl$StatementRunner.run(ThreadLeakControl.java:367)
	at java.lang.Thread.run(Thread.java:747)




Build Log:
[...truncated 9813 lines...]
   [junit4] Suite: org.apache.solr.cloud.HttpPartitionTest
   [junit4]   2> Creating dataDir: /home/jenkins/workspace/Lucene-Solr-trunk-Linux/solr/build/solr-core/test/J1/temp/solr.cloud.HttpPartitionTest_74A05DFD49F5F752-001/init-core-data-001
   [junit4]   2> 286401 INFO  (SUITE-HttpPartitionTest-seed#[74A05DFD49F5F752]-worker) [    ] o.a.s.BaseDistributedSearchTestCase Setting hostContext system property: /zz/
   [junit4]   2> 286403 INFO  (TEST-HttpPartitionTest.test-seed#[74A05DFD49F5F752]) [    ] o.a.s.c.ZkTestServer STARTING ZK TEST SERVER
   [junit4]   2> 286403 INFO  (Thread-825) [    ] o.a.s.c.ZkTestServer client port:0.0.0.0/0.0.0.0:0
   [junit4]   2> 286403 INFO  (Thread-825) [    ] o.a.s.c.ZkTestServer Starting server
   [junit4]   2> 286503 INFO  (TEST-HttpPartitionTest.test-seed#[74A05DFD49F5F752]) [    ] o.a.s.c.ZkTestServer start zk server on port:39265
   [junit4]   2> 286503 INFO  (TEST-HttpPartitionTest.test-seed#[74A05DFD49F5F752]) [    ] o.a.s.c.c.SolrZkClient Using default ZkCredentialsProvider
   [junit4]   2> 286503 INFO  (TEST-HttpPartitionTest.test-seed#[74A05DFD49F5F752]) [    ] o.a.s.c.c.ConnectionManager Waiting for client to connect to ZooKeeper
   [junit4]   2> 286510 INFO  (zkCallback-375-thread-1) [    ] o.a.s.c.c.ConnectionManager Watcher org.apache.solr.common.cloud.ConnectionManager@1e54edb name:ZooKeeperConnection Watcher:127.0.0.1:39265 got event WatchedEvent state:SyncConnected type:None path:null path:null type:None
   [junit4]   2> 286510 INFO  (TEST-HttpPartitionTest.test-seed#[74A05DFD49F5F752]) [    ] o.a.s.c.c.ConnectionManager Client is connected to ZooKeeper
   [junit4]   2> 286510 INFO  (TEST-HttpPartitionTest.test-seed#[74A05DFD49F5F752]) [    ] o.a.s.c.c.SolrZkClient Using default ZkACLProvider
   [junit4]   2> 286510 INFO  (TEST-HttpPartitionTest.test-seed#[74A05DFD49F5F752]) [    ] o.a.s.c.c.SolrZkClient makePath: /solr
   [junit4]   2> 286512 INFO  (TEST-HttpPartitionTest.test-seed#[74A05DFD49F5F752]) [    ] o.a.s.c.c.SolrZkClient Using default ZkCredentialsProvider
   [junit4]   2> 286512 INFO  (TEST-HttpPartitionTest.test-seed#[74A05DFD49F5F752]) [    ] o.a.s.c.c.ConnectionManager Waiting for client to connect to ZooKeeper
   [junit4]   2> 286512 INFO  (zkCallback-376-thread-1) [    ] o.a.s.c.c.ConnectionManager Watcher org.apache.solr.common.cloud.ConnectionManager@16ef1ab name:ZooKeeperConnection Watcher:127.0.0.1:39265/solr got event WatchedEvent state:SyncConnected type:None path:null path:null type:None
   [junit4]   2> 286512 INFO  (TEST-HttpPartitionTest.test-seed#[74A05DFD49F5F752]) [    ] o.a.s.c.c.ConnectionManager Client is connected to ZooKeeper
   [junit4]   2> 286513 INFO  (TEST-HttpPartitionTest.test-seed#[74A05DFD49F5F752]) [    ] o.a.s.c.c.SolrZkClient Using default ZkACLProvider
   [junit4]   2> 286513 INFO  (TEST-HttpPartitionTest.test-seed#[74A05DFD49F5F752]) [    ] o.a.s.c.c.SolrZkClient makePath: /collections/collection1
   [junit4]   2> 286526 INFO  (TEST-HttpPartitionTest.test-seed#[74A05DFD49F5F752]) [    ] o.a.s.c.c.SolrZkClient makePath: /collections/collection1/shards
   [junit4]   2> 286526 INFO  (TEST-HttpPartitionTest.test-seed#[74A05DFD49F5F752]) [    ] o.a.s.c.c.SolrZkClient makePath: /collections/control_collection
   [junit4]   2> 286527 INFO  (TEST-HttpPartitionTest.test-seed#[74A05DFD49F5F752]) [    ] o.a.s.c.c.SolrZkClient makePath: /collections/control_collection/shards
   [junit4]   2> 286528 INFO  (TEST-HttpPartitionTest.test-seed#[74A05DFD49F5F752]) [    ] o.a.s.c.AbstractZkTestCase put /home/jenkins/workspace/Lucene-Solr-trunk-Linux/solr/core/src/test-files/solr/collection1/conf/solrconfig-tlog.xml to /configs/conf1/solrconfig.xml
   [junit4]   2> 286528 INFO  (TEST-HttpPartitionTest.test-seed#[74A05DFD49F5F752]) [    ] o.a.s.c.c.SolrZkClient makePath: /configs/conf1/solrconfig.xml
   [junit4]   2> 286532 INFO  (TEST-HttpPartitionTest.test-seed#[74A05DFD49F5F752]) [    ] o.a.s.c.AbstractZkTestCase put /home/jenkins/workspace/Lucene-Solr-trunk-Linux/solr/core/src/test-files/solr/collection1/conf/schema.xml to /configs/conf1/schema.xml
   [junit4]   2> 286532 INFO  (TEST-HttpPartitionTest.test-seed#[74A05DFD49F5F752]) [    ] o.a.s.c.c.SolrZkClient makePath: /configs/conf1/schema.xml
   [junit4]   2> 286537 INFO  (TEST-HttpPartitionTest.test-seed#[74A05DFD49F5F752]) [    ] o.a.s.c.AbstractZkTestCase put /home/jenkins/workspace/Lucene-Solr-trunk-Linux/solr/core/src/test-files/solr/collection1/conf/solrconfig.snippet.randomindexconfig.xml to /configs/conf1/solrconfig.snippet.randomindexconfig.xml
   [junit4]   2> 286537 INFO  (TEST-HttpPartitionTest.test-seed#[74A05DFD49F5F752]) [    ] o.a.s.c.c.SolrZkClient makePath: /configs/conf1/solrconfig.snippet.randomindexconfig.xml
   [junit4]   2> 286556 INFO  (TEST-HttpPartitionTest.test-seed#[74A05DFD49F5F752]) [    ] o.a.s.c.AbstractZkTestCase put /home/jenkins/workspace/Lucene-Solr-trunk-Linux/solr/core/src/test-files/solr/collection1/conf/stopwords.txt to /configs/conf1/stopwords.txt
   [junit4]   2> 286556 INFO  (TEST-HttpPartitionTest.test-seed#[74A05DFD49F5F752]) [    ] o.a.s.c.c.SolrZkClient makePath: /configs/conf1/stopwords.txt
   [junit4]   2> 286557 INFO  (TEST-HttpPartitionTest.test-seed#[74A05DFD49F5F752]) [    ] o.a.s.c.AbstractZkTestCase put /home/jenkins/workspace/Lucene-Solr-trunk-Linux/solr/core/src/test-files/solr/collection1/conf/protwords.txt to /configs/conf1/protwords.txt
   [junit4]   2> 286558 INFO  (TEST-HttpPartitionTest.test-seed#[74A05DFD49F5F752]) [    ] o.a.s.c.c.SolrZkClient makePath: /configs/conf1/protwords.txt
   [junit4]   2> 286559 INFO  (TEST-HttpPartitionTest.test-seed#[74A05DFD49F5F752]) [    ] o.a.s.c.AbstractZkTestCase put /home/jenkins/workspace/Lucene-Solr-trunk-Linux/solr/core/src/test-files/solr/collection1/conf/currency.xml to /configs/conf1/currency.xml
   [junit4]   2> 286559 INFO  (TEST-HttpPartitionTest.test-seed#[74A05DFD49F5F752]) [    ] o.a.s.c.c.SolrZkClient makePath: /configs/conf1/currency.xml
   [junit4]   2> 286560 INFO  (TEST-HttpPartitionTest.test-seed#[74A05DFD49F5F752]) [    ] o.a.s.c.AbstractZkTestCase put /home/jenkins/workspace/Lucene-Solr-trunk-Linux/solr/core/src/test-files/solr/collection1/conf/enumsConfig.xml to /configs/conf1/enumsConfig.xml
   [junit4]   2> 286560 INFO  (TEST-HttpPartitionTest.test-seed#[74A05DFD49F5F752]) [    ] o.a.s.c.c.SolrZkClient makePath: /configs/conf1/enumsConfig.xml
   [junit4]   2> 286561 INFO  (TEST-HttpPartitionTest.test-seed#[74A05DFD49F5F752]) [    ] o.a.s.c.AbstractZkTestCase put /home/jenkins/workspace/Lucene-Solr-trunk-Linux/solr/core/src/test-files/solr/collection1/conf/open-exchange-rates.json to /configs/conf1/open-exchange-rates.json
   [junit4]   2> 286561 INFO  (TEST-HttpPartitionTest.test-seed#[74A05DFD49F5F752]) [    ] o.a.s.c.c.SolrZkClient makePath: /configs/conf1/open-exchange-rates.json
   [junit4]   2> 286569 INFO  (TEST-HttpPartitionTest.test-seed#[74A05DFD49F5F752]) [    ] o.a.s.c.AbstractZkTestCase put /home/jenkins/workspace/Lucene-Solr-trunk-Linux/solr/core/src/test-files/solr/collection1/conf/mapping-ISOLatin1Accent.txt to /configs/conf1/mapping-ISOLatin1Accent.txt
   [junit4]   2> 286569 INFO  (TEST-HttpPartitionTest.test-seed#[74A05DFD49F5F752]) [    ] o.a.s.c.c.SolrZkClient makePath: /configs/conf1/mapping-ISOLatin1Accent.txt
   [junit4]   2> 286570 INFO  (TEST-HttpPartitionTest.test-seed#[74A05DFD49F5F752]) [    ] o.a.s.c.AbstractZkTestCase put /home/jenkins/workspace/Lucene-Solr-trunk-Linux/solr/core/src/test-files/solr/collection1/conf/old_synonyms.txt to /configs/conf1/old_synonyms.txt
   [junit4]   2> 286570 INFO  (TEST-HttpPartitionTest.test-seed#[74A05DFD49F5F752]) [    ] o.a.s.c.c.SolrZkClient makePath: /configs/conf1/old_synonyms.txt
   [junit4]   2> 286571 INFO  (TEST-HttpPartitionTest.test-seed#[74A05DFD49F5F752]) [    ] o.a.s.c.AbstractZkTestCase put /home/jenkins/workspace/Lucene-Solr-trunk-Linux/solr/core/src/test-files/solr/collection1/conf/synonyms.txt to /configs/conf1/synonyms.txt
   [junit4]   2> 286571 INFO  (TEST-HttpPartitionTest.test-seed#[74A05DFD49F5F752]) [    ] o.a.s.c.c.SolrZkClient makePath: /configs/conf1/synonyms.txt
   [junit4]   2> 286716 INFO  (TEST-HttpPartitionTest.test-seed#[74A05DFD49F5F752]) [    ] o.a.s.SolrTestCaseJ4 Writing core.properties file to /home/jenkins/workspace/Lucene-Solr-trunk-Linux/solr/build/solr-core/test/J1/temp/solr.cloud.HttpPartitionTest_74A05DFD49F5F752-001/control-001/cores/collection1
   [junit4]   2> 286718 INFO  (TEST-HttpPartitionTest.test-seed#[74A05DFD49F5F752]) [    ] o.e.j.s.Server jetty-9.2.13.v20150730
   [junit4]   2> 286719 INFO  (TEST-HttpPartitionTest.test-seed#[74A05DFD49F5F752]) [    ] o.e.j.s.h.ContextHandler Started o.e.j.s.ServletContextHandler@1acf144{/zz,null,AVAILABLE}
   [junit4]   2> 286722 INFO  (TEST-HttpPartitionTest.test-seed#[74A05DFD49F5F752]) [    ] o.e.j.s.ServerConnector Started ServerConnector@1971867{HTTP/1.1}{127.0.0.1:45831}
   [junit4]   2> 286722 INFO  (TEST-HttpPartitionTest.test-seed#[74A05DFD49F5F752]) [    ] o.e.j.s.Server Started @288246ms
   [junit4]   2> 286722 INFO  (TEST-HttpPartitionTest.test-seed#[74A05DFD49F5F752]) [    ] o.a.s.c.s.e.JettySolrRunner Jetty properties: {solr.data.dir=/home/jenkins/workspace/Lucene-Solr-trunk-Linux/solr/build/solr-core/test/J1/temp/solr.cloud.HttpPartitionTest_74A05DFD49F5F752-001/tempDir-001/control/data, hostContext=/zz, hostPort=38659, coreRootDirectory=/home/jenkins/workspace/Lucene-Solr-trunk-Linux/solr/build/solr-core/test/J1/temp/solr.cloud.HttpPartitionTest_74A05DFD49F5F752-001/control-001/cores}
   [junit4]   2> 286723 INFO  (TEST-HttpPartitionTest.test-seed#[74A05DFD49F5F752]) [    ] o.a.s.s.SolrDispatchFilter SolrDispatchFilter.init(): sun.misc.Launcher$AppClassLoader@1521cc1
   [junit4]   2> 286723 INFO  (TEST-HttpPartitionTest.test-seed#[74A05DFD49F5F752]) [    ] o.a.s.c.SolrResourceLoader new SolrResourceLoader for directory: '/home/jenkins/workspace/Lucene-Solr-trunk-Linux/solr/build/solr-core/test/J1/temp/solr.cloud.HttpPartitionTest_74A05DFD49F5F752-001/control-001'
   [junit4]   2> 286723 INFO  (TEST-HttpPartitionTest.test-seed#[74A05DFD49F5F752]) [    ] o.a.s.c.SolrResourceLoader JNDI not configured for solr (NoInitialContextEx)
   [junit4]   2> 286723 INFO  (TEST-HttpPartitionTest.test-seed#[74A05DFD49F5F752]) [    ] o.a.s.c.SolrResourceLoader solr home defaulted to 'solr/' (could not find system property or JNDI)
   [junit4]   2> 286723 INFO  (TEST-HttpPartitionTest.test-seed#[74A05DFD49F5F752]) [    ] o.a.s.c.c.SolrZkClient Using default ZkCredentialsProvider
   [junit4]   2> 286723 INFO  (TEST-HttpPartitionTest.test-seed#[74A05DFD49F5F752]) [    ] o.a.s.c.c.ConnectionManager Waiting for client to connect to ZooKeeper
   [junit4]   2> 286724 INFO  (zkCallback-377-thread-1) [    ] o.a.s.c.c.ConnectionManager Watcher org.apache.solr.common.cloud.ConnectionManager@21cf99 name:ZooKeeperConnection Watcher:127.0.0.1:39265/solr got event WatchedEvent state:SyncConnected type:None path:null path:null type:None
   [junit4]   2> 286724 INFO  (TEST-HttpPartitionTest.test-seed#[74A05DFD49F5F752]) [    ] o.a.s.c.c.ConnectionManager Client is connected to ZooKeeper
   [junit4]   2> 286725 INFO  (TEST-HttpPartitionTest.test-seed#[74A05DFD49F5F752]) [    ] o.a.s.c.c.SolrZkClient Using default ZkACLProvider
   [junit4]   2> 286725 INFO  (TEST-HttpPartitionTest.test-seed#[74A05DFD49F5F752]) [    ] o.a.s.s.SolrDispatchFilter Loading solr.xml from SolrHome (not found in ZooKeeper)
   [junit4]   2> 286725 INFO  (TEST-HttpPartitionTest.test-seed#[74A05DFD49F5F752]) [    ] o.a.s.c.SolrXmlConfig Loading container configuration from /home/jenkins/workspace/Lucene-Solr-trunk-Linux/solr/build/solr-core/test/J1/temp/solr.cloud.HttpPartitionTest_74A05DFD49F5F752-001/control-001/solr.xml
   [junit4]   2> 286744 INFO  (TEST-HttpPartitionTest.test-seed#[74A05DFD49F5F752]) [    ] o.a.s.c.CorePropertiesLocator Config-defined core root directory: /home/jenkins/workspace/Lucene-Solr-trunk-Linux/solr/build/solr-core/test/J1/temp/solr.cloud.HttpPartitionTest_74A05DFD49F5F752-001/control-001/cores
   [junit4]   2> 286744 INFO  (TEST-HttpPartitionTest.test-seed#[74A05DFD49F5F752]) [    ] o.a.s.c.CoreContainer New CoreContainer 6722517
   [junit4]   2> 286744 INFO  (TEST-HttpPartitionTest.test-seed#[74A05DFD49F5F752]) [    ] o.a.s.c.CoreContainer Loading cores into CoreContainer [instanceDir=/home/jenkins/workspace/Lucene-Solr-trunk-Linux/solr/build/solr-core/test/J1/temp/solr.cloud.HttpPartitionTest_74A05DFD49F5F752-001/control-001]
   [junit4]   2> 286744 WARN  (TEST-HttpPartitionTest.test-seed#[74A05DFD49F5F752]) [    ] o.a.s.c.CoreContainer Couldn't add files from /home/jenkins/workspace/Lucene-Solr-trunk-Linux/solr/build/solr-core/test/J1/temp/solr.cloud.HttpPartitionTest_74A05DFD49F5F752-001/control-001/lib to classpath: /home/jenkins/workspace/Lucene-Solr-trunk-Linux/solr/build/solr-core/test/J1/temp/solr.cloud.HttpPartitionTest_74A05DFD49F5F752-001/control-001/lib
   [junit4]   2> 286744 INFO  (TEST-HttpPartitionTest.test-seed#[74A05DFD49F5F752]) [    ] o.a.s.h.c.HttpShardHandlerFactory created with socketTimeout : 90000,urlScheme : ,connTimeout : 15000,maxConnectionsPerHost : 20,maxConnections : 10000,corePoolSize : 0,maximumPoolSize : 2147483647,maxThreadIdleTime : 5,sizeOfQueue : -1,fairnessPolicy : false,useRetries : false,
   [junit4]   2> 286745 INFO  (TEST-HttpPartitionTest.test-seed#[74A05DFD49F5F752]) [    ] o.a.s.u.UpdateShardHandler Creating UpdateShardHandler HTTP client with params: socketTimeout=340000&connTimeout=45000&retry=true
   [junit4]   2> 286746 INFO  (TEST-HttpPartitionTest.test-seed#[74A05DFD49F5F752]) [    ] o.a.s.l.LogWatcher SLF4J impl is org.slf4j.impl.Log4jLoggerFactory
   [junit4]   2> 286746 INFO  (TEST-HttpPartitionTest.test-seed#[74A05DFD49F5F752]) [    ] o.a.s.l.LogWatcher Registering Log Listener [Log4j (org.slf4j.impl.Log4jLoggerFactory)]
   [junit4]   2> 286746 INFO  (TEST-HttpPartitionTest.test-seed#[74A05DFD49F5F752]) [    ] o.a.s.c.ZkContainer Zookeeper client=127.0.0.1:39265/solr
   [junit4]   2> 286746 INFO  (TEST-HttpPartitionTest.test-seed#[74A05DFD49F5F752]) [    ] o.a.s.c.ZkController zkHost includes chroot
   [junit4]   2> 286746 INFO  (TEST-HttpPartitionTest.test-seed#[74A05DFD49F5F752]) [    ] o.a.s.c.c.SolrZkClient Using default ZkCredentialsProvider
   [junit4]   2> 286746 INFO  (TEST-HttpPartitionTest.test-seed#[74A05DFD49F5F752]) [    ] o.a.s.c.c.ConnectionManager Waiting for client to connect to ZooKeeper
   [junit4]   2> 286747 INFO  (zkCallback-380-thread-1) [    ] o.a.s.c.c.ConnectionManager Watcher org.apache.solr.common.cloud.ConnectionManager@592773 name:ZooKeeperConnection Watcher:127.0.0.1:39265 got event WatchedEvent state:SyncConnected type:None path:null path:null type:None
   [junit4]   2> 286747 INFO  (TEST-HttpPartitionTest.test-seed#[74A05DFD49F5F752]) [    ] o.a.s.c.c.ConnectionManager Client is connected to ZooKeeper
   [junit4]   2> 286748 INFO  (TEST-HttpPartitionTest.test-seed#[74A05DFD49F5F752]) [    ] o.a.s.c.c.SolrZkClient Using default ZkACLProvider
   [junit4]   2> 286748 INFO  (TEST-HttpPartitionTest.test-seed#[74A05DFD49F5F752]) [    ] o.a.s.c.c.ConnectionManager Waiting for client to connect to ZooKeeper
   [junit4]   2> 286749 INFO  (zkCallback-381-thread-1) [    ] o.a.s.c.c.ConnectionManager Watcher org.apache.solr.common.cloud.ConnectionManager@7dfd7a name:ZooKeeperConnection Watcher:127.0.0.1:39265/solr got event WatchedEvent state:SyncConnected type:None path:null path:null type:None
   [junit4]   2> 286749 INFO  (TEST-HttpPartitionTest.test-seed#[74A05DFD49F5F752]) [    ] o.a.s.c.c.ConnectionManager Client is connected to ZooKeeper
   [junit4]   2> 286750 INFO  (TEST-HttpPartitionTest.test-seed#[74A05DFD49F5F752]) [    ] o.a.s.c.c.SolrZkClient makePath: /overseer/queue
   [junit4]   2> 286751 INFO  (TEST-HttpPartitionTest.test-seed#[74A05DFD49F5F752]) [    ] o.a.s.c.c.SolrZkClient makePath: /overseer/collection-queue-work
   [junit4]   2> 286753 INFO  (TEST-HttpPartitionTest.test-seed#[74A05DFD49F5F752]) [    ] o.a.s.c.c.SolrZkClient makePath: /overseer/collection-map-running
   [junit4]   2> 286754 INFO  (TEST-HttpPartitionTest.test-seed#[74A05DFD49F5F752]) [    ] o.a.s.c.c.SolrZkClient makePath: /overseer/collection-map-completed
   [junit4]   2> 286755 INFO  (TEST-HttpPartitionTest.test-seed#[74A05DFD49F5F752]) [    ] o.a.s.c.c.SolrZkClient makePath: /overseer/collection-map-failure
   [junit4]   2> 286755 INFO  (TEST-HttpPartitionTest.test-seed#[74A05DFD49F5F752]) [    ] o.a.s.c.c.SolrZkClient makePath: /live_nodes
   [junit4]   2> 286756 INFO  (TEST-HttpPartitionTest.test-seed#[74A05DFD49F5F752]) [    ] o.a.s.c.c.SolrZkClient makePath: /aliases.json
   [junit4]   2> 286757 INFO  (TEST-HttpPartitionTest.test-seed#[74A05DFD49F5F752]) [    ] o.a.s.c.c.SolrZkClient makePath: /clusterstate.json
   [junit4]   2> 286757 INFO  (TEST-HttpPartitionTest.test-seed#[74A05DFD49F5F752]) [    ] o.a.s.c.c.SolrZkClient makePath: /security.json
   [junit4]   2> 286767 INFO  (TEST-HttpPartitionTest.test-seed#[74A05DFD49F5F752]) [    ] o.a.s.c.ZkController Register node as live in ZooKeeper:/live_nodes/127.0.0.1:38659_zz
   [junit4]   2> 286767 INFO  (TEST-HttpPartitionTest.test-seed#[74A05DFD49F5F752]) [    ] o.a.s.c.c.SolrZkClient makePath: /live_nodes/127.0.0.1:38659_zz
   [junit4]   2> 286768 INFO  (TEST-HttpPartitionTest.test-seed#[74A05DFD49F5F752]) [    ] o.a.s.c.c.SolrZkClient makePath: /overseer_elect
   [junit4]   2> 286768 INFO  (TEST-HttpPartitionTest.test-seed#[74A05DFD49F5F752]) [    ] o.a.s.c.c.SolrZkClient makePath: /overseer_elect/election
   [junit4]   2> 286769 INFO  (TEST-HttpPartitionTest.test-seed#[74A05DFD49F5F752]) [    ] o.a.s.c.Overseer Overseer (id=null) closing
   [junit4]   2> 286769 INFO  (TEST-HttpPartitionTest.test-seed#[74A05DFD49F5F752]) [    ] o.a.s.c.LeaderElector Joined leadership election with path: /overseer_elect/election/95200179191152644-127.0.0.1:38659_zz-n_0000000000
   [junit4]   2> 286769 INFO  (TEST-HttpPartitionTest.test-seed#[74A05DFD49F5F752]) [    ] o.a.s.c.OverseerElectionContext I am going to be the leader 127.0.0.1:38659_zz
   [junit4]   2> 286769 INFO  (TEST-HttpPartitionTest.test-seed#[74A05DFD49F5F752]) [    ] o.a.s.c.c.SolrZkClient makePath: /overseer_elect/leader
   [junit4]   2> 286782 INFO  (TEST-HttpPartitionTest.test-seed#[74A05DFD49F5F752]) [    ] o.a.s.c.Overseer Overseer (id=95200179191152644-127.0.0.1:38659_zz-n_0000000000) starting
   [junit4]   2> 286783 INFO  (TEST-HttpPartitionTest.test-seed#[74A05DFD49F5F752]) [    ] o.a.s.c.c.SolrZkClient makePath: /overseer/queue-work
   [junit4]   2> 286799 INFO  (TEST-HttpPartitionTest.test-seed#[74A05DFD49F5F752]) [    ] o.a.s.c.OverseerAutoReplicaFailoverThread Starting OverseerAutoReplicaFailoverThread autoReplicaFailoverWorkLoopDelay=10000 autoReplicaFailoverWaitAfterExpiration=30000 autoReplicaFailoverBadNodeExpiration=60000
   [junit4]   2> 286799 INFO  (OverseerCollectionConfigSetProcessor-95200179191152644-127.0.0.1:38659_zz-n_0000000000) [    ] o.a.s.c.OverseerTaskProcessor Process current queue of overseer operations
   [junit4]   2> 286799 INFO  (TEST-HttpPartitionTest.test-seed#[74A05DFD49F5F752]) [    ] o.a.s.c.c.ZkStateReader Updating cluster state from ZooKeeper... 
   [junit4]   2> 286799 INFO  (OverseerStateUpdate-95200179191152644-127.0.0.1:38659_zz-n_0000000000) [    ] o.a.s.c.Overseer Starting to work on the main queue
   [junit4]   2> 286812 INFO  (TEST-HttpPartitionTest.test-seed#[74A05DFD49F5F752]) [    ] o.a.s.c.CoreContainer Security conf doesn't exist. Skipping setup for authorization module.
   [junit4]   2> 286813 INFO  (TEST-HttpPartitionTest.test-seed#[74A05DFD49F5F752]) [    ] o.a.s.c.CoreContainer No authentication plugin used.
   [junit4]   2> 286813 INFO  (TEST-HttpPartitionTest.test-seed#[74A05DFD49F5F752]) [    ] o.a.s.c.CorePropertiesLocator Looking for core definitions underneath /home/jenkins/workspace/Lucene-Solr-trunk-Linux/solr/build/solr-core/test/J1/temp/solr.cloud.HttpPartitionTest_74A05DFD49F5F752-001/control-001/cores
   [junit4]   2> 286822 INFO  (TEST-HttpPartitionTest.test-seed#[74A05DFD49F5F752]) [    ] o.a.s.c.CoreDescriptor Created CoreDescriptor: {name=collection1, config=solrconfig.xml, transient=false, schema=schema.xml, loadOnStartup=true, configSetProperties=configsetprops.json, collection=control_collection, coreNodeName=, dataDir=data/, shard=}
   [junit4]   2> 286822 INFO  (TEST-HttpPartitionTest.test-seed#[74A05DFD49F5F752]) [    ] o.a.s.c.CorePropertiesLocator Found core collection1 in /home/jenkins/workspace/Lucene-Solr-trunk-Linux/solr/build/solr-core/test/J1/temp/solr.cloud.HttpPartitionTest_74A05DFD49F5F752-001/control-001/cores/collection1
   [junit4]   2> 286822 INFO  (TEST-HttpPartitionTest.test-seed#[74A05DFD49F5F752]) [    ] o.a.s.c.CorePropertiesLocator Found 1 core definitions
   [junit4]   2> 286823 INFO  (TEST-HttpPartitionTest.test-seed#[74A05DFD49F5F752]) [    ] o.a.s.s.SolrDispatchFilter user.dir=/home/jenkins/workspace/Lucene-Solr-trunk-Linux/solr/build/solr-core/test/J1
   [junit4]   2> 286823 INFO  (TEST-HttpPartitionTest.test-seed#[74A05DFD49F5F752]) [    ] o.a.s.s.SolrDispatchFilter SolrDispatchFilter.init() done
   [junit4]   2> 286823 INFO  (coreLoadExecutor-919-thread-1) [    ] o.a.s.c.ZkController publishing state=down
   [junit4]   2> 286823 INFO  (coreLoadExecutor-919-thread-1) [    ] o.a.s.c.ZkController numShards not found on descriptor - reading it from system property
   [junit4]   2> 286824 INFO  (OverseerStateUpdate-95200179191152644-127.0.0.1:38659_zz-n_0000000000) [    ] o.a.s.c.Overseer processMessage: queueSize: 1, message = {
   [junit4]   2>   "core":"collection1",
   [junit4]   2>   "roles":null,
   [junit4]   2>   "base_url":"http://127.0.0.1:38659/zz",
   [junit4]   2>   "node_name":"127.0.0.1:38659_zz",
   [junit4]   2>   "numShards":"1",
   [junit4]   2>   "state":"down",
   [junit4]   2>   "shard":null,
   [junit4]   2>   "collection":"control_collection",
   [junit4]   2>   "operation":"state"} current state version: 0
   [junit4]   2> 286824 INFO  (coreLoadExecutor-919-thread-1) [    ] o.a.s.c.ZkController look for our core node name
   [junit4]   2> 286824 INFO  (OverseerStateUpdate-95200179191152644-127.0.0.1:38659_zz-n_0000000000) [    ] o.a.s.c.o.ReplicaMutator Update state numShards=1 message={
   [junit4]   2>   "core":"collection1",
   [junit4]   2>   "roles":null,
   [junit4]   2>   "base_url":"http://127.0.0.1:38659/zz",
   [junit4]   2>   "node_name":"127.0.0.1:38659_zz",
   [junit4]   2>   "numShards":"1",
   [junit4]   2>   "state":"down",
   [junit4]   2>   "shard":null,
   [junit4]   2>   "collection":"control_collection",
   [junit4]   2>   "operation":"state"}
   [junit4]   2> 286824 INFO  (OverseerStateUpdate-95200179191152644-127.0.0.1:38659_zz-n_0000000000) [    ] o.a.s.c.o.ClusterStateMutator building a new cName: control_collection
   [junit4]   2> 286824 INFO  (OverseerStateUpdate-95200179191152644-127.0.0.1:38659_zz-n_0000000000) [    ] o.a.s.c.o.ReplicaMutator Assigning new node to shard shard=shard1
   [junit4]   2> 286826 INFO  (zkCallback-381-thread-1) [    ] o.a.s.c.c.ZkStateReader A cluster state change: [WatchedEvent state:SyncConnected type:NodeDataChanged path:/clusterstate.json], has occurred - updating... (live nodes size: [1])
   [junit4]   2> 287824 INFO  (coreLoadExecutor-919-thread-1) [    ] o.a.s.c.ZkController waiting to find shard id in clusterstate for collection1
   [junit4]   2> 287824 INFO  (coreLoadExecutor-919-thread-1) [    ] o.a.s.c.ZkController Check for collection zkNode:control_collection
   [junit4]   2> 287825 INFO  (coreLoadExecutor-919-thread-1) [    ] o.a.s.c.ZkController Collection zkNode exists
   [junit4]   2> 287825 INFO  (coreLoadExecutor-919-thread-1) [    ] o.a.s.c.c.ZkStateReader Load collection config from: [/collections/control_collection]
   [junit4]   2> 287825 INFO  (coreLoadExecutor-919-thread-1) [    ] o.a.s.c.c.ZkStateReader path=[/collections/control_collection] [configName]=[conf1] specified config exists in ZooKeeper
   [junit4]   2> 287825 INFO  (coreLoadExecutor-919-thread-1) [    ] o.a.s.c.SolrResourceLoader new SolrResourceLoader for directory: '/home/jenkins/workspace/Lucene-Solr-trunk-Linux/solr/build/solr-core/test/J1/temp/solr.cloud.HttpPartitionTest_74A05DFD49F5F752-001/control-001/cores/collection1'
   [junit4]   2> 287825 INFO  (coreLoadExecutor-919-thread-1) [    ] o.a.s.c.SolrResourceLoader JNDI not configured for solr (NoInitialContextEx)
   [junit4]   2> 287825 INFO  (coreLoadExecutor-919-thread-1) [    ] o.a.s.c.SolrResourceLoader solr home defaulted to 'solr/' (could not find system property or JNDI)
   [junit4]   2> 287826 INFO  (coreLoadExecutor-919-thread-1) [    ] o.a.s.c.Config loaded config solrconfig.xml with version 0 
   [junit4]   2> 287829 INFO  (coreLoadExecutor-919-thread-1) [    ] o.a.s.c.SolrConfig current version of requestparams : -1
   [junit4]   2> 287831 INFO  (coreLoadExecutor-919-thread-1) [    ] o.a.s.c.SolrConfig Using Lucene MatchVersion: 6.0.0
   [junit4]   2> 287835 INFO  (coreLoadExecutor-919-thread-1) [    ] o.a.s.c.SolrConfig Loaded SolrConfig: solrconfig.xml
   [junit4]   2> 287839 INFO  (coreLoadExecutor-919-thread-1) [    ] o.a.s.s.IndexSchema [collection1] Schema name=test
   [junit4]   2> 287901 INFO  (coreLoadExecutor-919-thread-1) [    ] o.a.s.s.OpenExchangeRatesOrgProvider Initialized with rates=open-exchange-rates.json, refreshInterval=1440.
   [junit4]   2> 287904 INFO  (coreLoadExecutor-919-thread-1) [    ] o.a.s.s.IndexSchema default search field in schema is text
   [junit4]   2> 287905 INFO  (coreLoadExecutor-919-thread-1) [    ] o.a.s.s.IndexSchema unique key field: id
   [junit4]   2> 287908 INFO  (coreLoadExecutor-919-thread-1) [    ] o.a.s.s.FileExchangeRateProvider Reloading exchange rates from file currency.xml
   [junit4]   2> 287909 INFO  (coreLoadExecutor-919-thread-1) [    ] o.a.s.s.FileExchangeRateProvider Reloading exchange rates from file currency.xml
   [junit4]   2> 287910 INFO  (coreLoadExecutor-919-thread-1) [    ] o.a.s.s.OpenExchangeRatesOrgProvider Reloading exchange rates from open-exchange-rates.json
   [junit4]   2> 287910 INFO  (coreLoadExecutor-919-thread-1) [    ] o.a.s.s.OpenExchangeRatesOrgProvider Reloading exchange rates from open-exchange-rates.json
   [junit4]   2> 287911 INFO  (coreLoadExecutor-919-thread-1) [    ] o.a.s.c.ConfigSetProperties Did not find ConfigSet properties, assuming default properties: Can't find resource 'configsetprops.json' in classpath or '/configs/conf1', cwd=/home/jenkins/workspace/Lucene-Solr-trunk-Linux/solr/build/solr-core/test/J1
   [junit4]   2> 287911 INFO  (coreLoadExecutor-919-thread-1) [    ] o.a.s.c.CoreContainer Creating SolrCore 'collection1' using configuration from collection control_collection
   [junit4]   2> 287911 INFO  (coreLoadExecutor-919-thread-1) [    ] o.a.s.c.SolrCore org.apache.solr.core.MockDirectoryFactory
   [junit4]   2> 287911 INFO  (coreLoadExecutor-919-thread-1) [    ] o.a.s.c.SolrCore [[collection1] ] Opening new SolrCore at [/home/jenkins/workspace/Lucene-Solr-trunk-Linux/solr/build/solr-core/test/J1/temp/solr.cloud.HttpPartitionTest_74A05DFD49F5F752-001/control-001/cores/collection1], dataDir=[/home/jenkins/workspace/Lucene-Solr-trunk-Linux/solr/build/solr-core/test/J1/temp/solr.cloud.HttpPartitionTest_74A05DFD49F5F752-001/control-001/cores/collection1/data/]
   [junit4]   2> 287911 INFO  (coreLoadExecutor-919-thread-1) [    ] o.a.s.c.JmxMonitoredMap JMX monitoring is enabled. Adding Solr mbeans to JMX Server: com.sun.jmx.mbeanserver.JmxMBeanServer@1f88ed8
   [junit4]   2> 287912 INFO  (coreLoadExecutor-919-thread-1) [    ] o.a.s.c.CachingDirectoryFactory return new directory for /home/jenkins/workspace/Lucene-Solr-trunk-Linux/solr/build/solr-core/test/J1/temp/solr.cloud.HttpPartitionTest_74A05DFD49F5F752-001/control-001/cores/collection1/data
   [junit4]   2> 287912 INFO  (coreLoadExecutor-919-thread-1) [    ] o.a.s.c.SolrCore New index directory detected: old=null new=/home/jenkins/workspace/Lucene-Solr-trunk-Linux/solr/build/solr-core/test/J1/temp/solr.cloud.HttpPartitionTest_74A05DFD49F5F752-001/control-001/cores/collection1/data/index/
   [junit4]   2> 287912 WARN  (coreLoadExecutor-919-thread-1) [    ] o.a.s.c.SolrCore [collection1] Solr index directory '/home/jenkins/workspace/Lucene-Solr-trunk-Linux/solr/build/solr-core/test/J1/temp/solr.cloud.HttpPartitionTest_74A05DFD49F5F752-001/control-001/cores/collection1/data/index' doesn't exist. Creating new index...
   [junit4]   2> 287912 INFO  (coreLoadExecutor-919-thread-1) [    ] o.a.s.c.CachingDirectoryFactory return new directory for /home/jenkins/workspace/Lucene-Solr-trunk-Linux/solr/build/solr-core/test/J1/temp/solr.cloud.HttpPartitionTest_74A05DFD49F5F752-001/control-001/cores/collection1/data/index
   [junit4]   2> 287912 INFO  (coreLoadExecutor-919-thread-1) [    ] o.a.s.u.RandomMergePolicy RandomMergePolicy wrapping class org.apache.lucene.index.LogDocMergePolicy: [LogDocMergePolicy: minMergeSize=1000, mergeFactor=19, maxMergeSize=9223372036854775807, maxMergeSizeForForcedMerge=9223372036854775807, calibrateSizeByDeletes=false, maxMergeDocs=2147483647, maxCFSSegmentSizeMB=8.796093022207999E12, noCFSRatio=0.4014396159910435]
   [junit4]   2> 287912 INFO  (coreLoadExecutor-919-thread-1) [    ] o.a.s.c.SolrDeletionPolicy SolrDeletionPolicy.onCommit: commits: num=1
   [junit4]   2> 	commit{dir=MockDirectoryWrapper(RAMDirectory@1962cf9 lockFactory=org.apache.lucene.store.SingleInstanceLockFactory@1996b03),segFN=segments_1,generation=1}
   [junit4]   2> 287913 INFO  (coreLoadExecutor-919-thread-1) [    ] o.a.s.c.SolrDeletionPolicy newest commit generation = 1
   [junit4]   2> 287913 INFO  (OldIndexDirectoryCleanupThreadForCore-collection1) [    ] o.a.s.c.SolrCore Looking for old index directories to cleanup for core collection1 in /home/jenkins/workspace/Lucene-Solr-trunk-Linux/solr/build/solr-core/test/J1/temp/solr.cloud.HttpPartitionTest_74A05DFD49F5F752-001/control-001/cores/collection1/data/
   [junit4]   2> 287913 WARN  (OldIndexDirectoryCleanupThreadForCore-collection1) [    ] o.a.s.c.DirectoryFactory /home/jenkins/workspace/Lucene-Solr-trunk-Linux/solr/build/solr-core/test/J1/temp/solr.cloud.HttpPartitionTest_74A05DFD49F5F752-001/control-001/cores/collection1/data/ does not point to a valid data directory; skipping clean-up of old index directories.
   [junit4]   2> 287921 INFO  (coreLoadExecutor-919-thread-1) [    ] o.a.s.u.p.UpdateRequestProcessorChain creating updateRequestProcessorChain "nodistrib"
   [junit4]   2> 287921 INFO  (coreLoadExecutor-919-thread-1) [    ] o.a.s.u.p.UpdateRequestProcessorChain creating updateRequestProcessorChain "dedupe"
   [junit4]   2> 287921 INFO  (coreLoadExecutor-919-thread-1) [    ] o.a.s.u.p.UpdateRequestProcessorChain inserting DistributedUpdateProcessorFactory into updateRequestProcessorChain "dedupe"
   [junit4]   2> 287921 INFO  (coreLoadExecutor-919-thread-1) [    ] o.a.s.u.p.UpdateRequestProcessorChain creating updateRequestProcessorChain "stored_sig"
   [junit4]   2> 287921 INFO  (coreLoadExecutor-919-thread-1) [    ] o.a.s.u.p.UpdateRequestProcessorChain inserting DistributedUpdateProcessorFactory into updateRequestProcessorChain "stored_sig"
   [junit4]   2> 287921 INFO  (coreLoadExecutor-919-thread-1) [    ] o.a.s.u.p.UpdateRequestProcessorChain creating updateRequestProcessorChain "distrib-dup-test-chain-explicit"
   [junit4]   2> 287922 INFO  (coreLoadExecutor-919-thread-1) [    ] o.a.s.u.p.UpdateRequestProcessorChain creating updateRequestProcessorChain "distrib-dup-test-chain-implicit"
   [junit4]   2> 287922 INFO  (coreLoadExecutor-919-thread-1) [    ] o.a.s.u.p.UpdateRequestProcessorChain inserting DistributedUpdateProcessorFactory into updateRequestProcessorChain "distrib-dup-test-chain-implicit"
   [junit4]   2> 287922 INFO  (coreLoadExecutor-919-thread-1) [    ] o.a.s.c.SolrCore no updateRequestProcessorChain defined as default, creating implicit default
   [junit4]   2> 287922 WARN  (coreLoadExecutor-919-thread-1) [    ] o.a.s.c.RequestHandlers INVALID paramSet a in requestHandler {type = requestHandler,name = /dump,class = DumpRequestHandler,args = {defaults={a=A,b=B}}}
   [junit4]   2> 287923 INFO  (coreLoadExecutor-919-thread-1) [    ] o.a.s.h.l.XMLLoader xsltCacheLifetimeSeconds=60
   [junit4]   2> 287923 INFO  (coreLoadExecutor-919-thread-1) [    ] o.a.s.h.l.XMLLoader xsltCacheLifetimeSeconds=60
   [junit4]   2> 287924 INFO  (coreLoadExecutor-919-thread-1) [    ] o.a.s.h.l.XMLLoader xsltCacheLifetimeSeconds=60
   [junit4]   2> 287924 INFO  (coreLoadExecutor-919-thread-1) [    ] o.a.s.h.l.XMLLoader xsltCacheLifetimeSeconds=60
   [junit4]   2> 287926 INFO  (coreLoadExecutor-919-thread-1) [    ] o.a.s.c.RequestHandlers Registered paths: /admin/mbeans,standard,/dump,/update/csv,/sql,/update/json/docs,/admin/luke,/export,/admin/segments,/get,/admin/system,/replication,/admin/properties,/config,/stream,/schema,/admin/plugins,/admin/logging,/update/json,/admin/threads,/admin/ping,/update,/admin/file
   [junit4]   2> 287926 INFO  (coreLoadExecutor-919-thread-1) [    ] o.a.s.c.SolrCore Using default statsCache cache: org.apache.solr.search.stats.LocalStatsCache
   [junit4]   2> 287927 INFO  (coreLoadExecutor-919-thread-1) [    ] o.a.s.u.UpdateHandler Using UpdateLog implementation: org.apache.solr.update.UpdateLog
   [junit4]   2> 287927 INFO  (coreLoadExecutor-919-thread-1) [    ] o.a.s.u.UpdateLog Initializing UpdateLog: dataDir= defaultSyncLevel=FLUSH numRecordsToKeep=100 maxNumLogsToKeep=10 numVersionBuckets=65536
   [junit4]   2> 287927 INFO  (coreLoadExecutor-919-thread-1) [    ] o.a.s.u.CommitTracker Hard AutoCommit: disabled
   [junit4]   2> 287927 INFO  (coreLoadExecutor-919-thread-1) [    ] o.a.s.u.CommitTracker Soft AutoCommit: disabled
   [junit4]   2> 287927 INFO  (coreLoadExecutor-919-thread-1) [    ] o.a.s.u.RandomMergePolicy RandomMergePolicy wrapping class org.apache.lucene.index.LogDocMergePolicy: [LogDocMergePolicy: minMergeSize=1000, mergeFactor=32, maxMergeSize=9223372036854775807, maxMergeSizeForForcedMerge=9223372036854775807, calibrateSizeByDeletes=true, maxMergeDocs=2147483647, maxCFSSegmentSizeMB=8.796093022207999E12, noCFSRatio=0.7543455036189799]
   [junit4]   2> 287928 INFO  (coreLoadExecutor-919-thread-1) [    ] o.a.s.c.SolrDeletionPolicy SolrDeletionPolicy.onInit: commits: num=1
   [junit4]   2> 	commit{dir=MockDirectoryWrapper(RAMDirectory@1962cf9 lockFactory=org.apache.lucene.store.SingleInstanceLockFactory@1996b03),segFN=segments_1,generation=1}
   [junit4]   2> 287928 INFO  (coreLoadExecutor-919-thread-1) [    ] o.a.s.c.SolrDeletionPolicy newest commit generation = 1
   [junit4]   2> 287928 INFO  (coreLoadExecutor-919-thread-1) [    ] o.a.s.s.SolrIndexSearcher Opening [Searcher@7dd699[collection1] main]
   [junit4]   2> 287928 INFO  (coreLoadExecutor-919-thread-1) [    ] o.a.s.c.c.ZkStateReader Load collection config from: [/collections/control_collection]
   [junit4]   2> 287928 INFO  (coreLoadExecutor-919-thread-1) [    ] o.a.s.c.c.ZkStateReader path=[/collections/control_collection] [configName]=[conf1] specified config exists in ZooKeeper
   [junit4]   2> 287928 INFO  (coreLoadExecutor-919-thread-1) [    ] o.a.s.r.ManagedResourceStorage Setting up ZooKeeper-based storage for the RestManager with znodeBase: /configs/conf1
   [junit4]   2> 287928 INFO  (coreLoadExecutor-919-thread-1) [    ] o.a.s.r.ManagedResourceStorage Configured ZooKeeperStorageIO with znodeBase: /configs/conf1
   [junit4]   2> 287928 INFO  (coreLoadExecutor-919-thread-1) [    ] o.a.s.r.RestManager Initializing RestManager with initArgs: {}
   [junit4]   2> 287928 INFO  (coreLoadExecutor-919-thread-1) [    ] o.a.s.r.ManagedResourceStorage Reading _rest_managed.json using ZooKeeperStorageIO:path=/configs/conf1
   [junit4]   2> 287928 INFO  (coreLoadExecutor-919-thread-1) [    ] o.a.s.r.ManagedResourceStorage No data found for znode /configs/conf1/_rest_managed.json
   [junit4]   2> 287928 INFO  (coreLoadExecutor-919-thread-1) [    ] o.a.s.r.ManagedResourceStorage Loaded null at path _rest_managed.json using ZooKeeperStorageIO:path=/configs/conf1
   [junit4]   2> 287928 INFO  (coreLoadExecutor-919-thread-1) [    ] o.a.s.r.RestManager Initializing 0 registered ManagedResources
   [junit4]   2> 287929 INFO  (coreLoadExecutor-919-thread-1) [    ] o.a.s.h.ReplicationHandler Commits will be reserved for  10000
   [junit4]   2> 287929 INFO  (searcherExecutor-920-thread-1) [    ] o.a.s.c.SolrCore [collection1] Registered new searcher Searcher@7dd699[collection1] main{ExitableDirectoryReader(UninvertingDirectoryReader())}
   [junit4]   2> 287929 INFO  (coreLoadExecutor-919-thread-1) [    ] o.a.s.u.UpdateLog Looking up max value of version field to seed version buckets
   [junit4]   2> 287929 INFO  (coreLoadExecutor-919-thread-1) [    ] o.a.s.u.VersionInfo Refreshing highest value of _version_ for 65536 version buckets from index
   [junit4]   2> 287929 INFO  (coreLoadExecutor-919-thread-1) [    ] o.a.s.u.VersionInfo No terms found for _version_, cannot seed version bucket highest value from index
   [junit4]   2> 287929 INFO  (coreLoadExecutor-919-thread-1) [    ] o.a.s.u.UpdateLog Could not find max version in index or recent updates, using new clock 1523202868657520640
   [junit4]   2> 287931 INFO  (coreLoadExecutor-919-thread-1) [    ] o.a.s.u.UpdateLog Took 1.0ms to seed version buckets with highest version 1523202868657520640
   [junit4]   2> 287931 INFO  (coreLoadExecutor-919-thread-1) [    ] o.a.s.c.ZkController watch zkdir /configs/conf1
   [junit4]   2> 287931 INFO  (coreLoadExecutor-919-thread-1) [    ] o.a.s.c.CoreContainer registering core: collection1
   [junit4]   2> 287932 INFO  (coreZkRegister-913-thread-1) [    ] o.a.s.c.ZkController Register replica - core:collection1 address:http://127.0.0.1:38659/zz collection:control_collection shard:shard1
   [junit4]   2> 287932 INFO  (coreZkRegister-913-thread-1) [    ] o.a.s.c.c.SolrZkClient makePath: /collections/control_collection/leader_elect/shard1/election
   [junit4]   2> 287933 INFO  (coreZkRegister-913-thread-1) [    ] o.a.s.c.LeaderElector Joined leadership election with path: /collections/control_collection/leader_elect/shard1/election/95200179191152644-core_node1-n_0000000000
   [junit4]   2> 287933 INFO  (coreZkRegister-913-thread-1) [    ] o.a.s.c.ShardLeaderElectionContext Running the leader process for shard=shard1 and weAreReplacement=false and leaderVoteWait=10000
   [junit4]   2> 287934 INFO  (coreZkRegister-913-thread-1) [    ] o.a.s.c.ShardLeaderElectionContext Enough replicas found to continue.
   [junit4]   2> 287934 INFO  (coreZkRegister-913-thread-1) [    ] o.a.s.c.ShardLeaderElectionContext I may be the new leader - try and sync
   [junit4]   2> 287934 INFO  (coreZkRegister-913-thread-1) [    ] o.a.s.c.SyncStrategy Sync replicas to http://127.0.0.1:38659/zz/collection1/
   [junit4]   2> 287935 INFO  (coreZkRegister-913-thread-1) [    ] o.a.s.c.SyncStrategy Sync Success - now sync replicas to me
   [junit4]   2> 287935 INFO  (coreZkRegister-913-thread-1) [    ] o.a.s.c.SyncStrategy http://127.0.0.1:38659/zz/collection1/ has no replicas
   [junit4]   2> 287935 INFO  (OverseerStateUpdate-95200179191152644-127.0.0.1:38659_zz-n_0000000000) [    ] o.a.s.c.Overseer processMessage: queueSize: 1, message = {
   [junit4]   2>   "operation":"leader",
   [junit4]   2>   "shard":"shard1",
   [junit4]   2>   "collection":"control_collection"} current state version: 1
   [junit4]   2> 287935 INFO  (coreZkRegister-913-thread-1) [    ] o.a.s.c.c.SolrZkClient makePath: /collections/control_collection/leaders/shard1
   [junit4]   2> 287936 INFO  (coreZkRegister-913-thread-1) [    ] o.a.s.c.ShardLeaderElectionContextBase Creating leader registration node
   [junit4]   2> 287937 INFO  (coreZkRegister-913-thread-1) [    ] o.a.s.c.ShardLeaderElectionContext I am the new leader: http://127.0.0.1:38659/zz/collection1/ shard1
   [junit4]   2> 287937 INFO  (OverseerStateUpdate-95200179191152644-127.0.0.1:38659_zz-n_0000000000) [    ] o.a.s.c.Overseer processMessage: queueSize: 1, message = {
   [junit4]   2>   "operation":"leader",
   [junit4]   2>   "shard":"shard1",
   [junit4]   2>   "collection":"control_collection",
   [junit4]   2>   "base_url":"http://127.0.0.1:38659/zz",
   [junit4]   2>   "core":"collection1",
   [junit4]   2>   "state":"active"} current state version: 1
   [junit4]   2> 288039 INFO  (zkCallback-381-thread-1) [    ] o.a.s.c.c.ZkStateReader A cluster state change: [WatchedEvent state:SyncConnected type:NodeDataChanged path:/clusterstate.json], has occurred - updating... (live nodes size: [1])
   [junit4]   2> 288088 INFO  (coreZkRegister-913-thread-1) [    ] o.a.s.c.ZkController We are http://127.0.0.1:38659/zz/collection1/ and leader is http://127.0.0.1:38659/zz/collection1/
   [junit4]   2> 288088 INFO  (coreZkRegister-913-thread-1) [    ] o.a.s.c.ZkController No LogReplay needed for core=collection1 baseURL=http://127.0.0.1:38659/zz
   [junit4]   2> 288088 INFO  (coreZkRegister-913-thread-1) [    ] o.a.s.c.ZkController I am the leader, no recovery necessary
   [junit4]   2> 288088 INFO  (coreZkRegister-913-thread-1) [    ] o.a.s.c.ZkController publishing state=active
   [junit4]   2> 288088 INFO  (coreZkRegister-913-thread-1) [    ] o.a.s.c.ZkController numShards not found on descriptor - reading it from system property
   [junit4]   2> 288089 INFO  (OverseerStateUpdate-95200179191152644-127.0.0.1:38659_zz-n_0000000000) [    ] o.a.s.c.Overseer processMessage: queueSize: 1, message = {
   [junit4]   2>   "core":"collection1",
   [junit4]   2>   "core_node_name":"core_node1",
   [junit4]   2>   "roles":null,
   [junit4]   2>   "base_url":"http://127.0.0.1:38659/zz",
   [junit4]   2>   "node_name":"127.0.0.1:38659_zz",
   [junit4]   2>   "numShards":"1",
   [junit4]   2>   "state":"active",
   [junit4]   2>   "shard":"shard1",
   [junit4]   2>   "collection":"control_collection",
   [junit4]   2>   "operation":"state"} current state version: 2
   [junit4]   2> 288089 INFO  (OverseerStateUpdate-95200179191152644-127.0.0.1:38659_zz-n_0000000000) [    ] o.a.s.c.o.ReplicaMutator Update state numShards=1 message={
   [junit4]   2>   "core":"collection1",
   [junit4]   2>   "core_node_name":"core_node1",
   [junit4]   2>   "roles":null,
   [junit4]   2>   "base_url":"http://127.0.0.1:38659/zz",
   [junit4]   2>   "node_name":"127.0.0.1:38659_zz",
   [junit4]   2>   "numShards":"1",
   [junit4]   2>   "state":"active",
   [junit4]   2>   "shard":"shard1",
   [junit4]   2>   "collection":"control_collection",
   [junit4]   2>   "operation":"state"}
   [junit4]   2> 288190 INFO  (zkCallback-381-thread-1) [    ] o.a.s.c.c.ZkStateReader A cluster state change: [WatchedEvent state:SyncConnected type:NodeDataChanged path:/clusterstate.json], has occurred - updating... (live nodes size: [1])
   [junit4]   2> 288325 INFO  (TEST-HttpPartitionTest.test-seed#[74A05DFD49F5F752]) [    ] o.a.s.c.c.SolrZkClient Using default ZkCredentialsProvider
   [junit4]   2> 288325 INFO  (TEST-HttpPartitionTest.test-seed#[74A05DFD49F5F752]) [    ] o.a.s.c.c.ConnectionManager Waiting for client to connect to ZooKeeper
   [junit4]   2> 288326 INFO  (zkCallback-383-thread-1) [    ] o.a.s.c.c.ConnectionManager Watcher org.apache.solr.common.cloud.ConnectionManager@168b21c name:ZooKeeperConnection Watcher:127.0.0.1:39265/solr got event WatchedEvent state:SyncConnected type:None path:null path:null type:None
   [junit4]   2> 288326 INFO  (TEST-HttpPartitionTest.test-seed#[74A05DFD49F5F752]) [    ] o.a.s.c.c.ConnectionManager Client is connected to ZooKeeper
   [junit4]   2> 288326 INFO  (TEST-HttpPartitionTest.test-seed#[74A05DFD49F5F752]) [    ] o.a.s.c.c.SolrZkClient Using default ZkACLProvider
   [junit4]   2> 288326 INFO  (TEST-HttpPartitionTest.test-seed#[74A05DFD49F5F752]) [    ] o.a.s.c.c.ZkStateReader Updating cluster state from ZooKeeper... 
   [junit4]   2> 288327 INFO  (TEST-HttpPartitionTest.test-seed#[74A05DFD49F5F752]) [    ] o.a.s.c.ChaosMonkey monkey: init - expire sessions:false cause connection loss:false
   [junit4]   2> 288419 INFO  (TEST-HttpPartitionTest.test-seed#[74A05DFD49F5F752]) [    ] o.a.s.SolrTestCaseJ4 Writing core.properties file to /home/jenkins/workspace/Lucene-Solr-trunk-Linux/solr/build/solr-core/test/J1/temp/solr.cloud.HttpPartitionTest_74A05DFD49F5F752-001/shard-1-001/cores/collection1
   [junit4]   2> 288420 INFO  (TEST-HttpPartitionTest.test-seed#[74A05DFD49F5F752]) [    ] o.a.s.c.AbstractFullDistribZkTestBase create jetty 1 in directory /home/jenkins/workspace/Lucene-Solr-trunk-Linux/solr/build/solr-core/test/J1/temp/solr.cloud.HttpPartitionTest_74A05DFD49F5F752-001/shard-1-001
   [junit4]   2> 288420 INFO  (TEST-HttpPartitionTest.test-seed#[74A05DFD49F5F752]) [    ] o.e.j.s.Server jetty-9.2.13.v20150730
   [junit4]   2> 288421 INFO  (TEST-HttpPartitionTest.test-seed#[74A05DFD49F5F752]) [    ] o.e.j.s.h.ContextHandler Started o.e.j.s.ServletContextHandler@9352ed{/zz,null,AVAILABLE}
   [junit4]   2> 288421 INFO  (TEST-HttpPartitionTest.test-seed#[74A05DFD49F5F752]) [    ] o.e.j.s.ServerConnector Started ServerConnector@725edf{HTTP/1.1}{127.0.0.1:36378}
   [junit4]   2> 288421 INFO  (TEST-HttpPartitionTest.test-seed#[74A05DFD49F5F752]) [    ] o.e.j.s.Server Started @289945ms
   [junit4]   2> 288421 INFO  (TEST-HttpPartitionTest.test-seed#[74A05DFD49F5F752]) [    ] o.a.s.c.s.e.JettySolrRunner Jetty properties: {solr.data.dir=/home/jenkins/workspace/Lucene-Solr-trunk-Linux/solr/build/solr-core/test/J1/temp/solr.cloud.HttpPartitionTest_74A05DFD49F5F752-001/tempDir-001/jetty1, solrconfig=solrconfig.xml, hostContext=/zz, hostPort=37497, coreRootDirectory=/home/jenkins/workspace/Lucene-Solr-trunk-Linux/solr/build/solr-core/test/J1/temp/solr.cloud.HttpPartitionTest_74A05DFD49F5F752-001/shard-1-001/cores}
   [junit4]   2> 288421 INFO  (TEST-HttpPartitionTest.test-seed#[74A05DFD49F5F752]) [    ] o.a.s.s.SolrDispatchFilter SolrDispatchFilter.init(): sun.misc.Launcher$AppClassLoader@1521cc1
   [junit4]   2> 288421 INFO  (TEST-HttpPartitionTest.test-seed#[74A05DFD49F5F752]) [    ] o.a.s.c.SolrResourceLoader new SolrResourceLoader for directory: '/home/jenkins/workspace/Lucene-Solr-trunk-Linux/solr/build/solr-core/test/J1/temp/solr.cloud.HttpPartitionTest_74A05DFD49F5F752-001/shard-1-001'
   [junit4]   2> 288422 INFO  (TEST-HttpPartitionTest.test-seed#[74A05DFD49F5F752]) [    ] o.a.s.c.SolrResourceLoader JNDI not configured for solr (NoInitialContextEx)
   [junit4]   2> 288422 INFO  (TEST-HttpPartitionTest.test-seed#[74A05DFD49F5F752]) [    ] o.a.s.c.SolrResourceLoader solr home defaulted to 'solr/' (could not find system property or JNDI)
   [junit4]   2> 288422 INFO  (TEST-HttpPartitionTest.test-seed#[74A05DFD49F5F752]) [    ] o.a.s.c.c.SolrZkClient Using default ZkCredentialsProvider
   [junit4]   2> 288422 INFO  (TEST-HttpPartitionTest.test-seed#[74A05DFD49F5F752]) [    ] o.a.s.c.c.ConnectionManager Waiting for client to connect to ZooKeeper
   [junit4]   2> 288423 INFO  (zkCallback-384-thread-1) [    ] o.a.s.c.c.ConnectionManager Watcher org.apache.solr.common.cloud.ConnectionManager@2d5eae name:ZooKeeperConnection Watcher:127.0.0.1:39265/solr got event WatchedEvent state:SyncConnected type:None path:null path:null type:None
   [junit4]   2> 288423 INFO  (TEST-HttpPartitionTest.test-seed#[74A05DFD49F5F752]) [    ] o.a.s.c.c.ConnectionManager Client is connected to ZooKeeper
   [junit4]   2> 288423 INFO  (TEST-HttpPartitionTest.test-seed#[74A05DFD49F5F752]) [    ] o.a.s.c.c.SolrZkClient Using default ZkACLProvider
   [junit4]   2> 288424 INFO  (TEST-HttpPartitionTest.test-seed#[74A05DFD49F5F752]) [    ] o.a.s.s.SolrDispatchFilter Loading solr.xml from SolrHome (not found in ZooKeeper)
   [junit4]   2> 288424 INFO  (TEST-HttpPartitionTest.test-seed#[74A05DFD49F5F752]) [    ] o.a.s.c.SolrXmlConfig Loading container configuration from /home/jenkins/workspace/Lucene-Solr-trunk-Linux/solr/build/solr-core/test/J1/temp/solr.cloud.HttpPartitionTest_74A05DFD49F5F752-001/shard-1-001/solr.xml
   [junit4]   2> 288424 WARN  (NIOServerCxn.Factory:0.0.0.0/0.0.0.0:0) [    ] o.a.z.s.NIOServerCnxn caught end of stream exception
   [junit4]   2> EndOfStreamException: Unable to read additional data from client sessionid 0x152380eff3e0006, likely client has closed socket
   [junit4]   2> 	at org.apache.zookeeper.server.NIOServerCnxn.doIO(NIOServerCnxn.java:228)
   [junit4]   2> 	at org.apache.zookeeper.server.NIOServerCnxnFactory.run(NIOServerCnxnFactory.java:208)
   [junit4]   2> 	at java.lang.Thread.run(Thread.java:747)
   [junit4]   2> 288427 INFO  (TEST-HttpPartitionTest.test-seed#[74A05DFD49F5F752]) [    ] o.a.s.c.CorePropertiesLocator Config-defined core root directory: /home/jenkins/workspace/Lucene-Solr-trunk-Linux/solr/build/solr-core/test/J1/temp/solr.cloud.HttpPartitionTest_74A05DFD49F5F752-001/shard-1-001/cores
   [junit4]   2> 288427 INFO  (TEST-HttpPartitionTest.test-seed#[74A05DFD49F5F752]) [    ] o.a.s.c.CoreContainer New CoreContainer 18952381
   [junit4]   2> 288427 INFO  (TEST-HttpPartitionTest.test-seed#[74A05DFD49F5F752]) [    ] o.a.s.c.CoreContainer Loading cores into CoreContainer [instanceDir=/home/jenkins/workspace/Lucene-Solr-trunk-Linux/solr/build/solr-core/test/J1/temp/solr.cloud.HttpPartitionTest_74A05DFD49F5F752-001/shard-1-001]
   [junit4]   2> 288427 WARN  (TEST-HttpPartitionTest.test-seed#[74A05DFD49F5F752]) [    ] o.a.s.c.CoreContainer Couldn't add files from /home/jenkins/workspace/Lucene-Solr-trunk-Linux/solr/build/solr-core/test/J1/temp/solr.cloud.HttpPartitionTest_74A05DFD49F5F752-001/shard-1-001/lib to classpath: /home/jenkins/workspace/Lucene-Solr-trunk-Linux/solr/build/solr-core/test/J1/temp/solr.cloud.HttpPartitionTest_74A05DFD49F5F752-001/shard-1-001/lib
   [junit4]   2> 288427 INFO  (TEST-HttpPartitionTest.test-seed#[74A05DFD49F5F752]) [    ] o.a.s.h.c.HttpShardHandlerFactory created with socketTimeout : 90000,urlScheme : ,connTimeout : 15000,maxConnectionsPerHost : 20,maxConnections : 10000,corePoolSize : 0,maximumPoolSize : 2147483647,maxThreadIdleTime : 5,sizeOfQueue : -1,fairnessPolicy : false,useRetries : false,
   [junit4]   2> 288428 INFO  (TEST-HttpPartitionTest.test-seed#[74A05DFD49F5F752]) [    ] o.a.s.u.UpdateShardHandler Creating UpdateShardHandler HTTP client with params: socketTimeout=340000&connTimeout=45000&retry=true
   [junit4]   2> 288428 INFO  (TEST-HttpPartitionTest.test-seed#[74A05DFD49F5F752]) [    ] o.a.s.l.LogWatcher SLF4J impl is org.slf4j.impl.Log4jLoggerFactory
   [junit4]   2> 288428 INFO  (TEST-HttpPartitionTest.test-seed#[74A05DFD49F5F752]) [    ] o.a.s.l.LogWatcher Registering Log Listener [Log4j (org.slf4j.impl.Log4jLoggerFactory)]
   [junit4]   2> 288428 INFO  (TEST-HttpPartitionTest.test-seed#[74A05DFD49F5F752]) [    ] o.a.s.c.ZkContainer Zookeeper client=127.0.0.1:39265/solr
   [junit4]   2> 288428 INFO  (TEST-HttpPartitionTest.test-seed#[74A05DFD49F5F752]) [    ] o.a.s.c.ZkController zkHost includes chroot
   [junit4]   2> 288428 INFO  (TEST-HttpPartitionTest.test-seed#[74A05DFD49F5F752]) [    ] o.a.s.c.c.SolrZkClient Using default ZkCredentialsProvider
   [junit4]   2> 288428 INFO  (TEST-HttpPartitionTest.test-seed#[74A05DFD49F5F752]) [    ] o.a.s.c.c.ConnectionManager Waiting for client to connect to ZooKeeper
   [junit4]   2> 288429 INFO  (zkCallback-387-thread-1) [    ] o.a.s.c.c.ConnectionManager Watcher org.apache.solr.common.cloud.ConnectionManager@1e6e5ea name:ZooKeeperConnection Watcher:127.0.0.1:39265 got event WatchedEvent state:SyncConnected type:None path:null path:null type:None
   [junit4]   2> 288429 INFO  (TEST-HttpPartitionTest.test-seed#[74A05DFD49F5F752]) [    ] o.a.s.c.c.ConnectionManager Client is connected to ZooKeeper
   [junit4]   2> 288430 INFO  (TEST-HttpPartitionTest.test-seed#[74A05DFD49F5F752]) [    ] o.a.s.c.c.SolrZkClient Using default ZkACLProvider
   [junit4]   2> 288430 INFO  (TEST-HttpPartitionTest.test-seed#[74A05DFD49F5F752]) [    ] o.a.s.c.c.ConnectionManager Waiting for client to connect to ZooKeeper
   [junit4]   2> 288431 INFO  (zkCallback-388-thread-1) [    ] o.a.s.c.c.ConnectionManager Watcher org.apache.solr.common.cloud.ConnectionManager@35c774 name:ZooKeeperConnection Watcher:127.0.0.1:39265/solr got event WatchedEvent state:SyncConnected type:None path:null path:null type:None
   [junit4]   2> 288431 INFO  (TEST-HttpPartitionTest.test-seed#[74A05DFD49F5F752]) [    ] o.a.s.c.c.ConnectionManager Client is connected to ZooKeeper
   [junit4]   2> 288432 INFO  (TEST-HttpPartitionTest.test-seed#[74A05DFD49F5F752]) [    ] o.a.s.c.c.ZkStateReader Updating cluster state from ZooKeeper... 
   [junit4]   2> 289435 INFO  (TEST-HttpPartitionTest.test-seed#[74A05DFD49F5F752]) [    ] o.a.s.c.ZkController Register node as live in ZooKeeper:/live_nodes/127.0.0.1:37497_zz
   [junit4]   2> 289435 INFO  (TEST-HttpPartitionTest.test-seed#[74A05DFD49F5F752]) [    ] o.a.s.c.c.SolrZkClient makePath: /live_nodes/127.0.0.1:37497_zz
   [junit4]   2> 289435 INFO  (zkCallback-388-thread-1) [    ] o.a.s.c.c.ZkStateReader A live node change: [WatchedEvent state:SyncConnected type:NodeChildrenChanged path:/live_nodes], has occurred - updating... (live nodes size: [1])
   [junit4]   2> 289435 INFO  (zkCallback-383-thread-1) [    ] o.a.s.c.c.ZkStateReader A live node change: [WatchedEvent state:SyncConnected type:NodeChildrenChanged path:/live_nodes], has occurred - updating... (live nodes size: [1])
   [junit4]   2> 289435 INFO  (zkCallback-381-thread-2) [    ] o.a.s.c.c.ZkStateReader A live node change: [WatchedEvent state:SyncConnected type:NodeChildrenChanged path:/live_nodes], has occurred - updating... (live nodes size: [1])
   [junit4]   2> 289436 INFO  (TEST-HttpPartitionTest.test-seed#[74A05DFD49F5F752]) [    ] o.a.s.c.Overseer Overseer (id=null) closing
   [junit4]   2> 289437 INFO  (TEST-HttpPartitionTest.test-seed#[74A05DFD49F5F752]) [    ] o.a.s.c.LeaderElector Joined leadership election with path: /overseer_elect/election/95200179191152648-127.0.0.1:37497_zz-n_0000000001
   [junit4]   2> 289438 INFO  (TEST-HttpPartitionTest.test-seed#[74A05DFD49F5F752]) [    ] o.a.s.c.LeaderElector Watching path /overseer_elect/election/95200179191152644-127.0.0.1:38659_zz-n_0000000000 to know if I could be the leader
   [junit4]   2> 289454 INFO  (TEST-HttpPartitionTest.test-seed#[74A05DFD49F5F752]) [    ] o.a.s.c.CoreContainer Security conf doesn't exist. Skipping setup for authorization module.
   [junit4]   2> 289454 INFO  (TEST-HttpPartitionTest.test-seed#[74A05DFD49F5F752]) [    ] o.a.s.c.CoreContainer No authentication plugin used.
   [junit4]   2> 289455 INFO  (TEST-HttpPartitionTest.test-seed#[74A05DFD49F5F752]) [    ] o.a.s.c.CorePropertiesLocator Looking for core definitions underneath /home/jenkins/workspace/Lucene-Solr-trunk-Linux/solr/build/solr-core/test/J1/temp/solr.cloud.HttpPartitionTest_74A05DFD49F5F752-001/shard-1-001/cores
   [junit4]   2> 289455 INFO  (TEST-HttpPartitionTest.test-seed#[74A05DFD49F5F752]) [    ] o.a.s.c.CoreDescriptor Created CoreDescriptor: {name=collection1, config=solrconfig.xml, transient=false, schema=schema.xml, loadOnStartup=true, configSetProperties=configsetprops.json, collection=collection1, coreNodeName=, dataDir=data/, shard=}
   [junit4]   2> 289455 INFO  (TEST-HttpPartitionTest.test-seed#[74A05DFD49F5F752]) [    ] o.a.s.c.CorePropertiesLocator Found core collection1 in /home/jenkins/workspace/Lucene-Solr-trunk-Linux/solr/build/solr-core/test/J1/temp/solr.cloud.HttpPartitionTest_74A05DFD49F5F752-001/shard-1-001/cores/collection1
   [junit4]   2> 289455 INFO  (TEST-HttpPartitionTest.test-seed#[74A05DFD49F5F752]) [    ] o.a.s.c.CorePropertiesLocator Found 1 core definitions
   [junit4]   2> 289456 INFO  (TEST-HttpPartitionTest.test-seed#[74A05DFD49F5F752]) [    ] o.a.s.s.SolrDispatchFilter user.dir=/home/jenkins/workspace/Lucene-Solr-trunk-Linux/solr/build/solr-core/test/J1
   [junit4]   2> 289456 INFO  (TEST-HttpPartitionTest.test-seed#[74A05DFD49F5F752]) [    ] o.a.s.s.SolrDispatchFilter SolrDispatchFilter.init() done
   [junit4]   2> 289456 INFO  (coreLoadExecutor-930-thread-1) [    ] o.a.s.c.ZkController publishing state=down
   [junit4]   2> 289456 INFO  (coreLoadExecutor-930-thread-1) [    ] o.a.s.c.ZkController numShards not found on descriptor - reading it from system property
   [junit4]   2> 289458 INFO  (coreLoadExecutor-930-thread-1) [    ] o.a.s.c.ZkController look for our core node name
   [junit4]   2> 289458 INFO  (OverseerStateUpdate-95200179191152644-127.0.0.1:38659_zz-n_0000000000) [    ] o.a.s.c.Overseer processMessage: queueSize: 1, message = {
   [junit4]   2>   "core":"collection1",
   [junit4]   2>   "roles":null,
   [junit4]   2>   "base_url":"http://127.0.0.1:37497/zz",
   [junit4]   2>   "node_name":"127.0.0.1:37497_zz",
   [junit4]   2>   "numShards":"2",
   [junit4]   2>   "state":"down",
   [junit4]   2>   "shard":null,
   [junit4]   2>   "collection":"collection1",
   [junit4]   2>   "operation":"state"} current state version: 3
   [junit4]   2> 289458 INFO  (OverseerStateUpdate-95200179191152644-127.0.0.1:38659_zz-n_0000000000) [    ] o.a.s.c.o.ReplicaMutator Update state numShards=2 message={
   [junit4]   2>   "core":"collection1",
   [junit4]   2>   "roles":null,
   [junit4]   2>   "base_url":"http://127.0.0.1:37497/zz",
   [junit4]   2>   "node_name":"127.0.0.1:37497_zz",
   [junit4]   2>   "numShards":"2",
   [junit4]   2>   "state":"down",
   [junit4]   2>   "shard":null,
   [junit4]   2>   "collection":"collection1",
   [junit4]   2>   "operation":"state"}
   [junit4]   2> 289458 INFO  (OverseerStateUpdate-95200179191152644-127.0.0.1:38659_zz-n_0000000000) [    ] o.a.s.c.o.ClusterStateMutator building a new cName: collection1
   [junit4]   2> 289458 INFO  (OverseerStateUpdate-95200179191152644-127.0.0.1:38659_zz-n_0000000000) [    ] o.a.s.c.o.ReplicaMutator Assigning new node to shard shard=shard2
   [junit4]   2> 289559 INFO  (zkCallback-383-thread-1) [    ] o.a.s.c.c.ZkStateReader A cluster state change: [WatchedEvent state:SyncConnected type:NodeDataChanged path:/clusterstate.json], has occurred - updating... (live nodes size: [2])
   [junit4]   2> 289559 INFO  (zkCallback-381-thread-2) [    ] o.a.s.c.c.ZkStateReader A cluster state change: [WatchedEvent state:SyncConnected type:NodeDataChanged path:/clusterstate.json], has occurred - updating... (live nodes size: [2])
   [junit4]   2> 289559 INFO  (zkCallback-388-thread-1) [    ] o.a.s.c.c.ZkStateReader A cluster state change: [WatchedEvent state:SyncConnected type:NodeDataChanged path:/clusterstate.json], has occurred - updating... (live nodes size: [2])
   [junit4]   2> 290458 INFO  (coreLoadExecutor-930-thread-1) [    ] o.a.s.c.ZkController waiting to find shard id in clusterstate for collection1
   [junit4]   2> 290458 INFO  (coreLoadExecutor-930-thread-1) [    ] o.a.s.c.ZkController Check for collection zkNode:collection1
   [junit4]   2> 290458 INFO  (coreLoadExecutor-930-thread-1) [    ] o.a.s.c.ZkController Collection zkNode exists
   [junit4]   2> 290459 INFO  (coreLoadExecutor-930-thread-1) [    ] o.a.s.c.c.ZkStateReader Load collection config from: [/collections/collection1]
   [junit4]   2> 290459 INFO  (coreLoadExecutor-930-thread-1) [    ] o.a.s.c.c.ZkStateReader path=[/collections/collection1] [configName]=[conf1] specified config exists in ZooKeeper
   [junit4]   2> 290459 INFO  (coreLoadExecutor-930-thread-1) [    ] o.a.s.c.SolrResourceLoader new SolrResourceLoader for directory: '/home/jenkins/workspace/Lucene-Solr-trunk-Linux/solr/build/solr-core/test/J1/temp/solr.cloud.HttpPartitionTest_74A05DFD49F5F752-001/shard-1-001/cores/collection1'
   [junit4]   2> 290459 INFO  (coreLoadExecutor-930-thread-1) [    ] o.a.s.c.SolrResourceLoader JNDI not configured for solr (NoInitialContextEx)
   [junit4]   2> 290459 INFO  (coreLoadExecutor-930-thread-1) [    ] o.a.s.c.SolrResourceLoader solr home defaulted to 'solr/' (could not find system property or JNDI)
   [junit4]   2> 290460 INFO  (coreLoadExecutor-930-thread-1) [    ] o.a.s.c.Config loaded config solrconfig.xml with version 0 
   [junit4]   2> 290463 INFO  (coreLoadExecutor-930-thread-1) [    ] o.a.s.c.SolrConfig current version of requestparams : -1
   [junit4]   2> 290465 INFO  (coreLoadExecutor-930-thread-1) [    ] o.a.s.c.SolrConfig Using Lucene MatchVersion: 6.0.0
   [junit4]   2> 290470 INFO  (coreLoadExecutor-930-thread-1) [    ] o.a.s.c.SolrConfig Loaded SolrConfig: solrconfig.xml
   [junit4]   2> 290474 INFO  (coreLoadExecutor-930-thread-1) [    ] o.a.s.s.IndexSchema [collection1] Schema name=test
   [junit4]   2> 290785 INFO  (coreLoadExecutor-930-thread-1) [    ] o.a.s.s.OpenExchangeRatesOrgProvider Initialized with rates=open-exchange-rates.json, refreshInterval=1440.
   [junit4]   2> 290791 INFO  (coreLoadExecutor-930-thread-1) [    ] o.a.s.s.IndexSchema default search field in schema is text
   [junit4]   2> 290792 INFO  (coreLoadExecutor-930-thread-1) [    ] o.a.s.s.IndexSchema unique key field: id
   [junit4]   2> 290799 INFO  (coreLoadExecutor-930-thread-1) [    ] o.a.s.s.FileExchangeRateProvider Reloading exchange rates from file currency.xml
   [junit4]   2> 290800 INFO  (coreLoadExecutor-930-thread-1) [    ] o.a.s.s.FileExchangeRateProvider Reloading exchange rates from file currency.xml
   [junit4]   2> 290801 INFO  (coreLoadExecutor-930-thread-1) [    ] o.a.s.s.OpenExchangeRatesOrgProvider Reloading exchange rates from open-exchange-rates.json
   [junit4]   2> 290801 INFO  (coreLoadExecutor-930-thread-1) [    ] o.a.s.s.OpenExchangeRatesOrgProvider Reloading exchange rates from open-exchange-rates.json
   [junit4]   2> 290802 INFO  (coreLoadExecutor-930-thread-1) [    ] o.a.s.c.ConfigSetProperties Did not find ConfigSet properties, assuming default properties: Can't find resource 'configsetprops.json' in classpath or '/configs/conf1', cwd=/home/jenkins/workspace/Lucene-Solr-trunk-Linux/solr/build/solr-core/test/J1
   [junit4]   2> 290802 INFO  (coreLoadExecutor-930-thread-1) [    ] o.a.s.c.CoreContainer Creating SolrCore 'collection1' using configuration from collection collection1
   [junit4]   2> 290802 INFO  (coreLoadExecutor-930-thread-1) [    ] o.a.s.c.SolrCore org.apache.solr.core.MockDirectoryFactory
   [junit4]   2> 290803 INFO  (coreLoadExecutor-930-thread-1) [    ] o.a.s.c.SolrCore [[collection1] ] Opening new SolrCore at [/home/jenkins/workspace/Lucene-Solr-trunk-Linux/solr/build/solr-core/test/J1/temp/solr.cloud.HttpPartitionTest_74A05DFD49F5F752-001/shard-1-001/cores/collection1], dataDir=[/home/jenkins/workspace/Lucene-Solr-trunk-Linux/solr/build/solr-core/test/J1/temp/solr.cloud.HttpPartitionTest_74A05DFD49F5F752-001/shard-1-001/cores/collection1/data/]
   [junit4]   2> 290803 INFO  (coreLoadExecutor-930-thread-1) [    ] o.a.s.c.JmxMonitoredMap JMX monitoring is enabled. Adding Solr mbeans to JMX Server: com.sun.jmx.mbeanserver.JmxMBeanServer@1f88ed8
   [junit4]   2> 290803 INFO  (coreLoadExecutor-930-thread-1) [    ] o.a.s.c.CachingDirectoryFactory return new directory for /home/jenkins/workspace/Lucene-Solr-trunk-Linux/solr/build/solr-core/test/J1/temp/solr.cloud.HttpPartitionTest_74A05DFD49F5F752-001/shard-1-001/cores/collection1/data
   [junit4]   2> 290803 INFO  (coreLoadExecutor-930-thread-1) [    ] o.a.s.c.SolrCore New index directory detected: old=null new=/home/jenkins/workspace/Lucene-Solr-trunk-Linux/solr/build/solr-core/test/J1/temp/solr.cloud.HttpPartitionTest_74A05DFD49F5F752-001/shard-1-001/cores/collection1/data/index/
   [junit4]   2> 290803 WARN  (coreLoadExecutor-930-thread-1) [    ] o.a.s.c.SolrCore [collection1] Solr index directory '/home/jenkins/workspace/Lucene-Solr-trunk-Linux/solr/build/solr-core/test/J1/temp/solr.cloud.HttpPartitionTest_74A05DFD49F5F752-001/shard-1-001/cores/collection1/data/index' doesn't exist. Creating new index...
   [junit4]   2> 290803 INFO  (coreLoadExecutor-930-thread-1) [    ] o.a.s.c.CachingDirectoryFactory return new directory for /home/jenkins/workspace/Lucene-Solr-trunk-Linux/solr/build/solr-core/test/J1/temp/solr.cloud.HttpPartitionTest_74A05DFD49F5F752-001/shard-1-001/cores/collection1/data/index
   [junit4]   2> 290804 INFO  (coreLoadExecutor-930-thread-1) [    ] o.a.s.u.RandomMergePolicy RandomMergePolicy wrapping class org.apache.lucene.index.LogDocMergePolicy: [LogDocMergePolicy: minMergeSize=1000, mergeFactor=19, maxMergeSize=9223372036854775807, maxMergeSizeForForcedMerge=9223372036854775807, calibrateSizeByDeletes=false, maxMergeDocs=2147483647, maxCFSSegmentSizeMB=8.796093022207999E12, noCFSRatio=0.4014396159910435]
   [junit4]   2> 290804 INFO  (coreLoadExecutor-930-thread-1) [    ] o.a.s.c.SolrDeletionPolicy SolrDeletionPolicy.onCommit: commits: num=1
   [junit4]   2> 	commit{dir=MockDirectoryWrapper(RAMDirectory@550b3d lockFactory=org.apache.lucene.store.SingleInstanceLockFactory@19369e0),segFN=segments_1,generation=1}
   [junit4]   2> 290804 INFO  (coreLoadExecutor-930-thread-1) [    ] o.a.s.c.SolrDeletionPolicy newest commit generation = 1
   [junit4]   2> 290804 INFO  (OldIndexDirectoryCleanupThreadForCore-collection1) [    ] o.a.s.c.SolrCore Looking for old index directories to cleanup for core collection1 in /home/jenkins/workspace/Lucene-Solr-trunk-Linux/solr/build/solr-core/test/J1/temp/solr.cloud.HttpPartitionTest_74A05DFD49F5F752-001/shard-1-001/cores/collection1/data/
   [junit4]   2> 290805 WARN  (OldIndexDirectoryCleanupThreadForCore-collection1) [    ] o.a.s.c.DirectoryFactory /home/jenkins/workspace/Lucene-Solr-trunk-Linux/solr/build/solr-core/test/J1/temp/solr.cloud.HttpPartitionTest_74A05DFD49F5F752-001/shard-1-001/cores/collection1/data/ does not point to a valid data directory; skipping clean-up of old index directories.
   [junit4]   2> 290807 INFO  (coreLoadExecutor-930-thread-1) [    ] o.a.s.u.p.UpdateRequestProcessorChain creating updateRequestProcessorChain "nodistrib"
   [junit4]   2> 290807 INFO  (coreLoadExecutor-930-thread-1) [    ] o.a.s.u.p.UpdateRequestProcessorChain creating updateRequestProcessorChain "dedupe"
   [junit4]   2> 290807 INFO  (coreLoadExecutor-930-thread-1) [    ] o.a.s.u.p.UpdateRequestProcessorChain inserting DistributedUpdateProcessorFactory into updateRequestProcessorChain "dedupe"
   [junit4]   2> 290807 INFO  (coreLoadExecutor-930-thread-1) [    ] o.a.s.u.p.UpdateRequestProcessorChain creating updateRequestProcessorChain "stored_sig"
   [junit4]   2> 290808 INFO  (coreLoadExecutor-930-thread-1) [    ] o.a.s.u.p.UpdateRequestProcessorChain inserting DistributedUpdateProcessorFactory into updateRequestProcessorChain "stored_sig"
   [junit4]   2> 290808 INFO  (coreLoadExecutor-930-thread-1) [    ] o.a.s.u.p.UpdateRequestProcessorChain creating updateRequestProcessorChain "distrib-dup-test-chain-explicit"
   [junit4]   2> 290808 INFO  (coreLoadExecutor-930-thread-1) [    ] o.a.s.u.p.UpdateRequestProcessorChain creating updateRequestProcessorChain "distrib-dup-test-chain-implicit"
   [junit4]   2> 290808 INFO  (coreLoadExecutor-930-thread-1) [    ] o.a.s.u.p.UpdateRequestProcessorChain inserting DistributedUpdateProcessorFactory into updateRequestProcessorChain "distrib-dup-test-chain-implicit"
   [junit4]   2> 290808 INFO  (coreLoadExecutor-930-thread-1) [    ] o.a.s.c.SolrCore no updateRequestProcessorChain defined as default, creating implicit default
   [junit4]   2> 290808 WARN  (coreLoadExecutor-930-thread-1) [    ] o.a.s.c.RequestHandlers INVALID paramSet a in requestHandler {type = requestHandler,name = /dump,class = DumpRequestHandler,args = {defaults={a=A,b=B}}}
   [junit4]   2> 290809 INFO  (coreLoadExecutor-930-thread-1) [    ] o.a.s.h.l.XMLLoader xsltCacheLifetimeSeconds=60
   [junit4]   2> 290810 INFO  (coreLoadExecutor-930-thread-1) [    ] o.a.s.h.l.XMLLoader xsltCacheLifetimeSeconds=60
   [junit4]   2> 290810 INFO  (coreLoadExecutor-930-thread-1) [    ] o.a.s.h.l.XMLLoader xsltCacheLifetimeSeconds=60
   [junit4]   2> 290811 INFO  (coreLoadExecutor-930-thread-1) [    ] o.a.s.h.l.XMLLoader xsltCacheLifetimeSeconds=60
   [junit4]   2> 290814 INFO  (coreLoadExecutor-930-thread-1) [    ] o.a.s.c.RequestHandlers Registered paths: /admin/mbeans,standard,/dump,/update/csv,/sql,/update/json/docs,/admin/luke,/export,/admin/segments,/get,/admin/system,/replication,/admin/properties,/config,/stream,/schema,/admin/plugins,/admin/logging,/update/json,/admin/threads,/admin/ping,/update,/admin/file
   [junit4]   2> 290814 INFO  (coreLoadExecutor-930-thread-1) [    ] o.a.s.c.SolrCore Using default statsCache cache: org.apache.solr.search.stats.LocalStatsCache
   [junit4]   2> 290814 INFO  (coreLoadExecutor-930-thread-1) [    ] o.a.s.u.UpdateHandler Using UpdateLog implementation: org.apache.solr.update.UpdateLog
   [junit4]   2> 290814 INFO  (coreLoadExecutor-930-thread-1) [    ] o.a.s.u.UpdateLog Initializing UpdateLog: dataDir= defaultSyncLevel=FLUSH numRecordsToKeep=100 maxNumLogsToKeep=10 numVersionBuckets=65536
   [junit4]   2> 290815 INFO  (coreLoadExecutor-930-thread-1) [    ] o.a.s.u.CommitTracker Hard AutoCommit: disabled
   [junit4]   2> 290815 INFO  (coreLoadExecutor-930-thread-1) [    ] o.a.s.u.CommitTracker Soft AutoCommit: disabled
   [junit4]   2> 290815 INFO  (coreLoadExecutor-930-thread-1) [    ] o.a.s.u.RandomMergePolicy RandomMergePolicy wrapping class org.apache.lucene.index.LogDocMergePolicy: [LogDocMergePolicy: minMergeSize=1000, mergeFactor=32, maxMergeSize=9223372036854775807, maxMergeSizeForForcedMerge=9223372036854775807, calibrateSizeByDeletes=true, maxMergeDocs=2147483647, maxCFSSegmentSizeMB=8.796093022207999E12, noCFSRatio=0.7543455036189799]
   [junit4]   2> 290815 INFO  (coreLoadExecutor-930-thread-1) [    ] o.a.s.c.SolrDeletionPolicy SolrDeletionPolicy.onInit: commits: num=1
   [junit4]   2> 	commit{dir=MockDirectoryWrapper(RAMDirectory@550b3d lockFactory=org.apache.lucene.store.SingleInstanceLockFactory@19369e0),segFN=segments_1,generation=1}
   [junit4]   2> 290815 INFO  (coreLoadExecutor-930-thread-1) [    ] o.a.s.c.SolrDeletionPolicy newest commit generation = 1
   [junit4]   2> 290815 INFO  (coreLoadExecutor-930-thread-1) [    ] o.a.s.s.SolrIndexSearcher Opening [Searcher@1b5763f[collection1] main]
   [junit4]   2> 290816 INFO  (coreLoadExecutor-930-thread-1) [    ] o.a.s.c.c.ZkStateReader Load collection config from: [/collections/collection1]
   [junit4]   2> 290816 INFO  (coreLoadExecutor-930-thread-1) [    ] o.a.s.c.c.ZkStateReader path=[/collections/collection1] [configName]=[conf1] specified config exists in ZooKeeper
   [junit4]   2> 290816 INFO  (coreLoadExecutor-930-thread-1) [    ] o.a.s.r.ManagedResourceStorage Setting up ZooKeeper-based storage for the RestManager with znodeBase: /configs/conf1
   [junit4]   2> 290816 INFO  (coreLoadExecutor-930-thread-1) [    ] o.a.s.r.ManagedResourceStorage Configured ZooKeeperStorageIO with znodeBase: /configs/conf1
   [junit4]   2> 290816 INFO  (coreLoadExecutor-930-thread-1) [    ] o.a.s.r.RestManager Initializing RestManager with initArgs: {}
   [junit4]   2> 290816 INFO  (coreLoadExecutor-930-thread-1) [    ] o.a.s.r.ManagedResourceStorage Reading _rest_managed.json using ZooKeeperStorageIO:path=/configs/conf1
   [junit4]   2> 290816 INFO  (coreLoadExecutor-930-thread-1) [    ] o.a.s.r.ManagedResourceStorage No data found for znode /configs/conf1/_rest_managed.json
   [junit4]   2> 290816 INFO  (coreLoadExecutor-930-thread-1) [    ] o.a.s.r.ManagedResourceStorage Loaded null at path _rest_managed.json using ZooKeeperStorageIO:path=/configs/conf1
   [junit4]   2> 290816 INFO  (coreLoadExecutor-930-thread-1) [    ] o.a.s.r.RestManager Initializing 0 registered ManagedResources
   [junit4]   2> 290816 INFO  (coreLoadExecutor-930-thread-1) [    ] o.a.s.h.ReplicationHandler Commits will be reserved for  10000
   [junit4]   2> 290817 INFO  (searcherExecutor-931-thread-1) [    ] o.a.s.c.SolrCore [collection1] Registered new searcher Searcher@1b5763f[collection1] main{ExitableDirectoryReader(UninvertingDirectoryReader())}
   [junit4]   2> 290817 INFO  (coreLoadExecutor-930-thread-1) [    ] o.a.s.u.UpdateLog Looking up max value of version field to seed version buckets
   [junit4]   2> 290817 INFO  (coreLoadExecutor-930-thread-1) [    ] o.a.s.u.VersionInfo Refreshing highest value of _version_ for 65536 version buckets from index
   [junit4]   2> 290817 INFO  (coreLoadExecutor-930-thread-1) [    ] o.a.s.u.VersionInfo No terms found for _version_, cannot seed version bucket highest value from index
   [junit4]   2> 290817 INFO  (coreLoadExecutor-930-thread-1) [    ] o.a.s.u.UpdateLog Could not find max version in index or recent updates, using new clock 1523202871685808128
   [junit4]   2> 290819 INFO  (coreLoadExecutor-930-thread-1) [    ] o.a.s.u.UpdateLog Took 1.0ms to seed version buckets with highest version 1523202871685808128
   [junit4]   2> 290819 INFO  (coreLoadExecutor-930-thread-1) [    ] o.a.s.c.ZkController watch zkdir /configs/conf1
   [junit4]   2> 290819 INFO  (coreLoadExecutor-930-thread-1) [    ] o.a.s.c.CoreContainer registering core: collection1
   [junit4]   2> 290819 INFO  (coreZkRegister-925-thread-1) [    ] o.a.s.c.ZkController Register replica - core:collection1 address:http://127.0.0.1:37497/zz collection:collection1 shard:shard2
   [junit4]   2> 290820 INFO  (coreZkRegister-925-thread-1) [    ] o.a.s.c.c.SolrZkClient makePath: /collections/collection1/leader_elect/shard2/election
   [junit4]   2> 290821 INFO  (coreZkRegister-925-thread-1) [    ] o.a.s.c.LeaderElector Joined leadership election with path: /collections/collection1/leader_elect/shard2/election/95200179191152648-core_node1-n_0000000000
   [junit4]   2> 290821 INFO  (coreZkRegister-925-thread-1) [    ] o.a.s.c.ShardLeaderElectionContext Running the leader process for shard=shard2 and weAreReplacement=false and leaderVoteWait=10000
   [junit4]   2> 290822 INFO  (coreZkRegister-925-thread-1) [    ] o.a.s.c.ShardLeaderElectionContext Enough replicas found to continue.
   [junit4]   2> 290822 INFO  (coreZkRegister-925-thread-1) [    ] o.a.s.c.ShardLeaderElectionContext I may be the new leader - try and sync
   [junit4]   2> 290822 INFO  (coreZkRegister-925-thread-1) [    ] o.a.s.c.SyncStrategy Sync replicas to http://127.0.0.1:37497/zz/collection1/
   [junit4]   2> 290822 INFO  (coreZkRegister-925-thread-1) [    ] o.a.s.c.SyncStrategy Sync Success - now sync replicas to me
   [junit4]   2> 290822 INFO  (coreZkRegister-925-thread-1) [    ] o.a.s.c.SyncStrategy http://127.0.0.1:37497/zz/collection1/ has no replicas
   [junit4]   2> 290822 INFO  (OverseerStateUpdate-95200179191152644-127.0.0.1:38659_zz-n_0000000000) [    ] o.a.s.c.Overseer processMessage: queueSize: 1, message = {
   [junit4]   2>   "operation":"leader",
   [junit4]   2>   "shard":"shard2",
   [junit4]   2>   "collection":"collection1"} current state version: 4
   [junit4]   2> 290822 INFO  (coreZkRegister-925-thread-1) [    ] o.a.s.c.c.SolrZkClient makePath: /collections/collection1/leaders/shard2
   [junit4]   2> 290823 INFO  (coreZkRegister-925-thread-1) [    ] o.a.s.c.ShardLeaderElectionContextBase Creating leader registration node
   [junit4]   2> 290823 INFO  (coreZkRegister-925-thread-1) [    ] o.a.s.c.ShardLeaderElectionContext I am the new leader: http://127.0.0.1:37497/zz/collection1/ shard2
   [junit4]   2> 290824 INFO  (OverseerStateUpdate-95200179191152644-127.0.0.1:38659_zz-n_0000000000) [    ] o.a.s.c.Overseer processMessage: queueSize: 1, message = {
   [junit4]   2>   "operation":"leader",
   [junit4]   2>   "shard":"shard2",
   [junit4]   2>   "collection":"collection1",
   [junit4]   2>   "base_url":"http://127.0.0.1:37497/zz",
   [junit4]   2>   "core":"collection1",
   [junit4]   2>   "state":"active"} current state version: 4
   [junit4]   2> 290925 INFO  (zkCallback-388-thread-1) [    ] o.a.s.c.c.ZkStateReader A cluster state change: [WatchedEvent state:SyncConnected type:NodeDataChanged path:/clusterstate.json], has occurred - updating... (live nodes size: [2])
   [junit4]   2> 290925 INFO  (zkCallback-383-thread-1) [    ] o.a.s.c.c.ZkStateReader A cluster state change: [WatchedEvent state:SyncConnected type:NodeDataChanged path:/clusterstate.json], has occurred - updating... (live nodes size: [2])
   [junit4]   2> 290925 INFO  (zkCallback-381-thread-2) [    ] o.a.s.c.c.ZkStateReader A cluster state change: [WatchedEvent state:SyncConnected type:NodeDataChanged path:/clusterstate.json], has occurred - updating... (live nodes size: [2])
   [junit4]   2> 290974 INFO  (coreZkRegister-925-thread-1) [    ] o.a.s.c.ZkController We are http://127.0.0.1:37497/zz/collection1/ and leader is http://127.0.0.1:37497/zz/collection1/
   [junit4]   2> 290974 INFO  (coreZkRegister-925-thread-1) [    ] o.a.s.c.ZkController No LogReplay needed for core=collection1 baseURL=http://127.0.0.1:37497/zz
   [junit4]   2> 290974 INFO  (coreZkRegister-925-thread-1) [    ] o.a.s.c.ZkController I am the leader, no recovery necessary
   [junit4]   2> 290974 INFO  (coreZkRegister-925-thread-1) [    ] o.a.s.c.ZkController publishing state=active
   [junit4]   2> 290974 INFO  (coreZkRegister-925-thread-1) [    ] o.a.s.c.ZkController numShards not found on descriptor - reading it from system property
   [junit4]   2> 290975 INFO  (OverseerStateUpdate-95200179191152644-127.0.0.1:38659_zz-n_0000000000) [    ] o.a.s.c.Overseer processMessage: queueSize: 1, message = {
   [junit4]   2>   "core":"collection1",
   [junit4]   2>   "core_node_name":"core_node1",
   [junit4]   2>   "roles":null,
   [junit4]   2>   "base_url":"http://127.0.0.1:37497/zz",
   [junit4]   2>   "node_name":"127.0.0.1:37497_zz",
   [junit4]   2>   "numShards":"2",
   [junit4]   2>   "state":"active",
   [junit4]   2>   "shard":"shard2",
   [junit4]   2>   "collection":"collection1",
   [junit4]   2>   "operation":"state"} current state version: 5
   [junit4]   2> 290975 INFO  (OverseerStateUpdate-95200179191152644-127.0.0.1:38659_zz-n_0000000000) [    ] o.a.s.c.o.ReplicaMutator Update state numShards=2 message={
   [junit4]   2>   "core":"collection1",
   [junit4]   2>   "core_node_name":"core_node1",
   [junit4]   2>   "roles":null,
   [junit4]   2>   "base_url":"http://127.0.0.1:37497/zz",
   [junit4]   2>   "node_name":"127.0.0.1:37497_zz",
   [junit4]   2>   "numShards":"2",
   [junit4]   2>   "state":"active",
   [junit4]   2>   "shard":"shard2",
   [junit4]   2>   "collection":"collection1",
   [junit4]   2>   "operation":"state"}
   [junit4]   2> 291076 INFO  (zkCallback-381-thread-2) [    ] o.a.s.c.c.ZkStateReader A cluster state change: [WatchedEvent state:SyncConnected type:NodeDataChanged path:/clusterstate.json], has occurred - updating... (live nodes size: [2])
   [junit4]   2> 291076 INFO  (zkCallback-388-thread-1) [    ] o.a.s.c.c.ZkStat

[...truncated too long message...]

t4]   2> 	4	/solr/overseer/collection-queue-work
   [junit4]   2> 	2	/solr/overseer/queue-work
   [junit4]   2> 
   [junit4]   2> 421367 WARN  (TEST-HttpPartitionTest.test-seed#[74A05DFD49F5F752]) [    ] o.a.s.c.SocketProxy Closing 18 connections to: http://127.0.0.1:60847/zz, target: http://127.0.0.1:45274/zz
   [junit4]   2> 421367 WARN  (TEST-HttpPartitionTest.test-seed#[74A05DFD49F5F752]) [    ] o.a.s.c.SocketProxy Closing 16 connections to: http://127.0.0.1:38659/zz, target: http://127.0.0.1:45831/zz
   [junit4]   2> 421367 WARN  (TEST-HttpPartitionTest.test-seed#[74A05DFD49F5F752]) [    ] o.a.s.c.SocketProxy Closing 5 connections to: http://127.0.0.1:54946/zz, target: http://127.0.0.1:35930/zz
   [junit4]   2> 421367 WARN  (TEST-HttpPartitionTest.test-seed#[74A05DFD49F5F752]) [    ] o.a.s.c.SocketProxy Closing 1 connections to: http://127.0.0.1:37497/zz, target: http://127.0.0.1:36378/zz
   [junit4]   2> NOTE: reproduce with: ant test  -Dtestcase=HttpPartitionTest -Dtests.method=test -Dtests.seed=74A05DFD49F5F752 -Dtests.multiplier=3 -Dtests.slow=true -Dtests.locale=ln_AO -Dtests.timezone=Asia/Ho_Chi_Minh -Dtests.asserts=true -Dtests.file.encoding=UTF-8
   [junit4] FAILURE  135s J1 | HttpPartitionTest.test <<<
   [junit4]    > Throwable #1: java.lang.AssertionError: Didn't see all replicas for shard shard1 in c8n_1x2 come up within 30000 ms! ClusterState: {
   [junit4]    >   "collection1":{
   [junit4]    >     "replicationFactor":"1",
   [junit4]    >     "shards":{
   [junit4]    >       "shard1":{
   [junit4]    >         "range":"80000000-ffffffff",
   [junit4]    >         "state":"active",
   [junit4]    >         "replicas":{"core_node2":{
   [junit4]    >             "core":"collection1",
   [junit4]    >             "base_url":"http://127.0.0.1:54946/zz",
   [junit4]    >             "node_name":"127.0.0.1:54946_zz",
   [junit4]    >             "state":"active",
   [junit4]    >             "leader":"true"}}},
   [junit4]    >       "shard2":{
   [junit4]    >         "range":"0-7fffffff",
   [junit4]    >         "state":"active",
   [junit4]    >         "replicas":{
   [junit4]    >           "core_node1":{
   [junit4]    >             "core":"collection1",
   [junit4]    >             "base_url":"http://127.0.0.1:37497/zz",
   [junit4]    >             "node_name":"127.0.0.1:37497_zz",
   [junit4]    >             "state":"active",
   [junit4]    >             "leader":"true"},
   [junit4]    >           "core_node3":{
   [junit4]    >             "core":"collection1",
   [junit4]    >             "base_url":"http://127.0.0.1:60847/zz",
   [junit4]    >             "node_name":"127.0.0.1:60847_zz",
   [junit4]    >             "state":"active"}}}},
   [junit4]    >     "router":{"name":"compositeId"},
   [junit4]    >     "maxShardsPerNode":"1",
   [junit4]    >     "autoAddReplicas":"false",
   [junit4]    >     "autoCreated":"true"},
   [junit4]    >   "control_collection":{
   [junit4]    >     "replicationFactor":"1",
   [junit4]    >     "shards":{"shard1":{
   [junit4]    >         "range":"80000000-7fffffff",
   [junit4]    >         "state":"active",
   [junit4]    >         "replicas":{"core_node1":{
   [junit4]    >             "core":"collection1",
   [junit4]    >             "base_url":"http://127.0.0.1:38659/zz",
   [junit4]    >             "node_name":"127.0.0.1:38659_zz",
   [junit4]    >             "state":"active",
   [junit4]    >             "leader":"true"}}}},
   [junit4]    >     "router":{"name":"compositeId"},
   [junit4]    >     "maxShardsPerNode":"1",
   [junit4]    >     "autoAddReplicas":"false",
   [junit4]    >     "autoCreated":"true"},
   [junit4]    >   "c8n_1x2":{
   [junit4]    >     "replicationFactor":"2",
   [junit4]    >     "shards":{"shard1":{
   [junit4]    >         "range":"80000000-7fffffff",
   [junit4]    >         "state":"active",
   [junit4]    >         "replicas":{
   [junit4]    >           "core_node1":{
   [junit4]    >             "core":"c8n_1x2_shard1_replica1",
   [junit4]    >             "base_url":"http://127.0.0.1:38659/zz",
   [junit4]    >             "node_name":"127.0.0.1:38659_zz",
   [junit4]    >             "state":"active",
   [junit4]    >             "leader":"true"},
   [junit4]    >           "core_node2":{
   [junit4]    >             "core":"c8n_1x2_shard1_replica2",
   [junit4]    >             "base_url":"http://127.0.0.1:37497/zz",
   [junit4]    >             "node_name":"127.0.0.1:37497_zz",
   [junit4]    >             "state":"recovering"}}}},
   [junit4]    >     "router":{"name":"compositeId"},
   [junit4]    >     "maxShardsPerNode":"1",
   [junit4]    >     "autoAddReplicas":"false"},
   [junit4]    >   "collMinRf_1x3":{
   [junit4]    >     "replicationFactor":"3",
   [junit4]    >     "shards":{"shard1":{
   [junit4]    >         "range":"80000000-7fffffff",
   [junit4]    >         "state":"active",
   [junit4]    >         "replicas":{
   [junit4]    >           "core_node1":{
   [junit4]    >             "core":"collMinRf_1x3_shard1_replica1",
   [junit4]    >             "base_url":"http://127.0.0.1:60847/zz",
   [junit4]    >             "node_name":"127.0.0.1:60847_zz",
   [junit4]    >             "state":"active",
   [junit4]    >             "leader":"true"},
   [junit4]    >           "core_node2":{
   [junit4]    >             "core":"collMinRf_1x3_shard1_replica3",
   [junit4]    >             "base_url":"http://127.0.0.1:38659/zz",
   [junit4]    >             "node_name":"127.0.0.1:38659_zz",
   [junit4]    >             "state":"active"},
   [junit4]    >           "core_node3":{
   [junit4]    >             "core":"collMinRf_1x3_shard1_replica2",
   [junit4]    >             "base_url":"http://127.0.0.1:54946/zz",
   [junit4]    >             "node_name":"127.0.0.1:54946_zz",
   [junit4]    >             "state":"active"}}}},
   [junit4]    >     "router":{"name":"compositeId"},
   [junit4]    >     "maxShardsPerNode":"1",
   [junit4]    >     "autoAddReplicas":"false"}}
   [junit4]    > 	at __randomizedtesting.SeedInfo.seed([74A05DFD49F5F752:FCF46227E7099AAA]:0)
   [junit4]    > 	at org.apache.solr.cloud.AbstractFullDistribZkTestBase.ensureAllReplicasAreActive(AbstractFullDistribZkTestBase.java:1864)
   [junit4]    > 	at org.apache.solr.cloud.HttpPartitionTest.testRf2(HttpPartitionTest.java:349)
   [junit4]    > 	at org.apache.solr.cloud.HttpPartitionTest.test(HttpPartitionTest.java:109)
   [junit4]    > 	at org.apache.solr.BaseDistributedSearchTestCase$ShardsRepeatRule$ShardsFixedStatement.callStatement(BaseDistributedSearchTestCase.java:965)
   [junit4]    > 	at org.apache.solr.BaseDistributedSearchTestCase$ShardsRepeatRule$ShardsStatement.evaluate(BaseDistributedSearchTestCase.java:940)
   [junit4]    > 	at java.lang.Thread.run(Thread.java:747)
   [junit4]   2> 421370 INFO  (SUITE-HttpPartitionTest-seed#[74A05DFD49F5F752]-worker) [    ] o.a.s.SolrTestCaseJ4 ###deleteCore
   [junit4]   2> NOTE: leaving temporary files on disk at: /home/jenkins/workspace/Lucene-Solr-trunk-Linux/solr/build/solr-core/test/J1/temp/solr.cloud.HttpPartitionTest_74A05DFD49F5F752-001
   [junit4]   2> Jan 12, 2016 10:59:47 PM com.carrotsearch.randomizedtesting.ThreadLeakControl checkThreadLeaks
   [junit4]   2> WARNING: Will linger awaiting termination of 2 leaked thread(s).
   [junit4]   2> NOTE: test params are: codec=Asserting(Lucene60), sim=ClassicSimilarity, locale=ln_AO, timezone=Asia/Ho_Chi_Minh
   [junit4]   2> NOTE: Linux 3.19.0-42-generic i386/Oracle Corporation 9-ea (32-bit)/cpus=12,threads=1,free=104939024,total=210272256
   [junit4]   2> NOTE: All tests run in this JVM: [TestSchemaResource, TestSolrCloudWithKerberosAlt, TestConfigOverlay, TermVectorComponentTest, ZkSolrClientTest, MergeStrategyTest, DistributedQueueTest, SchemaVersionSpecificBehaviorTest, TestOverriddenPrefixQueryForCustomFieldType, TestCloudSchemaless, SmileWriterTest, TimeZoneUtilsTest, ChaosMonkeyNothingIsSafeTest, ZkCLITest, TestSchemaManager, AnalyticsMergeStrategyTest, SolrCmdDistributorTest, TestSurroundQueryParser, TestHdfsUpdateLog, TestChildDocTransformer, TestStressVersions, TestLeaderElectionZkExpiry, BlockJoinFacetRandomTest, TestCloudPivotFacet, CollectionReloadTest, MultiTermTest, SolrXmlInZkTest, TestSolrDynamicMBean, DistributedMLTComponentTest, SuggestComponentTest, TestManagedSchemaFieldTypeResource, DocumentBuilderTest, TestConfigSetsAPIExclusivity, SolrInfoMBeanTest, IndexBasedSpellCheckerTest, HdfsWriteToMultipleCollectionsTest, TestMaxScoreQueryParser, MBeansHandlerTest, SolrIndexConfigTest, MoreLikeThisHandlerTest, ConvertedLegacyTest, TestAddFieldRealTimeGet, HttpPartitionTest]
   [junit4] Completed [112/576 (1!)] on J1 in 135.24s, 1 test, 1 failure <<< FAILURES!

[...truncated 1515 lines...]
BUILD FAILED
/home/jenkins/workspace/Lucene-Solr-trunk-Linux/build.xml:784: The following error occurred while executing this line:
/home/jenkins/workspace/Lucene-Solr-trunk-Linux/build.xml:728: The following error occurred while executing this line:
/home/jenkins/workspace/Lucene-Solr-trunk-Linux/build.xml:59: The following error occurred while executing this line:
/home/jenkins/workspace/Lucene-Solr-trunk-Linux/solr/build.xml:233: The following error occurred while executing this line:
/home/jenkins/workspace/Lucene-Solr-trunk-Linux/solr/common-build.xml:522: The following error occurred while executing this line:
/home/jenkins/workspace/Lucene-Solr-trunk-Linux/lucene/common-build.xml:1424: The following error occurred while executing this line:
/home/jenkins/workspace/Lucene-Solr-trunk-Linux/lucene/common-build.xml:981: There were test failures: 576 suites (8 ignored), 2305 tests, 1 failure, 115 ignored (70 assumptions) [seed: 74A05DFD49F5F752]

Total time: 50 minutes 36 seconds
Build step 'Invoke Ant' marked build as failure
Archiving artifacts
[WARNINGS] Skipping publisher since build result is FAILURE
Recording test results
Email was triggered for: Failure - Any
Sending email for trigger: Failure - Any



Mime
View raw message