lucene-dev mailing list archives

Site index · List index
Message view « Date » · « Thread »
Top « Date » · « Thread »
From Policeman Jenkins Server <jenk...@thetaphi.de>
Subject [JENKINS-EA] Lucene-Solr-5.4-Linux (32bit/jdk-9-ea+95) - Build # 436 - Failure!
Date Fri, 22 Jan 2016 07:32:30 GMT
Build: http://jenkins.thetaphi.de/job/Lucene-Solr-5.4-Linux/436/
Java: 32bit/jdk-9-ea+95 -client -XX:+UseConcMarkSweepGC -XX:-CompactStrings

3 tests failed.
FAILED:  junit.framework.TestSuite.org.apache.solr.cloud.CollectionsAPIDistributedZkTest

Error Message:
5 threads leaked from SUITE scope at org.apache.solr.cloud.CollectionsAPIDistributedZkTest:     1) Thread[id=4325, name=TEST-CollectionsAPIDistributedZkTest.test-seed#[A03BD1E2FCB82628]-EventThread, state=WAITING, group=TGRP-CollectionsAPIDistributedZkTest]         at jdk.internal.misc.Unsafe.park(Native Method)         at java.util.concurrent.locks.LockSupport.park(LockSupport.java:178)         at java.util.concurrent.locks.AbstractQueuedSynchronizer$ConditionObject.await(AbstractQueuedSynchronizer.java:2061)         at java.util.concurrent.LinkedBlockingQueue.take(LinkedBlockingQueue.java:442)         at org.apache.zookeeper.ClientCnxn$EventThread.run(ClientCnxn.java:494)    2) Thread[id=4326, name=zkCallback-626-thread-1, state=TIMED_WAITING, group=TGRP-CollectionsAPIDistributedZkTest]         at jdk.internal.misc.Unsafe.park(Native Method)         at java.util.concurrent.locks.LockSupport.parkNanos(LockSupport.java:218)         at java.util.concurrent.SynchronousQueue$TransferStack.awaitFulfill(SynchronousQueue.java:461)         at java.util.concurrent.SynchronousQueue$TransferStack.transfer(SynchronousQueue.java:362)         at java.util.concurrent.SynchronousQueue.poll(SynchronousQueue.java:937)         at java.util.concurrent.ThreadPoolExecutor.getTask(ThreadPoolExecutor.java:1082)         at java.util.concurrent.ThreadPoolExecutor.runWorker(ThreadPoolExecutor.java:1143)         at java.util.concurrent.ThreadPoolExecutor$Worker.run(ThreadPoolExecutor.java:632)         at java.lang.Thread.run(Thread.java:747)    3) Thread[id=4324, name=TEST-CollectionsAPIDistributedZkTest.test-seed#[A03BD1E2FCB82628]-SendThread(127.0.0.1:39870), state=TIMED_WAITING, group=TGRP-CollectionsAPIDistributedZkTest]         at java.lang.Thread.sleep(Native Method)         at org.apache.zookeeper.client.StaticHostProvider.next(StaticHostProvider.java:101)         at org.apache.zookeeper.ClientCnxn$SendThread.startConnect(ClientCnxn.java:940)         at org.apache.zookeeper.ClientCnxn$SendThread.run(ClientCnxn.java:1003)    4) Thread[id=4950, name=zkCallback-626-thread-2, state=TIMED_WAITING, group=TGRP-CollectionsAPIDistributedZkTest]         at jdk.internal.misc.Unsafe.park(Native Method)         at java.util.concurrent.locks.LockSupport.parkNanos(LockSupport.java:218)         at java.util.concurrent.SynchronousQueue$TransferStack.awaitFulfill(SynchronousQueue.java:461)         at java.util.concurrent.SynchronousQueue$TransferStack.transfer(SynchronousQueue.java:362)         at java.util.concurrent.SynchronousQueue.poll(SynchronousQueue.java:937)         at java.util.concurrent.ThreadPoolExecutor.getTask(ThreadPoolExecutor.java:1082)         at java.util.concurrent.ThreadPoolExecutor.runWorker(ThreadPoolExecutor.java:1143)         at java.util.concurrent.ThreadPoolExecutor$Worker.run(ThreadPoolExecutor.java:632)         at java.lang.Thread.run(Thread.java:747)    5) Thread[id=4951, name=zkCallback-626-thread-3, state=TIMED_WAITING, group=TGRP-CollectionsAPIDistributedZkTest]         at jdk.internal.misc.Unsafe.park(Native Method)         at java.util.concurrent.locks.LockSupport.parkNanos(LockSupport.java:218)         at java.util.concurrent.SynchronousQueue$TransferStack.awaitFulfill(SynchronousQueue.java:461)         at java.util.concurrent.SynchronousQueue$TransferStack.transfer(SynchronousQueue.java:362)         at java.util.concurrent.SynchronousQueue.poll(SynchronousQueue.java:937)         at java.util.concurrent.ThreadPoolExecutor.getTask(ThreadPoolExecutor.java:1082)         at java.util.concurrent.ThreadPoolExecutor.runWorker(ThreadPoolExecutor.java:1143)         at java.util.concurrent.ThreadPoolExecutor$Worker.run(ThreadPoolExecutor.java:632)         at java.lang.Thread.run(Thread.java:747)

Stack Trace:
com.carrotsearch.randomizedtesting.ThreadLeakError: 5 threads leaked from SUITE scope at org.apache.solr.cloud.CollectionsAPIDistributedZkTest: 
   1) Thread[id=4325, name=TEST-CollectionsAPIDistributedZkTest.test-seed#[A03BD1E2FCB82628]-EventThread, state=WAITING, group=TGRP-CollectionsAPIDistributedZkTest]
        at jdk.internal.misc.Unsafe.park(Native Method)
        at java.util.concurrent.locks.LockSupport.park(LockSupport.java:178)
        at java.util.concurrent.locks.AbstractQueuedSynchronizer$ConditionObject.await(AbstractQueuedSynchronizer.java:2061)
        at java.util.concurrent.LinkedBlockingQueue.take(LinkedBlockingQueue.java:442)
        at org.apache.zookeeper.ClientCnxn$EventThread.run(ClientCnxn.java:494)
   2) Thread[id=4326, name=zkCallback-626-thread-1, state=TIMED_WAITING, group=TGRP-CollectionsAPIDistributedZkTest]
        at jdk.internal.misc.Unsafe.park(Native Method)
        at java.util.concurrent.locks.LockSupport.parkNanos(LockSupport.java:218)
        at java.util.concurrent.SynchronousQueue$TransferStack.awaitFulfill(SynchronousQueue.java:461)
        at java.util.concurrent.SynchronousQueue$TransferStack.transfer(SynchronousQueue.java:362)
        at java.util.concurrent.SynchronousQueue.poll(SynchronousQueue.java:937)
        at java.util.concurrent.ThreadPoolExecutor.getTask(ThreadPoolExecutor.java:1082)
        at java.util.concurrent.ThreadPoolExecutor.runWorker(ThreadPoolExecutor.java:1143)
        at java.util.concurrent.ThreadPoolExecutor$Worker.run(ThreadPoolExecutor.java:632)
        at java.lang.Thread.run(Thread.java:747)
   3) Thread[id=4324, name=TEST-CollectionsAPIDistributedZkTest.test-seed#[A03BD1E2FCB82628]-SendThread(127.0.0.1:39870), state=TIMED_WAITING, group=TGRP-CollectionsAPIDistributedZkTest]
        at java.lang.Thread.sleep(Native Method)
        at org.apache.zookeeper.client.StaticHostProvider.next(StaticHostProvider.java:101)
        at org.apache.zookeeper.ClientCnxn$SendThread.startConnect(ClientCnxn.java:940)
        at org.apache.zookeeper.ClientCnxn$SendThread.run(ClientCnxn.java:1003)
   4) Thread[id=4950, name=zkCallback-626-thread-2, state=TIMED_WAITING, group=TGRP-CollectionsAPIDistributedZkTest]
        at jdk.internal.misc.Unsafe.park(Native Method)
        at java.util.concurrent.locks.LockSupport.parkNanos(LockSupport.java:218)
        at java.util.concurrent.SynchronousQueue$TransferStack.awaitFulfill(SynchronousQueue.java:461)
        at java.util.concurrent.SynchronousQueue$TransferStack.transfer(SynchronousQueue.java:362)
        at java.util.concurrent.SynchronousQueue.poll(SynchronousQueue.java:937)
        at java.util.concurrent.ThreadPoolExecutor.getTask(ThreadPoolExecutor.java:1082)
        at java.util.concurrent.ThreadPoolExecutor.runWorker(ThreadPoolExecutor.java:1143)
        at java.util.concurrent.ThreadPoolExecutor$Worker.run(ThreadPoolExecutor.java:632)
        at java.lang.Thread.run(Thread.java:747)
   5) Thread[id=4951, name=zkCallback-626-thread-3, state=TIMED_WAITING, group=TGRP-CollectionsAPIDistributedZkTest]
        at jdk.internal.misc.Unsafe.park(Native Method)
        at java.util.concurrent.locks.LockSupport.parkNanos(LockSupport.java:218)
        at java.util.concurrent.SynchronousQueue$TransferStack.awaitFulfill(SynchronousQueue.java:461)
        at java.util.concurrent.SynchronousQueue$TransferStack.transfer(SynchronousQueue.java:362)
        at java.util.concurrent.SynchronousQueue.poll(SynchronousQueue.java:937)
        at java.util.concurrent.ThreadPoolExecutor.getTask(ThreadPoolExecutor.java:1082)
        at java.util.concurrent.ThreadPoolExecutor.runWorker(ThreadPoolExecutor.java:1143)
        at java.util.concurrent.ThreadPoolExecutor$Worker.run(ThreadPoolExecutor.java:632)
        at java.lang.Thread.run(Thread.java:747)
	at __randomizedtesting.SeedInfo.seed([A03BD1E2FCB82628]:0)


FAILED:  junit.framework.TestSuite.org.apache.solr.cloud.CollectionsAPIDistributedZkTest

Error Message:
There are still zombie threads that couldn't be terminated:    1) Thread[id=4326, name=zkCallback-626-thread-1, state=TIMED_WAITING, group=TGRP-CollectionsAPIDistributedZkTest]         at jdk.internal.misc.Unsafe.park(Native Method)         at java.util.concurrent.locks.LockSupport.parkNanos(LockSupport.java:218)         at java.util.concurrent.SynchronousQueue$TransferStack.awaitFulfill(SynchronousQueue.java:461)         at java.util.concurrent.SynchronousQueue$TransferStack.transfer(SynchronousQueue.java:362)         at java.util.concurrent.SynchronousQueue.poll(SynchronousQueue.java:937)         at java.util.concurrent.ThreadPoolExecutor.getTask(ThreadPoolExecutor.java:1082)         at java.util.concurrent.ThreadPoolExecutor.runWorker(ThreadPoolExecutor.java:1143)         at java.util.concurrent.ThreadPoolExecutor$Worker.run(ThreadPoolExecutor.java:632)         at java.lang.Thread.run(Thread.java:747)    2) Thread[id=4324, name=TEST-CollectionsAPIDistributedZkTest.test-seed#[A03BD1E2FCB82628]-SendThread(127.0.0.1:39870), state=TIMED_WAITING, group=TGRP-CollectionsAPIDistributedZkTest]         at java.lang.Thread.sleep(Native Method)         at org.apache.zookeeper.client.StaticHostProvider.next(StaticHostProvider.java:101)         at org.apache.zookeeper.ClientCnxn$SendThread.startConnect(ClientCnxn.java:940)         at org.apache.zookeeper.ClientCnxn$SendThread.run(ClientCnxn.java:1003)    3) Thread[id=4950, name=zkCallback-626-thread-2, state=TIMED_WAITING, group=TGRP-CollectionsAPIDistributedZkTest]         at jdk.internal.misc.Unsafe.park(Native Method)         at java.util.concurrent.locks.LockSupport.parkNanos(LockSupport.java:218)         at java.util.concurrent.SynchronousQueue$TransferStack.awaitFulfill(SynchronousQueue.java:461)         at java.util.concurrent.SynchronousQueue$TransferStack.transfer(SynchronousQueue.java:362)         at java.util.concurrent.SynchronousQueue.poll(SynchronousQueue.java:937)         at java.util.concurrent.ThreadPoolExecutor.getTask(ThreadPoolExecutor.java:1082)         at java.util.concurrent.ThreadPoolExecutor.runWorker(ThreadPoolExecutor.java:1143)         at java.util.concurrent.ThreadPoolExecutor$Worker.run(ThreadPoolExecutor.java:632)         at java.lang.Thread.run(Thread.java:747)    4) Thread[id=4951, name=zkCallback-626-thread-3, state=TIMED_WAITING, group=TGRP-CollectionsAPIDistributedZkTest]         at jdk.internal.misc.Unsafe.park(Native Method)         at java.util.concurrent.locks.LockSupport.parkNanos(LockSupport.java:218)         at java.util.concurrent.SynchronousQueue$TransferStack.awaitFulfill(SynchronousQueue.java:461)         at java.util.concurrent.SynchronousQueue$TransferStack.transfer(SynchronousQueue.java:362)         at java.util.concurrent.SynchronousQueue.poll(SynchronousQueue.java:937)         at java.util.concurrent.ThreadPoolExecutor.getTask(ThreadPoolExecutor.java:1082)         at java.util.concurrent.ThreadPoolExecutor.runWorker(ThreadPoolExecutor.java:1143)         at java.util.concurrent.ThreadPoolExecutor$Worker.run(ThreadPoolExecutor.java:632)         at java.lang.Thread.run(Thread.java:747)

Stack Trace:
com.carrotsearch.randomizedtesting.ThreadLeakError: There are still zombie threads that couldn't be terminated:
   1) Thread[id=4326, name=zkCallback-626-thread-1, state=TIMED_WAITING, group=TGRP-CollectionsAPIDistributedZkTest]
        at jdk.internal.misc.Unsafe.park(Native Method)
        at java.util.concurrent.locks.LockSupport.parkNanos(LockSupport.java:218)
        at java.util.concurrent.SynchronousQueue$TransferStack.awaitFulfill(SynchronousQueue.java:461)
        at java.util.concurrent.SynchronousQueue$TransferStack.transfer(SynchronousQueue.java:362)
        at java.util.concurrent.SynchronousQueue.poll(SynchronousQueue.java:937)
        at java.util.concurrent.ThreadPoolExecutor.getTask(ThreadPoolExecutor.java:1082)
        at java.util.concurrent.ThreadPoolExecutor.runWorker(ThreadPoolExecutor.java:1143)
        at java.util.concurrent.ThreadPoolExecutor$Worker.run(ThreadPoolExecutor.java:632)
        at java.lang.Thread.run(Thread.java:747)
   2) Thread[id=4324, name=TEST-CollectionsAPIDistributedZkTest.test-seed#[A03BD1E2FCB82628]-SendThread(127.0.0.1:39870), state=TIMED_WAITING, group=TGRP-CollectionsAPIDistributedZkTest]
        at java.lang.Thread.sleep(Native Method)
        at org.apache.zookeeper.client.StaticHostProvider.next(StaticHostProvider.java:101)
        at org.apache.zookeeper.ClientCnxn$SendThread.startConnect(ClientCnxn.java:940)
        at org.apache.zookeeper.ClientCnxn$SendThread.run(ClientCnxn.java:1003)
   3) Thread[id=4950, name=zkCallback-626-thread-2, state=TIMED_WAITING, group=TGRP-CollectionsAPIDistributedZkTest]
        at jdk.internal.misc.Unsafe.park(Native Method)
        at java.util.concurrent.locks.LockSupport.parkNanos(LockSupport.java:218)
        at java.util.concurrent.SynchronousQueue$TransferStack.awaitFulfill(SynchronousQueue.java:461)
        at java.util.concurrent.SynchronousQueue$TransferStack.transfer(SynchronousQueue.java:362)
        at java.util.concurrent.SynchronousQueue.poll(SynchronousQueue.java:937)
        at java.util.concurrent.ThreadPoolExecutor.getTask(ThreadPoolExecutor.java:1082)
        at java.util.concurrent.ThreadPoolExecutor.runWorker(ThreadPoolExecutor.java:1143)
        at java.util.concurrent.ThreadPoolExecutor$Worker.run(ThreadPoolExecutor.java:632)
        at java.lang.Thread.run(Thread.java:747)
   4) Thread[id=4951, name=zkCallback-626-thread-3, state=TIMED_WAITING, group=TGRP-CollectionsAPIDistributedZkTest]
        at jdk.internal.misc.Unsafe.park(Native Method)
        at java.util.concurrent.locks.LockSupport.parkNanos(LockSupport.java:218)
        at java.util.concurrent.SynchronousQueue$TransferStack.awaitFulfill(SynchronousQueue.java:461)
        at java.util.concurrent.SynchronousQueue$TransferStack.transfer(SynchronousQueue.java:362)
        at java.util.concurrent.SynchronousQueue.poll(SynchronousQueue.java:937)
        at java.util.concurrent.ThreadPoolExecutor.getTask(ThreadPoolExecutor.java:1082)
        at java.util.concurrent.ThreadPoolExecutor.runWorker(ThreadPoolExecutor.java:1143)
        at java.util.concurrent.ThreadPoolExecutor$Worker.run(ThreadPoolExecutor.java:632)
        at java.lang.Thread.run(Thread.java:747)
	at __randomizedtesting.SeedInfo.seed([A03BD1E2FCB82628]:0)


FAILED:  org.apache.solr.cloud.CollectionsAPIDistributedZkTest.test

Error Message:
Error from server at http://127.0.0.1:40807/jk/rl/awholynewcollection_0: non ok status: 500, message:Server Error

Stack Trace:
org.apache.solr.client.solrj.impl.HttpSolrClient$RemoteSolrException: Error from server at http://127.0.0.1:40807/jk/rl/awholynewcollection_0: non ok status: 500, message:Server Error
	at __randomizedtesting.SeedInfo.seed([A03BD1E2FCB82628:286FEE3852444BD0]:0)
	at org.apache.solr.client.solrj.impl.HttpSolrClient.executeMethod(HttpSolrClient.java:509)
	at org.apache.solr.client.solrj.impl.HttpSolrClient.request(HttpSolrClient.java:241)
	at org.apache.solr.client.solrj.impl.HttpSolrClient.request(HttpSolrClient.java:230)
	at org.apache.solr.client.solrj.SolrRequest.process(SolrRequest.java:150)
	at org.apache.solr.client.solrj.SolrClient.query(SolrClient.java:943)
	at org.apache.solr.client.solrj.SolrClient.query(SolrClient.java:958)
	at org.apache.solr.cloud.AbstractFullDistribZkTestBase.waitForNon403or404or503(AbstractFullDistribZkTestBase.java:1754)
	at org.apache.solr.cloud.CollectionsAPIDistributedZkTest.testCollectionsAPI(CollectionsAPIDistributedZkTest.java:658)
	at org.apache.solr.cloud.CollectionsAPIDistributedZkTest.test(CollectionsAPIDistributedZkTest.java:160)
	at sun.reflect.NativeMethodAccessorImpl.invoke0(Native Method)
	at sun.reflect.NativeMethodAccessorImpl.invoke(NativeMethodAccessorImpl.java:62)
	at sun.reflect.DelegatingMethodAccessorImpl.invoke(DelegatingMethodAccessorImpl.java:43)
	at java.lang.reflect.Method.invoke(Method.java:520)
	at com.carrotsearch.randomizedtesting.RandomizedRunner.invoke(RandomizedRunner.java:1764)
	at com.carrotsearch.randomizedtesting.RandomizedRunner$8.evaluate(RandomizedRunner.java:871)
	at com.carrotsearch.randomizedtesting.RandomizedRunner$9.evaluate(RandomizedRunner.java:907)
	at com.carrotsearch.randomizedtesting.RandomizedRunner$10.evaluate(RandomizedRunner.java:921)
	at org.apache.solr.BaseDistributedSearchTestCase$ShardsRepeatRule$ShardsFixedStatement.callStatement(BaseDistributedSearchTestCase.java:964)
	at org.apache.solr.BaseDistributedSearchTestCase$ShardsRepeatRule$ShardsStatement.evaluate(BaseDistributedSearchTestCase.java:939)
	at com.carrotsearch.randomizedtesting.rules.SystemPropertiesRestoreRule$1.evaluate(SystemPropertiesRestoreRule.java:57)
	at org.apache.lucene.util.TestRuleSetupTeardownChained$1.evaluate(TestRuleSetupTeardownChained.java:50)
	at org.apache.lucene.util.AbstractBeforeAfterRule$1.evaluate(AbstractBeforeAfterRule.java:46)
	at org.apache.lucene.util.TestRuleThreadAndTestName$1.evaluate(TestRuleThreadAndTestName.java:49)
	at org.apache.lucene.util.TestRuleIgnoreAfterMaxFailures$1.evaluate(TestRuleIgnoreAfterMaxFailures.java:65)
	at org.apache.lucene.util.TestRuleMarkFailure$1.evaluate(TestRuleMarkFailure.java:48)
	at com.carrotsearch.randomizedtesting.rules.StatementAdapter.evaluate(StatementAdapter.java:36)
	at com.carrotsearch.randomizedtesting.ThreadLeakControl$StatementRunner.run(ThreadLeakControl.java:367)
	at com.carrotsearch.randomizedtesting.ThreadLeakControl.forkTimeoutingTask(ThreadLeakControl.java:809)
	at com.carrotsearch.randomizedtesting.ThreadLeakControl$3.evaluate(ThreadLeakControl.java:460)
	at com.carrotsearch.randomizedtesting.RandomizedRunner.runSingleTest(RandomizedRunner.java:880)
	at com.carrotsearch.randomizedtesting.RandomizedRunner$5.evaluate(RandomizedRunner.java:781)
	at com.carrotsearch.randomizedtesting.RandomizedRunner$6.evaluate(RandomizedRunner.java:816)
	at com.carrotsearch.randomizedtesting.RandomizedRunner$7.evaluate(RandomizedRunner.java:827)
	at com.carrotsearch.randomizedtesting.rules.StatementAdapter.evaluate(StatementAdapter.java:36)
	at com.carrotsearch.randomizedtesting.rules.SystemPropertiesRestoreRule$1.evaluate(SystemPropertiesRestoreRule.java:57)
	at org.apache.lucene.util.AbstractBeforeAfterRule$1.evaluate(AbstractBeforeAfterRule.java:46)
	at com.carrotsearch.randomizedtesting.rules.StatementAdapter.evaluate(StatementAdapter.java:36)
	at org.apache.lucene.util.TestRuleStoreClassName$1.evaluate(TestRuleStoreClassName.java:42)
	at com.carrotsearch.randomizedtesting.rules.NoShadowingOrOverridesOnMethodsRule$1.evaluate(NoShadowingOrOverridesOnMethodsRule.java:40)
	at com.carrotsearch.randomizedtesting.rules.NoShadowingOrOverridesOnMethodsRule$1.evaluate(NoShadowingOrOverridesOnMethodsRule.java:40)
	at com.carrotsearch.randomizedtesting.rules.StatementAdapter.evaluate(StatementAdapter.java:36)
	at com.carrotsearch.randomizedtesting.rules.StatementAdapter.evaluate(StatementAdapter.java:36)
	at com.carrotsearch.randomizedtesting.rules.StatementAdapter.evaluate(StatementAdapter.java:36)
	at org.apache.lucene.util.TestRuleAssertionsRequired$1.evaluate(TestRuleAssertionsRequired.java:54)
	at org.apache.lucene.util.TestRuleMarkFailure$1.evaluate(TestRuleMarkFailure.java:48)
	at org.apache.lucene.util.TestRuleIgnoreAfterMaxFailures$1.evaluate(TestRuleIgnoreAfterMaxFailures.java:65)
	at org.apache.lucene.util.TestRuleIgnoreTestSuites$1.evaluate(TestRuleIgnoreTestSuites.java:55)
	at com.carrotsearch.randomizedtesting.rules.StatementAdapter.evaluate(StatementAdapter.java:36)
	at com.carrotsearch.randomizedtesting.ThreadLeakControl$StatementRunner.run(ThreadLeakControl.java:367)
	at java.lang.Thread.run(Thread.java:747)




Build Log:
[...truncated 10259 lines...]
   [junit4] Suite: org.apache.solr.cloud.CollectionsAPIDistributedZkTest
   [junit4]   2> Creating dataDir: /home/jenkins/workspace/Lucene-Solr-5.4-Linux/solr/build/solr-core/test/J1/temp/solr.cloud.CollectionsAPIDistributedZkTest_A03BD1E2FCB82628-001/init-core-data-001
   [junit4]   2> 357338 INFO  (SUITE-CollectionsAPIDistributedZkTest-seed#[A03BD1E2FCB82628]-worker) [    ] o.a.s.SolrTestCaseJ4 Randomized ssl (false) and clientAuth (false)
   [junit4]   2> 357338 INFO  (SUITE-CollectionsAPIDistributedZkTest-seed#[A03BD1E2FCB82628]-worker) [    ] o.a.s.BaseDistributedSearchTestCase Setting hostContext system property: /jk/rl
   [junit4]   2> 357340 INFO  (TEST-CollectionsAPIDistributedZkTest.test-seed#[A03BD1E2FCB82628]) [    ] o.a.s.c.ZkTestServer STARTING ZK TEST SERVER
   [junit4]   2> 357340 INFO  (Thread-1575) [    ] o.a.s.c.ZkTestServer client port:0.0.0.0/0.0.0.0:0
   [junit4]   2> 357340 INFO  (Thread-1575) [    ] o.a.s.c.ZkTestServer Starting server
   [junit4]   2> 357440 INFO  (TEST-CollectionsAPIDistributedZkTest.test-seed#[A03BD1E2FCB82628]) [    ] o.a.s.c.ZkTestServer start zk server on port:39870
   [junit4]   2> 357440 INFO  (TEST-CollectionsAPIDistributedZkTest.test-seed#[A03BD1E2FCB82628]) [    ] o.a.s.c.c.SolrZkClient Using default ZkCredentialsProvider
   [junit4]   2> 357440 INFO  (TEST-CollectionsAPIDistributedZkTest.test-seed#[A03BD1E2FCB82628]) [    ] o.a.s.c.c.ConnectionManager Waiting for client to connect to ZooKeeper
   [junit4]   2> 357442 INFO  (zkCallback-595-thread-1) [    ] o.a.s.c.c.ConnectionManager Watcher org.apache.solr.common.cloud.ConnectionManager@3babd1 name:ZooKeeperConnection Watcher:127.0.0.1:39870 got event WatchedEvent state:SyncConnected type:None path:null path:null type:None
   [junit4]   2> 357442 INFO  (TEST-CollectionsAPIDistributedZkTest.test-seed#[A03BD1E2FCB82628]) [    ] o.a.s.c.c.ConnectionManager Client is connected to ZooKeeper
   [junit4]   2> 357443 INFO  (TEST-CollectionsAPIDistributedZkTest.test-seed#[A03BD1E2FCB82628]) [    ] o.a.s.c.c.SolrZkClient Using default ZkACLProvider
   [junit4]   2> 357443 INFO  (TEST-CollectionsAPIDistributedZkTest.test-seed#[A03BD1E2FCB82628]) [    ] o.a.s.c.c.SolrZkClient makePath: /solr
   [junit4]   2> 357445 INFO  (TEST-CollectionsAPIDistributedZkTest.test-seed#[A03BD1E2FCB82628]) [    ] o.a.s.c.c.SolrZkClient Using default ZkCredentialsProvider
   [junit4]   2> 357445 INFO  (TEST-CollectionsAPIDistributedZkTest.test-seed#[A03BD1E2FCB82628]) [    ] o.a.s.c.c.ConnectionManager Waiting for client to connect to ZooKeeper
   [junit4]   2> 357446 INFO  (zkCallback-596-thread-1) [    ] o.a.s.c.c.ConnectionManager Watcher org.apache.solr.common.cloud.ConnectionManager@1fc515 name:ZooKeeperConnection Watcher:127.0.0.1:39870/solr got event WatchedEvent state:SyncConnected type:None path:null path:null type:None
   [junit4]   2> 357446 INFO  (TEST-CollectionsAPIDistributedZkTest.test-seed#[A03BD1E2FCB82628]) [    ] o.a.s.c.c.ConnectionManager Client is connected to ZooKeeper
   [junit4]   2> 357446 INFO  (TEST-CollectionsAPIDistributedZkTest.test-seed#[A03BD1E2FCB82628]) [    ] o.a.s.c.c.SolrZkClient Using default ZkACLProvider
   [junit4]   2> 357446 INFO  (TEST-CollectionsAPIDistributedZkTest.test-seed#[A03BD1E2FCB82628]) [    ] o.a.s.c.c.SolrZkClient makePath: /collections/collection1
   [junit4]   2> 357448 INFO  (TEST-CollectionsAPIDistributedZkTest.test-seed#[A03BD1E2FCB82628]) [    ] o.a.s.c.c.SolrZkClient makePath: /collections/collection1/shards
   [junit4]   2> 357449 INFO  (TEST-CollectionsAPIDistributedZkTest.test-seed#[A03BD1E2FCB82628]) [    ] o.a.s.c.c.SolrZkClient makePath: /collections/control_collection
   [junit4]   2> 357450 INFO  (TEST-CollectionsAPIDistributedZkTest.test-seed#[A03BD1E2FCB82628]) [    ] o.a.s.c.c.SolrZkClient makePath: /collections/control_collection/shards
   [junit4]   2> 357452 INFO  (TEST-CollectionsAPIDistributedZkTest.test-seed#[A03BD1E2FCB82628]) [    ] o.a.s.c.AbstractZkTestCase put /home/jenkins/workspace/Lucene-Solr-5.4-Linux/solr/core/src/test-files/solr/collection1/conf/solrconfig-tlog.xml to /configs/conf1/solrconfig.xml
   [junit4]   2> 357452 INFO  (TEST-CollectionsAPIDistributedZkTest.test-seed#[A03BD1E2FCB82628]) [    ] o.a.s.c.c.SolrZkClient makePath: /configs/conf1/solrconfig.xml
   [junit4]   2> 357454 INFO  (TEST-CollectionsAPIDistributedZkTest.test-seed#[A03BD1E2FCB82628]) [    ] o.a.s.c.AbstractZkTestCase put /home/jenkins/workspace/Lucene-Solr-5.4-Linux/solr/core/src/test-files/solr/collection1/conf/schema.xml to /configs/conf1/schema.xml
   [junit4]   2> 357454 INFO  (TEST-CollectionsAPIDistributedZkTest.test-seed#[A03BD1E2FCB82628]) [    ] o.a.s.c.c.SolrZkClient makePath: /configs/conf1/schema.xml
   [junit4]   2> 357456 INFO  (TEST-CollectionsAPIDistributedZkTest.test-seed#[A03BD1E2FCB82628]) [    ] o.a.s.c.AbstractZkTestCase put /home/jenkins/workspace/Lucene-Solr-5.4-Linux/solr/core/src/test-files/solr/collection1/conf/solrconfig.snippet.randomindexconfig.xml to /configs/conf1/solrconfig.snippet.randomindexconfig.xml
   [junit4]   2> 357456 INFO  (TEST-CollectionsAPIDistributedZkTest.test-seed#[A03BD1E2FCB82628]) [    ] o.a.s.c.c.SolrZkClient makePath: /configs/conf1/solrconfig.snippet.randomindexconfig.xml
   [junit4]   2> 357458 INFO  (TEST-CollectionsAPIDistributedZkTest.test-seed#[A03BD1E2FCB82628]) [    ] o.a.s.c.AbstractZkTestCase put /home/jenkins/workspace/Lucene-Solr-5.4-Linux/solr/core/src/test-files/solr/collection1/conf/stopwords.txt to /configs/conf1/stopwords.txt
   [junit4]   2> 357458 INFO  (TEST-CollectionsAPIDistributedZkTest.test-seed#[A03BD1E2FCB82628]) [    ] o.a.s.c.c.SolrZkClient makePath: /configs/conf1/stopwords.txt
   [junit4]   2> 357461 INFO  (TEST-CollectionsAPIDistributedZkTest.test-seed#[A03BD1E2FCB82628]) [    ] o.a.s.c.AbstractZkTestCase put /home/jenkins/workspace/Lucene-Solr-5.4-Linux/solr/core/src/test-files/solr/collection1/conf/protwords.txt to /configs/conf1/protwords.txt
   [junit4]   2> 357461 INFO  (TEST-CollectionsAPIDistributedZkTest.test-seed#[A03BD1E2FCB82628]) [    ] o.a.s.c.c.SolrZkClient makePath: /configs/conf1/protwords.txt
   [junit4]   2> 357462 INFO  (TEST-CollectionsAPIDistributedZkTest.test-seed#[A03BD1E2FCB82628]) [    ] o.a.s.c.AbstractZkTestCase put /home/jenkins/workspace/Lucene-Solr-5.4-Linux/solr/core/src/test-files/solr/collection1/conf/currency.xml to /configs/conf1/currency.xml
   [junit4]   2> 357462 INFO  (TEST-CollectionsAPIDistributedZkTest.test-seed#[A03BD1E2FCB82628]) [    ] o.a.s.c.c.SolrZkClient makePath: /configs/conf1/currency.xml
   [junit4]   2> 357464 INFO  (TEST-CollectionsAPIDistributedZkTest.test-seed#[A03BD1E2FCB82628]) [    ] o.a.s.c.AbstractZkTestCase put /home/jenkins/workspace/Lucene-Solr-5.4-Linux/solr/core/src/test-files/solr/collection1/conf/enumsConfig.xml to /configs/conf1/enumsConfig.xml
   [junit4]   2> 357464 INFO  (TEST-CollectionsAPIDistributedZkTest.test-seed#[A03BD1E2FCB82628]) [    ] o.a.s.c.c.SolrZkClient makePath: /configs/conf1/enumsConfig.xml
   [junit4]   2> 357465 INFO  (TEST-CollectionsAPIDistributedZkTest.test-seed#[A03BD1E2FCB82628]) [    ] o.a.s.c.AbstractZkTestCase put /home/jenkins/workspace/Lucene-Solr-5.4-Linux/solr/core/src/test-files/solr/collection1/conf/open-exchange-rates.json to /configs/conf1/open-exchange-rates.json
   [junit4]   2> 357465 INFO  (TEST-CollectionsAPIDistributedZkTest.test-seed#[A03BD1E2FCB82628]) [    ] o.a.s.c.c.SolrZkClient makePath: /configs/conf1/open-exchange-rates.json
   [junit4]   2> 357466 INFO  (TEST-CollectionsAPIDistributedZkTest.test-seed#[A03BD1E2FCB82628]) [    ] o.a.s.c.AbstractZkTestCase put /home/jenkins/workspace/Lucene-Solr-5.4-Linux/solr/core/src/test-files/solr/collection1/conf/mapping-ISOLatin1Accent.txt to /configs/conf1/mapping-ISOLatin1Accent.txt
   [junit4]   2> 357466 INFO  (TEST-CollectionsAPIDistributedZkTest.test-seed#[A03BD1E2FCB82628]) [    ] o.a.s.c.c.SolrZkClient makePath: /configs/conf1/mapping-ISOLatin1Accent.txt
   [junit4]   2> 357467 INFO  (TEST-CollectionsAPIDistributedZkTest.test-seed#[A03BD1E2FCB82628]) [    ] o.a.s.c.AbstractZkTestCase put /home/jenkins/workspace/Lucene-Solr-5.4-Linux/solr/core/src/test-files/solr/collection1/conf/old_synonyms.txt to /configs/conf1/old_synonyms.txt
   [junit4]   2> 357467 INFO  (TEST-CollectionsAPIDistributedZkTest.test-seed#[A03BD1E2FCB82628]) [    ] o.a.s.c.c.SolrZkClient makePath: /configs/conf1/old_synonyms.txt
   [junit4]   2> 357468 INFO  (TEST-CollectionsAPIDistributedZkTest.test-seed#[A03BD1E2FCB82628]) [    ] o.a.s.c.AbstractZkTestCase put /home/jenkins/workspace/Lucene-Solr-5.4-Linux/solr/core/src/test-files/solr/collection1/conf/synonyms.txt to /configs/conf1/synonyms.txt
   [junit4]   2> 357469 INFO  (TEST-CollectionsAPIDistributedZkTest.test-seed#[A03BD1E2FCB82628]) [    ] o.a.s.c.c.SolrZkClient makePath: /configs/conf1/synonyms.txt
   [junit4]   2> 357542 INFO  (TEST-CollectionsAPIDistributedZkTest.test-seed#[A03BD1E2FCB82628]) [    ] o.a.s.SolrTestCaseJ4 Writing core.properties file to /home/jenkins/workspace/Lucene-Solr-5.4-Linux/solr/build/solr-core/test/J1/temp/solr.cloud.CollectionsAPIDistributedZkTest_A03BD1E2FCB82628-001/control-001/cores/collection1
   [junit4]   2> 357543 INFO  (TEST-CollectionsAPIDistributedZkTest.test-seed#[A03BD1E2FCB82628]) [    ] o.e.j.s.Server jetty-9.2.13.v20150730
   [junit4]   2> 357544 INFO  (TEST-CollectionsAPIDistributedZkTest.test-seed#[A03BD1E2FCB82628]) [    ] o.e.j.s.h.ContextHandler Started o.e.j.s.ServletContextHandler@3a5922{/jk/rl,null,AVAILABLE}
   [junit4]   2> 357549 INFO  (TEST-CollectionsAPIDistributedZkTest.test-seed#[A03BD1E2FCB82628]) [    ] o.e.j.s.ServerConnector Started ServerConnector@18b59c2{HTTP/1.1}{127.0.0.1:44591}
   [junit4]   2> 357549 INFO  (TEST-CollectionsAPIDistributedZkTest.test-seed#[A03BD1E2FCB82628]) [    ] o.e.j.s.Server Started @358717ms
   [junit4]   2> 357549 INFO  (TEST-CollectionsAPIDistributedZkTest.test-seed#[A03BD1E2FCB82628]) [    ] o.a.s.c.s.e.JettySolrRunner Jetty properties: {solr.data.dir=/home/jenkins/workspace/Lucene-Solr-5.4-Linux/solr/build/solr-core/test/J1/temp/solr.cloud.CollectionsAPIDistributedZkTest_A03BD1E2FCB82628-001/tempDir-001/control/data, hostContext=/jk/rl, hostPort=44591, coreRootDirectory=/home/jenkins/workspace/Lucene-Solr-5.4-Linux/solr/build/solr-core/test/J1/../../../../../../../../../home/jenkins/workspace/Lucene-Solr-5.4-Linux/solr/build/solr-core/test/J1/temp/solr.cloud.CollectionsAPIDistributedZkTest_A03BD1E2FCB82628-001/control-001/cores}
   [junit4]   2> 357549 INFO  (TEST-CollectionsAPIDistributedZkTest.test-seed#[A03BD1E2FCB82628]) [    ] o.a.s.s.SolrDispatchFilter SolrDispatchFilter.init(): sun.misc.Launcher$AppClassLoader@1eb6432
   [junit4]   2> 357549 INFO  (TEST-CollectionsAPIDistributedZkTest.test-seed#[A03BD1E2FCB82628]) [    ] o.a.s.c.SolrResourceLoader new SolrResourceLoader for directory: '/home/jenkins/workspace/Lucene-Solr-5.4-Linux/solr/build/solr-core/test/J1/temp/solr.cloud.CollectionsAPIDistributedZkTest_A03BD1E2FCB82628-001/control-001'
   [junit4]   2> 357549 INFO  (TEST-CollectionsAPIDistributedZkTest.test-seed#[A03BD1E2FCB82628]) [    ] o.a.s.c.SolrResourceLoader JNDI not configured for solr (NoInitialContextEx)
   [junit4]   2> 357549 INFO  (TEST-CollectionsAPIDistributedZkTest.test-seed#[A03BD1E2FCB82628]) [    ] o.a.s.c.SolrResourceLoader solr home defaulted to 'solr/' (could not find system property or JNDI)
   [junit4]   2> 357550 INFO  (TEST-CollectionsAPIDistributedZkTest.test-seed#[A03BD1E2FCB82628]) [    ] o.a.s.c.c.SolrZkClient Using default ZkCredentialsProvider
   [junit4]   2> 357550 INFO  (TEST-CollectionsAPIDistributedZkTest.test-seed#[A03BD1E2FCB82628]) [    ] o.a.s.c.c.ConnectionManager Waiting for client to connect to ZooKeeper
   [junit4]   2> 357551 INFO  (zkCallback-597-thread-1) [    ] o.a.s.c.c.ConnectionManager Watcher org.apache.solr.common.cloud.ConnectionManager@1ef17c0 name:ZooKeeperConnection Watcher:127.0.0.1:39870/solr got event WatchedEvent state:SyncConnected type:None path:null path:null type:None
   [junit4]   2> 357551 INFO  (TEST-CollectionsAPIDistributedZkTest.test-seed#[A03BD1E2FCB82628]) [    ] o.a.s.c.c.ConnectionManager Client is connected to ZooKeeper
   [junit4]   2> 357552 INFO  (TEST-CollectionsAPIDistributedZkTest.test-seed#[A03BD1E2FCB82628]) [    ] o.a.s.c.c.SolrZkClient Using default ZkACLProvider
   [junit4]   2> 357552 INFO  (TEST-CollectionsAPIDistributedZkTest.test-seed#[A03BD1E2FCB82628]) [    ] o.a.s.s.SolrDispatchFilter Loading solr.xml from SolrHome (not found in ZooKeeper)
   [junit4]   2> 357552 INFO  (TEST-CollectionsAPIDistributedZkTest.test-seed#[A03BD1E2FCB82628]) [    ] o.a.s.c.SolrXmlConfig Loading container configuration from /home/jenkins/workspace/Lucene-Solr-5.4-Linux/solr/build/solr-core/test/J1/temp/solr.cloud.CollectionsAPIDistributedZkTest_A03BD1E2FCB82628-001/control-001/solr.xml
   [junit4]   2> 357560 INFO  (TEST-CollectionsAPIDistributedZkTest.test-seed#[A03BD1E2FCB82628]) [    ] o.a.s.c.CorePropertiesLocator Config-defined core root directory: /home/jenkins/workspace/Lucene-Solr-5.4-Linux/solr/build/solr-core/test/J1/../../../../../../../../../home/jenkins/workspace/Lucene-Solr-5.4-Linux/solr/build/solr-core/test/J1/temp/solr.cloud.CollectionsAPIDistributedZkTest_A03BD1E2FCB82628-001/control-001/cores
   [junit4]   2> 357561 INFO  (TEST-CollectionsAPIDistributedZkTest.test-seed#[A03BD1E2FCB82628]) [    ] o.a.s.c.CoreContainer New CoreContainer 24799530
   [junit4]   2> 357561 INFO  (TEST-CollectionsAPIDistributedZkTest.test-seed#[A03BD1E2FCB82628]) [    ] o.a.s.c.CoreContainer Loading cores into CoreContainer [instanceDir=/home/jenkins/workspace/Lucene-Solr-5.4-Linux/solr/build/solr-core/test/J1/temp/solr.cloud.CollectionsAPIDistributedZkTest_A03BD1E2FCB82628-001/control-001]
   [junit4]   2> 357561 WARN  (TEST-CollectionsAPIDistributedZkTest.test-seed#[A03BD1E2FCB82628]) [    ] o.a.s.c.CoreContainer Couldn't add files from /home/jenkins/workspace/Lucene-Solr-5.4-Linux/solr/build/solr-core/test/J1/temp/solr.cloud.CollectionsAPIDistributedZkTest_A03BD1E2FCB82628-001/control-001/lib to classpath: /home/jenkins/workspace/Lucene-Solr-5.4-Linux/solr/build/solr-core/test/J1/temp/solr.cloud.CollectionsAPIDistributedZkTest_A03BD1E2FCB82628-001/control-001/lib
   [junit4]   2> 357561 INFO  (TEST-CollectionsAPIDistributedZkTest.test-seed#[A03BD1E2FCB82628]) [    ] o.a.s.h.c.HttpShardHandlerFactory created with socketTimeout : 90000,urlScheme : ,connTimeout : 15000,maxConnectionsPerHost : 20,maxConnections : 10000,corePoolSize : 0,maximumPoolSize : 2147483647,maxThreadIdleTime : 5,sizeOfQueue : -1,fairnessPolicy : false,useRetries : false,
   [junit4]   2> 357562 INFO  (TEST-CollectionsAPIDistributedZkTest.test-seed#[A03BD1E2FCB82628]) [    ] o.a.s.u.UpdateShardHandler Creating UpdateShardHandler HTTP client with params: socketTimeout=340000&connTimeout=45000&retry=true
   [junit4]   2> 357562 INFO  (TEST-CollectionsAPIDistributedZkTest.test-seed#[A03BD1E2FCB82628]) [    ] o.a.s.l.LogWatcher SLF4J impl is org.slf4j.impl.Log4jLoggerFactory
   [junit4]   2> 357562 INFO  (TEST-CollectionsAPIDistributedZkTest.test-seed#[A03BD1E2FCB82628]) [    ] o.a.s.l.LogWatcher Registering Log Listener [Log4j (org.slf4j.impl.Log4jLoggerFactory)]
   [junit4]   2> 357562 INFO  (TEST-CollectionsAPIDistributedZkTest.test-seed#[A03BD1E2FCB82628]) [    ] o.a.s.c.ZkContainer Zookeeper client=127.0.0.1:39870/solr
   [junit4]   2> 357562 INFO  (TEST-CollectionsAPIDistributedZkTest.test-seed#[A03BD1E2FCB82628]) [    ] o.a.s.c.ZkController zkHost includes chroot
   [junit4]   2> 357562 INFO  (TEST-CollectionsAPIDistributedZkTest.test-seed#[A03BD1E2FCB82628]) [    ] o.a.s.c.c.SolrZkClient Using default ZkCredentialsProvider
   [junit4]   2> 357563 INFO  (TEST-CollectionsAPIDistributedZkTest.test-seed#[A03BD1E2FCB82628]) [    ] o.a.s.c.c.ConnectionManager Waiting for client to connect to ZooKeeper
   [junit4]   2> 357564 INFO  (zkCallback-599-thread-1) [    ] o.a.s.c.c.ConnectionManager Watcher org.apache.solr.common.cloud.ConnectionManager@12664a0 name:ZooKeeperConnection Watcher:127.0.0.1:39870 got event WatchedEvent state:SyncConnected type:None path:null path:null type:None
   [junit4]   2> 357564 INFO  (TEST-CollectionsAPIDistributedZkTest.test-seed#[A03BD1E2FCB82628]) [    ] o.a.s.c.c.ConnectionManager Client is connected to ZooKeeper
   [junit4]   2> 357565 INFO  (TEST-CollectionsAPIDistributedZkTest.test-seed#[A03BD1E2FCB82628]) [    ] o.a.s.c.c.SolrZkClient Using default ZkACLProvider
   [junit4]   2> 357566 INFO  (TEST-CollectionsAPIDistributedZkTest.test-seed#[A03BD1E2FCB82628]) [    ] o.a.s.c.c.ConnectionManager Waiting for client to connect to ZooKeeper
   [junit4]   2> 357567 INFO  (zkCallback-600-thread-1) [    ] o.a.s.c.c.ConnectionManager Watcher org.apache.solr.common.cloud.ConnectionManager@12c1bd9 name:ZooKeeperConnection Watcher:127.0.0.1:39870/solr got event WatchedEvent state:SyncConnected type:None path:null path:null type:None
   [junit4]   2> 357567 INFO  (TEST-CollectionsAPIDistributedZkTest.test-seed#[A03BD1E2FCB82628]) [    ] o.a.s.c.c.ConnectionManager Client is connected to ZooKeeper
   [junit4]   2> 357568 INFO  (TEST-CollectionsAPIDistributedZkTest.test-seed#[A03BD1E2FCB82628]) [    ] o.a.s.c.c.SolrZkClient makePath: /overseer/queue
   [junit4]   2> 357569 INFO  (TEST-CollectionsAPIDistributedZkTest.test-seed#[A03BD1E2FCB82628]) [    ] o.a.s.c.c.SolrZkClient makePath: /overseer/collection-queue-work
   [junit4]   2> 357571 INFO  (TEST-CollectionsAPIDistributedZkTest.test-seed#[A03BD1E2FCB82628]) [    ] o.a.s.c.c.SolrZkClient makePath: /overseer/collection-map-running
   [junit4]   2> 357572 INFO  (TEST-CollectionsAPIDistributedZkTest.test-seed#[A03BD1E2FCB82628]) [    ] o.a.s.c.c.SolrZkClient makePath: /overseer/collection-map-completed
   [junit4]   2> 357573 INFO  (TEST-CollectionsAPIDistributedZkTest.test-seed#[A03BD1E2FCB82628]) [    ] o.a.s.c.c.SolrZkClient makePath: /overseer/collection-map-failure
   [junit4]   2> 357574 INFO  (TEST-CollectionsAPIDistributedZkTest.test-seed#[A03BD1E2FCB82628]) [    ] o.a.s.c.c.SolrZkClient makePath: /live_nodes
   [junit4]   2> 357576 INFO  (TEST-CollectionsAPIDistributedZkTest.test-seed#[A03BD1E2FCB82628]) [    ] o.a.s.c.c.SolrZkClient makePath: /aliases.json
   [junit4]   2> 357576 INFO  (TEST-CollectionsAPIDistributedZkTest.test-seed#[A03BD1E2FCB82628]) [    ] o.a.s.c.c.SolrZkClient makePath: /clusterstate.json
   [junit4]   2> 357577 INFO  (TEST-CollectionsAPIDistributedZkTest.test-seed#[A03BD1E2FCB82628]) [    ] o.a.s.c.c.SolrZkClient makePath: /security.json
   [junit4]   2> 357577 INFO  (TEST-CollectionsAPIDistributedZkTest.test-seed#[A03BD1E2FCB82628]) [    ] o.a.s.c.ZkController Register node as live in ZooKeeper:/live_nodes/127.0.0.1:44591_jk%2Frl
   [junit4]   2> 357578 INFO  (TEST-CollectionsAPIDistributedZkTest.test-seed#[A03BD1E2FCB82628]) [    ] o.a.s.c.c.SolrZkClient makePath: /live_nodes/127.0.0.1:44591_jk%2Frl
   [junit4]   2> 357579 INFO  (TEST-CollectionsAPIDistributedZkTest.test-seed#[A03BD1E2FCB82628]) [    ] o.a.s.c.c.SolrZkClient makePath: /overseer_elect
   [junit4]   2> 357579 INFO  (TEST-CollectionsAPIDistributedZkTest.test-seed#[A03BD1E2FCB82628]) [    ] o.a.s.c.c.SolrZkClient makePath: /overseer_elect/election
   [junit4]   2> 357580 INFO  (TEST-CollectionsAPIDistributedZkTest.test-seed#[A03BD1E2FCB82628]) [    ] o.a.s.c.Overseer Overseer (id=null) closing
   [junit4]   2> 357580 INFO  (TEST-CollectionsAPIDistributedZkTest.test-seed#[A03BD1E2FCB82628]) [    ] o.a.s.c.LeaderElector Joined leadership election with path: /overseer_elect/election/95253098086858756-127.0.0.1:44591_jk%2Frl-n_0000000000
   [junit4]   2> 357581 INFO  (TEST-CollectionsAPIDistributedZkTest.test-seed#[A03BD1E2FCB82628]) [    ] o.a.s.c.OverseerElectionContext I am going to be the leader 127.0.0.1:44591_jk%2Frl
   [junit4]   2> 357581 INFO  (TEST-CollectionsAPIDistributedZkTest.test-seed#[A03BD1E2FCB82628]) [    ] o.a.s.c.c.SolrZkClient makePath: /overseer_elect/leader
   [junit4]   2> 357581 INFO  (TEST-CollectionsAPIDistributedZkTest.test-seed#[A03BD1E2FCB82628]) [    ] o.a.s.c.Overseer Overseer (id=95253098086858756-127.0.0.1:44591_jk%2Frl-n_0000000000) starting
   [junit4]   2> 357582 INFO  (TEST-CollectionsAPIDistributedZkTest.test-seed#[A03BD1E2FCB82628]) [    ] o.a.s.c.c.SolrZkClient makePath: /overseer/queue-work
   [junit4]   2> 357585 INFO  (TEST-CollectionsAPIDistributedZkTest.test-seed#[A03BD1E2FCB82628]) [    ] o.a.s.c.OverseerAutoReplicaFailoverThread Starting OverseerAutoReplicaFailoverThread autoReplicaFailoverWorkLoopDelay=10000 autoReplicaFailoverWaitAfterExpiration=10000 autoReplicaFailoverBadNodeExpiration=60000
   [junit4]   2> 357586 INFO  (OverseerCollectionConfigSetProcessor-95253098086858756-127.0.0.1:44591_jk%2Frl-n_0000000000) [    ] o.a.s.c.OverseerTaskProcessor Process current queue of overseer operations
   [junit4]   2> 357586 INFO  (TEST-CollectionsAPIDistributedZkTest.test-seed#[A03BD1E2FCB82628]) [    ] o.a.s.c.c.ZkStateReader Updating cluster state from ZooKeeper... 
   [junit4]   2> 357586 INFO  (OverseerStateUpdate-95253098086858756-127.0.0.1:44591_jk%2Frl-n_0000000000) [    ] o.a.s.c.Overseer Starting to work on the main queue
   [junit4]   2> 357616 INFO  (TEST-CollectionsAPIDistributedZkTest.test-seed#[A03BD1E2FCB82628]) [    ] o.a.s.c.CoreContainer Security conf doesn't exist. Skipping setup for authorization module.
   [junit4]   2> 357616 INFO  (TEST-CollectionsAPIDistributedZkTest.test-seed#[A03BD1E2FCB82628]) [    ] o.a.s.c.CoreContainer No authentication plugin used.
   [junit4]   2> 357617 INFO  (TEST-CollectionsAPIDistributedZkTest.test-seed#[A03BD1E2FCB82628]) [    ] o.a.s.c.CorePropertiesLocator Looking for core definitions underneath /home/jenkins/workspace/Lucene-Solr-5.4-Linux/solr/build/solr-core/test/J1/../../../../../../../../../home/jenkins/workspace/Lucene-Solr-5.4-Linux/solr/build/solr-core/test/J1/temp/solr.cloud.CollectionsAPIDistributedZkTest_A03BD1E2FCB82628-001/control-001/cores
   [junit4]   2> 357617 INFO  (TEST-CollectionsAPIDistributedZkTest.test-seed#[A03BD1E2FCB82628]) [    ] o.a.s.c.CoreDescriptor Created CoreDescriptor: {name=collection1, config=solrconfig.xml, transient=false, schema=schema.xml, loadOnStartup=true, configSetProperties=configsetprops.json, instanceDir=/home/jenkins/workspace/Lucene-Solr-5.4-Linux/solr/build/solr-core/test/J1/../../../../../../../../../home/jenkins/workspace/Lucene-Solr-5.4-Linux/solr/build/solr-core/test/J1/temp/solr.cloud.CollectionsAPIDistributedZkTest_A03BD1E2FCB82628-001/control-001/cores/collection1, collection=control_collection, absoluteInstDir=/home/jenkins/workspace/Lucene-Solr-5.4-Linux/solr/build/solr-core/test/J1/../../../../../../../../../home/jenkins/workspace/Lucene-Solr-5.4-Linux/solr/build/solr-core/test/J1/temp/solr.cloud.CollectionsAPIDistributedZkTest_A03BD1E2FCB82628-001/control-001/cores/collection1/, coreNodeName=, dataDir=data/, shard=}
   [junit4]   2> 357617 INFO  (TEST-CollectionsAPIDistributedZkTest.test-seed#[A03BD1E2FCB82628]) [    ] o.a.s.c.CorePropertiesLocator Found core collection1 in /home/jenkins/workspace/Lucene-Solr-5.4-Linux/solr/build/solr-core/test/J1/../../../../../../../../../home/jenkins/workspace/Lucene-Solr-5.4-Linux/solr/build/solr-core/test/J1/temp/solr.cloud.CollectionsAPIDistributedZkTest_A03BD1E2FCB82628-001/control-001/cores/collection1/
   [junit4]   2> 357617 INFO  (TEST-CollectionsAPIDistributedZkTest.test-seed#[A03BD1E2FCB82628]) [    ] o.a.s.c.CorePropertiesLocator Found 1 core definitions
   [junit4]   2> 357618 INFO  (TEST-CollectionsAPIDistributedZkTest.test-seed#[A03BD1E2FCB82628]) [    ] o.a.s.s.SolrDispatchFilter user.dir=/home/jenkins/workspace/Lucene-Solr-5.4-Linux/solr/build/solr-core/test/J1
   [junit4]   2> 357618 INFO  (TEST-CollectionsAPIDistributedZkTest.test-seed#[A03BD1E2FCB82628]) [    ] o.a.s.s.SolrDispatchFilter SolrDispatchFilter.init() done
   [junit4]   2> 357618 INFO  (coreLoadExecutor-1498-thread-1) [    ] o.a.s.c.ZkController publishing state=down
   [junit4]   2> 357618 INFO  (coreLoadExecutor-1498-thread-1) [    ] o.a.s.c.ZkController numShards not found on descriptor - reading it from system property
   [junit4]   2> 357620 INFO  (OverseerStateUpdate-95253098086858756-127.0.0.1:44591_jk%2Frl-n_0000000000) [    ] o.a.s.c.Overseer processMessage: queueSize: 1, message = {
   [junit4]   2>   "core":"collection1",
   [junit4]   2>   "roles":null,
   [junit4]   2>   "base_url":"http://127.0.0.1:44591/jk/rl",
   [junit4]   2>   "node_name":"127.0.0.1:44591_jk%2Frl",
   [junit4]   2>   "numShards":"1",
   [junit4]   2>   "state":"down",
   [junit4]   2>   "shard":null,
   [junit4]   2>   "collection":"control_collection",
   [junit4]   2>   "operation":"state"} current state version: 0
   [junit4]   2> 357620 INFO  (coreLoadExecutor-1498-thread-1) [    ] o.a.s.c.ZkController look for our core node name
   [junit4]   2> 357620 INFO  (OverseerStateUpdate-95253098086858756-127.0.0.1:44591_jk%2Frl-n_0000000000) [    ] o.a.s.c.o.ReplicaMutator Update state numShards=1 message={
   [junit4]   2>   "core":"collection1",
   [junit4]   2>   "roles":null,
   [junit4]   2>   "base_url":"http://127.0.0.1:44591/jk/rl",
   [junit4]   2>   "node_name":"127.0.0.1:44591_jk%2Frl",
   [junit4]   2>   "numShards":"1",
   [junit4]   2>   "state":"down",
   [junit4]   2>   "shard":null,
   [junit4]   2>   "collection":"control_collection",
   [junit4]   2>   "operation":"state"}
   [junit4]   2> 357620 INFO  (OverseerStateUpdate-95253098086858756-127.0.0.1:44591_jk%2Frl-n_0000000000) [    ] o.a.s.c.o.ClusterStateMutator building a new cName: control_collection
   [junit4]   2> 357620 INFO  (OverseerStateUpdate-95253098086858756-127.0.0.1:44591_jk%2Frl-n_0000000000) [    ] o.a.s.c.o.ReplicaMutator Assigning new node to shard shard=shard1
   [junit4]   2> 357621 INFO  (zkCallback-600-thread-1) [    ] o.a.s.c.c.ZkStateReader A cluster state change: WatchedEvent state:SyncConnected type:NodeDataChanged path:/clusterstate.json, has occurred - updating... (live nodes size: 1)
   [junit4]   2> 358620 INFO  (coreLoadExecutor-1498-thread-1) [    ] o.a.s.c.ZkController waiting to find shard id in clusterstate for collection1
   [junit4]   2> 358620 INFO  (coreLoadExecutor-1498-thread-1) [    ] o.a.s.c.ZkController Check for collection zkNode:control_collection
   [junit4]   2> 358620 INFO  (coreLoadExecutor-1498-thread-1) [    ] o.a.s.c.ZkController Collection zkNode exists
   [junit4]   2> 358621 INFO  (coreLoadExecutor-1498-thread-1) [    ] o.a.s.c.c.ZkStateReader Load collection config from:/collections/control_collection
   [junit4]   2> 358621 INFO  (coreLoadExecutor-1498-thread-1) [    ] o.a.s.c.c.ZkStateReader path=/collections/control_collection configName=conf1 specified config exists in ZooKeeper
   [junit4]   2> 358621 INFO  (coreLoadExecutor-1498-thread-1) [    ] o.a.s.c.SolrResourceLoader new SolrResourceLoader for directory: '/home/jenkins/workspace/Lucene-Solr-5.4-Linux/solr/build/solr-core/test/J1/temp/solr.cloud.CollectionsAPIDistributedZkTest_A03BD1E2FCB82628-001/control-001/cores/collection1'
   [junit4]   2> 358621 INFO  (coreLoadExecutor-1498-thread-1) [    ] o.a.s.c.SolrResourceLoader JNDI not configured for solr (NoInitialContextEx)
   [junit4]   2> 358621 INFO  (coreLoadExecutor-1498-thread-1) [    ] o.a.s.c.SolrResourceLoader solr home defaulted to 'solr/' (could not find system property or JNDI)
   [junit4]   2> 358623 INFO  (coreLoadExecutor-1498-thread-1) [    ] o.a.s.c.Config loaded config solrconfig.xml with version 0 
   [junit4]   2> 358628 INFO  (coreLoadExecutor-1498-thread-1) [    ] o.a.s.c.SolrConfig current version of requestparams : -1
   [junit4]   2> 358632 INFO  (coreLoadExecutor-1498-thread-1) [    ] o.a.s.c.SolrConfig Using Lucene MatchVersion: 5.4.1
   [junit4]   2> 358641 INFO  (coreLoadExecutor-1498-thread-1) [    ] o.a.s.c.SolrConfig Loaded SolrConfig: solrconfig.xml
   [junit4]   2> 358648 INFO  (coreLoadExecutor-1498-thread-1) [    ] o.a.s.s.IndexSchema [collection1] Schema name=test
   [junit4]   2> 358741 INFO  (coreLoadExecutor-1498-thread-1) [    ] o.a.s.s.OpenExchangeRatesOrgProvider Initialized with rates=open-exchange-rates.json, refreshInterval=1440.
   [junit4]   2> 358749 INFO  (coreLoadExecutor-1498-thread-1) [    ] o.a.s.s.IndexSchema default search field in schema is text
   [junit4]   2> 358751 INFO  (coreLoadExecutor-1498-thread-1) [    ] o.a.s.s.IndexSchema unique key field: id
   [junit4]   2> 358760 INFO  (coreLoadExecutor-1498-thread-1) [    ] o.a.s.s.FileExchangeRateProvider Reloading exchange rates from file currency.xml
   [junit4]   2> 358762 INFO  (coreLoadExecutor-1498-thread-1) [    ] o.a.s.s.FileExchangeRateProvider Reloading exchange rates from file currency.xml
   [junit4]   2> 358764 INFO  (coreLoadExecutor-1498-thread-1) [    ] o.a.s.s.OpenExchangeRatesOrgProvider Reloading exchange rates from open-exchange-rates.json
   [junit4]   2> 358765 WARN  (coreLoadExecutor-1498-thread-1) [    ] o.a.s.s.OpenExchangeRatesOrgProvider Unknown key IMPORTANT NOTE
   [junit4]   2> 358765 WARN  (coreLoadExecutor-1498-thread-1) [    ] o.a.s.s.OpenExchangeRatesOrgProvider Expected key, got STRING
   [junit4]   2> 358765 INFO  (coreLoadExecutor-1498-thread-1) [    ] o.a.s.s.OpenExchangeRatesOrgProvider Reloading exchange rates from open-exchange-rates.json
   [junit4]   2> 358765 WARN  (coreLoadExecutor-1498-thread-1) [    ] o.a.s.s.OpenExchangeRatesOrgProvider Unknown key IMPORTANT NOTE
   [junit4]   2> 358765 WARN  (coreLoadExecutor-1498-thread-1) [    ] o.a.s.s.OpenExchangeRatesOrgProvider Expected key, got STRING
   [junit4]   2> 358767 INFO  (coreLoadExecutor-1498-thread-1) [    ] o.a.s.c.ConfigSetProperties Did not find ConfigSet properties, assuming default properties: Can't find resource 'configsetprops.json' in classpath or '/configs/conf1', cwd=/home/jenkins/workspace/Lucene-Solr-5.4-Linux/solr/build/solr-core/test/J1
   [junit4]   2> 358767 INFO  (coreLoadExecutor-1498-thread-1) [    ] o.a.s.c.CoreContainer Creating SolrCore 'collection1' using configuration from collection control_collection
   [junit4]   2> 358767 INFO  (coreLoadExecutor-1498-thread-1) [    ] o.a.s.c.SolrCore org.apache.solr.core.MockDirectoryFactory
   [junit4]   2> 358767 INFO  (coreLoadExecutor-1498-thread-1) [    ] o.a.s.c.SolrCore [[collection1] ] Opening new SolrCore at [/home/jenkins/workspace/Lucene-Solr-5.4-Linux/solr/build/solr-core/test/J1/temp/solr.cloud.CollectionsAPIDistributedZkTest_A03BD1E2FCB82628-001/control-001/cores/collection1], dataDir=[null]
   [junit4]   2> 358767 INFO  (coreLoadExecutor-1498-thread-1) [    ] o.a.s.c.JmxMonitoredMap JMX monitoring is enabled. Adding Solr mbeans to JMX Server: com.sun.jmx.mbeanserver.JmxMBeanServer@1c2a1b2
   [junit4]   2> 358768 INFO  (coreLoadExecutor-1498-thread-1) [    ] o.a.s.c.CachingDirectoryFactory return new directory for /home/jenkins/workspace/Lucene-Solr-5.4-Linux/solr/build/solr-core/test/J1/../../../../../../../../../home/jenkins/workspace/Lucene-Solr-5.4-Linux/solr/build/solr-core/test/J1/temp/solr.cloud.CollectionsAPIDistributedZkTest_A03BD1E2FCB82628-001/control-001/cores/collection1/data
   [junit4]   2> 358768 INFO  (coreLoadExecutor-1498-thread-1) [    ] o.a.s.c.SolrCore New index directory detected: old=null new=/home/jenkins/workspace/Lucene-Solr-5.4-Linux/solr/build/solr-core/test/J1/../../../../../../../../../home/jenkins/workspace/Lucene-Solr-5.4-Linux/solr/build/solr-core/test/J1/temp/solr.cloud.CollectionsAPIDistributedZkTest_A03BD1E2FCB82628-001/control-001/cores/collection1/data/index/
   [junit4]   2> 358768 WARN  (coreLoadExecutor-1498-thread-1) [    ] o.a.s.c.SolrCore [collection1] Solr index directory '/home/jenkins/workspace/Lucene-Solr-5.4-Linux/solr/build/solr-core/test/J1/../../../../../../../../../home/jenkins/workspace/Lucene-Solr-5.4-Linux/solr/build/solr-core/test/J1/temp/solr.cloud.CollectionsAPIDistributedZkTest_A03BD1E2FCB82628-001/control-001/cores/collection1/data/index' doesn't exist. Creating new index...
   [junit4]   2> 358768 INFO  (coreLoadExecutor-1498-thread-1) [    ] o.a.s.c.CachingDirectoryFactory return new directory for /home/jenkins/workspace/Lucene-Solr-5.4-Linux/solr/build/solr-core/test/J1/../../../../../../../../../home/jenkins/workspace/Lucene-Solr-5.4-Linux/solr/build/solr-core/test/J1/temp/solr.cloud.CollectionsAPIDistributedZkTest_A03BD1E2FCB82628-001/control-001/cores/collection1/data/index
   [junit4]   2> 358768 INFO  (coreLoadExecutor-1498-thread-1) [    ] o.a.s.u.RandomMergePolicy RandomMergePolicy wrapping class org.apache.lucene.index.TieredMergePolicy: [TieredMergePolicy: maxMergeAtOnce=5, maxMergeAtOnceExplicit=8, maxMergedSegmentMB=69.8583984375, floorSegmentMB=0.791015625, forceMergeDeletesPctAllowed=23.006830109347444, segmentsPerTier=12.0, maxCFSSegmentSizeMB=8.796093022207999E12, noCFSRatio=1.0
   [junit4]   2> 358769 INFO  (coreLoadExecutor-1498-thread-1) [    ] o.a.s.c.SolrDeletionPolicy SolrDeletionPolicy.onCommit: commits: num=1
   [junit4]   2> 	commit{dir=MockDirectoryWrapper(RAMDirectory@1b557e6 lockFactory=org.apache.lucene.store.SingleInstanceLockFactory@70f6d3),segFN=segments_1,generation=1}
   [junit4]   2> 358769 INFO  (coreLoadExecutor-1498-thread-1) [    ] o.a.s.c.SolrDeletionPolicy newest commit generation = 1
   [junit4]   2> 358769 INFO  (OldIndexDirectoryCleanupThreadForCore-collection1) [    ] o.a.s.c.SolrCore Looking for old index directories to cleanup for core collection1 in /home/jenkins/workspace/Lucene-Solr-5.4-Linux/solr/build/solr-core/test/J1/../../../../../../../../../home/jenkins/workspace/Lucene-Solr-5.4-Linux/solr/build/solr-core/test/J1/temp/solr.cloud.CollectionsAPIDistributedZkTest_A03BD1E2FCB82628-001/control-001/cores/collection1/data/
   [junit4]   2> 358770 WARN  (OldIndexDirectoryCleanupThreadForCore-collection1) [    ] o.a.s.c.DirectoryFactory /home/jenkins/workspace/Lucene-Solr-5.4-Linux/solr/build/solr-core/test/J1/../../../../../../../../../home/jenkins/workspace/Lucene-Solr-5.4-Linux/solr/build/solr-core/test/J1/temp/solr.cloud.CollectionsAPIDistributedZkTest_A03BD1E2FCB82628-001/control-001/cores/collection1/data/ does not point to a valid data directory; skipping clean-up of old index directories.
   [junit4]   2> 358773 INFO  (coreLoadExecutor-1498-thread-1) [    ] o.a.s.u.p.UpdateRequestProcessorChain creating updateRequestProcessorChain "nodistrib"
   [junit4]   2> 358773 INFO  (coreLoadExecutor-1498-thread-1) [    ] o.a.s.u.p.UpdateRequestProcessorChain creating updateRequestProcessorChain "dedupe"
   [junit4]   2> 358773 INFO  (coreLoadExecutor-1498-thread-1) [    ] o.a.s.u.p.UpdateRequestProcessorChain inserting DistributedUpdateProcessorFactory into updateRequestProcessorChain "dedupe"
   [junit4]   2> 358773 INFO  (coreLoadExecutor-1498-thread-1) [    ] o.a.s.u.p.UpdateRequestProcessorChain creating updateRequestProcessorChain "stored_sig"
   [junit4]   2> 358773 INFO  (coreLoadExecutor-1498-thread-1) [    ] o.a.s.u.p.UpdateRequestProcessorChain inserting DistributedUpdateProcessorFactory into updateRequestProcessorChain "stored_sig"
   [junit4]   2> 358774 INFO  (coreLoadExecutor-1498-thread-1) [    ] o.a.s.u.p.UpdateRequestProcessorChain creating updateRequestProcessorChain "distrib-dup-test-chain-explicit"
   [junit4]   2> 358774 INFO  (coreLoadExecutor-1498-thread-1) [    ] o.a.s.u.p.UpdateRequestProcessorChain creating updateRequestProcessorChain "distrib-dup-test-chain-implicit"
   [junit4]   2> 358774 INFO  (coreLoadExecutor-1498-thread-1) [    ] o.a.s.u.p.UpdateRequestProcessorChain inserting DistributedUpdateProcessorFactory into updateRequestProcessorChain "distrib-dup-test-chain-implicit"
   [junit4]   2> 358774 INFO  (coreLoadExecutor-1498-thread-1) [    ] o.a.s.c.SolrCore no updateRequestProcessorChain defined as default, creating implicit default
   [junit4]   2> 358774 WARN  (coreLoadExecutor-1498-thread-1) [    ] o.a.s.c.RequestHandlers INVALID paramSet a in requestHandler {type = requestHandler,name = /dump,class = DumpRequestHandler,args = {defaults={a=A,b=B}}}
   [junit4]   2> 358776 INFO  (coreLoadExecutor-1498-thread-1) [    ] o.a.s.h.l.XMLLoader xsltCacheLifetimeSeconds=60
   [junit4]   2> 358777 INFO  (coreLoadExecutor-1498-thread-1) [    ] o.a.s.h.l.XMLLoader xsltCacheLifetimeSeconds=60
   [junit4]   2> 358778 INFO  (coreLoadExecutor-1498-thread-1) [    ] o.a.s.h.l.XMLLoader xsltCacheLifetimeSeconds=60
   [junit4]   2> 358779 INFO  (coreLoadExecutor-1498-thread-1) [    ] o.a.s.h.l.XMLLoader xsltCacheLifetimeSeconds=60
   [junit4]   2> 358782 INFO  (coreLoadExecutor-1498-thread-1) [    ] o.a.s.c.RequestHandlers Registered paths: /admin/mbeans,standard,/dump,/update/csv,/update/json/docs,/admin/luke,/admin/segments,/get,/admin/system,/replication,/admin/properties,/config,/schema,/admin/plugins,/admin/logging,/update/json,/admin/threads,/admin/ping,/update,/admin/file
   [junit4]   2> 358783 INFO  (coreLoadExecutor-1498-thread-1) [    ] o.a.s.c.SolrCore Using default statsCache cache: org.apache.solr.search.stats.LocalStatsCache
   [junit4]   2> 358784 INFO  (coreLoadExecutor-1498-thread-1) [    ] o.a.s.u.UpdateHandler Using UpdateLog implementation: org.apache.solr.update.UpdateLog
   [junit4]   2> 358784 INFO  (coreLoadExecutor-1498-thread-1) [    ] o.a.s.u.UpdateLog Initializing UpdateLog: dataDir= defaultSyncLevel=FLUSH numRecordsToKeep=100 maxNumLogsToKeep=10 numVersionBuckets=65536
   [junit4]   2> 358785 INFO  (coreLoadExecutor-1498-thread-1) [    ] o.a.s.u.CommitTracker Hard AutoCommit: disabled
   [junit4]   2> 358785 INFO  (coreLoadExecutor-1498-thread-1) [    ] o.a.s.u.CommitTracker Soft AutoCommit: disabled
   [junit4]   2> 358785 INFO  (coreLoadExecutor-1498-thread-1) [    ] o.a.s.u.RandomMergePolicy RandomMergePolicy wrapping class org.apache.lucene.index.LogDocMergePolicy: [LogDocMergePolicy: minMergeSize=1000, mergeFactor=42, maxMergeSize=9223372036854775807, maxMergeSizeForForcedMerge=9223372036854775807, calibrateSizeByDeletes=false, maxMergeDocs=2147483647, maxCFSSegmentSizeMB=8.796093022207999E12, noCFSRatio=1.0]
   [junit4]   2> 358785 INFO  (coreLoadExecutor-1498-thread-1) [    ] o.a.s.c.SolrDeletionPolicy SolrDeletionPolicy.onInit: commits: num=1
   [junit4]   2> 	commit{dir=MockDirectoryWrapper(RAMDirectory@1b557e6 lockFactory=org.apache.lucene.store.SingleInstanceLockFactory@70f6d3),segFN=segments_1,generation=1}
   [junit4]   2> 358785 INFO  (coreLoadExecutor-1498-thread-1) [    ] o.a.s.c.SolrDeletionPolicy newest commit generation = 1
   [junit4]   2> 358786 INFO  (coreLoadExecutor-1498-thread-1) [    ] o.a.s.s.SolrIndexSearcher Opening Searcher@1b0d770[collection1] main
   [junit4]   2> 358786 INFO  (coreLoadExecutor-1498-thread-1) [    ] o.a.s.c.c.ZkStateReader Load collection config from:/collections/control_collection
   [junit4]   2> 358786 INFO  (coreLoadExecutor-1498-thread-1) [    ] o.a.s.c.c.ZkStateReader path=/collections/control_collection configName=conf1 specified config exists in ZooKeeper
   [junit4]   2> 358786 INFO  (coreLoadExecutor-1498-thread-1) [    ] o.a.s.r.ManagedResourceStorage Setting up ZooKeeper-based storage for the RestManager with znodeBase: /configs/conf1
   [junit4]   2> 358786 INFO  (coreLoadExecutor-1498-thread-1) [    ] o.a.s.r.ManagedResourceStorage Configured ZooKeeperStorageIO with znodeBase: /configs/conf1
   [junit4]   2> 358786 INFO  (coreLoadExecutor-1498-thread-1) [    ] o.a.s.r.RestManager Initializing RestManager with initArgs: {}
   [junit4]   2> 358787 INFO  (coreLoadExecutor-1498-thread-1) [    ] o.a.s.r.ManagedResourceStorage Reading _rest_managed.json using ZooKeeperStorageIO:path=/configs/conf1
   [junit4]   2> 358787 INFO  (coreLoadExecutor-1498-thread-1) [    ] o.a.s.r.ManagedResourceStorage No data found for znode /configs/conf1/_rest_managed.json
   [junit4]   2> 358787 INFO  (coreLoadExecutor-1498-thread-1) [    ] o.a.s.r.ManagedResourceStorage Loaded null at path _rest_managed.json using ZooKeeperStorageIO:path=/configs/conf1
   [junit4]   2> 358787 INFO  (coreLoadExecutor-1498-thread-1) [    ] o.a.s.r.RestManager Initializing 0 registered ManagedResources
   [junit4]   2> 358787 INFO  (coreLoadExecutor-1498-thread-1) [    ] o.a.s.h.ReplicationHandler Commits will be reserved for  10000
   [junit4]   2> 358788 INFO  (searcherExecutor-1499-thread-1) [    ] o.a.s.c.SolrCore [collection1] Registered new searcher Searcher@1b0d770[collection1] main{ExitableDirectoryReader(UninvertingDirectoryReader())}
   [junit4]   2> 358788 INFO  (coreLoadExecutor-1498-thread-1) [    ] o.a.s.u.UpdateLog Looking up max value of version field to seed version buckets
   [junit4]   2> 358788 INFO  (coreLoadExecutor-1498-thread-1) [    ] o.a.s.u.VersionInfo Refreshing highest value of _version_ for 65536 version buckets from index
   [junit4]   2> 358788 INFO  (coreLoadExecutor-1498-thread-1) [    ] o.a.s.u.VersionInfo No terms found for _version_, cannot seed version bucket highest value from index
   [junit4]   2> 358788 INFO  (coreLoadExecutor-1498-thread-1) [    ] o.a.s.u.UpdateLog Could not find max version in index or recent updates, using new clock 1524049570907029504
   [junit4]   2> 358789 INFO  (coreLoadExecutor-1498-thread-1) [    ] o.a.s.u.UpdateLog Took 1.0ms to seed version buckets with highest version 1524049570907029504
   [junit4]   2> 358789 INFO  (coreLoadExecutor-1498-thread-1) [    ] o.a.s.c.ZkController watch zkdir /configs/conf1
   [junit4]   2> 358790 INFO  (coreLoadExecutor-1498-thread-1) [    ] o.a.s.c.CoreContainer registering core: collection1
   [junit4]   2> 358790 INFO  (coreZkRegister-1492-thread-1) [    ] o.a.s.c.ZkController Register replica - core:collection1 address:http://127.0.0.1:44591/jk/rl collection:control_collection shard:shard1
   [junit4]   2> 358790 INFO  (coreZkRegister-1492-thread-1) [    ] o.a.s.c.c.SolrZkClient makePath: /collections/control_collection/leader_elect/shard1/election
   [junit4]   2> 358793 INFO  (coreZkRegister-1492-thread-1) [    ] o.a.s.c.LeaderElector Joined leadership election with path: /collections/control_collection/leader_elect/shard1/election/95253098086858756-core_node1-n_0000000000
   [junit4]   2> 358794 INFO  (coreZkRegister-1492-thread-1) [    ] o.a.s.c.ShardLeaderElectionContext Running the leader process for shard shard1
   [junit4]   2> 358795 INFO  (coreZkRegister-1492-thread-1) [    ] o.a.s.c.ShardLeaderElectionContext Enough replicas found to continue.
   [junit4]   2> 358795 INFO  (coreZkRegister-1492-thread-1) [    ] o.a.s.c.ShardLeaderElectionContext I may be the new leader - try and sync
   [junit4]   2> 358795 INFO  (coreZkRegister-1492-thread-1) [    ] o.a.s.c.SyncStrategy Sync replicas to http://127.0.0.1:44591/jk/rl/collection1/
   [junit4]   2> 358795 INFO  (coreZkRegister-1492-thread-1) [    ] o.a.s.c.SyncStrategy Sync Success - now sync replicas to me
   [junit4]   2> 358795 INFO  (OverseerStateUpdate-95253098086858756-127.0.0.1:44591_jk%2Frl-n_0000000000) [    ] o.a.s.c.Overseer processMessage: queueSize: 1, message = {
   [junit4]   2>   "operation":"leader",
   [junit4]   2>   "shard":"shard1",
   [junit4]   2>   "collection":"control_collection"} current state version: 1
   [junit4]   2> 358795 INFO  (coreZkRegister-1492-thread-1) [    ] o.a.s.c.SyncStrategy http://127.0.0.1:44591/jk/rl/collection1/ has no replicas
   [junit4]   2> 358796 INFO  (coreZkRegister-1492-thread-1) [    ] o.a.s.c.c.SolrZkClient makePath: /collections/control_collection/leaders/shard1
   [junit4]   2> 358797 INFO  (coreZkRegister-1492-thread-1) [    ] o.a.s.c.ShardLeaderElectionContextBase Creating leader registration node
   [junit4]   2> 358799 INFO  (coreZkRegister-1492-thread-1) [    ] o.a.s.c.ShardLeaderElectionContext I am the new leader: http://127.0.0.1:44591/jk/rl/collection1/ shard1
   [junit4]   2> 358799 INFO  (OverseerStateUpdate-95253098086858756-127.0.0.1:44591_jk%2Frl-n_0000000000) [    ] o.a.s.c.Overseer processMessage: queueSize: 1, message = {
   [junit4]   2>   "operation":"leader",
   [junit4]   2>   "shard":"shard1",
   [junit4]   2>   "collection":"control_collection",
   [junit4]   2>   "base_url":"http://127.0.0.1:44591/jk/rl",
   [junit4]   2>   "core":"collection1",
   [junit4]   2>   "state":"active"} current state version: 1
   [junit4]   2> 358901 INFO  (zkCallback-600-thread-1) [    ] o.a.s.c.c.ZkStateReader A cluster state change: WatchedEvent state:SyncConnected type:NodeDataChanged path:/clusterstate.json, has occurred - updating... (live nodes size: 1)
   [junit4]   2> 358950 INFO  (coreZkRegister-1492-thread-1) [    ] o.a.s.c.ZkController We are http://127.0.0.1:44591/jk/rl/collection1/ and leader is http://127.0.0.1:44591/jk/rl/collection1/
   [junit4]   2> 358950 INFO  (coreZkRegister-1492-thread-1) [    ] o.a.s.c.ZkController No LogReplay needed for core=collection1 baseURL=http://127.0.0.1:44591/jk/rl
   [junit4]   2> 358950 INFO  (coreZkRegister-1492-thread-1) [    ] o.a.s.c.ZkController I am the leader, no recovery necessary
   [junit4]   2> 358950 INFO  (coreZkRegister-1492-thread-1) [    ] o.a.s.c.ZkController publishing state=active
   [junit4]   2> 358950 INFO  (coreZkRegister-1492-thread-1) [    ] o.a.s.c.ZkController numShards not found on descriptor - reading it from system property
   [junit4]   2> 358952 INFO  (OverseerStateUpdate-95253098086858756-127.0.0.1:44591_jk%2Frl-n_0000000000) [    ] o.a.s.c.Overseer processMessage: queueSize: 1, message = {
   [junit4]   2>   "core":"collection1",
   [junit4]   2>   "core_node_name":"core_node1",
   [junit4]   2>   "roles":null,
   [junit4]   2>   "base_url":"http://127.0.0.1:44591/jk/rl",
   [junit4]   2>   "node_name":"127.0.0.1:44591_jk%2Frl",
   [junit4]   2>   "numShards":"1",
   [junit4]   2>   "state":"active",
   [junit4]   2>   "shard":"shard1",
   [junit4]   2>   "collection":"control_collection",
   [junit4]   2>   "operation":"state"} current state version: 2
   [junit4]   2> 358952 INFO  (OverseerStateUpdate-95253098086858756-127.0.0.1:44591_jk%2Frl-n_0000000000) [    ] o.a.s.c.o.ReplicaMutator Update state numShards=1 message={
   [junit4]   2>   "core":"collection1",
   [junit4]   2>   "core_node_name":"core_node1",
   [junit4]   2>   "roles":null,
   [junit4]   2>   "base_url":"http://127.0.0.1:44591/jk/rl",
   [junit4]   2>   "node_name":"127.0.0.1:44591_jk%2Frl",
   [junit4]   2>   "numShards":"1",
   [junit4]   2>   "state":"active",
   [junit4]   2>   "shard":"shard1",
   [junit4]   2>   "collection":"control_collection",
   [junit4]   2>   "operation":"state"}
   [junit4]   2> 359054 INFO  (zkCallback-600-thread-1) [    ] o.a.s.c.c.ZkStateReader A cluster state change: WatchedEvent state:SyncConnected type:NodeDataChanged path:/clusterstate.json, has occurred - updating... (live nodes size: 1)
   [junit4]   2> 359120 INFO  (TEST-CollectionsAPIDistributedZkTest.test-seed#[A03BD1E2FCB82628]) [    ] o.a.s.c.c.SolrZkClient Using default ZkCredentialsProvider
   [junit4]   2> 359120 INFO  (TEST-CollectionsAPIDistributedZkTest.test-seed#[A03BD1E2FCB82628]) [    ] o.a.s.c.c.ConnectionManager Waiting for client to connect to ZooKeeper
   [junit4]   2> 359121 INFO  (zkCallback-602-thread-1) [    ] o.a.s.c.c.ConnectionManager Watcher org.apache.solr.common.cloud.ConnectionManager@1bb0b59 name:ZooKeeperConnection Watcher:127.0.0.1:39870/solr got event WatchedEvent state:SyncConnected type:None path:null path:null type:None
   [junit4]   2> 359121 INFO  (TEST-CollectionsAPIDistributedZkTest.test-seed#[A03BD1E2FCB82628]) [    ] o.a.s.c.c.ConnectionManager Client is connected to ZooKeeper
   [junit4]   2> 359122 INFO  (TEST-CollectionsAPIDistributedZkTest.test-seed#[A03BD1E2FCB82628]) [    ] o.a.s.c.c.SolrZkClient Using default ZkACLProvider
   [junit4]   2> 359122 INFO  (TEST-CollectionsAPIDistributedZkTest.test-seed#[A03BD1E2FCB82628]) [    ] o.a.s.c.c.ZkStateReader Updating cluster state from ZooKeeper... 
   [junit4]   2> 359123 INFO  (TEST-CollectionsAPIDistributedZkTest.test-seed#[A03BD1E2FCB82628]) [    ] o.a.s.c.ChaosMonkey monkey: init - expire sessions:false cause connection loss:false
   [junit4]   2> 359212 INFO  (TEST-CollectionsAPIDistributedZkTest.test-seed#[A03BD1E2FCB82628]) [    ] o.a.s.SolrTestCaseJ4 Writing core.properties file to /home/jenkins/workspace/Lucene-Solr-5.4-Linux/solr/build/solr-core/test/J1/temp/solr.cloud.CollectionsAPIDistributedZkTest_A03BD1E2FCB82628-001/shard-1-001/cores/collection1
   [junit4]   2> 359213 INFO  (TEST-CollectionsAPIDistributedZkTest.test-seed#[A03BD1E2FCB82628]) [    ] o.a.s.c.AbstractFullDistribZkTestBase create jetty 1 in directory /home/jenkins/workspace/Lucene-Solr-5.4-Linux/solr/build/solr-core/test/J1/temp/solr.cloud.CollectionsAPIDistributedZkTest_A03BD1E2FCB82628-001/shard-1-001
   [junit4]   2> 359213 INFO  (TEST-CollectionsAPIDistributedZkTest.test-seed#[A03BD1E2FCB82628]) [    ] o.e.j.s.Server jetty-9.2.13.v20150730
   [junit4]   2> 359215 INFO  (TEST-CollectionsAPIDistributedZkTest.test-seed#[A03BD1E2FCB82628]) [    ] o.e.j.s.h.ContextHandler Started o.e.j.s.ServletContextHandler@689b51{/jk/rl,null,AVAILABLE}
   [junit4]   2> 359215 INFO  (TEST-CollectionsAPIDistributedZkTest.test-seed#[A03BD1E2FCB82628]) [    ] o.e.j.s.ServerConnector Started ServerConnector@153781b{HTTP/1.1}{127.0.0.1:40807}
   [junit4]   2> 359215 INFO  (TEST-CollectionsAPIDistributedZkTest.test-seed#[A03BD1E2FCB82628]) [    ] o.e.j.s.Server Started @360383ms
   [junit4]   2> 359215 INFO  (TEST-CollectionsAPIDistributedZkTest.test-seed#[A03BD1E2FCB82628]) [    ] o.a.s.c.s.e.JettySolrRunner Jetty properties: {solr.data.dir=/home/jenkins/workspace/Lucene-Solr-5.4-Linux/solr/build/solr-core/test/J1/temp/solr.cloud.CollectionsAPIDistributedZkTest_A03BD1E2FCB82628-001/tempDir-001/jetty1, solrconfig=solrconfig.xml, hostContext=/jk/rl, hostPort=40807, coreRootDirectory=/home/jenkins/workspace/Lucene-Solr-5.4-Linux/solr/build/solr-core/test/J1/../../../../../../../../../home/jenkins/workspace/Lucene-Solr-5.4-Linux/solr/build/solr-core/test/J1/temp/solr.cloud.CollectionsAPIDistributedZkTest_A03BD1E2FCB82628-001/shard-1-001/cores}
   [junit4]   2> 359216 INFO  (TEST-CollectionsAPIDistributedZkTest.test-seed#[A03BD1E2FCB82628]) [    ] o.a.s.s.SolrDispatchFilter SolrDispatchFilter.init(): sun.misc.Launcher$AppClassLoader@1eb6432
   [junit4]   2> 359216 INFO  (TEST-CollectionsAPIDistributedZkTest.test-seed#[A03BD1E2FCB82628]) [    ] o.a.s.c.SolrResourceLoader new SolrResourceLoader for directory: '/home/jenkins/workspace/Lucene-Solr-5.4-Linux/solr/build/solr-core/test/J1/temp/solr.cloud.CollectionsAPIDistributedZkTest_A03BD1E2FCB82628-001/shard-1-001'
   [junit4]   2> 359216 INFO  (TEST-CollectionsAPIDistributedZkTest.test-seed#[A03BD1E2FCB82628]) [    ] o.a.s.c.SolrResourceLoader JNDI not configured for solr (NoInitialContextEx)
   [junit4]   2> 359216 INFO  (TEST-CollectionsAPIDistributedZkTest.test-seed#[A03BD1E2FCB82628]) [    ] o.a.s.c.SolrResourceLoader solr home defaulted to 'solr/' (could not find system property or JNDI)
   [junit4]   2> 359216 INFO  (TEST-CollectionsAPIDistributedZkTest.test-seed#[A03BD1E2FCB82628]) [    ] o.a.s.c.c.SolrZkClient Using default ZkCredentialsProvider
   [junit4]   2> 359216 INFO  (TEST-CollectionsAPIDistributedZkTest.test-seed#[A03BD1E2FCB82628]) [    ] o.a.s.c.c.ConnectionManager Waiting for client to connect to ZooKeeper
   [junit4]   2> 359217 INFO  (zkCallback-603-thread-1) [    ] o.a.s.c.c.ConnectionManager Watcher org.apache.solr.common.cloud.ConnectionManager@ac3b9 name:ZooKeeperConnection Watcher:127.0.0.1:39870/solr got event WatchedEvent state:SyncConnected type:None path:null path:null type:None
   [junit4]   2> 359217 INFO  (TEST-CollectionsAPIDistributedZkTest.test-seed#[A03BD1E2FCB82628]) [    ] o.a.s.c.c.ConnectionManager Client is connected to ZooKeeper
   [junit4]   2> 359218 INFO  (TEST-CollectionsAPIDistributedZkTest.test-seed#[A03BD1E2FCB82628]) [    ] o.a.s.c.c.SolrZkClient Using default ZkACLProvider
   [junit4]   2> 359218 INFO  (TEST-CollectionsAPIDistributedZkTest.test-seed#[A03BD1E2FCB82628]) [    ] o.a.s.s.SolrDispatchFilter Loading solr.xml from SolrHome (not found in ZooKeeper)
   [junit4]   2> 359218 INFO  (TEST-CollectionsAPIDistributedZkTest.test-seed#[A03BD1E2FCB82628]) [    ] o.a.s.c.SolrXmlConfig Loading container configuration from /home/jenkins/workspace/Lucene-Solr-5.4-Linux/solr/build/solr-core/test/J1/temp/solr.cloud.CollectionsAPIDistributedZkTest_A03BD1E2FCB82628-001/shard-1-001/solr.xml
   [junit4]   2> 359222 INFO  (TEST-CollectionsAPIDistributedZkTest.test-seed#[A03BD1E2FCB82628]) [    ] o.a.s.c.CorePropertiesLocator Config-defined core root directory: /home/jenkins/workspace/Lucene-Solr-5.4-Linux/solr/build/solr-core/test/J1/../../../../../../../../../home/jenkins/workspace/Lucene-Solr-5.4-Linux/solr/build/solr-core/test/J1/temp/solr.cloud.CollectionsAPIDistributedZkTest_A03BD1E2FCB82628-001/shard-1-001/cores
   [junit4]   2> 359222 INFO  (TEST-CollectionsAPIDistributedZkTest.test-seed#[A03BD1E2FCB82628]) [    ] o.a.s.c.CoreContainer New CoreContainer 10304361
   [junit4]   2> 359223 INFO  (TEST-CollectionsAPIDistributedZkTest.test-seed#[A03BD1E2FCB82628]) [    ] o.a.s.c.CoreContainer Loading cores into CoreContainer [instanceDir=/home/jenkins/workspace/Lucene-Solr-5.4-Linux/solr/build/solr-core/test/J1/temp/solr.cloud.CollectionsAPIDistributedZkTest_A03BD1E2FCB82628-001/shard-1-001]
   [junit4]   2> 359223 WARN  (TEST-CollectionsAPIDistributedZkTest.test-seed#[A03BD1E2FCB82628]) [    ] o.a.s.c.CoreContainer Couldn't add files from /home/jenkins/workspace/Lucene-Solr-5.4-Linux/solr/build/solr-core/test/J1/temp/solr.cloud.CollectionsAPIDistributedZkTest_A03BD1E2FCB82628-001/shard-1-001/lib to classpath: /home/jenkins/workspace/Lucene-Solr-5.4-Linux/solr/build/solr-core/test/J1/temp/solr.cloud.CollectionsAPIDistributedZkTest_A03BD1E2FCB82628-001/shard-1-001/lib
   [junit4]   2> 359223 INFO  (TEST-CollectionsAPIDistributedZkTest.test-seed#[A03BD1E2FCB82628]) [    ] o.a.s.h.c.HttpShardHandlerFactory created with socketTimeout : 90000,urlScheme : ,connTimeout : 15000,maxConnectionsPerHost : 20,maxConnections : 10000,corePoolSize : 0,maximumPoolSize : 2147483647,maxThreadIdleTime : 5,sizeOfQueue : -1,fairnessPolicy : false,useRetries : false,
   [junit4]   2> 359224 INFO  (TEST-CollectionsAPIDistributedZkTest.test-seed#[A03BD1E2FCB82628]) [    ] o.a.s.u.UpdateShardHandler Creating UpdateShardHandler HTTP client with params: socketTimeout=340000&connTimeout=45000&retry=true
   [junit4]   2> 359224 INFO  (TEST-CollectionsAPIDistributedZkTest.test-seed#[A03BD1E2FCB82628]) [    ] o.a.s.l.LogWatcher SLF4J impl is org.slf4j.impl.Log4jLoggerFactory
   [junit4]   2> 359224 INFO  (TEST-CollectionsAPIDistributedZkTest.test-seed#[A03BD1E2FCB82628]) [    ] o.a.s.l.LogWatcher Registering Log Listener [Log4j (org.slf4j.impl.Log4jLoggerFactory)]
   [junit4]   2> 359224 INFO  (TEST-CollectionsAPIDistributedZkTest.test-seed#[A03BD1E2FCB82628]) [    ] o.a.s.c.ZkContainer Zookeeper client=127.0.0.1:39870/solr
   [junit4]   2> 359224 INFO  (TEST-CollectionsAPIDistributedZkTest.test-seed#[A03BD1E2FCB82628]) [    ] o.a.s.c.ZkController zkHost includes chroot
   [junit4]   2> 359224 INFO  (TEST-CollectionsAPIDistributedZkTest.test-seed#[A03BD1E2FCB82628]) [    ] o.a.s.c.c.SolrZkClient Using default ZkCredentialsProvider
   [junit4]   2> 359226 INFO  (TEST-CollectionsAPIDistributedZkTest.test-seed#[A03BD1E2FCB82628]) [    ] o.a.s.c.c.ConnectionManager Waiting for client to connect to ZooKeeper
   [junit4]   2> 359227 INFO  (zkCallback-605-thread-1) [    ] o.a.s.c.c.ConnectionManager Watcher org.apache.solr.common.cloud.ConnectionManager@17bc1a4 name:ZooKeeperConnection Watcher:127.0.0.1:39870 got event WatchedEvent state:SyncConnected type:None path:null path:null type:None
   [junit4]   2> 359227 INFO  (TEST-CollectionsAPIDistributedZkTest.test-seed#[A03BD1E2FCB82628]) [    ] o.a.s.c.c.ConnectionManager Client is connected to ZooKeeper
   [junit4]   2> 359228 INFO  (TEST-CollectionsAPIDistributedZkTest.test-seed#[A03BD1E2FCB82628]) [    ] o.a.s.c.c.SolrZkClient Using default ZkACLProvider
   [junit4]   2> 359229 INFO  (TEST-CollectionsAPIDistributedZkTest.test-seed#[A03BD1E2FCB82628]) [    ] o.a.s.c.c.ConnectionManager Waiting for client to connect to ZooKeeper
   [junit4]   2> 359230 INFO  (zkCallback-606-thread-1) [    ] o.a.s.c.c.ConnectionManager Watcher org.apache.solr.common.cloud.ConnectionManager@1f9c8e9 name:ZooKeeperConnection Watcher:127.0.0.1:39870/solr got event WatchedEvent state:SyncConnected type:None path:null path:null type:None
   [junit4]   2> 359230 INFO  (TEST-CollectionsAPIDistributedZkTest.test-seed#[A03BD1E2FCB82628]) [    ] o.a.s.c.c.ConnectionManager Client is connected to ZooKeeper
   [junit4]   2> 359234 INFO  (TEST-CollectionsAPIDistributedZkTest.test-seed#[A03BD1E2FCB82628]) [    ] o.a.s.c.c.ZkStateReader Updating cluster state from ZooKeeper... 
   [junit4]   2> 360238 INFO  (TEST-CollectionsAPIDistributedZkTest.test-seed#[A03BD1E2FCB82628]) [    ] o.a.s.c.ZkController Register node as live in ZooKeeper:/live_nodes/127.0.0.1:40807_jk%2Frl
   [junit4]   2> 360238 INFO  (TEST-CollectionsAPIDistributedZkTest.test-seed#[A03BD1E2FCB82628]) [    ] o.a.s.c.c.SolrZkClient makePath: /live_nodes/127.0.0.1:40807_jk%2Frl
   [junit4]   2> 360239 INFO  (zkCallback-600-thread-1) [    ] o.a.s.c.c.ZkStateReader A live node change: WatchedEvent state:SyncConnected type:NodeChildrenChanged path:/live_nodes, has occurred - updating... (live nodes size: 1)
   [junit4]   2> 360239 INFO  (zkCallback-602-thread-1) [    ] o.a.s.c.c.ZkStateReader A live node change: WatchedEvent state:SyncConnected type:NodeChildrenChanged path:/live_nodes, has occurred - updating... (live nodes size: 1)
   [junit4]   2> 360239 INFO  (zkCallback-606-thread-1) [    ] o.a.s.c.c.ZkStateReader A live node change: WatchedEvent state:SyncConnected type:NodeChildrenChanged path:/live_nodes, has occurred - updating... (live nodes size: 1)
   [junit4]   2> 360240 INFO  (TEST-CollectionsAPIDistributedZkTest.test-seed#[A03BD1E2FCB82628]) [    ] o.a.s.c.Overseer Overseer (id=null) closing
   [junit4]   2> 360241 INFO  (TEST-CollectionsAPIDistributedZkTest.test-seed#[A03BD1E2FCB82628]) [    ] o.a.s.c.LeaderElector Joined leadership election with path: /overseer_elect/election/95253098086858760-127.0.0.1:40807_jk%2Frl-n_0000000001
   [junit4]   2> 360241 INFO  (TEST-CollectionsAPIDistributedZkTest.test-seed#[A03BD1E2FCB82628]) [    ] o.a.s.c.LeaderElector Watching path /overseer_elect/election/95253098086858756-127.0.0.1:44591_jk%2Frl-n_0000000000 to know if I could be the leader
   [junit4]   2> 360333 INFO  (TEST-CollectionsAPIDistributedZkTest.test-seed#[A03BD1E2FCB82628]) [    ] o.a.s.c.CoreContainer Security conf doesn't exist. Skipping setup for authorization module.
   [junit4]   2> 360333 INFO  (TEST-CollectionsAPIDistributedZkTest.test-seed#[A03BD1E2FCB82628]) [    ] o.a.s.c.CoreContainer No authentication plugin used.
   [junit4]   2> 360334 INFO  (TEST-CollectionsAPIDistributedZkTest.test-seed#[A03BD1E2FCB82628]) [    ] o.a.s.c.CorePropertiesLocator Looking for core definitions underneath /home/jenkins/workspace/Lucene-Solr-5.4-Linux/solr/build/solr-core/test/J1/../../../../../../../../../home/jenkins/workspace/Lucene-Solr-5.4-Linux/solr/build/solr-core/test/J1/temp/solr.cloud.CollectionsAPIDistributedZkTest_A03BD1E2FCB82628-001/shard-1-001/cores
   [junit4]   2> 360335 INFO  (TEST-CollectionsAPIDistributedZkTest.test-seed#[A03BD1E2FCB82628]) [    ] o.a.s.c.CoreDescriptor Created CoreDescriptor: {name=collection1, config=solrconfig.xml, transient=false, schema=schema.xml, loadOnStartup=true, configSetProperties=configsetprops.json, instanceDir=/home/jenkins/workspace/Lucene-Solr-5.4-Linux/solr/build/solr-core/test/J1/../../../../../../../../../home/jenkins/workspace/Lucene-Solr-5.4-Linux/solr/build/solr-core/test/J1/temp/solr.cloud.CollectionsAPIDistributedZkTest_A03BD1E2FCB82628-001/shard-1-001/cores/collection1, collection=collection1, absoluteInstDir=/home/jenkins/workspace/Lucene-Solr-5.4-Linux/solr/build/solr-core/test/J1/../../../../../../../../../home/jenkins/workspace/Lucene-Solr-5.4-Linux/solr/build/solr-core/test/J1/temp/solr.cloud.CollectionsAPIDistributedZkTest_A03BD1E2FCB82628-001/shard-1-001/cores/collection1/, coreNodeName=, dataDir=data/, shard=}
   [junit4]   2> 360335 INFO  (TEST-CollectionsAPIDistributedZkTest.test-seed#[A03BD1E2FCB82628]) [    ] o.a.s.c.CorePropertiesLocator Found core collection1 in /home/jenkins/workspace/Lucene-Solr-5.4-Linux/solr/build/solr-core/test/J1/../../../../../../../../../home/jenkins/workspace/Lucene-Solr-5.4-Linux/solr/build/solr-core/test/J1/temp/solr.cloud.CollectionsAPIDistributedZkTest_A03BD1E2FCB82628-001/shard-1-001/cores/collection1/
   [junit4]   2> 360335 INFO  (TEST-CollectionsAPIDistributedZkTest.test-seed#[A03BD1E2FCB82628]) [    ] o.a.s.c.CorePropertiesLocator Found 1 core definitions
   [junit4]   2> 360336 INFO  (TEST-CollectionsAPIDistributedZkTest.test-seed#[A03BD1E2FCB82628]) [    ] o.a.s.s.SolrDispatchFilter user.dir=/home/jenkins/workspace/Lucene-Solr-5.4-Linux/solr/build/solr-core/test/J1
   [junit4]   2> 360336 INFO  (TEST-CollectionsAPIDistributedZkTest.test-seed#[A03BD1E2FCB82628]) [    ] o.a.s.s.SolrDispatchFilter SolrDispatchFilter.init() done
   [junit4]   2> 360336 INFO  (coreLoadExecutor-1509-thread-1) [    ] o.a.s.c.ZkController publishing state=down
   [junit4]   2> 360336 INFO  (coreLoadExecutor-1509-thread-1) [    ] o.a.s.c.ZkController numShards not found on descriptor - reading it from system property
   [junit4]   2> 360337 INFO  (coreLoadExecutor-1509-thread-1) [    ] o.a.s.c.ZkController look for our core node name
   [junit4]   2> 360337 INFO  (OverseerStateUpdate-95253098086858756-127.0.0.1:44591_jk%2Frl-n_0000000000) [    ] o.a.s.c.Overseer processMessage: queueSize: 1, message = {
   [junit4]   2>   "core":"collection1",
   [junit4]   2>   "roles":null,
   [junit4]   2>   "base_url":"http://127.0.0.1:40807/jk/rl",
   [junit4]   2>   "node_name":"127.0.0.1:40807_jk%2Frl",
   [junit4]   2>   "numShards":"2",
   [junit4]   2>   "state":"down",
   [junit4]   2>   "shard":null,
   [junit4]   2>   "collection":"collection1",
   [junit4]   2>   "operation":"state"} current state version: 3
   [junit4]   2> 360338 INFO  (OverseerStateUpdate-95253098086858756-127.0.0.1:44591_jk%2Frl-n_0000000000) [    ] o.a.s.c.o.ReplicaMutator Update state numShards=2 message={
   [junit4]   2>   "core":"collection1",
   [junit4]   2>   "roles":null,
   [junit4]   2>   "base_url":"http://127.0.0.1:40807/jk/rl",
   [junit4]   2>   "node_name":"127.0.0.1:40807_jk%2Frl",
   [junit4]   2>   "numShards":"2",
   [junit4]   2>   "state":"down",
   [junit4]   2>   "shard":null,
   [junit4]   2>   "collection":"collection1",
   [junit4]   2>   "operation":"state"}
   [junit4]   2> 360338 INFO  (OverseerStateUpdate-95253098086858756-127.0.0.1:44591_jk%2Frl-n_0000000000) [    ] o.a.s.c.o.ClusterStateMutator building a new cName: collection1
   [junit4]   2> 360338 INFO  (OverseerStateUpdate-95253098086858756-127.0.0.1:44591_jk%2Frl-n_0000000000) [    ] o.a.s.c.o.ReplicaMutator Assigning new node to shard shard=shard2
   [junit4]   2> 360440 INFO  (zkCallback-600-thread-1) [    ] o.a.s.c.c.ZkStateReader A cluster state change: WatchedEvent state:SyncConnected type:NodeDataChanged path:/clusterstate.json, has occurred - updating... (live nodes size: 2)
   [junit4]   2> 360440 INFO  (zkCallback-606-thread-1) [    ] o.a.s.c.c.ZkStateReader A cluster state change: WatchedEvent state:SyncConnected type:NodeDataChanged path:/clusterstate.json, has occurred - updating... (live nodes size: 2)
   [junit4]   2> 360440 INFO  (zkCallback-602-thread-1) [    ] o.a.s.c.c.ZkStateReader A cluster state change: WatchedEvent state:SyncConnected type:NodeDataChanged path:/clusterstate.json, has occurred - updating... (live nodes size: 2)
   [junit4]   2> 361338 INFO  (coreLoadExecutor-1509-thread-1) [    ] o.a.s.c.ZkController waiting to find shard id in clusterstate for collection1
   [junit4]   2> 361338 INFO  (coreLoadExecutor-1509-thread-1) [    ] o.a.s.c.ZkController Check for collection zkNode:collection1
   [junit4]   2> 361338 INFO  (coreLoadExecutor-1509-thread-1) [    ] o.a.s.c.ZkController Collection zkNode exists
   [junit4]   2> 361338 INFO  (coreLoadExecutor-1509-thread-1) [    ] o.a.s.c.c.ZkStateReader Load collection config from:/collections/collection1
   [junit4]   2> 361339 INFO  (coreLoadExecutor-1509-thread-1) [    ] o.a.s.c.c.ZkStateReader path=/collections/collection1 configName=conf1 specified config exists in ZooKeeper
   [junit4]   2> 361339 INFO  (coreLoadExecutor-1509-thread-1) [    ] o.a.s.c.SolrResourceLoader new SolrResourceLoader for directory: '/home/jenkins/workspace/Lucene-Solr-5.4-Linux/solr/build/solr-core/test/J1/temp/solr.cloud.CollectionsAPIDistributedZkTest_A03BD1E2FCB82628-001/shard-1-001/cores/collection1'
   [junit4]   2> 361340 INFO  (coreLoadExecutor-1509-thread-1) [    ] o.a.s.c.SolrResourceLoader JNDI not configured for solr (NoInitialContextEx)
   [junit4]   2> 361340 INFO  (coreLoadExecutor-1509-thread-1) [    ] o.a.s.c.SolrResourceLoader solr home defaulted to 'solr/' (could not find system property or JNDI)
   [junit4]   2> 361341 INFO  (coreLoadExecutor-1509-thread-1) [    ] o.a.s.c.Config loaded config solrconfig.xml with version 0 
   [junit4]   2> 361345 INFO  (coreLoadExecutor-1509-thread-1) [    ] o.a.s.c.SolrConfig current version of requestparams : -1
   [junit4]   2> 361349 INFO  (coreLoadExecutor-1509-thread-1) [    ] o.a.s.c.SolrConfig Using Lucene MatchVersion: 5.4.1
   [junit4]   2> 361361 INFO  (coreLoadExecutor-1509-thread-1) [    ] o.a.s.c.SolrConfig Loaded SolrConfig: solrconfig.xml
   [junit4]   2> 361368 INFO  (coreLoadExecutor-1509-thread-1) [    ] o.a.s.s.IndexSchema [collection1] Schema name=test
   [junit4]   2> 361449 INFO  (coreLoadExecutor-1509-thread-1) [    ] o.a.s.s.OpenExchangeRatesOrgProvider Initialized with rates=open-exchange-rates.json, refreshInterval=1440.
   [junit4]   2> 361454 INFO  (coreLoadExecutor-1509-thread-1) [    ] o.a.s.s.IndexSchema default search field in schema is text
   [junit4]   2> 361455 INFO  (coreLoadExecutor-1509-thread-1) [    ] o.a.s.s.IndexSchema unique key field: id
   [junit4]   2> 361462 INFO  (coreLoadExecutor-1509-thread-1) [    ] o.a.s.s.FileExchangeRateProvider Reloading exchange rates from file currency.xml
   [junit4]   2> 361465 INFO  (coreLoadExecutor-1509-thread-1) [    ] o.a.s.s.FileExchangeRateProvider Reloading exchange rates from file currency.xml
   [junit4]   2> 361468 INFO  (coreLoadExecutor-1509-thread-1) [    ] o.a.s.s.OpenExchangeRatesOrgProvider Reloading exchange rates from open-exchange-rates.json
   [junit4]   2> 361469 WARN  (coreLoadExecutor-1509-thread-1) [    ] o.a.s.s.OpenExchangeRatesOrgProvider Unknown key IMPORTANT NOTE
   [junit4]   2> 361469 WARN  (coreLoadExecutor-1509-thread-1) [    ] o.a.s.s.OpenExchangeRatesOrgProvider Expected key, got STRING
   [junit4]   2> 361469 INFO  (coreLoadExecutor-1509-thread-1) [    ] o.a.s.s.OpenExchangeRatesOrgProvider Reloading exchange rates from open-exchange-rates.json
   [junit4]   2> 361469 WARN  (coreLoadExecutor-1509-thread-1) [    ] o.a.s.s.OpenExchangeRatesOrgProvider Unknown key IMPORTANT NOTE
   [junit4]   2> 361469 WARN  (coreLoadExecutor-1509-thread-1) [    ] o.a.s.s.OpenExchangeRatesOrgProvider Expected key, got STRING
   [junit4]   2> 361470 INFO  (coreLoadExecutor-1509-thread-1) [    ] o.a.s.c.ConfigSetProperties Did not find ConfigSet properties, assuming default properties: Can't find resource 'configsetprops.json' in classpath or '/configs/conf1', cwd=/home/jenkins/workspace/Lucene-Solr-5.4-Linux/solr/build/solr-core/test/J1
   [junit4]   2> 361470 INFO  (coreLoadExecutor-1509-thread-1) [    ] o.a.s.c.CoreContainer Creating SolrCore 'collection1' using configuration from collection collection1
   [junit4]   2> 361471 INFO  (coreLoadExecutor-1509-thread-1) [    ] o.a.s.c.SolrCore org.apache.solr.core.MockDirectoryFactory
   [junit4]   2> 361471 INFO  (coreLoadExecutor-1509-thread-1) [    ] o.a.s.c.SolrCore [[collection1] ] Opening new SolrCore at [/home/jenkins/workspace/Lucene-Solr-5.4-Linux/solr/build/solr-core/test/J1/temp/solr.cloud.CollectionsAPIDistributedZkTest_A03BD1E2FCB82628-001/shard-1-001/cores/collection1], dataDir=[null]
   [junit4]   2> 361471 INFO  (coreLoadExecutor-1509-thread-1) [    ] o.a.s.c.JmxMonitoredMap JMX monitoring is enabled. Adding Solr mbeans to JMX Server: com.sun.jmx.mbeanserver.JmxMBeanServer@1c2a1b2
   [junit4]   2> 361472 INFO  (coreLoadExecutor-1509-thread-1) [    ] o.a.s.c.CachingDirectoryFactory return new directory for /home/jenkins/workspace/Lucene-Solr-5.4-Linux/solr/build/solr-core/test/J1/../../../../../../../../../home/jenkins/workspace/Lucene-Solr-5.4-Linux/solr/build/solr-core/test/J1/temp/solr.cloud.CollectionsAPIDistributedZkTest_A03BD1E2FCB82628-001/shard-1-001/cores/collection1/data
   [junit4]   2> 361472 INFO  (coreLoadExecutor-1509-thread-1) [    ] o.a.s.c.SolrCore New index directory detected: old=null new=/home/jenkins/workspace/Lucene-Solr-5.4-Linux/solr/build/solr-core/test/J1/../../../../../../../../../home/jenkins/workspace/Lucene-Solr-5.4-Linux/solr/build/solr-core/test/J1/temp/solr.cloud.CollectionsAPIDistributedZkTest_A03BD1E2FCB82628-001/shard-1-001/cores/collection1/data/index/
   [junit4]   2> 361472 WARN  (coreLoadExecutor-1509-thread-1) [    ] o.a.s.c.SolrCore [collection1] Solr index directory '/home/jenkins/workspace/Lucene-Solr-5.4-Linux/solr/build/solr-core/test/J1/../../../../../../../../../home/jenkins/workspace/Lucene-Solr-5.4-Linux/solr/build/solr-core/test/J1/temp/solr.cloud.CollectionsAPIDistributedZkTest_A03BD1E2FCB82628-001/shard-1-001/cores/collection1/data/index' doesn't exist. Creating new index...
   [junit4]   2> 361472 INFO  (coreLoadExecutor-1509-thread-1) [    ] o.a.s.c.CachingDirectoryFactory return new directory for /home/jenkins/workspace/Lucene-Solr-5.4-Linux/solr/build/solr-core/test/J1/../../../../../.

[...truncated too long message...]

s.locale=kok_IN -Dtests.timezone=America/Curacao -Dtests.asserts=true -Dtests.file.encoding=US-ASCII
   [junit4] ERROR   0.00s J1 | CollectionsAPIDistributedZkTest (suite) <<<
   [junit4]    > Throwable #1: com.carrotsearch.randomizedtesting.ThreadLeakError: 5 threads leaked from SUITE scope at org.apache.solr.cloud.CollectionsAPIDistributedZkTest: 
   [junit4]    >    1) Thread[id=4325, name=TEST-CollectionsAPIDistributedZkTest.test-seed#[A03BD1E2FCB82628]-EventThread, state=WAITING, group=TGRP-CollectionsAPIDistributedZkTest]
   [junit4]    >         at jdk.internal.misc.Unsafe.park(Native Method)
   [junit4]    >         at java.util.concurrent.locks.LockSupport.park(LockSupport.java:178)
   [junit4]    >         at java.util.concurrent.locks.AbstractQueuedSynchronizer$ConditionObject.await(AbstractQueuedSynchronizer.java:2061)
   [junit4]    >         at java.util.concurrent.LinkedBlockingQueue.take(LinkedBlockingQueue.java:442)
   [junit4]    >         at org.apache.zookeeper.ClientCnxn$EventThread.run(ClientCnxn.java:494)
   [junit4]    >    2) Thread[id=4326, name=zkCallback-626-thread-1, state=TIMED_WAITING, group=TGRP-CollectionsAPIDistributedZkTest]
   [junit4]    >         at jdk.internal.misc.Unsafe.park(Native Method)
   [junit4]    >         at java.util.concurrent.locks.LockSupport.parkNanos(LockSupport.java:218)
   [junit4]    >         at java.util.concurrent.SynchronousQueue$TransferStack.awaitFulfill(SynchronousQueue.java:461)
   [junit4]    >         at java.util.concurrent.SynchronousQueue$TransferStack.transfer(SynchronousQueue.java:362)
   [junit4]    >         at java.util.concurrent.SynchronousQueue.poll(SynchronousQueue.java:937)
   [junit4]    >         at java.util.concurrent.ThreadPoolExecutor.getTask(ThreadPoolExecutor.java:1082)
   [junit4]    >         at java.util.concurrent.ThreadPoolExecutor.runWorker(ThreadPoolExecutor.java:1143)
   [junit4]    >         at java.util.concurrent.ThreadPoolExecutor$Worker.run(ThreadPoolExecutor.java:632)
   [junit4]    >         at java.lang.Thread.run(Thread.java:747)
   [junit4]    >    3) Thread[id=4324, name=TEST-CollectionsAPIDistributedZkTest.test-seed#[A03BD1E2FCB82628]-SendThread(127.0.0.1:39870), state=TIMED_WAITING, group=TGRP-CollectionsAPIDistributedZkTest]
   [junit4]    >         at java.lang.Thread.sleep(Native Method)
   [junit4]    >         at org.apache.zookeeper.client.StaticHostProvider.next(StaticHostProvider.java:101)
   [junit4]    >         at org.apache.zookeeper.ClientCnxn$SendThread.startConnect(ClientCnxn.java:940)
   [junit4]    >         at org.apache.zookeeper.ClientCnxn$SendThread.run(ClientCnxn.java:1003)
   [junit4]    >    4) Thread[id=4950, name=zkCallback-626-thread-2, state=TIMED_WAITING, group=TGRP-CollectionsAPIDistributedZkTest]
   [junit4]    >         at jdk.internal.misc.Unsafe.park(Native Method)
   [junit4]    >         at java.util.concurrent.locks.LockSupport.parkNanos(LockSupport.java:218)
   [junit4]    >         at java.util.concurrent.SynchronousQueue$TransferStack.awaitFulfill(SynchronousQueue.java:461)
   [junit4]    >         at java.util.concurrent.SynchronousQueue$TransferStack.transfer(SynchronousQueue.java:362)
   [junit4]    >         at java.util.concurrent.SynchronousQueue.poll(SynchronousQueue.java:937)
   [junit4]    >         at java.util.concurrent.ThreadPoolExecutor.getTask(ThreadPoolExecutor.java:1082)
   [junit4]    >         at java.util.concurrent.ThreadPoolExecutor.runWorker(ThreadPoolExecutor.java:1143)
   [junit4]    >         at java.util.concurrent.ThreadPoolExecutor$Worker.run(ThreadPoolExecutor.java:632)
   [junit4]    >         at java.lang.Thread.run(Thread.java:747)
   [junit4]    >    5) Thread[id=4951, name=zkCallback-626-thread-3, state=TIMED_WAITING, group=TGRP-CollectionsAPIDistributedZkTest]
   [junit4]    >         at jdk.internal.misc.Unsafe.park(Native Method)
   [junit4]    >         at java.util.concurrent.locks.LockSupport.parkNanos(LockSupport.java:218)
   [junit4]    >         at java.util.concurrent.SynchronousQueue$TransferStack.awaitFulfill(SynchronousQueue.java:461)
   [junit4]    >         at java.util.concurrent.SynchronousQueue$TransferStack.transfer(SynchronousQueue.java:362)
   [junit4]    >         at java.util.concurrent.SynchronousQueue.poll(SynchronousQueue.java:937)
   [junit4]    >         at java.util.concurrent.ThreadPoolExecutor.getTask(ThreadPoolExecutor.java:1082)
   [junit4]    >         at java.util.concurrent.ThreadPoolExecutor.runWorker(ThreadPoolExecutor.java:1143)
   [junit4]    >         at java.util.concurrent.ThreadPoolExecutor$Worker.run(ThreadPoolExecutor.java:632)
   [junit4]    >         at java.lang.Thread.run(Thread.java:747)
   [junit4]    > 	at __randomizedtesting.SeedInfo.seed([A03BD1E2FCB82628]:0)Throwable #2: com.carrotsearch.randomizedtesting.ThreadLeakError: There are still zombie threads that couldn't be terminated:
   [junit4]    >    1) Thread[id=4326, name=zkCallback-626-thread-1, state=TIMED_WAITING, group=TGRP-CollectionsAPIDistributedZkTest]
   [junit4]    >         at jdk.internal.misc.Unsafe.park(Native Method)
   [junit4]    >         at java.util.concurrent.locks.LockSupport.parkNanos(LockSupport.java:218)
   [junit4]    >         at java.util.concurrent.SynchronousQueue$TransferStack.awaitFulfill(SynchronousQueue.java:461)
   [junit4]    >         at java.util.concurrent.SynchronousQueue$TransferStack.transfer(SynchronousQueue.java:362)
   [junit4]    >         at java.util.concurrent.SynchronousQueue.poll(SynchronousQueue.java:937)
   [junit4]    >         at java.util.concurrent.ThreadPoolExecutor.getTask(ThreadPoolExecutor.java:1082)
   [junit4]    >         at java.util.concurrent.ThreadPoolExecutor.runWorker(ThreadPoolExecutor.java:1143)
   [junit4]    >         at java.util.concurrent.ThreadPoolExecutor$Worker.run(ThreadPoolExecutor.java:632)
   [junit4]    >         at java.lang.Thread.run(Thread.java:747)
   [junit4]    >    2) Thread[id=4324, name=TEST-CollectionsAPIDistributedZkTest.test-seed#[A03BD1E2FCB82628]-SendThread(127.0.0.1:39870), state=TIMED_WAITING, group=TGRP-CollectionsAPIDistributedZkTest]
   [junit4]    >         at java.lang.Thread.sleep(Native Method)
   [junit4]    >         at org.apache.zookeeper.client.StaticHostProvider.next(StaticHostProvider.java:101)
   [junit4]    >         at org.apache.zookeeper.ClientCnxn$SendThread.startConnect(ClientCnxn.java:940)
   [junit4]    >         at org.apache.zookeeper.ClientCnxn$SendThread.run(ClientCnxn.java:1003)
   [junit4]    >    3) Thread[id=4950, name=zkCallback-626-thread-2, state=TIMED_WAITING, group=TGRP-CollectionsAPIDistributedZkTest]
   [junit4]    >         at jdk.internal.misc.Unsafe.park(Native Method)
   [junit4]    >         at java.util.concurrent.locks.LockSupport.parkNanos(LockSupport.java:218)
   [junit4]    >         at java.util.concurrent.SynchronousQueue$TransferStack.awaitFulfill(SynchronousQueue.java:461)
   [junit4]    >         at java.util.concurrent.SynchronousQueue$TransferStack.transfer(SynchronousQueue.java:362)
   [junit4]    >         at java.util.concurrent.SynchronousQueue.poll(SynchronousQueue.java:937)
   [junit4]    >         at java.util.concurrent.ThreadPoolExecutor.getTask(ThreadPoolExecutor.java:1082)
   [junit4]    >         at java.util.concurrent.ThreadPoolExecutor.runWorker(ThreadPoolExecutor.java:1143)
   [junit4]    >         at java.util.concurrent.ThreadPoolExecutor$Worker.run(ThreadPoolExecutor.java:632)
   [junit4]    >         at java.lang.Thread.run(Thread.java:747)
   [junit4]    >    4) Thread[id=4951, name=zkCallback-626-thread-3, state=TIMED_WAITING, group=TGRP-CollectionsAPIDistributedZkTest]
   [junit4]    >         at jdk.internal.misc.Unsafe.park(Native Method)
   [junit4]    >         at java.util.concurrent.locks.LockSupport.parkNanos(LockSupport.java:218)
   [junit4]    >         at java.util.concurrent.SynchronousQueue$TransferStack.awaitFulfill(SynchronousQueue.java:461)
   [junit4]    >         at java.util.concurrent.SynchronousQueue$TransferStack.transfer(SynchronousQueue.java:362)
   [junit4]    >         at java.util.concurrent.SynchronousQueue.poll(SynchronousQueue.java:937)
   [junit4]    >         at java.util.concurrent.ThreadPoolExecutor.getTask(ThreadPoolExecutor.java:1082)
   [junit4]    >         at java.util.concurrent.ThreadPoolExecutor.runWorker(ThreadPoolExecutor.java:1143)
   [junit4]    >         at java.util.concurrent.ThreadPoolExecutor$Worker.run(ThreadPoolExecutor.java:632)
   [junit4]    >         at java.lang.Thread.run(Thread.java:747)
   [junit4]    > 	at __randomizedtesting.SeedInfo.seed([A03BD1E2FCB82628]:0)
   [junit4] Completed [137/551] on J1 in 95.93s, 1 test, 3 errors <<< FAILURES!

[...truncated 1275 lines...]
BUILD FAILED
/home/jenkins/workspace/Lucene-Solr-5.4-Linux/build.xml:792: The following error occurred while executing this line:
/home/jenkins/workspace/Lucene-Solr-5.4-Linux/build.xml:736: The following error occurred while executing this line:
/home/jenkins/workspace/Lucene-Solr-5.4-Linux/build.xml:59: The following error occurred while executing this line:
/home/jenkins/workspace/Lucene-Solr-5.4-Linux/solr/build.xml:233: The following error occurred while executing this line:
/home/jenkins/workspace/Lucene-Solr-5.4-Linux/solr/common-build.xml:526: The following error occurred while executing this line:
/home/jenkins/workspace/Lucene-Solr-5.4-Linux/lucene/common-build.xml:1452: The following error occurred while executing this line:
/home/jenkins/workspace/Lucene-Solr-5.4-Linux/lucene/common-build.xml:1006: There were test failures: 551 suites (7 ignored), 2179 tests, 2 suite-level errors, 1 error, 1204 ignored (30 assumptions) [seed: A03BD1E2FCB82628]

Total time: 46 minutes 11 seconds
Build step 'Invoke Ant' marked build as failure
Archiving artifacts
[WARNINGS] Skipping publisher since build result is FAILURE
Recording test results
Email was triggered for: Failure - Any
Sending email for trigger: Failure - Any



Mime
View raw message