lucene-dev mailing list archives

Site index · List index
Message view « Date » · « Thread »
Top « Date » · « Thread »
From Policeman Jenkins Server <jenk...@thetaphi.de>
Subject [JENKINS] Lucene-Solr-5.x-Solaris (64bit/jdk1.8.0) - Build # 311 - Still Failing!
Date Wed, 06 Jan 2016 10:40:03 GMT
Build: http://jenkins.thetaphi.de/job/Lucene-Solr-5.x-Solaris/311/
Java: 64bit/jdk1.8.0 -XX:+UseCompressedOops -XX:+UseSerialGC

3 tests failed.
FAILED:  junit.framework.TestSuite.org.apache.solr.core.TestCoreDiscovery

Error Message:
ObjectTracker found 4 object(s) that were not released!!! [MockDirectoryWrapper, MockDirectoryWrapper, MDCAwareThreadPoolExecutor, SolrCore]

Stack Trace:
java.lang.AssertionError: ObjectTracker found 4 object(s) that were not released!!! [MockDirectoryWrapper, MockDirectoryWrapper, MDCAwareThreadPoolExecutor, SolrCore]
	at __randomizedtesting.SeedInfo.seed([4EBD43E2E9B8E98E]:0)
	at org.junit.Assert.fail(Assert.java:93)
	at org.junit.Assert.assertTrue(Assert.java:43)
	at org.junit.Assert.assertNull(Assert.java:551)
	at org.apache.solr.SolrTestCaseJ4.afterClass(SolrTestCaseJ4.java:228)
	at sun.reflect.NativeMethodAccessorImpl.invoke0(Native Method)
	at sun.reflect.NativeMethodAccessorImpl.invoke(NativeMethodAccessorImpl.java:62)
	at sun.reflect.DelegatingMethodAccessorImpl.invoke(DelegatingMethodAccessorImpl.java:43)
	at java.lang.reflect.Method.invoke(Method.java:497)
	at com.carrotsearch.randomizedtesting.RandomizedRunner.invoke(RandomizedRunner.java:1764)
	at com.carrotsearch.randomizedtesting.RandomizedRunner$7.evaluate(RandomizedRunner.java:834)
	at com.carrotsearch.randomizedtesting.rules.StatementAdapter.evaluate(StatementAdapter.java:36)
	at com.carrotsearch.randomizedtesting.rules.SystemPropertiesRestoreRule$1.evaluate(SystemPropertiesRestoreRule.java:57)
	at org.apache.lucene.util.AbstractBeforeAfterRule$1.evaluate(AbstractBeforeAfterRule.java:46)
	at com.carrotsearch.randomizedtesting.rules.StatementAdapter.evaluate(StatementAdapter.java:36)
	at org.apache.lucene.util.TestRuleStoreClassName$1.evaluate(TestRuleStoreClassName.java:42)
	at com.carrotsearch.randomizedtesting.rules.NoShadowingOrOverridesOnMethodsRule$1.evaluate(NoShadowingOrOverridesOnMethodsRule.java:40)
	at com.carrotsearch.randomizedtesting.rules.NoShadowingOrOverridesOnMethodsRule$1.evaluate(NoShadowingOrOverridesOnMethodsRule.java:40)
	at com.carrotsearch.randomizedtesting.rules.StatementAdapter.evaluate(StatementAdapter.java:36)
	at com.carrotsearch.randomizedtesting.rules.StatementAdapter.evaluate(StatementAdapter.java:36)
	at com.carrotsearch.randomizedtesting.rules.StatementAdapter.evaluate(StatementAdapter.java:36)
	at org.apache.lucene.util.TestRuleAssertionsRequired$1.evaluate(TestRuleAssertionsRequired.java:54)
	at org.apache.lucene.util.TestRuleMarkFailure$1.evaluate(TestRuleMarkFailure.java:48)
	at org.apache.lucene.util.TestRuleIgnoreAfterMaxFailures$1.evaluate(TestRuleIgnoreAfterMaxFailures.java:65)
	at org.apache.lucene.util.TestRuleIgnoreTestSuites$1.evaluate(TestRuleIgnoreTestSuites.java:55)
	at com.carrotsearch.randomizedtesting.rules.StatementAdapter.evaluate(StatementAdapter.java:36)
	at com.carrotsearch.randomizedtesting.ThreadLeakControl$StatementRunner.run(ThreadLeakControl.java:367)
	at java.lang.Thread.run(Thread.java:745)


FAILED:  junit.framework.TestSuite.org.apache.solr.core.TestCoreDiscovery

Error Message:
1 thread leaked from SUITE scope at org.apache.solr.core.TestCoreDiscovery:     1) Thread[id=806, name=searcherExecutor-430-thread-1, state=WAITING, group=TGRP-TestCoreDiscovery]         at sun.misc.Unsafe.park(Native Method)         at java.util.concurrent.locks.LockSupport.park(LockSupport.java:175)         at java.util.concurrent.locks.AbstractQueuedSynchronizer$ConditionObject.await(AbstractQueuedSynchronizer.java:2039)         at java.util.concurrent.LinkedBlockingQueue.take(LinkedBlockingQueue.java:442)         at java.util.concurrent.ThreadPoolExecutor.getTask(ThreadPoolExecutor.java:1067)         at java.util.concurrent.ThreadPoolExecutor.runWorker(ThreadPoolExecutor.java:1127)         at java.util.concurrent.ThreadPoolExecutor$Worker.run(ThreadPoolExecutor.java:617)         at java.lang.Thread.run(Thread.java:745)

Stack Trace:
com.carrotsearch.randomizedtesting.ThreadLeakError: 1 thread leaked from SUITE scope at org.apache.solr.core.TestCoreDiscovery: 
   1) Thread[id=806, name=searcherExecutor-430-thread-1, state=WAITING, group=TGRP-TestCoreDiscovery]
        at sun.misc.Unsafe.park(Native Method)
        at java.util.concurrent.locks.LockSupport.park(LockSupport.java:175)
        at java.util.concurrent.locks.AbstractQueuedSynchronizer$ConditionObject.await(AbstractQueuedSynchronizer.java:2039)
        at java.util.concurrent.LinkedBlockingQueue.take(LinkedBlockingQueue.java:442)
        at java.util.concurrent.ThreadPoolExecutor.getTask(ThreadPoolExecutor.java:1067)
        at java.util.concurrent.ThreadPoolExecutor.runWorker(ThreadPoolExecutor.java:1127)
        at java.util.concurrent.ThreadPoolExecutor$Worker.run(ThreadPoolExecutor.java:617)
        at java.lang.Thread.run(Thread.java:745)
	at __randomizedtesting.SeedInfo.seed([4EBD43E2E9B8E98E]:0)


FAILED:  junit.framework.TestSuite.org.apache.solr.core.TestCoreDiscovery

Error Message:
There are still zombie threads that couldn't be terminated:    1) Thread[id=806, name=searcherExecutor-430-thread-1, state=WAITING, group=TGRP-TestCoreDiscovery]         at sun.misc.Unsafe.park(Native Method)         at java.util.concurrent.locks.LockSupport.park(LockSupport.java:175)         at java.util.concurrent.locks.AbstractQueuedSynchronizer$ConditionObject.await(AbstractQueuedSynchronizer.java:2039)         at java.util.concurrent.LinkedBlockingQueue.take(LinkedBlockingQueue.java:442)         at java.util.concurrent.ThreadPoolExecutor.getTask(ThreadPoolExecutor.java:1067)         at java.util.concurrent.ThreadPoolExecutor.runWorker(ThreadPoolExecutor.java:1127)         at java.util.concurrent.ThreadPoolExecutor$Worker.run(ThreadPoolExecutor.java:617)         at java.lang.Thread.run(Thread.java:745)

Stack Trace:
com.carrotsearch.randomizedtesting.ThreadLeakError: There are still zombie threads that couldn't be terminated:
   1) Thread[id=806, name=searcherExecutor-430-thread-1, state=WAITING, group=TGRP-TestCoreDiscovery]
        at sun.misc.Unsafe.park(Native Method)
        at java.util.concurrent.locks.LockSupport.park(LockSupport.java:175)
        at java.util.concurrent.locks.AbstractQueuedSynchronizer$ConditionObject.await(AbstractQueuedSynchronizer.java:2039)
        at java.util.concurrent.LinkedBlockingQueue.take(LinkedBlockingQueue.java:442)
        at java.util.concurrent.ThreadPoolExecutor.getTask(ThreadPoolExecutor.java:1067)
        at java.util.concurrent.ThreadPoolExecutor.runWorker(ThreadPoolExecutor.java:1127)
        at java.util.concurrent.ThreadPoolExecutor$Worker.run(ThreadPoolExecutor.java:617)
        at java.lang.Thread.run(Thread.java:745)
	at __randomizedtesting.SeedInfo.seed([4EBD43E2E9B8E98E]:0)




Build Log:
[...truncated 9737 lines...]
   [junit4] Suite: org.apache.solr.core.TestCoreDiscovery
   [junit4]   2> Creating dataDir: /export/home/jenkins/workspace/Lucene-Solr-5.x-Solaris/solr/build/solr-core/test/J1/temp/solr.core.TestCoreDiscovery_4EBD43E2E9B8E98E-001/init-core-data-001
   [junit4]   2> 119516 INFO  (SUITE-TestCoreDiscovery-seed#[4EBD43E2E9B8E98E]-worker) [    ] o.a.s.SolrTestCaseJ4 Randomized ssl (false) and clientAuth (false)
   [junit4]   2> 119516 INFO  (SUITE-TestCoreDiscovery-seed#[4EBD43E2E9B8E98E]-worker) [    ] o.a.s.SolrTestCaseJ4 ####initCore
   [junit4]   2> 119516 INFO  (SUITE-TestCoreDiscovery-seed#[4EBD43E2E9B8E98E]-worker) [    ] o.a.s.SolrTestCaseJ4 ####initCore end
   [junit4]   2> 119521 INFO  (TEST-TestCoreDiscovery.testDiscovery-seed#[4EBD43E2E9B8E98E]) [    ] o.a.s.SolrTestCaseJ4 ###Starting testDiscovery
   [junit4]   2> 119538 INFO  (TEST-TestCoreDiscovery.testDiscovery-seed#[4EBD43E2E9B8E98E]) [    ] o.a.s.c.SolrResourceLoader JNDI not configured for solr (NoInitialContextEx)
   [junit4]   2> 119538 INFO  (TEST-TestCoreDiscovery.testDiscovery-seed#[4EBD43E2E9B8E98E]) [    ] o.a.s.c.SolrResourceLoader using system property solr.solr.home: /export/home/jenkins/workspace/Lucene-Solr-5.x-Solaris/solr/build/solr-core/test/J1/temp/solr.core.TestCoreDiscovery_4EBD43E2E9B8E98E-001/tempDir-001
   [junit4]   2> 119538 INFO  (TEST-TestCoreDiscovery.testDiscovery-seed#[4EBD43E2E9B8E98E]) [    ] o.a.s.c.SolrResourceLoader new SolrResourceLoader for directory: '/export/home/jenkins/workspace/Lucene-Solr-5.x-Solaris/solr/build/solr-core/test/J1/temp/solr.core.TestCoreDiscovery_4EBD43E2E9B8E98E-001/tempDir-001'
   [junit4]   2> 119538 INFO  (TEST-TestCoreDiscovery.testDiscovery-seed#[4EBD43E2E9B8E98E]) [    ] o.a.s.c.SolrResourceLoader JNDI not configured for solr (NoInitialContextEx)
   [junit4]   2> 119538 INFO  (TEST-TestCoreDiscovery.testDiscovery-seed#[4EBD43E2E9B8E98E]) [    ] o.a.s.c.SolrResourceLoader using system property solr.solr.home: /export/home/jenkins/workspace/Lucene-Solr-5.x-Solaris/solr/build/solr-core/test/J1/temp/solr.core.TestCoreDiscovery_4EBD43E2E9B8E98E-001/tempDir-001
   [junit4]   2> 119538 INFO  (TEST-TestCoreDiscovery.testDiscovery-seed#[4EBD43E2E9B8E98E]) [    ] o.a.s.c.SolrXmlConfig Loading container configuration from /export/home/jenkins/workspace/Lucene-Solr-5.x-Solaris/solr/build/solr-core/test/J1/temp/solr.core.TestCoreDiscovery_4EBD43E2E9B8E98E-001/tempDir-001/solr.xml
   [junit4]   2> 119570 INFO  (TEST-TestCoreDiscovery.testDiscovery-seed#[4EBD43E2E9B8E98E]) [    ] o.a.s.c.CorePropertiesLocator Config-defined core root directory: /export/home/jenkins/workspace/Lucene-Solr-5.x-Solaris/solr/build/solr-core/test/J1/temp/solr.core.TestCoreDiscovery_4EBD43E2E9B8E98E-001/tempDir-001
   [junit4]   2> 119570 INFO  (TEST-TestCoreDiscovery.testDiscovery-seed#[4EBD43E2E9B8E98E]) [    ] o.a.s.c.CoreContainer New CoreContainer 1084599994
   [junit4]   2> 119570 INFO  (TEST-TestCoreDiscovery.testDiscovery-seed#[4EBD43E2E9B8E98E]) [    ] o.a.s.c.CoreContainer Loading cores into CoreContainer [instanceDir=/export/home/jenkins/workspace/Lucene-Solr-5.x-Solaris/solr/build/solr-core/test/J1/temp/solr.core.TestCoreDiscovery_4EBD43E2E9B8E98E-001/tempDir-001]
   [junit4]   2> 119570 WARN  (TEST-TestCoreDiscovery.testDiscovery-seed#[4EBD43E2E9B8E98E]) [    ] o.a.s.c.CoreContainer Couldn't add files from /export/home/jenkins/workspace/Lucene-Solr-5.x-Solaris/solr/build/solr-core/test/J1/temp/solr.core.TestCoreDiscovery_4EBD43E2E9B8E98E-001/tempDir-001/lib to classpath: /export/home/jenkins/workspace/Lucene-Solr-5.x-Solaris/solr/build/solr-core/test/J1/temp/solr.core.TestCoreDiscovery_4EBD43E2E9B8E98E-001/tempDir-001/lib
   [junit4]   2> 119570 INFO  (TEST-TestCoreDiscovery.testDiscovery-seed#[4EBD43E2E9B8E98E]) [    ] o.a.s.h.c.HttpShardHandlerFactory created with socketTimeout : 600000,connTimeout : 60000,maxConnectionsPerHost : 20,maxConnections : 10000,corePoolSize : 0,maximumPoolSize : 2147483647,maxThreadIdleTime : 5,sizeOfQueue : -1,fairnessPolicy : false,useRetries : false,
   [junit4]   2> 119572 INFO  (TEST-TestCoreDiscovery.testDiscovery-seed#[4EBD43E2E9B8E98E]) [    ] o.a.s.u.UpdateShardHandler Creating UpdateShardHandler HTTP client with params: socketTimeout=600000&connTimeout=60000&retry=true
   [junit4]   2> 119573 INFO  (TEST-TestCoreDiscovery.testDiscovery-seed#[4EBD43E2E9B8E98E]) [    ] o.a.s.c.SolrCores Allocating transient cache for 2 transient cores
   [junit4]   2> 119574 INFO  (TEST-TestCoreDiscovery.testDiscovery-seed#[4EBD43E2E9B8E98E]) [    ] o.a.s.l.LogWatcher SLF4J impl is org.slf4j.impl.Log4jLoggerFactory
   [junit4]   2> 119574 INFO  (TEST-TestCoreDiscovery.testDiscovery-seed#[4EBD43E2E9B8E98E]) [    ] o.a.s.l.LogWatcher Registering Log Listener [Log4j (org.slf4j.impl.Log4jLoggerFactory)]
   [junit4]   2> 119574 INFO  (TEST-TestCoreDiscovery.testDiscovery-seed#[4EBD43E2E9B8E98E]) [    ] o.a.s.c.CoreContainer Security conf doesn't exist. Skipping setup for authorization module.
   [junit4]   2> 119574 INFO  (TEST-TestCoreDiscovery.testDiscovery-seed#[4EBD43E2E9B8E98E]) [    ] o.a.s.c.CoreContainer No authentication plugin used.
   [junit4]   2> 119575 INFO  (TEST-TestCoreDiscovery.testDiscovery-seed#[4EBD43E2E9B8E98E]) [    ] o.a.s.c.CorePropertiesLocator Looking for core definitions underneath /export/home/jenkins/workspace/Lucene-Solr-5.x-Solaris/solr/build/solr-core/test/J1/temp/solr.core.TestCoreDiscovery_4EBD43E2E9B8E98E-001/tempDir-001
   [junit4]   2> 119576 INFO  (TEST-TestCoreDiscovery.testDiscovery-seed#[4EBD43E2E9B8E98E]) [    ] o.a.s.c.CoreDescriptor Created CoreDescriptor: {name=core1, config=solrconfig-minimal.xml, loadOnStartup=true, schema=schema-tiny.xml, configSetProperties=configsetprops.json, transient=false, dataDir=core1}
   [junit4]   2> 119576 INFO  (TEST-TestCoreDiscovery.testDiscovery-seed#[4EBD43E2E9B8E98E]) [    ] o.a.s.c.CorePropertiesLocator Found core core1 in /export/home/jenkins/workspace/Lucene-Solr-5.x-Solaris/solr/build/solr-core/test/J1/temp/solr.core.TestCoreDiscovery_4EBD43E2E9B8E98E-001/tempDir-001/core1
   [junit4]   2> 119576 INFO  (TEST-TestCoreDiscovery.testDiscovery-seed#[4EBD43E2E9B8E98E]) [    ] o.a.s.c.CoreDescriptor Created CoreDescriptor: {name=lazy1, config=solrconfig-minimal.xml, loadOnStartup=false, schema=schema-tiny.xml, configSetProperties=configsetprops.json, transient=true, dataDir=lazy1}
   [junit4]   2> 119577 INFO  (TEST-TestCoreDiscovery.testDiscovery-seed#[4EBD43E2E9B8E98E]) [    ] o.a.s.c.CorePropertiesLocator Found core lazy1 in /export/home/jenkins/workspace/Lucene-Solr-5.x-Solaris/solr/build/solr-core/test/J1/temp/solr.core.TestCoreDiscovery_4EBD43E2E9B8E98E-001/tempDir-001/lazy1
   [junit4]   2> 119577 INFO  (TEST-TestCoreDiscovery.testDiscovery-seed#[4EBD43E2E9B8E98E]) [    ] o.a.s.c.CoreDescriptor Created CoreDescriptor: {name=core2, config=solrconfig-minimal.xml, loadOnStartup=false, schema=schema-tiny.xml, configSetProperties=configsetprops.json, transient=false, dataDir=core2}
   [junit4]   2> 119577 INFO  (TEST-TestCoreDiscovery.testDiscovery-seed#[4EBD43E2E9B8E98E]) [    ] o.a.s.c.CorePropertiesLocator Found core core2 in /export/home/jenkins/workspace/Lucene-Solr-5.x-Solaris/solr/build/solr-core/test/J1/temp/solr.core.TestCoreDiscovery_4EBD43E2E9B8E98E-001/tempDir-001/core2
   [junit4]   2> 119577 INFO  (TEST-TestCoreDiscovery.testDiscovery-seed#[4EBD43E2E9B8E98E]) [    ] o.a.s.c.CorePropertiesLocator Found 3 core definitions
   [junit4]   2> 119577 INFO  (coreLoadExecutor-333-thread-1) [    ] o.a.s.c.SolrResourceLoader new SolrResourceLoader for directory: '/export/home/jenkins/workspace/Lucene-Solr-5.x-Solaris/solr/build/solr-core/test/J1/temp/solr.core.TestCoreDiscovery_4EBD43E2E9B8E98E-001/tempDir-001/core1'
   [junit4]   2> 119578 INFO  (coreLoadExecutor-333-thread-1) [    ] o.a.s.c.SolrResourceLoader JNDI not configured for solr (NoInitialContextEx)
   [junit4]   2> 119578 INFO  (coreLoadExecutor-333-thread-1) [    ] o.a.s.c.SolrResourceLoader using system property solr.solr.home: /export/home/jenkins/workspace/Lucene-Solr-5.x-Solaris/solr/build/solr-core/test/J1/temp/solr.core.TestCoreDiscovery_4EBD43E2E9B8E98E-001/tempDir-001
   [junit4]   2> 119594 INFO  (coreLoadExecutor-333-thread-1) [    ] o.a.s.c.SolrConfig current version of requestparams : -1
   [junit4]   2> 119599 INFO  (coreLoadExecutor-333-thread-1) [    ] o.a.s.c.SolrConfig Using Lucene MatchVersion: 5.5.0
   [junit4]   2> 119603 INFO  (coreLoadExecutor-333-thread-1) [    ] o.a.s.c.SolrConfig Loaded SolrConfig: solrconfig-minimal.xml
   [junit4]   2> 119606 INFO  (coreLoadExecutor-333-thread-1) [    ] o.a.s.s.IndexSchema [core1] Schema name=tiny
   [junit4]   2> 119642 INFO  (coreLoadExecutor-333-thread-1) [    ] o.a.s.s.IndexSchema unique key field: id
   [junit4]   2> 119643 INFO  (coreLoadExecutor-333-thread-1) [    ] o.a.s.c.ConfigSetProperties Did not find ConfigSet properties, assuming default properties: Can't find resource 'configsetprops.json' in classpath or '/export/home/jenkins/workspace/Lucene-Solr-5.x-Solaris/solr/build/solr-core/test/J1/temp/solr.core.TestCoreDiscovery_4EBD43E2E9B8E98E-001/tempDir-001/core1'
   [junit4]   2> 119644 INFO  (coreLoadExecutor-333-thread-1) [    ] o.a.s.c.CoreContainer Creating SolrCore 'core1' using configuration from instancedir /export/home/jenkins/workspace/Lucene-Solr-5.x-Solaris/solr/build/solr-core/test/J1/temp/solr.core.TestCoreDiscovery_4EBD43E2E9B8E98E-001/tempDir-001/core1
   [junit4]   2> 119644 INFO  (coreLoadExecutor-333-thread-1) [    x:core1] o.a.s.c.SolrCore org.apache.solr.core.MockDirectoryFactory
   [junit4]   2> 119644 INFO  (coreLoadExecutor-333-thread-1) [    x:core1] o.a.s.c.SolrCore [[core1] ] Opening new SolrCore at [/export/home/jenkins/workspace/Lucene-Solr-5.x-Solaris/solr/build/solr-core/test/J1/temp/solr.core.TestCoreDiscovery_4EBD43E2E9B8E98E-001/tempDir-001/core1], dataDir=[/export/home/jenkins/workspace/Lucene-Solr-5.x-Solaris/solr/build/solr-core/test/J1/temp/solr.core.TestCoreDiscovery_4EBD43E2E9B8E98E-001/tempDir-001/core1/core1/]
   [junit4]   2> 119644 INFO  (coreLoadExecutor-333-thread-1) [    x:core1] o.a.s.c.SolrCore JMX monitoring not detected for core: core1
   [junit4]   2> 119644 INFO  (coreLoadExecutor-333-thread-1) [    x:core1] o.a.s.c.CachingDirectoryFactory return new directory for /export/home/jenkins/workspace/Lucene-Solr-5.x-Solaris/solr/build/solr-core/test/J1/temp/solr.core.TestCoreDiscovery_4EBD43E2E9B8E98E-001/tempDir-001/core1/core1
   [junit4]   2> 119644 INFO  (coreLoadExecutor-333-thread-1) [    x:core1] o.a.s.c.SolrCore New index directory detected: old=null new=/export/home/jenkins/workspace/Lucene-Solr-5.x-Solaris/solr/build/solr-core/test/J1/temp/solr.core.TestCoreDiscovery_4EBD43E2E9B8E98E-001/tempDir-001/core1/core1/index/
   [junit4]   2> 119644 WARN  (coreLoadExecutor-333-thread-1) [    x:core1] o.a.s.c.SolrCore [core1] Solr index directory '/export/home/jenkins/workspace/Lucene-Solr-5.x-Solaris/solr/build/solr-core/test/J1/temp/solr.core.TestCoreDiscovery_4EBD43E2E9B8E98E-001/tempDir-001/core1/core1/index' doesn't exist. Creating new index...
   [junit4]   2> 119645 INFO  (coreLoadExecutor-333-thread-1) [    x:core1] o.a.s.c.CachingDirectoryFactory return new directory for /export/home/jenkins/workspace/Lucene-Solr-5.x-Solaris/solr/build/solr-core/test/J1/temp/solr.core.TestCoreDiscovery_4EBD43E2E9B8E98E-001/tempDir-001/core1/core1/index
   [junit4]   2> 119645 INFO  (coreLoadExecutor-333-thread-1) [    x:core1] o.a.s.u.RandomMergePolicy RandomMergePolicy wrapping class org.apache.lucene.index.TieredMergePolicy: [TieredMergePolicy: maxMergeAtOnce=14, maxMergeAtOnceExplicit=18, maxMergedSegmentMB=50.8486328125, floorSegmentMB=1.2568359375, forceMergeDeletesPctAllowed=8.63511315331079, segmentsPerTier=47.0, maxCFSSegmentSizeMB=8.796093022207999E12, noCFSRatio=0.10843337539701077
   [junit4]   2> 119645 INFO  (coreLoadExecutor-333-thread-1) [    x:core1] o.a.s.c.SolrDeletionPolicy SolrDeletionPolicy.onCommit: commits: num=1
   [junit4]   2> 	commit{dir=MockDirectoryWrapper(RAMDirectory@197241a2 lockFactory=org.apache.lucene.store.SingleInstanceLockFactory@2058f0c3),segFN=segments_1,generation=1}
   [junit4]   2> 119645 INFO  (coreLoadExecutor-333-thread-1) [    x:core1] o.a.s.c.SolrDeletionPolicy newest commit generation = 1
   [junit4]   2> 119646 INFO  (OldIndexDirectoryCleanupThreadForCore-core1) [    x:core1] o.a.s.c.SolrCore Looking for old index directories to cleanup for core core1 in /export/home/jenkins/workspace/Lucene-Solr-5.x-Solaris/solr/build/solr-core/test/J1/temp/solr.core.TestCoreDiscovery_4EBD43E2E9B8E98E-001/tempDir-001/core1/core1/
   [junit4]   2> 119647 WARN  (OldIndexDirectoryCleanupThreadForCore-core1) [    x:core1] o.a.s.c.DirectoryFactory /export/home/jenkins/workspace/Lucene-Solr-5.x-Solaris/solr/build/solr-core/test/J1/temp/solr.core.TestCoreDiscovery_4EBD43E2E9B8E98E-001/tempDir-001/core1/core1/ does not point to a valid data directory; skipping clean-up of old index directories.
   [junit4]   2> 119650 INFO  (coreLoadExecutor-333-thread-1) [    x:core1] o.a.s.c.SolrCore no updateRequestProcessorChain defined as default, creating implicit default
   [junit4]   2> 119657 INFO  (coreLoadExecutor-333-thread-1) [    x:core1] o.a.s.h.l.XMLLoader xsltCacheLifetimeSeconds=60
   [junit4]   2> 119658 INFO  (coreLoadExecutor-333-thread-1) [    x:core1] o.a.s.h.l.XMLLoader xsltCacheLifetimeSeconds=60
   [junit4]   2> 119659 INFO  (coreLoadExecutor-333-thread-1) [    x:core1] o.a.s.h.l.XMLLoader xsltCacheLifetimeSeconds=60
   [junit4]   2> 119660 INFO  (coreLoadExecutor-333-thread-1) [    x:core1] o.a.s.h.l.XMLLoader xsltCacheLifetimeSeconds=60
   [junit4]   2> 119661 INFO  (coreLoadExecutor-333-thread-1) [    x:core1] o.a.s.c.RequestHandlers Registered paths: /admin/mbeans,/update/csv,/update/json/docs,/admin/luke,/select,/admin/segments,/get,/admin/system,/replication,/admin/properties,/config,/schema,/admin/plugins,/admin/logging,/update/json,/admin/threads,/admin/ping,/update,/admin/file
   [junit4]   2> 119661 INFO  (coreLoadExecutor-333-thread-1) [    x:core1] o.a.s.c.SolrCore Using default statsCache cache: org.apache.solr.search.stats.LocalStatsCache
   [junit4]   2> 119661 INFO  (coreLoadExecutor-333-thread-1) [    x:core1] o.a.s.u.CommitTracker Hard AutoCommit: disabled
   [junit4]   2> 119662 INFO  (coreLoadExecutor-333-thread-1) [    x:core1] o.a.s.u.CommitTracker Soft AutoCommit: disabled
   [junit4]   2> 119662 INFO  (coreLoadExecutor-333-thread-1) [    x:core1] o.a.s.u.RandomMergePolicy RandomMergePolicy wrapping class org.apache.lucene.index.LogDocMergePolicy: [LogDocMergePolicy: minMergeSize=1000, mergeFactor=41, maxMergeSize=9223372036854775807, maxMergeSizeForForcedMerge=9223372036854775807, calibrateSizeByDeletes=false, maxMergeDocs=2147483647, maxCFSSegmentSizeMB=8.796093022207999E12, noCFSRatio=0.0]
   [junit4]   2> 119663 INFO  (coreLoadExecutor-333-thread-1) [    x:core1] o.a.s.c.SolrDeletionPolicy SolrDeletionPolicy.onInit: commits: num=1
   [junit4]   2> 	commit{dir=MockDirectoryWrapper(RAMDirectory@197241a2 lockFactory=org.apache.lucene.store.SingleInstanceLockFactory@2058f0c3),segFN=segments_1,generation=1}
   [junit4]   2> 119663 INFO  (coreLoadExecutor-333-thread-1) [    x:core1] o.a.s.c.SolrDeletionPolicy newest commit generation = 1
   [junit4]   2> 119663 INFO  (coreLoadExecutor-333-thread-1) [    x:core1] o.a.s.s.SolrIndexSearcher Opening Searcher@1e2e1c27[core1] main
   [junit4]   2> 119663 INFO  (coreLoadExecutor-333-thread-1) [    x:core1] o.a.s.r.ManagedResourceStorage File-based storage initialized to use dir: /export/home/jenkins/workspace/Lucene-Solr-5.x-Solaris/solr/build/solr-core/test/J1/temp/solr.core.TestCoreDiscovery_4EBD43E2E9B8E98E-001/tempDir-001/core1/conf
   [junit4]   2> 119664 INFO  (coreLoadExecutor-333-thread-1) [    x:core1] o.a.s.r.RestManager Initializing RestManager with initArgs: {storageDir=/export/home/jenkins/workspace/Lucene-Solr-5.x-Solaris/solr/build/solr-core/test/J1/temp/solr.core.TestCoreDiscovery_4EBD43E2E9B8E98E-001/tempDir-001/core1/conf}
   [junit4]   2> 119664 INFO  (coreLoadExecutor-333-thread-1) [    x:core1] o.a.s.r.ManagedResourceStorage Reading _rest_managed.json using file:dir=/export/home/jenkins/workspace/Lucene-Solr-5.x-Solaris/solr/build/solr-core/test/J1/temp/solr.core.TestCoreDiscovery_4EBD43E2E9B8E98E-001/tempDir-001/core1/conf
   [junit4]   2> 119664 INFO  (coreLoadExecutor-333-thread-1) [    x:core1] o.a.s.r.RestManager Initializing 0 registered ManagedResources
   [junit4]   2> 119664 INFO  (coreLoadExecutor-333-thread-1) [    x:core1] o.a.s.h.ReplicationHandler Commits will be reserved for  10000
   [junit4]   2> 119664 INFO  (coreLoadExecutor-333-thread-1) [    x:core1] o.a.s.c.CoreContainer registering core: core1
   [junit4]   2> 119664 INFO  (searcherExecutor-334-thread-1-processing-x:core1) [    x:core1] o.a.s.c.SolrCore [core1] Registered new searcher Searcher@1e2e1c27[core1] main{ExitableDirectoryReader(UninvertingDirectoryReader())}
   [junit4]   2> 119667 INFO  (TEST-TestCoreDiscovery.testDiscovery-seed#[4EBD43E2E9B8E98E]) [    ] o.a.s.c.SolrResourceLoader new SolrResourceLoader for directory: '/export/home/jenkins/workspace/Lucene-Solr-5.x-Solaris/solr/build/solr-core/test/J1/temp/solr.core.TestCoreDiscovery_4EBD43E2E9B8E98E-001/tempDir-001/core2'
   [junit4]   2> 119667 INFO  (TEST-TestCoreDiscovery.testDiscovery-seed#[4EBD43E2E9B8E98E]) [    ] o.a.s.c.SolrResourceLoader JNDI not configured for solr (NoInitialContextEx)
   [junit4]   2> 119667 INFO  (TEST-TestCoreDiscovery.testDiscovery-seed#[4EBD43E2E9B8E98E]) [    ] o.a.s.c.SolrResourceLoader using system property solr.solr.home: /export/home/jenkins/workspace/Lucene-Solr-5.x-Solaris/solr/build/solr-core/test/J1/temp/solr.core.TestCoreDiscovery_4EBD43E2E9B8E98E-001/tempDir-001
   [junit4]   2> 119676 INFO  (TEST-TestCoreDiscovery.testDiscovery-seed#[4EBD43E2E9B8E98E]) [    ] o.a.s.c.SolrConfig current version of requestparams : -1
   [junit4]   2> 119697 INFO  (TEST-TestCoreDiscovery.testDiscovery-seed#[4EBD43E2E9B8E98E]) [    ] o.a.s.c.SolrConfig Using Lucene MatchVersion: 5.5.0
   [junit4]   2> 119700 INFO  (TEST-TestCoreDiscovery.testDiscovery-seed#[4EBD43E2E9B8E98E]) [    ] o.a.s.c.SolrConfig Loaded SolrConfig: solrconfig-minimal.xml
   [junit4]   2> 119706 INFO  (TEST-TestCoreDiscovery.testDiscovery-seed#[4EBD43E2E9B8E98E]) [    ] o.a.s.s.IndexSchema [core2] Schema name=tiny
   [junit4]   2> 119720 INFO  (TEST-TestCoreDiscovery.testDiscovery-seed#[4EBD43E2E9B8E98E]) [    ] o.a.s.s.IndexSchema unique key field: id
   [junit4]   2> 119721 INFO  (TEST-TestCoreDiscovery.testDiscovery-seed#[4EBD43E2E9B8E98E]) [    ] o.a.s.c.ConfigSetProperties Did not find ConfigSet properties, assuming default properties: Can't find resource 'configsetprops.json' in classpath or '/export/home/jenkins/workspace/Lucene-Solr-5.x-Solaris/solr/build/solr-core/test/J1/temp/solr.core.TestCoreDiscovery_4EBD43E2E9B8E98E-001/tempDir-001/core2'
   [junit4]   2> 119721 INFO  (TEST-TestCoreDiscovery.testDiscovery-seed#[4EBD43E2E9B8E98E]) [    ] o.a.s.c.CoreContainer Creating SolrCore 'core2' using configuration from instancedir /export/home/jenkins/workspace/Lucene-Solr-5.x-Solaris/solr/build/solr-core/test/J1/temp/solr.core.TestCoreDiscovery_4EBD43E2E9B8E98E-001/tempDir-001/core2
   [junit4]   2> 119721 INFO  (TEST-TestCoreDiscovery.testDiscovery-seed#[4EBD43E2E9B8E98E]) [    x:core2] o.a.s.c.SolrCore org.apache.solr.core.MockDirectoryFactory
   [junit4]   2> 119721 INFO  (TEST-TestCoreDiscovery.testDiscovery-seed#[4EBD43E2E9B8E98E]) [    x:core2] o.a.s.c.SolrCore [[core2] ] Opening new SolrCore at [/export/home/jenkins/workspace/Lucene-Solr-5.x-Solaris/solr/build/solr-core/test/J1/temp/solr.core.TestCoreDiscovery_4EBD43E2E9B8E98E-001/tempDir-001/core2], dataDir=[/export/home/jenkins/workspace/Lucene-Solr-5.x-Solaris/solr/build/solr-core/test/J1/temp/solr.core.TestCoreDiscovery_4EBD43E2E9B8E98E-001/tempDir-001/core2/core2/]
   [junit4]   2> 119721 INFO  (TEST-TestCoreDiscovery.testDiscovery-seed#[4EBD43E2E9B8E98E]) [    x:core2] o.a.s.c.SolrCore JMX monitoring not detected for core: core2
   [junit4]   2> 119723 INFO  (TEST-TestCoreDiscovery.testDiscovery-seed#[4EBD43E2E9B8E98E]) [    x:core2] o.a.s.c.CachingDirectoryFactory return new directory for /export/home/jenkins/workspace/Lucene-Solr-5.x-Solaris/solr/build/solr-core/test/J1/temp/solr.core.TestCoreDiscovery_4EBD43E2E9B8E98E-001/tempDir-001/core2/core2
   [junit4]   2> 119723 INFO  (TEST-TestCoreDiscovery.testDiscovery-seed#[4EBD43E2E9B8E98E]) [    x:core2] o.a.s.c.SolrCore New index directory detected: old=null new=/export/home/jenkins/workspace/Lucene-Solr-5.x-Solaris/solr/build/solr-core/test/J1/temp/solr.core.TestCoreDiscovery_4EBD43E2E9B8E98E-001/tempDir-001/core2/core2/index/
   [junit4]   2> 119723 WARN  (TEST-TestCoreDiscovery.testDiscovery-seed#[4EBD43E2E9B8E98E]) [    x:core2] o.a.s.c.SolrCore [core2] Solr index directory '/export/home/jenkins/workspace/Lucene-Solr-5.x-Solaris/solr/build/solr-core/test/J1/temp/solr.core.TestCoreDiscovery_4EBD43E2E9B8E98E-001/tempDir-001/core2/core2/index' doesn't exist. Creating new index...
   [junit4]   2> 119724 INFO  (TEST-TestCoreDiscovery.testDiscovery-seed#[4EBD43E2E9B8E98E]) [    x:core2] o.a.s.c.CachingDirectoryFactory return new directory for /export/home/jenkins/workspace/Lucene-Solr-5.x-Solaris/solr/build/solr-core/test/J1/temp/solr.core.TestCoreDiscovery_4EBD43E2E9B8E98E-001/tempDir-001/core2/core2/index
   [junit4]   2> 119724 INFO  (TEST-TestCoreDiscovery.testDiscovery-seed#[4EBD43E2E9B8E98E]) [    x:core2] o.a.s.u.RandomMergePolicy RandomMergePolicy wrapping class org.apache.lucene.index.TieredMergePolicy: [TieredMergePolicy: maxMergeAtOnce=47, maxMergeAtOnceExplicit=33, maxMergedSegmentMB=10.1025390625, floorSegmentMB=1.9208984375, forceMergeDeletesPctAllowed=4.453210056781135, segmentsPerTier=43.0, maxCFSSegmentSizeMB=8.796093022207999E12, noCFSRatio=0.0
   [junit4]   2> 119724 INFO  (TEST-TestCoreDiscovery.testDiscovery-seed#[4EBD43E2E9B8E98E]) [    x:core2] o.a.s.c.SolrDeletionPolicy SolrDeletionPolicy.onCommit: commits: num=1
   [junit4]   2> 	commit{dir=MockDirectoryWrapper(RAMDirectory@66c53b76 lockFactory=org.apache.lucene.store.SingleInstanceLockFactory@18ba353f),segFN=segments_1,generation=1}
   [junit4]   2> 119724 INFO  (TEST-TestCoreDiscovery.testDiscovery-seed#[4EBD43E2E9B8E98E]) [    x:core2] o.a.s.c.SolrDeletionPolicy newest commit generation = 1
   [junit4]   2> 119725 INFO  (OldIndexDirectoryCleanupThreadForCore-core2) [    x:core2] o.a.s.c.SolrCore Looking for old index directories to cleanup for core core2 in /export/home/jenkins/workspace/Lucene-Solr-5.x-Solaris/solr/build/solr-core/test/J1/temp/solr.core.TestCoreDiscovery_4EBD43E2E9B8E98E-001/tempDir-001/core2/core2/
   [junit4]   2> 119725 WARN  (OldIndexDirectoryCleanupThreadForCore-core2) [    x:core2] o.a.s.c.DirectoryFactory /export/home/jenkins/workspace/Lucene-Solr-5.x-Solaris/solr/build/solr-core/test/J1/temp/solr.core.TestCoreDiscovery_4EBD43E2E9B8E98E-001/tempDir-001/core2/core2/ does not point to a valid data directory; skipping clean-up of old index directories.
   [junit4]   2> 119726 INFO  (TEST-TestCoreDiscovery.testDiscovery-seed#[4EBD43E2E9B8E98E]) [    x:core2] o.a.s.c.SolrCore no updateRequestProcessorChain defined as default, creating implicit default
   [junit4]   2> 119728 INFO  (TEST-TestCoreDiscovery.testDiscovery-seed#[4EBD43E2E9B8E98E]) [    x:core2] o.a.s.h.l.XMLLoader xsltCacheLifetimeSeconds=60
   [junit4]   2> 119728 INFO  (TEST-TestCoreDiscovery.testDiscovery-seed#[4EBD43E2E9B8E98E]) [    x:core2] o.a.s.h.l.XMLLoader xsltCacheLifetimeSeconds=60
   [junit4]   2> 119729 INFO  (TEST-TestCoreDiscovery.testDiscovery-seed#[4EBD43E2E9B8E98E]) [    x:core2] o.a.s.h.l.XMLLoader xsltCacheLifetimeSeconds=60
   [junit4]   2> 119730 INFO  (TEST-TestCoreDiscovery.testDiscovery-seed#[4EBD43E2E9B8E98E]) [    x:core2] o.a.s.h.l.XMLLoader xsltCacheLifetimeSeconds=60
   [junit4]   2> 119731 INFO  (TEST-TestCoreDiscovery.testDiscovery-seed#[4EBD43E2E9B8E98E]) [    x:core2] o.a.s.c.RequestHandlers Registered paths: /admin/mbeans,/update/csv,/update/json/docs,/admin/luke,/select,/admin/segments,/get,/admin/system,/replication,/admin/properties,/config,/schema,/admin/plugins,/admin/logging,/update/json,/admin/threads,/admin/ping,/update,/admin/file
   [junit4]   2> 119732 INFO  (TEST-TestCoreDiscovery.testDiscovery-seed#[4EBD43E2E9B8E98E]) [    x:core2] o.a.s.c.SolrCore Using default statsCache cache: org.apache.solr.search.stats.LocalStatsCache
   [junit4]   2> 119732 INFO  (TEST-TestCoreDiscovery.testDiscovery-seed#[4EBD43E2E9B8E98E]) [    x:core2] o.a.s.u.CommitTracker Hard AutoCommit: disabled
   [junit4]   2> 119732 INFO  (TEST-TestCoreDiscovery.testDiscovery-seed#[4EBD43E2E9B8E98E]) [    x:core2] o.a.s.u.CommitTracker Soft AutoCommit: disabled
   [junit4]   2> 119732 INFO  (TEST-TestCoreDiscovery.testDiscovery-seed#[4EBD43E2E9B8E98E]) [    x:core2] o.a.s.u.RandomMergePolicy RandomMergePolicy wrapping class org.apache.lucene.index.TieredMergePolicy: [TieredMergePolicy: maxMergeAtOnce=16, maxMergeAtOnceExplicit=17, maxMergedSegmentMB=4.33984375, floorSegmentMB=1.875, forceMergeDeletesPctAllowed=12.200130535998152, segmentsPerTier=24.0, maxCFSSegmentSizeMB=8.796093022207999E12, noCFSRatio=0.0
   [junit4]   2> 119758 INFO  (TEST-TestCoreDiscovery.testDiscovery-seed#[4EBD43E2E9B8E98E]) [    x:core2] o.a.s.c.SolrDeletionPolicy SolrDeletionPolicy.onInit: commits: num=1
   [junit4]   2> 	commit{dir=MockDirectoryWrapper(RAMDirectory@66c53b76 lockFactory=org.apache.lucene.store.SingleInstanceLockFactory@18ba353f),segFN=segments_1,generation=1}
   [junit4]   2> 119758 INFO  (TEST-TestCoreDiscovery.testDiscovery-seed#[4EBD43E2E9B8E98E]) [    x:core2] o.a.s.c.SolrDeletionPolicy newest commit generation = 1
   [junit4]   2> 119758 INFO  (TEST-TestCoreDiscovery.testDiscovery-seed#[4EBD43E2E9B8E98E]) [    x:core2] o.a.s.s.SolrIndexSearcher Opening Searcher@41f218ed[core2] main
   [junit4]   2> 119759 INFO  (TEST-TestCoreDiscovery.testDiscovery-seed#[4EBD43E2E9B8E98E]) [    x:core2] o.a.s.r.ManagedResourceStorage File-based storage initialized to use dir: /export/home/jenkins/workspace/Lucene-Solr-5.x-Solaris/solr/build/solr-core/test/J1/temp/solr.core.TestCoreDiscovery_4EBD43E2E9B8E98E-001/tempDir-001/core2/conf
   [junit4]   2> 119759 INFO  (TEST-TestCoreDiscovery.testDiscovery-seed#[4EBD43E2E9B8E98E]) [    x:core2] o.a.s.r.RestManager Initializing RestManager with initArgs: {storageDir=/export/home/jenkins/workspace/Lucene-Solr-5.x-Solaris/solr/build/solr-core/test/J1/temp/solr.core.TestCoreDiscovery_4EBD43E2E9B8E98E-001/tempDir-001/core2/conf}
   [junit4]   2> 119759 INFO  (TEST-TestCoreDiscovery.testDiscovery-seed#[4EBD43E2E9B8E98E]) [    x:core2] o.a.s.r.ManagedResourceStorage Reading _rest_managed.json using file:dir=/export/home/jenkins/workspace/Lucene-Solr-5.x-Solaris/solr/build/solr-core/test/J1/temp/solr.core.TestCoreDiscovery_4EBD43E2E9B8E98E-001/tempDir-001/core2/conf
   [junit4]   2> 119759 INFO  (TEST-TestCoreDiscovery.testDiscovery-seed#[4EBD43E2E9B8E98E]) [    x:core2] o.a.s.r.RestManager Initializing 0 registered ManagedResources
   [junit4]   2> 119759 INFO  (TEST-TestCoreDiscovery.testDiscovery-seed#[4EBD43E2E9B8E98E]) [    x:core2] o.a.s.h.ReplicationHandler Commits will be reserved for  10000
   [junit4]   2> 119759 INFO  (TEST-TestCoreDiscovery.testDiscovery-seed#[4EBD43E2E9B8E98E]) [    x:core2] o.a.s.c.CoreContainer registering core: core2
   [junit4]   2> 119759 INFO  (TEST-TestCoreDiscovery.testDiscovery-seed#[4EBD43E2E9B8E98E]) [    x:core2] o.a.s.c.SolrResourceLoader new SolrResourceLoader for directory: '/export/home/jenkins/workspace/Lucene-Solr-5.x-Solaris/solr/build/solr-core/test/J1/temp/solr.core.TestCoreDiscovery_4EBD43E2E9B8E98E-001/tempDir-001/lazy1'
   [junit4]   2> 119759 INFO  (TEST-TestCoreDiscovery.testDiscovery-seed#[4EBD43E2E9B8E98E]) [    x:core2] o.a.s.c.SolrResourceLoader JNDI not configured for solr (NoInitialContextEx)
   [junit4]   2> 119760 INFO  (TEST-TestCoreDiscovery.testDiscovery-seed#[4EBD43E2E9B8E98E]) [    x:core2] o.a.s.c.SolrResourceLoader using system property solr.solr.home: /export/home/jenkins/workspace/Lucene-Solr-5.x-Solaris/solr/build/solr-core/test/J1/temp/solr.core.TestCoreDiscovery_4EBD43E2E9B8E98E-001/tempDir-001
   [junit4]   2> 119760 INFO  (searcherExecutor-338-thread-1-processing-x:core2) [    x:core2] o.a.s.c.SolrCore [core2] Registered new searcher Searcher@41f218ed[core2] main{ExitableDirectoryReader(UninvertingDirectoryReader())}
   [junit4]   2> 119765 INFO  (TEST-TestCoreDiscovery.testDiscovery-seed#[4EBD43E2E9B8E98E]) [    x:core2] o.a.s.c.SolrConfig current version of requestparams : -1
   [junit4]   2> 119768 INFO  (TEST-TestCoreDiscovery.testDiscovery-seed#[4EBD43E2E9B8E98E]) [    x:core2] o.a.s.c.SolrConfig Using Lucene MatchVersion: 5.5.0
   [junit4]   2> 119811 INFO  (TEST-TestCoreDiscovery.testDiscovery-seed#[4EBD43E2E9B8E98E]) [    x:core2] o.a.s.c.SolrConfig Loaded SolrConfig: solrconfig-minimal.xml
   [junit4]   2> 119820 INFO  (TEST-TestCoreDiscovery.testDiscovery-seed#[4EBD43E2E9B8E98E]) [    x:core2] o.a.s.s.IndexSchema [lazy1] Schema name=tiny
   [junit4]   2> 119822 INFO  (TEST-TestCoreDiscovery.testDiscovery-seed#[4EBD43E2E9B8E98E]) [    x:core2] o.a.s.s.IndexSchema unique key field: id
   [junit4]   2> 119823 INFO  (TEST-TestCoreDiscovery.testDiscovery-seed#[4EBD43E2E9B8E98E]) [    x:core2] o.a.s.c.ConfigSetProperties Did not find ConfigSet properties, assuming default properties: Can't find resource 'configsetprops.json' in classpath or '/export/home/jenkins/workspace/Lucene-Solr-5.x-Solaris/solr/build/solr-core/test/J1/temp/solr.core.TestCoreDiscovery_4EBD43E2E9B8E98E-001/tempDir-001/lazy1'
   [junit4]   2> 119823 INFO  (TEST-TestCoreDiscovery.testDiscovery-seed#[4EBD43E2E9B8E98E]) [    x:core2] o.a.s.c.CoreContainer Creating SolrCore 'lazy1' using configuration from instancedir /export/home/jenkins/workspace/Lucene-Solr-5.x-Solaris/solr/build/solr-core/test/J1/temp/solr.core.TestCoreDiscovery_4EBD43E2E9B8E98E-001/tempDir-001/lazy1
   [junit4]   2> 119823 INFO  (TEST-TestCoreDiscovery.testDiscovery-seed#[4EBD43E2E9B8E98E]) [    x:lazy1] o.a.s.c.SolrCore org.apache.solr.core.MockDirectoryFactory
   [junit4]   2> 119823 INFO  (TEST-TestCoreDiscovery.testDiscovery-seed#[4EBD43E2E9B8E98E]) [    x:lazy1] o.a.s.c.SolrCore [[lazy1] ] Opening new SolrCore at [/export/home/jenkins/workspace/Lucene-Solr-5.x-Solaris/solr/build/solr-core/test/J1/temp/solr.core.TestCoreDiscovery_4EBD43E2E9B8E98E-001/tempDir-001/lazy1], dataDir=[/export/home/jenkins/workspace/Lucene-Solr-5.x-Solaris/solr/build/solr-core/test/J1/temp/solr.core.TestCoreDiscovery_4EBD43E2E9B8E98E-001/tempDir-001/lazy1/lazy1/]
   [junit4]   2> 119823 INFO  (TEST-TestCoreDiscovery.testDiscovery-seed#[4EBD43E2E9B8E98E]) [    x:lazy1] o.a.s.c.SolrCore JMX monitoring not detected for core: lazy1
   [junit4]   2> 119824 INFO  (TEST-TestCoreDiscovery.testDiscovery-seed#[4EBD43E2E9B8E98E]) [    x:lazy1] o.a.s.c.CachingDirectoryFactory return new directory for /export/home/jenkins/workspace/Lucene-Solr-5.x-Solaris/solr/build/solr-core/test/J1/temp/solr.core.TestCoreDiscovery_4EBD43E2E9B8E98E-001/tempDir-001/lazy1/lazy1
   [junit4]   2> 119824 INFO  (TEST-TestCoreDiscovery.testDiscovery-seed#[4EBD43E2E9B8E98E]) [    x:lazy1] o.a.s.c.SolrCore New index directory detected: old=null new=/export/home/jenkins/workspace/Lucene-Solr-5.x-Solaris/solr/build/solr-core/test/J1/temp/solr.core.TestCoreDiscovery_4EBD43E2E9B8E98E-001/tempDir-001/lazy1/lazy1/index/
   [junit4]   2> 119824 WARN  (TEST-TestCoreDiscovery.testDiscovery-seed#[4EBD43E2E9B8E98E]) [    x:lazy1] o.a.s.c.SolrCore [lazy1] Solr index directory '/export/home/jenkins/workspace/Lucene-Solr-5.x-Solaris/solr/build/solr-core/test/J1/temp/solr.core.TestCoreDiscovery_4EBD43E2E9B8E98E-001/tempDir-001/lazy1/lazy1/index' doesn't exist. Creating new index...
   [junit4]   2> 119824 INFO  (TEST-TestCoreDiscovery.testDiscovery-seed#[4EBD43E2E9B8E98E]) [    x:lazy1] o.a.s.c.CachingDirectoryFactory return new directory for /export/home/jenkins/workspace/Lucene-Solr-5.x-Solaris/solr/build/solr-core/test/J1/temp/solr.core.TestCoreDiscovery_4EBD43E2E9B8E98E-001/tempDir-001/lazy1/lazy1/index
   [junit4]   2> 119824 INFO  (TEST-TestCoreDiscovery.testDiscovery-seed#[4EBD43E2E9B8E98E]) [    x:lazy1] o.a.s.u.RandomMergePolicy RandomMergePolicy wrapping class org.apache.lucene.index.LogDocMergePolicy: [LogDocMergePolicy: minMergeSize=1000, mergeFactor=42, maxMergeSize=9223372036854775807, maxMergeSizeForForcedMerge=9223372036854775807, calibrateSizeByDeletes=true, maxMergeDocs=2147483647, maxCFSSegmentSizeMB=8.796093022207999E12, noCFSRatio=1.0]
   [junit4]   2> 119825 INFO  (TEST-TestCoreDiscovery.testDiscovery-seed#[4EBD43E2E9B8E98E]) [    x:lazy1] o.a.s.c.SolrDeletionPolicy SolrDeletionPolicy.onCommit: commits: num=1
   [junit4]   2> 	commit{dir=MockDirectoryWrapper(RAMDirectory@23210848 lockFactory=org.apache.lucene.store.SingleInstanceLockFactory@5fa0b22f),segFN=segments_1,generation=1}
   [junit4]   2> 119825 INFO  (TEST-TestCoreDiscovery.testDiscovery-seed#[4EBD43E2E9B8E98E]) [    x:lazy1] o.a.s.c.SolrDeletionPolicy newest commit generation = 1
   [junit4]   2> 119825 INFO  (OldIndexDirectoryCleanupThreadForCore-lazy1) [    x:lazy1] o.a.s.c.SolrCore Looking for old index directories to cleanup for core lazy1 in /export/home/jenkins/workspace/Lucene-Solr-5.x-Solaris/solr/build/solr-core/test/J1/temp/solr.core.TestCoreDiscovery_4EBD43E2E9B8E98E-001/tempDir-001/lazy1/lazy1/
   [junit4]   2> 119825 WARN  (OldIndexDirectoryCleanupThreadForCore-lazy1) [    x:lazy1] o.a.s.c.DirectoryFactory /export/home/jenkins/workspace/Lucene-Solr-5.x-Solaris/solr/build/solr-core/test/J1/temp/solr.core.TestCoreDiscovery_4EBD43E2E9B8E98E-001/tempDir-001/lazy1/lazy1/ does not point to a valid data directory; skipping clean-up of old index directories.
   [junit4]   2> 119827 INFO  (TEST-TestCoreDiscovery.testDiscovery-seed#[4EBD43E2E9B8E98E]) [    x:lazy1] o.a.s.c.SolrCore no updateRequestProcessorChain defined as default, creating implicit default
   [junit4]   2> 119828 INFO  (TEST-TestCoreDiscovery.testDiscovery-seed#[4EBD43E2E9B8E98E]) [    x:lazy1] o.a.s.h.l.XMLLoader xsltCacheLifetimeSeconds=60
   [junit4]   2> 119829 INFO  (TEST-TestCoreDiscovery.testDiscovery-seed#[4EBD43E2E9B8E98E]) [    x:lazy1] o.a.s.h.l.XMLLoader xsltCacheLifetimeSeconds=60
   [junit4]   2> 119830 INFO  (TEST-TestCoreDiscovery.testDiscovery-seed#[4EBD43E2E9B8E98E]) [    x:lazy1] o.a.s.h.l.XMLLoader xsltCacheLifetimeSeconds=60
   [junit4]   2> 119831 INFO  (TEST-TestCoreDiscovery.testDiscovery-seed#[4EBD43E2E9B8E98E]) [    x:lazy1] o.a.s.h.l.XMLLoader xsltCacheLifetimeSeconds=60
   [junit4]   2> 119832 INFO  (TEST-TestCoreDiscovery.testDiscovery-seed#[4EBD43E2E9B8E98E]) [    x:lazy1] o.a.s.c.RequestHandlers Registered paths: /admin/mbeans,/update/csv,/update/json/docs,/admin/luke,/select,/admin/segments,/get,/admin/system,/replication,/admin/properties,/config,/schema,/admin/plugins,/admin/logging,/update/json,/admin/threads,/admin/ping,/update,/admin/file
   [junit4]   2> 119832 INFO  (TEST-TestCoreDiscovery.testDiscovery-seed#[4EBD43E2E9B8E98E]) [    x:lazy1] o.a.s.c.SolrCore Using default statsCache cache: org.apache.solr.search.stats.LocalStatsCache
   [junit4]   2> 119832 INFO  (TEST-TestCoreDiscovery.testDiscovery-seed#[4EBD43E2E9B8E98E]) [    x:lazy1] o.a.s.u.CommitTracker Hard AutoCommit: disabled
   [junit4]   2> 119832 INFO  (TEST-TestCoreDiscovery.testDiscovery-seed#[4EBD43E2E9B8E98E]) [    x:lazy1] o.a.s.u.CommitTracker Soft AutoCommit: disabled
   [junit4]   2> 119833 INFO  (TEST-TestCoreDiscovery.testDiscovery-seed#[4EBD43E2E9B8E98E]) [    x:lazy1] o.a.s.u.RandomMergePolicy RandomMergePolicy wrapping class org.apache.lucene.index.TieredMergePolicy: [TieredMergePolicy: maxMergeAtOnce=38, maxMergeAtOnceExplicit=12, maxMergedSegmentMB=60.720703125, floorSegmentMB=2.115234375, forceMergeDeletesPctAllowed=16.369446649480032, segmentsPerTier=42.0, maxCFSSegmentSizeMB=8.796093022207999E12, noCFSRatio=0.8956743526616465
   [junit4]   2> 119836 INFO  (TEST-TestCoreDiscovery.testDiscovery-seed#[4EBD43E2E9B8E98E]) [    x:lazy1] o.a.s.c.SolrDeletionPolicy SolrDeletionPolicy.onInit: commits: num=1
   [junit4]   2> 	commit{dir=MockDirectoryWrapper(RAMDirectory@23210848 lockFactory=org.apache.lucene.store.SingleInstanceLockFactory@5fa0b22f),segFN=segments_1,generation=1}
   [junit4]   2> 119836 INFO  (TEST-TestCoreDiscovery.testDiscovery-seed#[4EBD43E2E9B8E98E]) [    x:lazy1] o.a.s.c.SolrDeletionPolicy newest commit generation = 1
   [junit4]   2> 119836 INFO  (TEST-TestCoreDiscovery.testDiscovery-seed#[4EBD43E2E9B8E98E]) [    x:lazy1] o.a.s.s.SolrIndexSearcher Opening Searcher@24acdf3e[lazy1] main
   [junit4]   2> 119836 INFO  (TEST-TestCoreDiscovery.testDiscovery-seed#[4EBD43E2E9B8E98E]) [    x:lazy1] o.a.s.r.ManagedResourceStorage File-based storage initialized to use dir: /export/home/jenkins/workspace/Lucene-Solr-5.x-Solaris/solr/build/solr-core/test/J1/temp/solr.core.TestCoreDiscovery_4EBD43E2E9B8E98E-001/tempDir-001/lazy1/conf
   [junit4]   2> 119836 INFO  (TEST-TestCoreDiscovery.testDiscovery-seed#[4EBD43E2E9B8E98E]) [    x:lazy1] o.a.s.r.RestManager Initializing RestManager with initArgs: {storageDir=/export/home/jenkins/workspace/Lucene-Solr-5.x-Solaris/solr/build/solr-core/test/J1/temp/solr.core.TestCoreDiscovery_4EBD43E2E9B8E98E-001/tempDir-001/lazy1/conf}
   [junit4]   2> 119836 INFO  (TEST-TestCoreDiscovery.testDiscovery-seed#[4EBD43E2E9B8E98E]) [    x:lazy1] o.a.s.r.ManagedResourceStorage Reading _rest_managed.json using file:dir=/export/home/jenkins/workspace/Lucene-Solr-5.x-Solaris/solr/build/solr-core/test/J1/temp/solr.core.TestCoreDiscovery_4EBD43E2E9B8E98E-001/tempDir-001/lazy1/conf
   [junit4]   2> 119836 INFO  (TEST-TestCoreDiscovery.testDiscovery-seed#[4EBD43E2E9B8E98E]) [    x:lazy1] o.a.s.r.RestManager Initializing 0 registered ManagedResources
   [junit4]   2> 119836 INFO  (TEST-TestCoreDiscovery.testDiscovery-seed#[4EBD43E2E9B8E98E]) [    x:lazy1] o.a.s.h.ReplicationHandler Commits will be reserved for  10000
   [junit4]   2> 119837 INFO  (TEST-TestCoreDiscovery.testDiscovery-seed#[4EBD43E2E9B8E98E]) [    x:lazy1] o.a.s.c.SolrCores Opening transient core lazy1
   [junit4]   2> 119837 INFO  (TEST-TestCoreDiscovery.testDiscovery-seed#[4EBD43E2E9B8E98E]) [    x:lazy1] o.a.s.c.CoreContainer registering core: lazy1
   [junit4]   2> 119837 INFO  (TEST-TestCoreDiscovery.testDiscovery-seed#[4EBD43E2E9B8E98E]) [    x:lazy1] o.a.s.c.CoreContainer Shutting down CoreContainer instance=1084599994
   [junit4]   2> 119840 INFO  (searcherExecutor-342-thread-1-processing-x:lazy1) [    x:lazy1] o.a.s.c.SolrCore [lazy1] Registered new searcher Searcher@24acdf3e[lazy1] main{ExitableDirectoryReader(UninvertingDirectoryReader())}
   [junit4]   2> 119840 INFO  (TEST-TestCoreDiscovery.testDiscovery-seed#[4EBD43E2E9B8E98E]) [    x:core1] o.a.s.c.SolrCore [core1]  CLOSING SolrCore org.apache.solr.core.SolrCore@6052702b
   [junit4]   2> 119863 INFO  (TEST-TestCoreDiscovery.testDiscovery-seed#[4EBD43E2E9B8E98E]) [    x:core1] o.a.s.u.DirectUpdateHandler2 closing DirectUpdateHandler2{commits=0,autocommits=0,soft autocommits=0,optimizes=0,rollbacks=0,expungeDeletes=0,docsPending=0,adds=0,deletesById=0,deletesByQuery=0,errors=0,cumulative_adds=0,cumulative_deletesById=0,cumulative_deletesByQuery=0,cumulative_errors=0}
   [junit4]   2> 119863 INFO  (TEST-TestCoreDiscovery.testDiscovery-seed#[4EBD43E2E9B8E98E]) [    x:core1] o.a.s.u.SolrCoreState Closing SolrCoreState
   [junit4]   2> 119863 INFO  (TEST-TestCoreDiscovery.testDiscovery-seed#[4EBD43E2E9B8E98E]) [    x:core1] o.a.s.u.DefaultSolrCoreState SolrCoreState ref count has reached 0 - closing IndexWriter
   [junit4]   2> 119863 INFO  (TEST-TestCoreDiscovery.testDiscovery-seed#[4EBD43E2E9B8E98E]) [    x:core1] o.a.s.u.DefaultSolrCoreState closing IndexWriter with IndexWriterCloser
   [junit4]   2> 119865 INFO  (TEST-TestCoreDiscovery.testDiscovery-seed#[4EBD43E2E9B8E98E]) [    x:core1] o.a.s.c.SolrCore [core1] Closing main searcher on request.
   [junit4]   2> 119865 INFO  (TEST-TestCoreDiscovery.testDiscovery-seed#[4EBD43E2E9B8E98E]) [    x:core1] o.a.s.c.CachingDirectoryFactory Closing MockDirectoryFactory - 2 directories currently being tracked
   [junit4]   2> 119865 INFO  (TEST-TestCoreDiscovery.testDiscovery-seed#[4EBD43E2E9B8E98E]) [    x:core1] o.a.s.c.CachingDirectoryFactory looking to close /export/home/jenkins/workspace/Lucene-Solr-5.x-Solaris/solr/build/solr-core/test/J1/temp/solr.core.TestCoreDiscovery_4EBD43E2E9B8E98E-001/tempDir-001/core1/core1 [CachedDir<<refCount=0;path=/export/home/jenkins/workspace/Lucene-Solr-5.x-Solaris/solr/build/solr-core/test/J1/temp/solr.core.TestCoreDiscovery_4EBD43E2E9B8E98E-001/tempDir-001/core1/core1;done=false>>]
   [junit4]   2> 119865 INFO  (TEST-TestCoreDiscovery.testDiscovery-seed#[4EBD43E2E9B8E98E]) [    x:core1] o.a.s.c.CachingDirectoryFactory Closing directory: /export/home/jenkins/workspace/Lucene-Solr-5.x-Solaris/solr/build/solr-core/test/J1/temp/solr.core.TestCoreDiscovery_4EBD43E2E9B8E98E-001/tempDir-001/core1/core1
   [junit4]   2> 119865 INFO  (TEST-TestCoreDiscovery.testDiscovery-seed#[4EBD43E2E9B8E98E]) [    x:core1] o.a.s.c.CachingDirectoryFactory looking to close /export/home/jenkins/workspace/Lucene-Solr-5.x-Solaris/solr/build/solr-core/test/J1/temp/solr.core.TestCoreDiscovery_4EBD43E2E9B8E98E-001/tempDir-001/core1/core1/index [CachedDir<<refCount=0;path=/export/home/jenkins/workspace/Lucene-Solr-5.x-Solaris/solr/build/solr-core/test/J1/temp/solr.core.TestCoreDiscovery_4EBD43E2E9B8E98E-001/tempDir-001/core1/core1/index;done=false>>]
   [junit4]   2> 119865 INFO  (TEST-TestCoreDiscovery.testDiscovery-seed#[4EBD43E2E9B8E98E]) [    x:core1] o.a.s.c.CachingDirectoryFactory Closing directory: /export/home/jenkins/workspace/Lucene-Solr-5.x-Solaris/solr/build/solr-core/test/J1/temp/solr.core.TestCoreDiscovery_4EBD43E2E9B8E98E-001/tempDir-001/core1/core1/index
   [junit4]   2> 119865 INFO  (TEST-TestCoreDiscovery.testDiscovery-seed#[4EBD43E2E9B8E98E]) [    x:core2] o.a.s.c.SolrCore [core2]  CLOSING SolrCore org.apache.solr.core.SolrCore@2bfc1b7e
   [junit4]   2> 119865 INFO  (TEST-TestCoreDiscovery.testDiscovery-seed#[4EBD43E2E9B8E98E]) [    x:core2] o.a.s.u.DirectUpdateHandler2 closing DirectUpdateHandler2{commits=0,autocommits=0,soft autocommits=0,optimizes=0,rollbacks=0,expungeDeletes=0,docsPending=0,adds=0,deletesById=0,deletesByQuery=0,errors=0,cumulative_adds=0,cumulative_deletesById=0,cumulative_deletesByQuery=0,cumulative_errors=0}
   [junit4]   2> 119865 INFO  (TEST-TestCoreDiscovery.testDiscovery-seed#[4EBD43E2E9B8E98E]) [    x:core2] o.a.s.u.SolrCoreState Closing SolrCoreState
   [junit4]   2> 119865 INFO  (TEST-TestCoreDiscovery.testDiscovery-seed#[4EBD43E2E9B8E98E]) [    x:core2] o.a.s.u.DefaultSolrCoreState SolrCoreState ref count has reached 0 - closing IndexWriter
   [junit4]   2> 119865 INFO  (TEST-TestCoreDiscovery.testDiscovery-seed#[4EBD43E2E9B8E98E]) [    x:core2] o.a.s.u.DefaultSolrCoreState closing IndexWriter with IndexWriterCloser
   [junit4]   2> 119865 INFO  (TEST-TestCoreDiscovery.testDiscovery-seed#[4EBD43E2E9B8E98E]) [    x:core2] o.a.s.c.SolrCore [core2] Closing main searcher on request.
   [junit4]   2> 119865 INFO  (TEST-TestCoreDiscovery.testDiscovery-seed#[4EBD43E2E9B8E98E]) [    x:core2] o.a.s.c.CachingDirectoryFactory Closing MockDirectoryFactory - 2 directories currently being tracked
   [junit4]   2> 119865 INFO  (TEST-TestCoreDiscovery.testDiscovery-seed#[4EBD43E2E9B8E98E]) [    x:core2] o.a.s.c.CachingDirectoryFactory looking to close /export/home/jenkins/workspace/Lucene-Solr-5.x-Solaris/solr/build/solr-core/test/J1/temp/solr.core.TestCoreDiscovery_4EBD43E2E9B8E98E-001/tempDir-001/core2/core2/index [CachedDir<<refCount=0;path=/export/home/jenkins/workspace/Lucene-Solr-5.x-Solaris/solr/build/solr-core/test/J1/temp/solr.core.TestCoreDiscovery_4EBD43E2E9B8E98E-001/tempDir-001/core2/core2/index;done=false>>]
   [junit4]   2> 119865 INFO  (TEST-TestCoreDiscovery.testDiscovery-seed#[4EBD43E2E9B8E98E]) [    x:core2] o.a.s.c.CachingDirectoryFactory Closing directory: /export/home/jenkins/workspace/Lucene-Solr-5.x-Solaris/solr/build/solr-core/test/J1/temp/solr.core.TestCoreDiscovery_4EBD43E2E9B8E98E-001/tempDir-001/core2/core2/index
   [junit4]   2> 119866 INFO  (TEST-TestCoreDiscovery.testDiscovery-seed#[4EBD43E2E9B8E98E]) [    x:core2] o.a.s.c.CachingDirectoryFactory looking to close /export/home/jenkins/workspace/Lucene-Solr-5.x-Solaris/solr/build/solr-core/test/J1/temp/solr.core.TestCoreDiscovery_4EBD43E2E9B8E98E-001/tempDir-001/core2/core2 [CachedDir<<refCount=0;path=/export/home/jenkins/workspace/Lucene-Solr-5.x-Solaris/solr/build/solr-core/test/J1/temp/solr.core.TestCoreDiscovery_4EBD43E2E9B8E98E-001/tempDir-001/core2/core2;done=false>>]
   [junit4]   2> 119866 INFO  (TEST-TestCoreDiscovery.testDiscovery-seed#[4EBD43E2E9B8E98E]) [    x:core2] o.a.s.c.CachingDirectoryFactory Closing directory: /export/home/jenkins/workspace/Lucene-Solr-5.x-Solaris/solr/build/solr-core/test/J1/temp/solr.core.TestCoreDiscovery_4EBD43E2E9B8E98E-001/tempDir-001/core2/core2
   [junit4]   2> 119866 INFO  (TEST-TestCoreDiscovery.testDiscovery-seed#[4EBD43E2E9B8E98E]) [    x:lazy1] o.a.s.c.SolrCore [lazy1]  CLOSING SolrCore org.apache.solr.core.SolrCore@65494c5e
   [junit4]   2> 119866 INFO  (TEST-TestCoreDiscovery.testDiscovery-seed#[4EBD43E2E9B8E98E]) [    x:lazy1] o.a.s.u.DirectUpdateHandler2 closing DirectUpdateHandler2{commits=0,autocommits=0,soft autocommits=0,optimizes=0,rollbacks=0,expungeDeletes=0,docsPending=0,adds=0,deletesById=0,deletesByQuery=0,errors=0,cumulative_adds=0,cumulative_deletesById=0,cumulative_deletesByQuery=0,cumulative_errors=0}
   [junit4]   2> 119866 INFO  (TEST-TestCoreDiscovery.testDiscovery-seed#[4EBD43E2E9B8E98E]) [    x:lazy1] o.a.s.u.SolrCoreState Closing SolrCoreState
   [junit4]   2> 119866 INFO  (TEST-TestCoreDiscovery.testDiscovery-seed#[4EBD43E2E9B8E98E]) [    x:lazy1] o.a.s.u.DefaultSolrCoreState SolrCoreState ref count has reached 0 - closing IndexWriter
   [junit4]   2> 119866 INFO  (TEST-TestCoreDiscovery.testDiscovery-seed#[4EBD43E2E9B8E98E]) [    x:lazy1] o.a.s.u.DefaultSolrCoreState closing IndexWriter with IndexWriterCloser
   [junit4]   2> 119866 INFO  (TEST-TestCoreDiscovery.testDiscovery-seed#[4EBD43E2E9B8E98E]) [    x:lazy1] o.a.s.c.SolrCore [lazy1] Closing main searcher on request.
   [junit4]   2> 119867 INFO  (TEST-TestCoreDiscovery.testDiscovery-seed#[4EBD43E2E9B8E98E]) [    x:lazy1] o.a.s.c.CachingDirectoryFactory Closing MockDirectoryFactory - 2 directories currently being tracked
   [junit4]   2> 119867 INFO  (TEST-TestCoreDiscovery.testDiscovery-seed#[4EBD43E2E9B8E98E]) [    x:lazy1] o.a.s.c.CachingDirectoryFactory looking to close /export/home/jenkins/workspace/Lucene-Solr-5.x-Solaris/solr/build/solr-core/test/J1/temp/solr.core.TestCoreDiscovery_4EBD43E2E9B8E98E-001/tempDir-001/lazy1/lazy1 [CachedDir<<refCount=0;path=/export/home/jenkins/workspace/Lucene-Solr-5.x-Solaris/solr/build/solr-core/test/J1/temp/solr.core.TestCoreDiscovery_4EBD43E2E9B8E98E-001/tempDir-001/lazy1/lazy1;done=false>>]
   [junit4]   2> 119867 INFO  (TEST-TestCoreDiscovery.testDiscovery-seed#[4EBD43E2E9B8E98E]) [    x:lazy1] o.a.s.c.CachingDirectoryFactory Closing directory: /export/home/jenkins/workspace/Lucene-Solr-5.x-Solaris/solr/build/solr-core/test/J1/temp/solr.core.TestCoreDiscovery_4EBD43E2E9B8E98E-001/tempDir-001/lazy1/lazy1
   [junit4]   2> 119867 INFO  (TEST-TestCoreDiscovery.testDiscovery-seed#[4EBD43E2E9B8E98E]) [    x:lazy1] o.a.s.c.CachingDirectoryFactory looking to close /export/home/jenkins/workspace/Lucene-Solr-5.x-Solaris/solr/build/solr-core/test/J1/temp/solr.core.TestCoreDiscovery_4EBD43E2E9B8E98E-001/tempDir-001/lazy1/lazy1/index [CachedDir<<refCount=0;path=/export/home/jenkins/workspace/Lucene-Solr-5.x-Solaris/solr/build/solr-core/test/J1/temp/solr.core.TestCoreDiscovery_4EBD43E2E9B8E98E-001/tempDir-001/lazy1/lazy1/index;done=false>>]
   [junit4]   2> 119867 INFO  (TEST-TestCoreDiscovery.testDiscovery-seed#[4EBD43E2E9B8E98E]) [    x:lazy1] o.a.s.c.CachingDirectoryFactory Closing directory: /export/home/jenkins/workspace/Lucene-Solr-5.x-Solaris/solr/build/solr-core/test/J1/temp/solr.core.TestCoreDiscovery_4EBD43E2E9B8E98E-001/tempDir-001/lazy1/lazy1/index
   [junit4]   2> 119867 INFO  (TEST-TestCoreDiscovery.testDiscovery-seed#[4EBD43E2E9B8E98E]) [    x:lazy1] o.a.s.SolrTestCaseJ4 ###Ending testDiscovery
   [junit4]   2> 119869 INFO  (TEST-TestCoreDiscovery.testNonCoreDirCantRead-seed#[4EBD43E2E9B8E98E]) [    x:lazy1] o.a.s.SolrTestCaseJ4 ###Starting testNonCoreDirCantRead
   [junit4]   2> 119876 INFO  (TEST-TestCoreDiscovery.testNonCoreDirCantRead-seed#[4EBD43E2E9B8E98E]) [    x:lazy1] o.a.s.c.SolrResourceLoader JNDI not configured for solr (NoInitialContextEx)
   [junit4]   2> 119876 INFO  (TEST-TestCoreDiscovery.testNonCoreDirCantRead-seed#[4EBD43E2E9B8E98E]) [    x:lazy1] o.a.s.c.SolrResourceLoader using system property solr.solr.home: /export/home/jenkins/workspace/Lucene-Solr-5.x-Solaris/solr/build/solr-core/test/J1/temp/solr.core.TestCoreDiscovery_4EBD43E2E9B8E98E-001/tempDir-002
   [junit4]   2> 119876 INFO  (TEST-TestCoreDiscovery.testNonCoreDirCantRead-seed#[4EBD43E2E9B8E98E]) [    x:lazy1] o.a.s.c.SolrResourceLoader new SolrResourceLoader for directory: '/export/home/jenkins/workspace/Lucene-Solr-5.x-Solaris/solr/build/solr-core/test/J1/temp/solr.core.TestCoreDiscovery_4EBD43E2E9B8E98E-001/tempDir-002'
   [junit4]   2> 119876 INFO  (TEST-TestCoreDiscovery.testNonCoreDirCantRead-seed#[4EBD43E2E9B8E98E]) [    x:lazy1] o.a.s.c.SolrResourceLoader JNDI not configured for solr (NoInitialContextEx)
   [junit4]   2> 119876 INFO  (TEST-TestCoreDiscovery.testNonCoreDirCantRead-seed#[4EBD43E2E9B8E98E]) [    x:lazy1] o.a.s.c.SolrResourceLoader using system property solr.solr.home: /export/home/jenkins/workspace/Lucene-Solr-5.x-Solaris/solr/build/solr-core/test/J1/temp/solr.core.TestCoreDiscovery_4EBD43E2E9B8E98E-001/tempDir-002
   [junit4]   2> 119876 INFO  (TEST-TestCoreDiscovery.testNonCoreDirCantRead-seed#[4EBD43E2E9B8E98E]) [    x:lazy1] o.a.s.c.SolrXmlConfig Loading container configuration from /export/home/jenkins/workspace/Lucene-Solr-5.x-Solaris/solr/build/solr-core/test/J1/temp/solr.core.TestCoreDiscovery_4EBD43E2E9B8E98E-001/tempDir-002/solr.xml
   [junit4]   2> 119889 INFO  (TEST-TestCoreDiscovery.testNonCoreDirCantRead-seed#[4EBD43E2E9B8E98E]) [    x:lazy1] o.a.s.c.CorePropertiesLocator Config-defined core root directory: /export/home/jenkins/workspace/Lucene-Solr-5.x-Solaris/solr/build/solr-core/test/J1/temp/solr.core.TestCoreDiscovery_4EBD43E2E9B8E98E-001/tempDir-002
   [junit4]   2> 119889 INFO  (TEST-TestCoreDiscovery.testNonCoreDirCantRead-seed#[4EBD43E2E9B8E98E]) [    x:lazy1] o.a.s.c.CoreContainer New CoreContainer 339988997
   [junit4]   2> 119889 INFO  (TEST-TestCoreDiscovery.testNonCoreDirCantRead-seed#[4EBD43E2E9B8E98E]) [    x:lazy1] o.a.s.c.CoreContainer Loading cores into CoreContainer [instanceDir=/export/home/jenkins/workspace/Lucene-Solr-5.x-Solaris/solr/build/solr-core/test/J1/temp/solr.core.TestCoreDiscovery_4EBD43E2E9B8E98E-001/tempDir-002]
   [junit4]   2> 119890 WARN  (TEST-TestCoreDiscovery.testNonCoreDirCantRead-seed#[4EBD43E2E9B8E98E]) [    x:lazy1] o.a.s.c.CoreContainer Couldn't add files from /export/home/jenkins/workspace/Lucene-Solr-5.x-Solaris/solr/build/solr-core/test/J1/temp/solr.core.TestCoreDiscovery_4EBD43E2E9B8E98E-001/tempDir-002/lib to classpath: /export/home/jenkins/workspace/Lucene-Solr-5.x-Solaris/solr/build/solr-core/test/J1/temp/solr.core.TestCoreDiscovery_4EBD43E2E9B8E98E-001/tempDir-002/lib
   [junit4]   2> 119890 INFO  (TEST-TestCoreDiscovery.testNonCoreDirCantRead-seed#[4EBD43E2E9B8E98E]) [    x:lazy1] o.a.s.h.c.HttpShardHandlerFactory created with socketTimeout : 600000,connTimeout : 60000,maxConnectionsPerHost : 20,maxConnections : 10000,corePoolSize : 0,maximumPoolSize : 2147483647,maxThreadIdleTime : 5,sizeOfQueue : -1,fairnessPolicy : false,useRetries : false,
   [junit4]   2> 119891 INFO  (TEST-TestCoreDiscovery.testNonCoreDirCantRead-seed#[4EBD43E2E9B8E98E]) [    x:lazy1] o.a.s.u.UpdateShardHandler Creating UpdateShardHandler HTTP client with params: socketTimeout=600000&connTimeout=60000&retry=true
   [junit4]   2> 119891 INFO  (TEST-TestCoreDiscovery.testNonCoreDirCantRead-seed#[4EBD43E2E9B8E98E]) [    x:lazy1] o.a.s.c.SolrCores Allocating transient cache for 2 transient cores
   [junit4]   2> 119891 INFO  (TEST-TestCoreDiscovery.testNonCoreDirCantRead-seed#[4EBD43E2E9B8E98E]) [    x:lazy1] o.a.s.l.LogWatcher SLF4J impl is org.slf4j.impl.Log4jLoggerFactory
   [junit4]   2> 119891 INFO  (TEST-TestCoreDiscovery.testNonCoreDirCantRead-seed#[4EBD43E2E9B8E98E]) [    x:lazy1] o.a.s.l.LogWatcher Registering Log Listener [Log4j (org.slf4j.impl.Log4jLoggerFactory)]
   [junit4]   2> 119891 INFO  (TEST-TestCoreDiscovery.testNonCoreDirCantRead-seed#[4EBD43E2E9B8E98E]) [    x:lazy1] o.a.s.c.CoreContainer Security conf doesn't exist. Skipping setup for authorization module.
   [junit4]   2> 119891 INFO  (TEST-TestCoreDiscovery.testNonCoreDirCantRead-seed#[4EBD43E2E9B8E98E]) [    x:lazy1] o.a.s.c.CoreContainer No authentication plugin used.
   [junit4]   2> 119892 INFO  (TEST-TestCoreDiscovery.testNonCoreDirCantRead-seed#[4EBD43E2E9B8E98E]) [    x:lazy1] o.a.s.c.CorePropertiesLocator Looking for core definitions underneath /export/home/jenkins/workspace/Lucene-Solr-5.x-Solaris/solr/build/solr-core/test/J1/temp/solr.core.TestCoreDiscovery_4EBD43E2E9B8E98E-001/tempDir-002
   [junit4]   2> 119893 WARN  (TEST-TestCoreDiscovery.testNonCoreDirCantRead-seed#[4EBD43E2E9B8E98E]) [    x:lazy1] o.a.s.c.CorePropertiesLocator Error visiting /export/home/jenkins/workspace/Lucene-Solr-5.x-Solaris/solr/build/solr-core/test/J1/temp/solr.core.TestCoreDiscovery_4EBD43E2E9B8E98E-001/tempDir-002/cantReadDir: java.nio.file.AccessDeniedException: /export/home/jenkins/workspace/Lucene-Solr-5.x-Solaris/solr/build/solr-core/test/J1/temp/solr.core.TestCoreDiscovery_4EBD43E2E9B8E98E-001/tempDir-002/cantReadDir
   [junit4]   2> 119893 INFO  (TEST-TestCoreDiscovery.testNonCoreDirCantRead-seed#[4EBD43E2E9B8E98E]) [    x:lazy1] o.a.s.c.CoreDescriptor Created CoreDescriptor: {name=core1, config=solrconfig-minimal.xml, loadOnStartup=true, schema=schema-tiny.xml, configSetProperties=configsetprops.json, transient=false, dataDir=stuffandnonsense}
   [junit4]   2> 119893 INFO  (TEST-TestCoreDiscovery.testNonCoreDirCantRead-seed#[4EBD43E2E9B8E98E]) [    x:lazy1] o.a.s.c.CorePropertiesLocator Found core core1 in /export/home/jenkins/workspace/Lucene-Solr-5.x-Solaris/solr/build/solr-core/test/J1/temp/solr.core.TestCoreDiscovery_4EBD43E2E9B8E98E-001/tempDir-002/core1
   [junit4]   2> 119894 INFO  (TEST-TestCoreDiscovery.testNonCoreDirCantRead-seed#[4EBD43E2E9B8E98E]) [    x:lazy1] o.a.s.c.CoreDescriptor Created CoreDescriptor: {name=core2, config=solrconfig-minimal.xml, loadOnStartup=false, schema=schema-tiny.xml, configSetProperties=configsetprops.json, transient=false, dataDir=core2}
   [junit4]   2> 119894 INFO  (TEST-TestCoreDiscovery.testNonCoreDirCantRead-seed#[4EBD43E2E9B8E98E]) [    x:lazy1] o.a.s.c.CorePropertiesLocator Found core core2 in /export/home/jenkins/workspace/Lucene-Solr-5.x-Solaris/solr/build/solr-core/test/J1/temp/solr.core.TestCoreDiscovery_4EBD43E2E9B8E98E-001/tempDir-002/core2
   [junit4]   2> 119894 INFO  (TEST-TestCoreDiscovery.testNonCoreDirCantRead-seed#[4EBD43E2E9B8E98E]) [    x:lazy1] o.a.s.c.CorePropertiesLocator Found 2 core definitions
   [junit4]   2> 119894 INFO  (coreLoadExecutor-351-thread-1-processing-x:lazy1) [    x:lazy1] o.a.s.c.SolrResourceLoader new SolrResourceLoader for directory: '/export/home/jenkins/workspace/Lucene-Solr-5.x-Solaris/solr/build/solr-core/test/J1/temp/solr.core.TestCoreDiscovery_4EBD43E2E9B8E98E-001/tempDir-002/core1'
   [junit4]   2> 119903 INFO  (coreLoadExecutor-351-thread-1-processing-x:lazy1) [    x:lazy1] o.a.s.c.SolrResourceLoader JNDI not configured for solr (NoInitialContextEx)
   [junit4]   2> 119908 INFO  (coreLoadExecutor-351-thread-1-processing-x:lazy1) [    x:lazy1] o.a.s.c.SolrResourceLoader using system property solr.solr.home: /export/home/jenkins/workspace/Lucene-Solr-5.x-Solaris/solr/build/solr-core/test/J1/temp/solr.core.TestCoreDiscovery_4EBD43E2E9B8E98E-001/tempDir-002
   [junit4]   2> 119938 INFO  (coreLoadExecutor-351-thread-1-processing-x:lazy1) [    x:lazy1] o.a.s.c.SolrConfig current version of requestparams : -1
   [junit4]   2> 119948 INFO  (coreLoadExecutor-351-thread-1-processing-x:lazy1) [    x:lazy1] o.a.s.c.SolrConfig Using Lucene MatchVersion: 5.5.0
   [junit4]   2> 119952 INFO  (coreLoadExecutor-351-thread-1-processing-x:lazy1) [    x:lazy1] o.a.s.c.SolrConfig Loaded SolrConfig: solrconfig-minimal.xml
   [junit4]   2> 119955 INFO  (coreLoadExecutor-351-thread-1-processing-x:lazy1) [    x:lazy1] o.a.s.s.IndexSchema [core1] Schema name=tiny
   [junit4]   2> 119965 INFO  (coreLoadExecutor-351-thread-1-processing-x:lazy1) [    x:lazy1] o.a.s.s.IndexSchema unique key field: id
   [junit4]   2> 119966 INFO  (coreLoadExecutor-351-thread-1-processing-x:lazy1) [    x:lazy1] o.a.s.c.ConfigSetProperties Did not find ConfigSet properties, assuming default properties: Can't find resource 'configsetprops.json' in classpath or '/export/home/jenkins/workspace/Lucene-Solr-5.x-Solaris/solr/build/solr-core/test/J1/temp/solr.core.TestCoreDiscovery_4EBD43E2E9B8E98E-001/tempDir-002/core1'
   [junit4]   2> 119966 INFO  (coreLoadExecutor-351-thread-1-processing-x:lazy1) [    x:lazy1] o.a.s.c.CoreContainer Creating SolrCore 'core1' using configuration from instancedir /export/home/jenkins/workspace/Lucene-Solr-5.x-Solaris/solr/build/solr-core/test/J1/temp/solr.core.TestCoreDiscovery_4EBD43E2E9B8E98E-001/tempDir-002/core1
   [junit4]   2> 119967 INFO  (coreLoadExecutor-351-thread-1-processing-x:lazy1) [    x:core1] o.a.s.c.SolrCore org.apache.solr.core.MockDirectoryFactory
   [junit4]   2> 119967 INFO  (coreLoadExecutor-351-thread-1-processing-x:lazy1) [    x:core1] o.a.s.c.SolrCore [[core1] ] Opening new SolrCore at [/export/home/jenkins/workspace/Lucene-Solr-5.x-Solaris/solr/build/solr-core/test/J1/temp/solr.core.TestCoreDiscovery_4EBD43E2E9B8E98E-001/tempDir-002/core1], dataDir=[/export/home/jenkins/workspace/Lucene-Solr-5.x-Solaris/solr/build/solr-core/test/J1/temp/solr.core.TestCoreDiscovery_4EBD43E2E9B8E98E-001/tempDir-002/core1/stuffandnonsense/]
   [junit4]   2> 119967 INFO  (coreLoadExecutor-351-thread-1-processing-x:lazy1) [    x:core1] o.a.s.c.SolrCore JMX monitoring not detected for core: core1
   [junit4]   2> 119967 INFO  (coreLoadExecutor-351-thread-1-processing-x:lazy1) [    x:core1] o.a.s.c.CachingDirectoryFactory return new directory for /export/home/jenkins/workspace/Lucene-Solr-5.x-Solaris/solr/build/solr-core/test/J1/temp/solr.core.TestCoreDiscovery_4EBD43E2E9B8E98E-001/tempDir-002/core1/stuffandnonsense
   [junit4]   2> 119968 INFO  (coreLoadExecutor-351-thread-1-processing-x:lazy1) [    x:core1] o.a.s.c.SolrCore New index directory detected: old=null new=/export/home/jenkins/workspace/Lucene-Solr-5.x-Solaris/solr/build/solr-core/test/J1/temp/solr.core.TestCoreDiscovery_4EBD43E2E9B8E98E-001/tempDir-002/core1/stuffandnonsense/index/
   [junit4]   2> 119968 WARN  (coreLoadExecutor-351-thread-1-processing-x:lazy1) [    x:core1] o.a.s.c.SolrCore [core1] Solr index directory '/export/home/jenkins/workspace/Lucene-Solr-5.x-Solaris/solr/build/solr-core/test/J1/temp/solr.core.TestCoreDiscovery_4EBD43E2E9B8E98E-001/tempDir-002/core1/stuffandnonsense/index' doesn't exist. Creating new index...
   [junit4]   2> 119969 INFO  (coreLoadExecutor-351-thread-1-processing-x:lazy1) [    x:core1] o.a.s.c.CachingDirectoryFactory return new directory for /export/home/jenkins/workspace/Lucene-Solr-5.x-Solaris/solr/build/solr-core/test/J1/temp/solr.core.TestCoreDiscovery_4EBD43E2E9B8E98E-001/tempDir-002/core1/stuffandnonsense/index
   [junit4]   2> 119972 INFO  (coreLoadExecutor-351-thread-1-processing-x:lazy1) [    x:core1] o.a.s.u.RandomMergePolicy RandomMergePolicy wrapping class org.apache.lucene.index.TieredMergePolicy: [TieredMergePolicy: maxMergeAtOnce=14, maxMergeAtOnceExplicit=18, maxMergedSegmentMB=50.8486328125, floorSegmentMB=1.2568359375, forceMergeDeletesPctAllowed=8.63511315331079, segmentsPerTier=47.0, maxCFSSegmentSizeMB=8.796093022207999E12, noCFSRatio=0.10843337539701077
   [junit4]   2> 119972 INFO  (coreLoadExecutor-351-thread-1-processing-x:lazy1) [    x:core1] o.a.s.c.SolrDeletionPolicy SolrDeletionPolicy.onCommit: commits: num=1
   [junit4]   2> 	commit{dir=MockDirectoryWrapper(RAMDirectory@b49bf97 lockFactory=org.apache.lucene.store.SingleInstanceLockFactory@3246d5f9),segFN=segments_1,generation=1}
   [junit4]   2> 119972 INFO  (coreLoadExecutor-351-thread-1-processing-x:lazy1) [    x:core1] o.a.s.c.SolrDeletionPolicy newest commit generation = 1
   [junit4]   2> 119972 INFO  (OldIndexDirectoryCleanupThreadForCore-core1) [    x:core1] o.a.s.c.SolrCore Looking for old index directories to cleanup for core core1 in /export/home/jenkins/workspace/Lucene-Solr-5.x-Solaris/solr/build/solr-core/test/J1/temp/solr.core.TestCoreDiscovery_4EBD43E2E9B8E98E-001/tempDir-002/core1/stuffandnonsense/
   [junit4]   2> 119972 WARN  (OldIndexDirectoryCleanupThreadForCore-core1) [    x:core1] o.a.s.c.DirectoryFactory /export/home/jenkins/workspace/Lucene-Solr-5.x-Solaris/solr/build/solr-core/test/J1/temp/solr.core.TestCoreDiscovery_4EBD43E2E9B8E98E-001/tempDir-002/core1/stuffandnonsense/ does not point to a valid data directory; skipping clean-up of old index directories.
   [junit4]   2> 119974 INFO  (coreLoadExecutor-351-thread-1-processing-x:lazy1) [    x:core1] o.a.s.c.SolrCore no updateRequestProcessorChain defined as default, creating implicit default
   [junit4]   2> 119975 INFO  (coreLoadExecutor-351-thread-1-processing-x:lazy1) [    x:core1] o.a.s.h.l.XMLLoader xsltCacheLifetimeSeconds=60
   [junit4]   2> 119976 INFO  (coreLoadExecutor-351-thread-1-processing-x:lazy1) [    x:core1] o.a.s.h.l.XMLLoader xsltCacheLifetimeSeconds=60
   [junit4]   2> 119976 INFO  (coreLoadExecutor-351-thread-1-processing-x:lazy1) [    x:core1] o.a.s.h.l.XMLLoader xsltCacheLifetimeSeconds=60
   [junit4]   2> 119977 INFO  (coreLoadExecutor-351-thread-1-processing-x:lazy1) [    x:core1] o.a.s.h.l.XMLLoader xsltCacheLifetimeSeconds=60
   [junit4]   2> 119979 INFO  (coreLoadExecutor-351-thread-1-processing-x:lazy1) [    x:core1] o.a.s.c.RequestHandlers Registered paths: /admin/mbeans,/update/csv,/update/json/docs,/admin/luke,/select,/admin/segments,/get,/admin/system,/replication,/admin/properties,/config,/schema,/admin/plugins,/admin/logging,/update/json,/admin/threads,/admin/ping,/update,/admin/file
   [junit4]   2> 119979 INFO  (coreLoadExecutor-351-thread-1-processing-x:lazy1) [    x:core1] o.a.s.c.SolrCore Using default statsCache cache: org.apache.solr.search.stats.LocalStatsCache
   [junit4]   2> 119979 INFO  (coreLoadExecutor-351-thread-1-processing-x:lazy1) [    x:core1] o.a.s.u.CommitTracker Hard AutoCommit: disabled
   [junit4]   2> 119979 INFO  (coreLoadExecutor-351-thread-1-processing-x:lazy1) [    x:core1] o.a.s.u.CommitTracker Soft AutoCommit: disabled
   [junit4]   2> 119979 INFO  (coreLoadExecutor-351-thread-1-processing-x:lazy1) [    x:core1] o.a.s.u.RandomMergePolicy RandomMergePolicy wrapping class org.apache.lucene.index.LogDocMergePolicy: [LogDocMergePolicy: minMergeSize=1000, mergeFactor=41, maxMergeSize=9223372036854775807, maxMergeSizeForForcedMerge=9223372036854775807, calibrateSizeByDeletes=false, maxMergeDocs=2147483647, maxCFSSegmentSizeMB=8.796093022207999E12, noCFSRatio=0.0]
   [junit4]   2> 119979 INFO  (coreLoadExecutor-351-thread-1-processing-x:lazy1) [    x:core1] o.a.s.c.SolrDeletionPolicy SolrDeletionPolicy.onInit: commits: num=1
   [junit4]   2> 	commit{dir=MockDirectoryWrapper(RAMDirectory@b49bf97 lockFactory=org.apache.lucene.store.SingleInstanceLockFactory@3246d5f9),segFN=segments_1,generation=1}
   [junit4]   2> 119980 INFO  (coreLoadExecutor-351-thread-1-processing-x:lazy1) [    x:core1] o.a.s.c.SolrDeletionPolicy newest commit generation = 1
   [junit4]   2> 119980 INFO  (coreLoadExecutor-351-thread-1-processing-x:lazy1) [    x:core1] o.a.s.s.SolrIndexSearcher Opening Searcher@5ddf0526[core1] main
   [junit4]   2> 119980 INFO  (coreLoadExecutor-351-thread-1-processing-x:lazy1) [    x:core1] o.a.s.r.ManagedResourceStorage File-based storage initialized to use dir: /export/home/jenkins/workspace/Lucene-Solr-5.x-Solaris/solr/build/solr-core/test/J1/temp/solr.core.TestCoreDiscovery_4EBD43E2E9B8E98E-001/tempDir-002/core1/conf
   [junit4]   2> 119980 INFO  (coreLoadExecutor-351-thread-1-processing-x:lazy1) [    x:core1] o.a.s.r.RestManager Initializing RestManager with initArgs: {storageDir=/export/home/jenkins/workspace/Lucene-Solr-5.x-Solaris/solr/build/solr-core/test/J1/temp/solr.core.TestCoreDiscovery_4EBD43E2E9B8E98E-001/tempDir-002/core1/conf}
   [junit4]   2> 119980 INFO  (coreLoadExecutor-351-thread-1-processing-x:lazy1) [    x:core1] o.a.s.r.ManagedResourceStorage Reading _rest_managed.json using file:dir=/export/home/jenkins/workspace/Lucene-Solr-5.x-Solaris/solr/build/solr-core/test/J1/temp/solr.core.TestCoreDiscovery_4EBD43E2E9B8E98E-001/tempDir-002/core1/conf
   [junit4]   2> 119980 INFO  (coreLoadExecutor-351-thread-1-processing-x:lazy1) [    x:core1] o.a.s.r.RestManager Initializing 0 registered ManagedResources
   [junit4]   2> 119980 INFO  (coreLoadExecutor-351-thread-1-processing-x:lazy1) [    x:core1] o.a.s.h.ReplicationHandler Commits will be reserved for  10000
   [junit4]   2> 119980 INFO  (searcherExecutor-352-thread-1-processing-x:core1) [    x:core1] o.a.s.c.SolrCore [core1] Registered new searcher Searcher@5ddf0526[core1] main{ExitableDirectoryReader(UninvertingDirectoryReader())}
   [junit4]   2> 119980 INFO  (coreLoadExecutor-351-thread-1-processing-x:lazy1) [    x:core1] o.a.s.c.CoreContainer registering core: core1
   [junit4]   2> 119980 INFO  (TEST-TestCoreDiscovery.testNonCoreDirCantRead-seed#[4EBD43E2E9B8E98E]) [    x:lazy1] o.a.s.c.SolrResourceLoader new SolrResourceLoader for directory: '/export/home/jenkins/workspace/Lucene-Solr-5.x-Solaris/solr/build/solr-core/test/J1/temp/solr.core.TestCoreDiscovery_4EBD43E2E9B8E98E-001/tempDir-002/core2'
   [junit4]   2> 119982 INFO  (TEST-TestCoreDiscovery.testNonCoreDirCantRead-seed#[4EBD43E2E9B8E98E]) [    x:lazy1] o.a.s.c.SolrResourceLoader JNDI not configured for solr (NoInitialContextEx)
   [junit4]   2> 119982 INFO  (TEST-TestCoreDiscovery.testNonCoreDirCantRead-seed#[4EBD43E2E9B8E98E]) [    x:lazy1] o.a.s.c.SolrResourceLoader using system property solr.solr.home: /export/home/jenkins/workspace/Lucene-Solr-5.x-Solaris/solr/build/solr-core/test/J1/temp/solr.core.TestCoreDiscovery_4EBD43E2E9B8E98E-001/tempDir-002
   [junit4]   2> 119990 INFO  (TEST-TestCoreDiscovery.testNonCoreDirCantRead-seed#[4EBD43E2E9B8E98E]) [    x:lazy1] o.a.s.c.SolrConfig current version of requestparams : -1
   [junit4]   2> 119992 INFO  (TEST-TestCoreDiscovery.testNonCoreDirCantRead-seed#[4EBD43E2E9B8E98E]) [    x:lazy1] o.a.s.c.SolrConfig Using Lucene MatchVersion: 5.5.0
   [junit4]   2> 120029 INFO  (TEST-TestCoreDiscovery.testNonCoreDirCantRead-seed#[4EBD43E2E9B8E98E]) [    x:lazy1] o.a.s.c.SolrConfig Loaded SolrConfig: solrconfig-minimal.xml
   [junit4]   2> 120032 INFO  (TEST-TestCoreDiscovery.testNonCoreDirCantRead-seed#[4EBD43E2E9B8E98E]) [    x:lazy1] o.a.s.s.IndexSchema [core2] Schema name=tiny
   [junit4]   2> 120035 INFO  (TEST-TestCoreDiscovery.testNonCoreDirCantRead-seed#[4EBD43E2E9B8E98E]) [    x:lazy1] o.a.s.s.IndexSchema unique key field: id
   [junit4]   2> 120037 INFO  (TEST-TestCoreDiscovery.testNonCoreDirCantRead-seed#[4EBD43E2E9B8E98E]) [    x:lazy1] o.a.s.c.ConfigSetProperties Did not find ConfigSet properties, assuming default properties: Can't find resource 'configsetprops.json' in classpath or '/export/home/jenkins/workspace/Lucene-Solr-5.x-Solaris/solr/build/solr-core/test/J1/temp/solr.core.TestCoreDiscovery_4EBD43E2E9B8E98E-001/tempDir-002/core2'
   [junit4]   2> 120037 INFO  (TEST-TestCoreDiscovery.testNonCoreDirCantRead-seed#[4EBD43E2E9B8E98E]) [    x:lazy1] o.a.s.c.CoreContainer Creating SolrCore 'core2' using configuration from instancedir /export/home/jenkins/workspace/Lucene-Solr-5.x-Solaris/solr/build/solr-core/test/J1/temp/solr.core.TestCoreDiscovery_4EBD43E2E9B8E98E-001/tempDir-002/core2
   [junit4]   2> 120037 INFO  (TEST-TestCoreDiscovery.testNonCoreDirCantRead-seed#[4EBD43E2E9B8E98E]) [    x:core2] o.a.s.c.SolrCore org.apache.solr.core.MockDirectoryFactory
   [junit4]   2> 120038 INFO  (TEST-TestCoreDiscovery.testNonCoreDirCantRead-seed#[4EBD43E2E9B8E98E]) [    x:core2] o.a.s.c.SolrCore [[core2] ] Opening new SolrCore at [/export/home/jenkins/workspace/Lucene-Solr-5.x-Solaris/solr/build/solr-core/test/J1/temp/solr.core.TestCoreDiscovery_4EBD43E2E9B8E98E-001/tempDir-002/core2], dataDir=[/export/home/jenkins/workspace/Lucene-Solr-5.x-Solaris/solr/build/solr-core/test/J1/temp/solr.core.TestCoreDiscovery_4EBD43E2E9B8E98E-001/tempDir-002/core2/core2/]
   [junit4]   2> 120038 INFO  (TEST-TestCoreDiscovery.testNonCoreDirCantRead-seed#[4EBD43E2E9B8E98E]) [    x:core2] o.a.s.c.SolrCore JMX monitoring not detected for core: core2
   [junit4]   2> 120041 INFO  (TEST-TestCoreDiscovery.testNonCoreDirCantRead-seed#[4EBD43E2E9B8E98E]) [    x:core2] o.a.s.c.CachingDirectoryFactory return new directory for /export/home/jenkins/workspace/Lucene-Solr-5.x-Solaris/solr/build/solr-core/test/J1/temp/solr.core.TestCoreDiscovery_4EBD43E2E9B8E98E-001/tempDir-002/core2/core2
   [junit4]   2> 120041 INFO  (TEST-TestCoreDiscovery.testNonCoreDirCantRead-seed#[4EBD43E2E9B8E98E]) [    x:core2] o.a.s.c.SolrCore New index directory detected: old=null new=/export/home/jenkins/workspace/Lucene-Solr-5.x-Solaris/solr/build/solr-core/test/J1/temp/solr.core.TestCoreDiscovery_4EBD43E2E9B8E98E-001/tempDir-002/core2/core2/index/
   [junit4]   2> 120041 WARN  (TEST-TestCoreDiscovery.testNonCoreDirCantRead-seed#[4EBD43E2E9B8E98E]) [    x:core2] o.a.s.c.SolrCore [core2] Solr index directory '/export/home/jenkins/workspace/Lucene-Solr-5.x-Solaris/solr/build/solr-core/test/J1/temp/solr.core.TestCoreDiscovery_4EBD43E2E9B8E98E-001/tempDir-002/core2/core2/index' doesn't exist. Creating new index...
   [junit4]   2> 120042 INFO  (TEST-TestCoreDiscovery.testNonCoreDirCantRead-seed#[4EBD43E2E9B8E98E]) [    x:core2] o.a.s.c.CachingDirectoryFactory return new directory for /export/home/jenkins/workspace/Lucene-Solr-5.x-Solaris/solr/build/solr-core/test/J1/temp/solr.core.TestCoreDiscovery_4EBD43E2E9B8E98E-001/tempDir-002/core2/core2/index
   [junit4]   2> 120042 INFO  (TEST-TestCoreDiscovery.testNonCoreDirCantRead-seed#[4EBD43E2E9B8E98E]) [    x:core2] o.a.s.u.RandomMergePolicy RandomMergePolicy wrapping class org.apache.lucene.index.TieredMergePolicy: [TieredMergePolicy: maxMergeAtOnce=18, maxMergeAtOnceExplicit=30, maxMergedSegmentMB=42.201171875, floorSegmentMB=1.3564453125, forceMergeDeletesPctAllowed=20.38754910731414, segmentsPerTier=11.0, maxCFSSegmentSizeMB=8.796093022207999E12, noCFSRatio=0.255403246689734
   [junit4]   2> 120043 INFO  (TEST-TestCoreDiscovery.testNonCoreDirCantRead-seed#[4EBD43E2E9B8E98E]) [    x:core2] o.a.s.c.SolrDeletionPolicy SolrDeletionPolicy.onCommit: commits: num=1
   [junit4]   2> 	commit{dir=MockDirectoryWrapper(RAMDirectory@4cccc38f lockFactory=org.apache.lucene.store.SingleInstanceLockFactory@28520d16),segFN=segments_1,generation=1}
   [junit4]   2> 120043 INFO  (TEST-TestCoreDiscovery.testNonCoreDirCantRead-seed#[4EBD43E2E9B8E98E]) [    x:core2] o.a.s.c.SolrDeletionPolicy newest commit generation = 1
   [junit4]   2> 120044 INFO  (TEST-TestCoreDiscovery.testNonCoreDirCantRead-seed#[4EBD43E2E9B8E98E]) [    x:core2] o.a.s.c.SolrCore no updateRequestProcessorChain defined as default, creating implicit default
   [junit4]   2> 120060 INFO  (TEST-TestCoreDiscovery.testNonCoreDirCantRead-seed#[4EBD43E2E9B8E98E]) [    x:core2] o.a.s.h.l.XMLLoader xsltCacheLifetimeSeconds=60
   [junit4]   2> 120060 INFO  (TEST-TestCoreDiscovery.testNonCoreDirCantRead-seed#[4EBD43E2E9B8E98E]) [    x:core2] o.a.s.h.l.XMLLoader xsltCacheLifetimeSeconds=60
   [junit4]   2> 120061 INFO  (TEST-TestCoreDiscovery.testNonCoreDirCantRead-seed#[4EBD43E2E9B8E98E]) [    x:core2] o.a.s.h.l.XMLLoader xsltCacheLifetimeSeconds=60
   [junit4]   2> 120062 INFO  (TEST-TestCoreDiscovery.testNonCoreDirCantRead-seed#[4EBD43E2E9B8E98E]) [    x:core2] o.a.s.h.l.XMLLoader xsltCacheLifetimeSeconds=60
   [junit4]   2> 120063 INFO  (TEST-TestCoreDiscovery.testNonCoreDirCantRead-seed#[4EBD43E2E9B8E98E]) [    x:core2] o.a.s.c.RequestHandlers Registered paths: /admin/mbeans,/update/csv,/update/json/docs,/admin/luke,/select,/admin/segments,/get,/admin/system,/replication,/admin/properties,/config,/schema,/admin/plugins,/admin/logging,/update/json,/admin/threads,/admin/ping,/update,/admin/file
   [junit4]   2> 120064 INFO  (TEST-TestCoreDiscovery.testNonCoreDirCantRead-seed#[4EBD43E2E9B8E98E]) [    x:core2] o.a.s.c.SolrCore Using default statsCache cache: org.apache.solr.search.stats.LocalStatsCache
   [junit4]   2> 120064 INFO  (TEST-TestCoreDiscovery.testNonCoreDirCantRead-seed#[4EBD43E2E9B8E98E]) [    x:core2] o.a.s.u.CommitTracker Hard AutoCommit: disabled
   [junit4]   2> 120064 INFO  (TEST-TestCoreDiscovery.testNonCoreDirCantRead-seed#[4EBD43E2E9B8E98E]) [    x:core2] o.a.s.u.CommitTracker Soft AutoCommit: disabled
   [junit4]   2> 120064 INFO  (TEST-TestCoreDiscovery.testNonCoreDirCantRead-seed#[4EBD43E2E9B8E98E]) [    x:core2] o.a.s.u.RandomMergePolicy RandomMergePolicy wrapping class org.apache.lucene.index.TieredMergePolicy: [TieredMergePolicy: maxMergeAtOnce=16, maxMergeAtOnceExplicit=47, maxMergedSegmentMB=71.5361328125, floorSegmentMB=0.208984375, forceMergeDeletesPctAllowed=4.296984547097606, segmentsPerTier=28.0, maxCFSSegmentSizeMB=8.796093022207999E12, noCFSRatio=0.8148689375536241
   [junit4]   2> 120064 INFO  (TEST-TestCoreDiscovery.testNonCoreDirCantRead-seed#[4EBD43E2E9B8E98E]) [    x:core2] o.a.s.c.SolrDeletionPolicy SolrDeletionPolicy.onInit: commits: num=1
   [junit4]   2> 	commit{dir=MockDirectoryWrapper(RAMDirectory@4cccc38f lockFactory=org.apache.lucene.store.SingleInstanceLockFactory@28520d16),segFN=segments_1,generation=1}
   [junit4]   2> 120064 INFO  (TEST-TestCoreDiscovery.testNonCoreDirCantRead-seed#[4EBD43E2E9B8E98E]) [    x:core2] o.a.s.c.SolrDeletionPolicy newest commit generation = 1
   [junit4]   2> 120065 INFO  (TEST-TestCoreDiscovery.testNonCoreDirCantRead-seed#[4EBD43E2E9B8E98E]) [    x:core2] o.a.s.s.SolrIndexSearcher Opening Searcher@2a072199[core2] main
   [junit4]   2> 120065 INFO  (TEST-TestCoreDiscovery.testNonCoreDirCantRead-seed#[4EBD43E2E9B8E98E]) [    x:core2] o.a.s.r.ManagedResourceStorage File-based storage initialized to use dir: /export/home/jenkins/workspace/Lucene-Solr-5.x-Solaris/solr/build/solr-core/test/J1/temp/solr.core.TestCoreDiscovery_4EBD43E2E9B8E98E-001/tempDir-002/core2/conf
   [junit4]   2> 120065 INFO  (TEST-TestCoreDiscovery.testNonCoreDirCantRead-seed#[4EBD43E2E9B8E98E]) [    x:core2] o.a.s.r.RestManager Initializing RestManager with initArgs: {storageDir=/export/home/jenkins/workspace/Lucene-Solr-5.x-Solaris/solr/build/solr-core/test/J1/temp/solr.core.TestCoreDiscovery_4EBD43E2E9B8E98E-001/tempDir-002/core2/conf}
   [junit4]   2> 120065 INFO  (TEST-TestCoreDiscovery.testNonCoreDirCantRead-seed#[4EBD43E2E9B8E98E]) [    x:core2] o.a.s.r.ManagedResourceStorage Reading _rest_managed.json using file:dir=/export/home/jenkins/workspace/Lucene-Solr-5.x-Solaris/solr/build/solr-core/test/J1/temp/solr.core.TestCoreDiscovery_4EBD43E2E9B8E98E-001/tempDir-002/core2/conf
   [junit4]   2> 120065 INFO  (TEST-TestCoreDiscovery.testNonCoreDirCantRead-seed#[4EBD43E2E9B8E98E]) [    x:core2] o.a.s.r.RestManager Initializing 0 registered ManagedResources
   [junit4]   2> 120065 INFO  (TEST-TestCoreDiscovery.testNonCoreDirCantRead-seed#[4EBD43E2E9B8E98E]) [    x:core2] o.a.s.h.ReplicationHandler Commits will be reserved for  10000
   [junit4]   2> 120065 INFO  (TEST-TestCoreDiscovery.testNonCoreDirCantRead-seed#[4EBD43E2E9B8E98E]) [    x:core2] o.a.s.c.CoreContainer registering core: core2
   [junit4]   2> 120066 INFO  (TEST-TestCoreDiscovery.testNonCoreDirCantRead-seed#[4EBD43E2E9B8E98E]) [    x:core2] o.a.s.c.CoreContainer Shutting down CoreContainer instance=339988997
   [junit4]   2> 120066 INFO  (OldIndexDirectoryCleanupThreadForCore-core2) [    x:core2] o.a.s.c.SolrCore Looking for old index directories to cleanup for core core2 in /export/home/jenkins/workspace/Lucene-Solr-5.x-Solaris/solr/build/solr-core/test/J1/temp/solr.core.TestCoreDiscovery_4EBD43E2E9B8E98E-001/tempDir-002/core2/core2/
   [junit4]   2> 120066 WARN  (OldIndexDirectoryCleanupThreadForCore-core2) [    x:core2] o.a.s.c.DirectoryFactory /export/home/jenkins/workspace/Lucene-Solr-5.x-Solaris/solr/build/solr-core/test/J1/temp/solr.core.TestCoreDiscovery_4EBD43E2E9B8E98E-001/tempDir-002/core2/core2/ does not point to a valid data directory; skipping clean-up of old index directories.
   [junit4]   2> 120094 INFO  (searcherExecutor-356-thread-1-processing-x:core2) [    x:core2] o.a.s.c.SolrCore [core2] Registered new searcher Searcher@2a072199[core2] main{ExitableDirectoryReader(UninvertingDirectoryReader())}
   [junit4]   2> 120094 INFO  (TEST-TestCoreDiscovery.testNonCoreDirCantRead-seed#[4EBD43E2E9B8E98E]) [    x:core1] o.a.s.c.SolrCore [core1]  CLOSING SolrCore org.apache.solr.core.SolrCore@3f03109e
   [junit4]   2> 120094 INFO  (TEST-TestCoreDiscovery.testNonCoreDirCantRead-seed#[4EBD43E2E9B8E98E]) [    x:core1] o.a.s.u.DirectUpdateHandler2 closing DirectUpdateHandler2{commits=0,autocommits=0,soft autocommits=0,optimizes=0,rollbacks=0,expungeDeletes=0,docsPending=0,adds=0,deletesById=0,deletesByQuery=0,errors=0,cumulative_adds=0,cumulative_deletesById=0,cumulative_deletesByQuery=0,cumulative_errors=0}
   [junit4]   2> 120095 INFO  (TEST-TestCoreDiscovery.testNonCoreDirCantRead-seed#[4EBD43E2E9B8E98E]) [    x:core1] o.a.s.u.SolrCoreState Closing SolrCoreState
   [junit4]   2> 120095 INFO  (TEST-TestCoreDiscovery.testNonCoreDirCantRead-seed#[4EBD43E2E9B8E98E]) [    x:core1] o.a.s.u.DefaultSolrCoreState SolrCoreState ref count has reached 0 - closing IndexWriter
   [junit4]   2> 120095 INFO  (TEST-TestCoreDiscovery.testNonCoreDirCantRead-seed#[4EBD43E2E9B8E98E]) [    x:core1] o.a.s.u.DefaultSolrCoreState closing IndexWriter with IndexWriterCloser
   [junit4]   2> 120097 INFO  (TEST-TestCoreDiscovery.testNonCoreDirCantRead-seed#[4EBD43E2E9B8E98E]) [    x:core1] o.a.s.c.SolrCore [core1] Closing main searcher on request.
   [junit4]   2> 120097 INFO  (TEST-TestCoreDiscovery.testNonCoreDirCantRead-seed#[4EBD43E2E9B8E98E]) [    x:core1] o.a.s.c.CachingDirectoryFactory Closing MockDirectoryFactory - 2 directories currently being tracked
   [junit4]   2> 120097 INFO  (TEST-TestCoreDiscovery.testNonCoreDirCantRead-seed#[4EBD43E2E9B8E98E]) [    x:core1] o.a.s.c.CachingDirectoryFactory looking to close /export/home/jenkins/workspace/Lucene-Solr-5.x-Solaris/solr/build/solr-core/test/J1/temp/solr.core.TestCoreDiscovery_4EBD43E2E9B8E98E-001/tempDir-002/core1/stuffandnonsense [CachedDir<<refCount=0;path=/export/home/jenkins/workspace/Lucene-Solr-5.x-Solaris/solr/build/solr-core/test/J1/temp/solr.core.TestCoreDiscovery_4EBD43E2E9B8E98E-001/tempDir-002/core1/stuffandnonsense;done=false>>]
   [junit4]   2> 120097 INFO  (TEST-TestCoreDiscovery.testNonCoreDirCantRead-seed#[4EBD43E2E9B8E98E]) [    x:core1] o.a.s.c.CachingDirectoryFactory Closing directory: /export/home/jenkins/workspace/Lucene-Solr-5.x-Solaris/solr/build/solr-core/test/J1/temp/solr.core.TestCoreDiscovery_4EBD43E2E9B8E98E-001/tempDir-002/core1/stuffandnonsense
   [junit4]   2> 120097 INFO  (TEST-TestCoreDiscovery.testNonCoreDirCantRead-seed#[4EBD43E2E9B8E98E]) [    x:core1] o.a.s.c.CachingDirectoryFactory looking to close /export/home/jenkins/workspace/Lucene-Solr-5.x-Solaris/solr/build/solr-core/test/J1/temp/solr.core.TestCoreDiscovery_4EBD43E2E9B8E98E-001/tempDir-002/core1/stuffandnonsense/index [CachedDir<<refCount=0;path=/export/home/jenkins/workspace/Lucene-Solr-5.x-Solaris/solr/build/solr-core/test/J1/temp/solr.core.TestCoreDiscovery_4EBD43E2E9B8E98E-001/tempDir-002/core1/stuffandnonsense/index;done=false>>]
   [junit4]   2> 120097 INFO  (TEST-TestCoreDiscovery.testNonCoreDirCantRead-seed#[4EBD43E2E9B8E98E]) [    x:core1] o.a.s.c.CachingDirectoryFactory Closing directory: /export/home/jenkins/workspace/Lucene-Solr-5.x-Solaris/solr/build/solr-core/test/J1/temp/solr.core.TestCoreDiscovery_4EBD43E2E9B8E98E-001/tempDir-002/core1/stuffandnonsense/index
   [junit4]   2> 120097 INFO  (TEST-TestCoreDiscovery.testNonCoreDirCantRead-seed#[4EBD43E2E9B8E98E]) [    x:core2] o.a.s.c.SolrCore [core2]  CLOSING SolrCore org.apache.solr.core.SolrCore@6bf01d9e
   [junit4]   2> 120097 INFO  (TEST-TestCoreDiscovery.testNonCoreDirCantRead-seed#[4EBD43E2E9B8E98E]) [    x:core2] o.a.s.u.DirectUpdateHandler2 closing DirectUpdateHandler2{commits=0,autocommits=0,soft autocommits=0,optimizes=0,rollbacks=0,expungeDeletes=0,docsPending=0,adds=0,deletesById=0,deletesByQuery=0,errors=0,cumulative_adds=0,cumulative_deletesById=0,cumulative_deletesByQuery=0,cumulative_errors=0}
   [junit4]   2> 120098 INFO  (TEST-TestCoreDiscovery.testNonCoreDirCantRead-seed#[4EBD43E2E9B8E98E]) [    x:core2] o.a.s.u.SolrCoreState Closing SolrCoreState
   [junit4]   2> 120098 INFO  (TEST-TestCoreDiscovery.testNonCoreDirCantRead-seed#[4EBD43E2E9B8E98E]) [    x:core2] o.a.s.u.DefaultSolrCoreState SolrCoreState ref count has reached 0 - closing IndexWriter
   [junit4]   2> 120098 INFO  (TEST-TestCoreDiscovery.testNonCoreDirCantRead-seed#[4EBD43E2E9B8E98E]) [    x:core2] o.a.s.u.DefaultSolrCoreState closing IndexWriter with IndexWriterCloser
   [junit4]   2> 120101 INFO  (TEST-TestCoreDiscovery.testNonCoreDirCantRead-seed#[4EBD43E2E9B8E98E]) [    x:core2] o.a.s.c.SolrCore [core2] Closing main searcher on request.
   [junit4]   2> 120101 INFO  (TEST-TestCoreDiscovery.testNonCoreDirCantRead-seed#[4EBD43E2E9B8E98E]) [    x:core2] o.a.s.c.CachingDirectoryFactory Closing MockDirectoryFactory - 2 directories currently being tracked
   [junit4]   2> 120101 INFO  (TEST-TestCoreDiscovery.testNonCoreDirCantRead-seed#[4EBD43E2E9B8E98E]) [    x:core2] o.a.s.c.CachingDirectoryFactory looking to close /export/home/jenkins/workspace/Lucene-Solr-5.x-Solaris/solr/build/solr-core/test/J1/temp/solr.core.TestCoreDiscovery_4EBD43E2E9B8E98E-001/tempDir-002/core2/core2 [CachedDir<<refCount=0;path=/export/home/jenkins/workspace/Lucene-Solr-5.x-Solaris/solr/build/solr-core/test/J1/temp/solr.core.TestCoreDiscovery_4EBD43E2E9B8E98E-001/tempDir-002/cor

[...truncated too long message...]

randomizedtesting.RandomizedRunner$5.evaluate(RandomizedRunner.java:781)
   [junit4]   2> 	at com.carrotsearch.randomizedtesting.RandomizedRunner$6.evaluate(RandomizedRunner.java:816)
   [junit4]   2> 	at com.carrotsearch.randomizedtesting.RandomizedRunner$7.evaluate(RandomizedRunner.java:827)
   [junit4]   2> 	at com.carrotsearch.randomizedtesting.rules.StatementAdapter.evaluate(StatementAdapter.java:36)
   [junit4]   2> 	at com.carrotsearch.randomizedtesting.rules.SystemPropertiesRestoreRule$1.evaluate(SystemPropertiesRestoreRule.java:57)
   [junit4]   2> 	at org.apache.lucene.util.AbstractBeforeAfterRule$1.evaluate(AbstractBeforeAfterRule.java:46)
   [junit4]   2> 	at com.carrotsearch.randomizedtesting.rules.StatementAdapter.evaluate(StatementAdapter.java:36)
   [junit4]   2> 	at org.apache.lucene.util.TestRuleStoreClassName$1.evaluate(TestRuleStoreClassName.java:42)
   [junit4]   2> 	at com.carrotsearch.randomizedtesting.rules.NoShadowingOrOverridesOnMethodsRule$1.evaluate(NoShadowingOrOverridesOnMethodsRule.java:40)
   [junit4]   2> 	at com.carrotsearch.randomizedtesting.rules.NoShadowingOrOverridesOnMethodsRule$1.evaluate(NoShadowingOrOverridesOnMethodsRule.java:40)
   [junit4]   2> 	at com.carrotsearch.randomizedtesting.rules.StatementAdapter.evaluate(StatementAdapter.java:36)
   [junit4]   2> 	at com.carrotsearch.randomizedtesting.rules.StatementAdapter.evaluate(StatementAdapter.java:36)
   [junit4]   2> 	at com.carrotsearch.randomizedtesting.rules.StatementAdapter.evaluate(StatementAdapter.java:36)
   [junit4]   2> 	at org.apache.lucene.util.TestRuleAssertionsRequired$1.evaluate(TestRuleAssertionsRequired.java:54)
   [junit4]   2> 	at org.apache.lucene.util.TestRuleMarkFailure$1.evaluate(TestRuleMarkFailure.java:48)
   [junit4]   2> 	at org.apache.lucene.util.TestRuleIgnoreAfterMaxFailures$1.evaluate(TestRuleIgnoreAfterMaxFailures.java:65)
   [junit4]   2> 	at org.apache.lucene.util.TestRuleIgnoreTestSuites$1.evaluate(TestRuleIgnoreTestSuites.java:55)
   [junit4]   2> 	at com.carrotsearch.randomizedtesting.rules.StatementAdapter.evaluate(StatementAdapter.java:36)
   [junit4]   2> 	at com.carrotsearch.randomizedtesting.ThreadLeakControl$StatementRunner.run(ThreadLeakControl.java:367)
   [junit4]   2> 	at java.lang.Thread.run(Thread.java:745)
   [junit4]   2> 
   [junit4]   2> Jan 06, 2016 10:15:19 AM com.carrotsearch.randomizedtesting.ThreadLeakControl checkThreadLeaks
   [junit4]   2> WARNING: Will linger awaiting termination of 1 leaked thread(s).
   [junit4]   2> Jan 06, 2016 10:15:39 AM com.carrotsearch.randomizedtesting.ThreadLeakControl checkThreadLeaks
   [junit4]   2> SEVERE: 1 thread leaked from SUITE scope at org.apache.solr.core.TestCoreDiscovery: 
   [junit4]   2>    1) Thread[id=806, name=searcherExecutor-430-thread-1, state=WAITING, group=TGRP-TestCoreDiscovery]
   [junit4]   2>         at sun.misc.Unsafe.park(Native Method)
   [junit4]   2>         at java.util.concurrent.locks.LockSupport.park(LockSupport.java:175)
   [junit4]   2>         at java.util.concurrent.locks.AbstractQueuedSynchronizer$ConditionObject.await(AbstractQueuedSynchronizer.java:2039)
   [junit4]   2>         at java.util.concurrent.LinkedBlockingQueue.take(LinkedBlockingQueue.java:442)
   [junit4]   2>         at java.util.concurrent.ThreadPoolExecutor.getTask(ThreadPoolExecutor.java:1067)
   [junit4]   2>         at java.util.concurrent.ThreadPoolExecutor.runWorker(ThreadPoolExecutor.java:1127)
   [junit4]   2>         at java.util.concurrent.ThreadPoolExecutor$Worker.run(ThreadPoolExecutor.java:617)
   [junit4]   2>         at java.lang.Thread.run(Thread.java:745)
   [junit4]   2> Jan 06, 2016 10:15:39 AM com.carrotsearch.randomizedtesting.ThreadLeakControl tryToInterruptAll
   [junit4]   2> INFO: Starting to interrupt leaked threads:
   [junit4]   2>    1) Thread[id=806, name=searcherExecutor-430-thread-1, state=WAITING, group=TGRP-TestCoreDiscovery]
   [junit4]   2> Jan 06, 2016 10:15:42 AM com.carrotsearch.randomizedtesting.ThreadLeakControl tryToInterruptAll
   [junit4]   2> SEVERE: There are still zombie threads that couldn't be terminated:
   [junit4]   2>    1) Thread[id=806, name=searcherExecutor-430-thread-1, state=WAITING, group=TGRP-TestCoreDiscovery]
   [junit4]   2>         at sun.misc.Unsafe.park(Native Method)
   [junit4]   2>         at java.util.concurrent.locks.LockSupport.park(LockSupport.java:175)
   [junit4]   2>         at java.util.concurrent.locks.AbstractQueuedSynchronizer$ConditionObject.await(AbstractQueuedSynchronizer.java:2039)
   [junit4]   2>         at java.util.concurrent.LinkedBlockingQueue.take(LinkedBlockingQueue.java:442)
   [junit4]   2>         at java.util.concurrent.ThreadPoolExecutor.getTask(ThreadPoolExecutor.java:1067)
   [junit4]   2>         at java.util.concurrent.ThreadPoolExecutor.runWorker(ThreadPoolExecutor.java:1127)
   [junit4]   2>         at java.util.concurrent.ThreadPoolExecutor$Worker.run(ThreadPoolExecutor.java:617)
   [junit4]   2>         at java.lang.Thread.run(Thread.java:745)
   [junit4]   2> NOTE: test params are: codec=Asserting(Lucene54): {}, docValues:{}, sim=RandomSimilarityProvider(queryNorm=false,coord=crazy): {}, locale=ar_AE, timezone=Pacific/Fiji
   [junit4]   2> NOTE: SunOS 5.11 amd64/Oracle Corporation 1.8.0_66 (64-bit)/cpus=3,threads=2,free=52055488,total=148840448
   [junit4]   2> NOTE: All tests run in this JVM: [DistributedIntervalFacetingTest, OverseerCollectionConfigSetProcessorTest, AsyncMigrateRouteKeyTest, RuleEngineTest, TestExactSharedStatsCache, TestCrossCoreJoin, ResponseLogComponentTest, TestQueryTypes, CacheHeaderTest, TestCoreDiscovery]
   [junit4]   2> NOTE: reproduce with: ant test  -Dtestcase=TestCoreDiscovery -Dtests.seed=4EBD43E2E9B8E98E -Dtests.slow=true -Dtests.locale=ar_AE -Dtests.timezone=Pacific/Fiji -Dtests.asserts=true -Dtests.file.encoding=UTF-8
   [junit4] ERROR   0.00s J1 | TestCoreDiscovery (suite) <<<
   [junit4]    > Throwable #1: java.lang.AssertionError: ObjectTracker found 4 object(s) that were not released!!! [MockDirectoryWrapper, MockDirectoryWrapper, MDCAwareThreadPoolExecutor, SolrCore]
   [junit4]    > 	at __randomizedtesting.SeedInfo.seed([4EBD43E2E9B8E98E]:0)
   [junit4]    > 	at org.apache.solr.SolrTestCaseJ4.afterClass(SolrTestCaseJ4.java:228)
   [junit4]    > 	at java.lang.Thread.run(Thread.java:745)Throwable #2: com.carrotsearch.randomizedtesting.ThreadLeakError: 1 thread leaked from SUITE scope at org.apache.solr.core.TestCoreDiscovery: 
   [junit4]    >    1) Thread[id=806, name=searcherExecutor-430-thread-1, state=WAITING, group=TGRP-TestCoreDiscovery]
   [junit4]    >         at sun.misc.Unsafe.park(Native Method)
   [junit4]    >         at java.util.concurrent.locks.LockSupport.park(LockSupport.java:175)
   [junit4]    >         at java.util.concurrent.locks.AbstractQueuedSynchronizer$ConditionObject.await(AbstractQueuedSynchronizer.java:2039)
   [junit4]    >         at java.util.concurrent.LinkedBlockingQueue.take(LinkedBlockingQueue.java:442)
   [junit4]    >         at java.util.concurrent.ThreadPoolExecutor.getTask(ThreadPoolExecutor.java:1067)
   [junit4]    >         at java.util.concurrent.ThreadPoolExecutor.runWorker(ThreadPoolExecutor.java:1127)
   [junit4]    >         at java.util.concurrent.ThreadPoolExecutor$Worker.run(ThreadPoolExecutor.java:617)
   [junit4]    >         at java.lang.Thread.run(Thread.java:745)
   [junit4]    > 	at __randomizedtesting.SeedInfo.seed([4EBD43E2E9B8E98E]:0)Throwable #3: com.carrotsearch.randomizedtesting.ThreadLeakError: There are still zombie threads that couldn't be terminated:
   [junit4]    >    1) Thread[id=806, name=searcherExecutor-430-thread-1, state=WAITING, group=TGRP-TestCoreDiscovery]
   [junit4]    >         at sun.misc.Unsafe.park(Native Method)
   [junit4]    >         at java.util.concurrent.locks.LockSupport.park(LockSupport.java:175)
   [junit4]    >         at java.util.concurrent.locks.AbstractQueuedSynchronizer$ConditionObject.await(AbstractQueuedSynchronizer.java:2039)
   [junit4]    >         at java.util.concurrent.LinkedBlockingQueue.take(LinkedBlockingQueue.java:442)
   [junit4]    >         at java.util.concurrent.ThreadPoolExecutor.getTask(ThreadPoolExecutor.java:1067)
   [junit4]    >         at java.util.concurrent.ThreadPoolExecutor.runWorker(ThreadPoolExecutor.java:1127)
   [junit4]    >         at java.util.concurrent.ThreadPoolExecutor$Worker.run(ThreadPoolExecutor.java:617)
   [junit4]    >         at java.lang.Thread.run(Thread.java:745)
   [junit4]    > 	at __randomizedtesting.SeedInfo.seed([4EBD43E2E9B8E98E]:0)
   [junit4] Completed [41/562 (1!)] on J1 in 146.10s, 12 tests, 1 failure, 2 errors <<< FAILURES!

[...truncated 1614 lines...]
BUILD FAILED
/export/home/jenkins/workspace/Lucene-Solr-5.x-Solaris/build.xml:794: The following error occurred while executing this line:
/export/home/jenkins/workspace/Lucene-Solr-5.x-Solaris/build.xml:738: The following error occurred while executing this line:
/export/home/jenkins/workspace/Lucene-Solr-5.x-Solaris/build.xml:59: The following error occurred while executing this line:
/export/home/jenkins/workspace/Lucene-Solr-5.x-Solaris/solr/build.xml:233: The following error occurred while executing this line:
/export/home/jenkins/workspace/Lucene-Solr-5.x-Solaris/solr/common-build.xml:526: The following error occurred while executing this line:
/export/home/jenkins/workspace/Lucene-Solr-5.x-Solaris/lucene/common-build.xml:1444: The following error occurred while executing this line:
/export/home/jenkins/workspace/Lucene-Solr-5.x-Solaris/lucene/common-build.xml:1000: There were test failures: 562 suites (7 ignored), 2231 tests, 3 suite-level errors, 1503 ignored (27 assumptions) [seed: 4EBD43E2E9B8E98E]

Total time: 48 minutes 39 seconds
Build step 'Invoke Ant' marked build as failure
Archiving artifacts
[WARNINGS] Skipping publisher since build result is FAILURE
Recording test results
Email was triggered for: Failure - Any
Sending email for trigger: Failure - Any



Mime
View raw message