lucene-dev mailing list archives

Site index · List index
Message view « Date » · « Thread »
Top « Date » · « Thread »
From Policeman Jenkins Server <jenk...@thetaphi.de>
Subject [JENKINS] Lucene-Solr-5.x-Solaris (multiarch/jdk1.7.0) - Build # 304 - Failure!
Date Sun, 03 Jan 2016 20:47:24 GMT
Build: http://jenkins.thetaphi.de/job/Lucene-Solr-5.x-Solaris/304/
Java: multiarch/jdk1.7.0 -d32 -server -XX:+UseG1GC

13 tests failed.
FAILED:  org.apache.solr.cloud.CustomCollectionTest.test

Error Message:
expected:<3> but was:<0>

Stack Trace:
java.lang.AssertionError: expected:<3> but was:<0>
	at __randomizedtesting.SeedInfo.seed([501C786580DF0D84:D84847BF2E23607C]:0)
	at org.junit.Assert.fail(Assert.java:93)
	at org.junit.Assert.failNotEquals(Assert.java:647)
	at org.junit.Assert.assertEquals(Assert.java:128)
	at org.junit.Assert.assertEquals(Assert.java:472)
	at org.junit.Assert.assertEquals(Assert.java:456)
	at org.apache.solr.cloud.CustomCollectionTest.testCustomCollectionsAPI(CustomCollectionTest.java:216)
	at org.apache.solr.cloud.CustomCollectionTest.test(CustomCollectionTest.java:100)
	at sun.reflect.NativeMethodAccessorImpl.invoke0(Native Method)
	at sun.reflect.NativeMethodAccessorImpl.invoke(NativeMethodAccessorImpl.java:57)
	at sun.reflect.DelegatingMethodAccessorImpl.invoke(DelegatingMethodAccessorImpl.java:43)
	at java.lang.reflect.Method.invoke(Method.java:606)
	at com.carrotsearch.randomizedtesting.RandomizedRunner.invoke(RandomizedRunner.java:1764)
	at com.carrotsearch.randomizedtesting.RandomizedRunner$8.evaluate(RandomizedRunner.java:871)
	at com.carrotsearch.randomizedtesting.RandomizedRunner$9.evaluate(RandomizedRunner.java:907)
	at com.carrotsearch.randomizedtesting.RandomizedRunner$10.evaluate(RandomizedRunner.java:921)
	at org.apache.solr.BaseDistributedSearchTestCase$ShardsRepeatRule$ShardsFixedStatement.callStatement(BaseDistributedSearchTestCase.java:965)
	at org.apache.solr.BaseDistributedSearchTestCase$ShardsRepeatRule$ShardsStatement.evaluate(BaseDistributedSearchTestCase.java:940)
	at com.carrotsearch.randomizedtesting.rules.SystemPropertiesRestoreRule$1.evaluate(SystemPropertiesRestoreRule.java:57)
	at org.apache.lucene.util.TestRuleSetupTeardownChained$1.evaluate(TestRuleSetupTeardownChained.java:50)
	at org.apache.lucene.util.AbstractBeforeAfterRule$1.evaluate(AbstractBeforeAfterRule.java:46)
	at org.apache.lucene.util.TestRuleThreadAndTestName$1.evaluate(TestRuleThreadAndTestName.java:49)
	at org.apache.lucene.util.TestRuleIgnoreAfterMaxFailures$1.evaluate(TestRuleIgnoreAfterMaxFailures.java:65)
	at org.apache.lucene.util.TestRuleMarkFailure$1.evaluate(TestRuleMarkFailure.java:48)
	at com.carrotsearch.randomizedtesting.rules.StatementAdapter.evaluate(StatementAdapter.java:36)
	at com.carrotsearch.randomizedtesting.ThreadLeakControl$StatementRunner.run(ThreadLeakControl.java:367)
	at com.carrotsearch.randomizedtesting.ThreadLeakControl.forkTimeoutingTask(ThreadLeakControl.java:809)
	at com.carrotsearch.randomizedtesting.ThreadLeakControl$3.evaluate(ThreadLeakControl.java:460)
	at com.carrotsearch.randomizedtesting.RandomizedRunner.runSingleTest(RandomizedRunner.java:880)
	at com.carrotsearch.randomizedtesting.RandomizedRunner$5.evaluate(RandomizedRunner.java:781)
	at com.carrotsearch.randomizedtesting.RandomizedRunner$6.evaluate(RandomizedRunner.java:816)
	at com.carrotsearch.randomizedtesting.RandomizedRunner$7.evaluate(RandomizedRunner.java:827)
	at com.carrotsearch.randomizedtesting.rules.StatementAdapter.evaluate(StatementAdapter.java:36)
	at com.carrotsearch.randomizedtesting.rules.SystemPropertiesRestoreRule$1.evaluate(SystemPropertiesRestoreRule.java:57)
	at org.apache.lucene.util.AbstractBeforeAfterRule$1.evaluate(AbstractBeforeAfterRule.java:46)
	at com.carrotsearch.randomizedtesting.rules.StatementAdapter.evaluate(StatementAdapter.java:36)
	at org.apache.lucene.util.TestRuleStoreClassName$1.evaluate(TestRuleStoreClassName.java:42)
	at com.carrotsearch.randomizedtesting.rules.NoShadowingOrOverridesOnMethodsRule$1.evaluate(NoShadowingOrOverridesOnMethodsRule.java:40)
	at com.carrotsearch.randomizedtesting.rules.NoShadowingOrOverridesOnMethodsRule$1.evaluate(NoShadowingOrOverridesOnMethodsRule.java:40)
	at com.carrotsearch.randomizedtesting.rules.StatementAdapter.evaluate(StatementAdapter.java:36)
	at com.carrotsearch.randomizedtesting.rules.StatementAdapter.evaluate(StatementAdapter.java:36)
	at com.carrotsearch.randomizedtesting.rules.StatementAdapter.evaluate(StatementAdapter.java:36)
	at org.apache.lucene.util.TestRuleAssertionsRequired$1.evaluate(TestRuleAssertionsRequired.java:54)
	at org.apache.lucene.util.TestRuleMarkFailure$1.evaluate(TestRuleMarkFailure.java:48)
	at org.apache.lucene.util.TestRuleIgnoreAfterMaxFailures$1.evaluate(TestRuleIgnoreAfterMaxFailures.java:65)
	at org.apache.lucene.util.TestRuleIgnoreTestSuites$1.evaluate(TestRuleIgnoreTestSuites.java:55)
	at com.carrotsearch.randomizedtesting.rules.StatementAdapter.evaluate(StatementAdapter.java:36)
	at com.carrotsearch.randomizedtesting.ThreadLeakControl$StatementRunner.run(ThreadLeakControl.java:367)
	at java.lang.Thread.run(Thread.java:745)


FAILED:  org.apache.solr.cloud.DistribDocExpirationUpdateProcessorTest.test

Error Message:
There are still nodes recoverying - waited for 30 seconds

Stack Trace:
java.lang.AssertionError: There are still nodes recoverying - waited for 30 seconds
	at __randomizedtesting.SeedInfo.seed([501C786580DF0D84:D84847BF2E23607C]:0)
	at org.junit.Assert.fail(Assert.java:93)
	at org.apache.solr.cloud.AbstractDistribZkTestBase.waitForRecoveriesToFinish(AbstractDistribZkTestBase.java:175)
	at org.apache.solr.cloud.AbstractFullDistribZkTestBase.waitForRecoveriesToFinish(AbstractFullDistribZkTestBase.java:837)
	at org.apache.solr.cloud.AbstractFullDistribZkTestBase.waitForThingsToLevelOut(AbstractFullDistribZkTestBase.java:1393)
	at org.apache.solr.cloud.DistribDocExpirationUpdateProcessorTest.test(DistribDocExpirationUpdateProcessorTest.java:73)
	at sun.reflect.NativeMethodAccessorImpl.invoke0(Native Method)
	at sun.reflect.NativeMethodAccessorImpl.invoke(NativeMethodAccessorImpl.java:57)
	at sun.reflect.DelegatingMethodAccessorImpl.invoke(DelegatingMethodAccessorImpl.java:43)
	at java.lang.reflect.Method.invoke(Method.java:606)
	at com.carrotsearch.randomizedtesting.RandomizedRunner.invoke(RandomizedRunner.java:1764)
	at com.carrotsearch.randomizedtesting.RandomizedRunner$8.evaluate(RandomizedRunner.java:871)
	at com.carrotsearch.randomizedtesting.RandomizedRunner$9.evaluate(RandomizedRunner.java:907)
	at com.carrotsearch.randomizedtesting.RandomizedRunner$10.evaluate(RandomizedRunner.java:921)
	at org.apache.solr.BaseDistributedSearchTestCase$ShardsRepeatRule$ShardsFixedStatement.callStatement(BaseDistributedSearchTestCase.java:965)
	at org.apache.solr.BaseDistributedSearchTestCase$ShardsRepeatRule$ShardsStatement.evaluate(BaseDistributedSearchTestCase.java:940)
	at com.carrotsearch.randomizedtesting.rules.SystemPropertiesRestoreRule$1.evaluate(SystemPropertiesRestoreRule.java:57)
	at org.apache.lucene.util.TestRuleSetupTeardownChained$1.evaluate(TestRuleSetupTeardownChained.java:50)
	at org.apache.lucene.util.AbstractBeforeAfterRule$1.evaluate(AbstractBeforeAfterRule.java:46)
	at org.apache.lucene.util.TestRuleThreadAndTestName$1.evaluate(TestRuleThreadAndTestName.java:49)
	at org.apache.lucene.util.TestRuleIgnoreAfterMaxFailures$1.evaluate(TestRuleIgnoreAfterMaxFailures.java:65)
	at org.apache.lucene.util.TestRuleMarkFailure$1.evaluate(TestRuleMarkFailure.java:48)
	at com.carrotsearch.randomizedtesting.rules.StatementAdapter.evaluate(StatementAdapter.java:36)
	at com.carrotsearch.randomizedtesting.ThreadLeakControl$StatementRunner.run(ThreadLeakControl.java:367)
	at com.carrotsearch.randomizedtesting.ThreadLeakControl.forkTimeoutingTask(ThreadLeakControl.java:809)
	at com.carrotsearch.randomizedtesting.ThreadLeakControl$3.evaluate(ThreadLeakControl.java:460)
	at com.carrotsearch.randomizedtesting.RandomizedRunner.runSingleTest(RandomizedRunner.java:880)
	at com.carrotsearch.randomizedtesting.RandomizedRunner$5.evaluate(RandomizedRunner.java:781)
	at com.carrotsearch.randomizedtesting.RandomizedRunner$6.evaluate(RandomizedRunner.java:816)
	at com.carrotsearch.randomizedtesting.RandomizedRunner$7.evaluate(RandomizedRunner.java:827)
	at com.carrotsearch.randomizedtesting.rules.StatementAdapter.evaluate(StatementAdapter.java:36)
	at com.carrotsearch.randomizedtesting.rules.SystemPropertiesRestoreRule$1.evaluate(SystemPropertiesRestoreRule.java:57)
	at org.apache.lucene.util.AbstractBeforeAfterRule$1.evaluate(AbstractBeforeAfterRule.java:46)
	at com.carrotsearch.randomizedtesting.rules.StatementAdapter.evaluate(StatementAdapter.java:36)
	at org.apache.lucene.util.TestRuleStoreClassName$1.evaluate(TestRuleStoreClassName.java:42)
	at com.carrotsearch.randomizedtesting.rules.NoShadowingOrOverridesOnMethodsRule$1.evaluate(NoShadowingOrOverridesOnMethodsRule.java:40)
	at com.carrotsearch.randomizedtesting.rules.NoShadowingOrOverridesOnMethodsRule$1.evaluate(NoShadowingOrOverridesOnMethodsRule.java:40)
	at com.carrotsearch.randomizedtesting.rules.StatementAdapter.evaluate(StatementAdapter.java:36)
	at com.carrotsearch.randomizedtesting.rules.StatementAdapter.evaluate(StatementAdapter.java:36)
	at com.carrotsearch.randomizedtesting.rules.StatementAdapter.evaluate(StatementAdapter.java:36)
	at org.apache.lucene.util.TestRuleAssertionsRequired$1.evaluate(TestRuleAssertionsRequired.java:54)
	at org.apache.lucene.util.TestRuleMarkFailure$1.evaluate(TestRuleMarkFailure.java:48)
	at org.apache.lucene.util.TestRuleIgnoreAfterMaxFailures$1.evaluate(TestRuleIgnoreAfterMaxFailures.java:65)
	at org.apache.lucene.util.TestRuleIgnoreTestSuites$1.evaluate(TestRuleIgnoreTestSuites.java:55)
	at com.carrotsearch.randomizedtesting.rules.StatementAdapter.evaluate(StatementAdapter.java:36)
	at com.carrotsearch.randomizedtesting.ThreadLeakControl$StatementRunner.run(ThreadLeakControl.java:367)
	at java.lang.Thread.run(Thread.java:745)


FAILED:  org.apache.solr.cloud.DistributedVersionInfoTest.test

Error Message:
Test abandoned because suite timeout was reached.

Stack Trace:
java.lang.Exception: Test abandoned because suite timeout was reached.
	at __randomizedtesting.SeedInfo.seed([501C786580DF0D84]:0)


FAILED:  junit.framework.TestSuite.org.apache.solr.cloud.DistributedVersionInfoTest

Error Message:
Suite timeout exceeded (>= 7200000 msec).

Stack Trace:
java.lang.Exception: Suite timeout exceeded (>= 7200000 msec).
	at __randomizedtesting.SeedInfo.seed([501C786580DF0D84]:0)


FAILED:  org.apache.solr.cloud.ForceLeaderTest.testReplicasInLIRNoLeader

Error Message:
Doc with id=1 not found in http://127.0.0.1:40697/forceleader_test_collection due to: Path not found: /id; rsp={doc=null}

Stack Trace:
java.lang.AssertionError: Doc with id=1 not found in http://127.0.0.1:40697/forceleader_test_collection due to: Path not found: /id; rsp={doc=null}
	at __randomizedtesting.SeedInfo.seed([501C786580DF0D84:B68B4CA5B95DF4E5]:0)
	at org.junit.Assert.fail(Assert.java:93)
	at org.junit.Assert.assertTrue(Assert.java:43)
	at org.apache.solr.cloud.HttpPartitionTest.assertDocExists(HttpPartitionTest.java:620)
	at org.apache.solr.cloud.HttpPartitionTest.assertDocsExistInAllReplicas(HttpPartitionTest.java:573)
	at org.apache.solr.cloud.ForceLeaderTest.testReplicasInLIRNoLeader(ForceLeaderTest.java:137)
	at sun.reflect.NativeMethodAccessorImpl.invoke0(Native Method)
	at sun.reflect.NativeMethodAccessorImpl.invoke(NativeMethodAccessorImpl.java:57)
	at sun.reflect.DelegatingMethodAccessorImpl.invoke(DelegatingMethodAccessorImpl.java:43)
	at java.lang.reflect.Method.invoke(Method.java:606)
	at com.carrotsearch.randomizedtesting.RandomizedRunner.invoke(RandomizedRunner.java:1764)
	at com.carrotsearch.randomizedtesting.RandomizedRunner$8.evaluate(RandomizedRunner.java:871)
	at com.carrotsearch.randomizedtesting.RandomizedRunner$9.evaluate(RandomizedRunner.java:907)
	at com.carrotsearch.randomizedtesting.RandomizedRunner$10.evaluate(RandomizedRunner.java:921)
	at org.apache.solr.BaseDistributedSearchTestCase$ShardsRepeatRule$ShardsFixedStatement.callStatement(BaseDistributedSearchTestCase.java:965)
	at org.apache.solr.BaseDistributedSearchTestCase$ShardsRepeatRule$ShardsStatement.evaluate(BaseDistributedSearchTestCase.java:940)
	at com.carrotsearch.randomizedtesting.rules.SystemPropertiesRestoreRule$1.evaluate(SystemPropertiesRestoreRule.java:57)
	at org.apache.lucene.util.TestRuleSetupTeardownChained$1.evaluate(TestRuleSetupTeardownChained.java:50)
	at org.apache.lucene.util.AbstractBeforeAfterRule$1.evaluate(AbstractBeforeAfterRule.java:46)
	at org.apache.lucene.util.TestRuleThreadAndTestName$1.evaluate(TestRuleThreadAndTestName.java:49)
	at org.apache.lucene.util.TestRuleIgnoreAfterMaxFailures$1.evaluate(TestRuleIgnoreAfterMaxFailures.java:65)
	at org.apache.lucene.util.TestRuleMarkFailure$1.evaluate(TestRuleMarkFailure.java:48)
	at com.carrotsearch.randomizedtesting.rules.StatementAdapter.evaluate(StatementAdapter.java:36)
	at com.carrotsearch.randomizedtesting.ThreadLeakControl$StatementRunner.run(ThreadLeakControl.java:367)
	at com.carrotsearch.randomizedtesting.ThreadLeakControl.forkTimeoutingTask(ThreadLeakControl.java:809)
	at com.carrotsearch.randomizedtesting.ThreadLeakControl$3.evaluate(ThreadLeakControl.java:460)
	at com.carrotsearch.randomizedtesting.RandomizedRunner.runSingleTest(RandomizedRunner.java:880)
	at com.carrotsearch.randomizedtesting.RandomizedRunner$5.evaluate(RandomizedRunner.java:781)
	at com.carrotsearch.randomizedtesting.RandomizedRunner$6.evaluate(RandomizedRunner.java:816)
	at com.carrotsearch.randomizedtesting.RandomizedRunner$7.evaluate(RandomizedRunner.java:827)
	at com.carrotsearch.randomizedtesting.rules.StatementAdapter.evaluate(StatementAdapter.java:36)
	at com.carrotsearch.randomizedtesting.rules.SystemPropertiesRestoreRule$1.evaluate(SystemPropertiesRestoreRule.java:57)
	at org.apache.lucene.util.AbstractBeforeAfterRule$1.evaluate(AbstractBeforeAfterRule.java:46)
	at com.carrotsearch.randomizedtesting.rules.StatementAdapter.evaluate(StatementAdapter.java:36)
	at org.apache.lucene.util.TestRuleStoreClassName$1.evaluate(TestRuleStoreClassName.java:42)
	at com.carrotsearch.randomizedtesting.rules.NoShadowingOrOverridesOnMethodsRule$1.evaluate(NoShadowingOrOverridesOnMethodsRule.java:40)
	at com.carrotsearch.randomizedtesting.rules.NoShadowingOrOverridesOnMethodsRule$1.evaluate(NoShadowingOrOverridesOnMethodsRule.java:40)
	at com.carrotsearch.randomizedtesting.rules.StatementAdapter.evaluate(StatementAdapter.java:36)
	at com.carrotsearch.randomizedtesting.rules.StatementAdapter.evaluate(StatementAdapter.java:36)
	at com.carrotsearch.randomizedtesting.rules.StatementAdapter.evaluate(StatementAdapter.java:36)
	at org.apache.lucene.util.TestRuleAssertionsRequired$1.evaluate(TestRuleAssertionsRequired.java:54)
	at org.apache.lucene.util.TestRuleMarkFailure$1.evaluate(TestRuleMarkFailure.java:48)
	at org.apache.lucene.util.TestRuleIgnoreAfterMaxFailures$1.evaluate(TestRuleIgnoreAfterMaxFailures.java:65)
	at org.apache.lucene.util.TestRuleIgnoreTestSuites$1.evaluate(TestRuleIgnoreTestSuites.java:55)
	at com.carrotsearch.randomizedtesting.rules.StatementAdapter.evaluate(StatementAdapter.java:36)
	at com.carrotsearch.randomizedtesting.ThreadLeakControl$StatementRunner.run(ThreadLeakControl.java:367)
	at java.lang.Thread.run(Thread.java:745)


FAILED:  org.apache.solr.cloud.HttpPartitionTest.test

Error Message:
Unexpected achieved replication factor expected:<2> but was:<1>

Stack Trace:
java.lang.AssertionError: Unexpected achieved replication factor expected:<2> but was:<1>
	at __randomizedtesting.SeedInfo.seed([501C786580DF0D84:D84847BF2E23607C]:0)
	at org.junit.Assert.fail(Assert.java:93)
	at org.junit.Assert.failNotEquals(Assert.java:647)
	at org.junit.Assert.assertEquals(Assert.java:128)
	at org.junit.Assert.assertEquals(Assert.java:472)
	at org.apache.solr.cloud.HttpPartitionTest.testMinRf(HttpPartitionTest.java:212)
	at org.apache.solr.cloud.HttpPartitionTest.test(HttpPartitionTest.java:104)
	at sun.reflect.NativeMethodAccessorImpl.invoke0(Native Method)
	at sun.reflect.NativeMethodAccessorImpl.invoke(NativeMethodAccessorImpl.java:57)
	at sun.reflect.DelegatingMethodAccessorImpl.invoke(DelegatingMethodAccessorImpl.java:43)
	at java.lang.reflect.Method.invoke(Method.java:606)
	at com.carrotsearch.randomizedtesting.RandomizedRunner.invoke(RandomizedRunner.java:1764)
	at com.carrotsearch.randomizedtesting.RandomizedRunner$8.evaluate(RandomizedRunner.java:871)
	at com.carrotsearch.randomizedtesting.RandomizedRunner$9.evaluate(RandomizedRunner.java:907)
	at com.carrotsearch.randomizedtesting.RandomizedRunner$10.evaluate(RandomizedRunner.java:921)
	at org.apache.solr.BaseDistributedSearchTestCase$ShardsRepeatRule$ShardsFixedStatement.callStatement(BaseDistributedSearchTestCase.java:965)
	at org.apache.solr.BaseDistributedSearchTestCase$ShardsRepeatRule$ShardsStatement.evaluate(BaseDistributedSearchTestCase.java:940)
	at com.carrotsearch.randomizedtesting.rules.SystemPropertiesRestoreRule$1.evaluate(SystemPropertiesRestoreRule.java:57)
	at org.apache.lucene.util.TestRuleSetupTeardownChained$1.evaluate(TestRuleSetupTeardownChained.java:50)
	at org.apache.lucene.util.AbstractBeforeAfterRule$1.evaluate(AbstractBeforeAfterRule.java:46)
	at org.apache.lucene.util.TestRuleThreadAndTestName$1.evaluate(TestRuleThreadAndTestName.java:49)
	at org.apache.lucene.util.TestRuleIgnoreAfterMaxFailures$1.evaluate(TestRuleIgnoreAfterMaxFailures.java:65)
	at org.apache.lucene.util.TestRuleMarkFailure$1.evaluate(TestRuleMarkFailure.java:48)
	at com.carrotsearch.randomizedtesting.rules.StatementAdapter.evaluate(StatementAdapter.java:36)
	at com.carrotsearch.randomizedtesting.ThreadLeakControl$StatementRunner.run(ThreadLeakControl.java:367)
	at com.carrotsearch.randomizedtesting.ThreadLeakControl.forkTimeoutingTask(ThreadLeakControl.java:809)
	at com.carrotsearch.randomizedtesting.ThreadLeakControl$3.evaluate(ThreadLeakControl.java:460)
	at com.carrotsearch.randomizedtesting.RandomizedRunner.runSingleTest(RandomizedRunner.java:880)
	at com.carrotsearch.randomizedtesting.RandomizedRunner$5.evaluate(RandomizedRunner.java:781)
	at com.carrotsearch.randomizedtesting.RandomizedRunner$6.evaluate(RandomizedRunner.java:816)
	at com.carrotsearch.randomizedtesting.RandomizedRunner$7.evaluate(RandomizedRunner.java:827)
	at com.carrotsearch.randomizedtesting.rules.StatementAdapter.evaluate(StatementAdapter.java:36)
	at com.carrotsearch.randomizedtesting.rules.SystemPropertiesRestoreRule$1.evaluate(SystemPropertiesRestoreRule.java:57)
	at org.apache.lucene.util.AbstractBeforeAfterRule$1.evaluate(AbstractBeforeAfterRule.java:46)
	at com.carrotsearch.randomizedtesting.rules.StatementAdapter.evaluate(StatementAdapter.java:36)
	at org.apache.lucene.util.TestRuleStoreClassName$1.evaluate(TestRuleStoreClassName.java:42)
	at com.carrotsearch.randomizedtesting.rules.NoShadowingOrOverridesOnMethodsRule$1.evaluate(NoShadowingOrOverridesOnMethodsRule.java:40)
	at com.carrotsearch.randomizedtesting.rules.NoShadowingOrOverridesOnMethodsRule$1.evaluate(NoShadowingOrOverridesOnMethodsRule.java:40)
	at com.carrotsearch.randomizedtesting.rules.StatementAdapter.evaluate(StatementAdapter.java:36)
	at com.carrotsearch.randomizedtesting.rules.StatementAdapter.evaluate(StatementAdapter.java:36)
	at com.carrotsearch.randomizedtesting.rules.StatementAdapter.evaluate(StatementAdapter.java:36)
	at org.apache.lucene.util.TestRuleAssertionsRequired$1.evaluate(TestRuleAssertionsRequired.java:54)
	at org.apache.lucene.util.TestRuleMarkFailure$1.evaluate(TestRuleMarkFailure.java:48)
	at org.apache.lucene.util.TestRuleIgnoreAfterMaxFailures$1.evaluate(TestRuleIgnoreAfterMaxFailures.java:65)
	at org.apache.lucene.util.TestRuleIgnoreTestSuites$1.evaluate(TestRuleIgnoreTestSuites.java:55)
	at com.carrotsearch.randomizedtesting.rules.StatementAdapter.evaluate(StatementAdapter.java:36)
	at com.carrotsearch.randomizedtesting.ThreadLeakControl$StatementRunner.run(ThreadLeakControl.java:367)
	at java.lang.Thread.run(Thread.java:745)


FAILED:  org.apache.solr.cloud.LeaderFailoverAfterPartitionTest.test

Error Message:
Doc with id=4 not found in http://127.0.0.1:65129/c8n_1x3_lf due to: Path not found: /id; rsp={doc=null}

Stack Trace:
java.lang.AssertionError: Doc with id=4 not found in http://127.0.0.1:65129/c8n_1x3_lf due to: Path not found: /id; rsp={doc=null}
	at __randomizedtesting.SeedInfo.seed([501C786580DF0D84:D84847BF2E23607C]:0)
	at org.junit.Assert.fail(Assert.java:93)
	at org.junit.Assert.assertTrue(Assert.java:43)
	at org.apache.solr.cloud.HttpPartitionTest.assertDocExists(HttpPartitionTest.java:620)
	at org.apache.solr.cloud.HttpPartitionTest.assertDocsExistInAllReplicas(HttpPartitionTest.java:575)
	at org.apache.solr.cloud.LeaderFailoverAfterPartitionTest.testRf3WithLeaderFailover(LeaderFailoverAfterPartitionTest.java:103)
	at org.apache.solr.cloud.LeaderFailoverAfterPartitionTest.test(LeaderFailoverAfterPartitionTest.java:56)
	at sun.reflect.NativeMethodAccessorImpl.invoke0(Native Method)
	at sun.reflect.NativeMethodAccessorImpl.invoke(NativeMethodAccessorImpl.java:57)
	at sun.reflect.DelegatingMethodAccessorImpl.invoke(DelegatingMethodAccessorImpl.java:43)
	at java.lang.reflect.Method.invoke(Method.java:606)
	at com.carrotsearch.randomizedtesting.RandomizedRunner.invoke(RandomizedRunner.java:1764)
	at com.carrotsearch.randomizedtesting.RandomizedRunner$8.evaluate(RandomizedRunner.java:871)
	at com.carrotsearch.randomizedtesting.RandomizedRunner$9.evaluate(RandomizedRunner.java:907)
	at com.carrotsearch.randomizedtesting.RandomizedRunner$10.evaluate(RandomizedRunner.java:921)
	at org.apache.solr.BaseDistributedSearchTestCase$ShardsRepeatRule$ShardsFixedStatement.callStatement(BaseDistributedSearchTestCase.java:965)
	at org.apache.solr.BaseDistributedSearchTestCase$ShardsRepeatRule$ShardsStatement.evaluate(BaseDistributedSearchTestCase.java:940)
	at com.carrotsearch.randomizedtesting.rules.SystemPropertiesRestoreRule$1.evaluate(SystemPropertiesRestoreRule.java:57)
	at org.apache.lucene.util.TestRuleSetupTeardownChained$1.evaluate(TestRuleSetupTeardownChained.java:50)
	at org.apache.lucene.util.AbstractBeforeAfterRule$1.evaluate(AbstractBeforeAfterRule.java:46)
	at org.apache.lucene.util.TestRuleThreadAndTestName$1.evaluate(TestRuleThreadAndTestName.java:49)
	at org.apache.lucene.util.TestRuleIgnoreAfterMaxFailures$1.evaluate(TestRuleIgnoreAfterMaxFailures.java:65)
	at org.apache.lucene.util.TestRuleMarkFailure$1.evaluate(TestRuleMarkFailure.java:48)
	at com.carrotsearch.randomizedtesting.rules.StatementAdapter.evaluate(StatementAdapter.java:36)
	at com.carrotsearch.randomizedtesting.ThreadLeakControl$StatementRunner.run(ThreadLeakControl.java:367)
	at com.carrotsearch.randomizedtesting.ThreadLeakControl.forkTimeoutingTask(ThreadLeakControl.java:809)
	at com.carrotsearch.randomizedtesting.ThreadLeakControl$3.evaluate(ThreadLeakControl.java:460)
	at com.carrotsearch.randomizedtesting.RandomizedRunner.runSingleTest(RandomizedRunner.java:880)
	at com.carrotsearch.randomizedtesting.RandomizedRunner$5.evaluate(RandomizedRunner.java:781)
	at com.carrotsearch.randomizedtesting.RandomizedRunner$6.evaluate(RandomizedRunner.java:816)
	at com.carrotsearch.randomizedtesting.RandomizedRunner$7.evaluate(RandomizedRunner.java:827)
	at com.carrotsearch.randomizedtesting.rules.StatementAdapter.evaluate(StatementAdapter.java:36)
	at com.carrotsearch.randomizedtesting.rules.SystemPropertiesRestoreRule$1.evaluate(SystemPropertiesRestoreRule.java:57)
	at org.apache.lucene.util.AbstractBeforeAfterRule$1.evaluate(AbstractBeforeAfterRule.java:46)
	at com.carrotsearch.randomizedtesting.rules.StatementAdapter.evaluate(StatementAdapter.java:36)
	at org.apache.lucene.util.TestRuleStoreClassName$1.evaluate(TestRuleStoreClassName.java:42)
	at com.carrotsearch.randomizedtesting.rules.NoShadowingOrOverridesOnMethodsRule$1.evaluate(NoShadowingOrOverridesOnMethodsRule.java:40)
	at com.carrotsearch.randomizedtesting.rules.NoShadowingOrOverridesOnMethodsRule$1.evaluate(NoShadowingOrOverridesOnMethodsRule.java:40)
	at com.carrotsearch.randomizedtesting.rules.StatementAdapter.evaluate(StatementAdapter.java:36)
	at com.carrotsearch.randomizedtesting.rules.StatementAdapter.evaluate(StatementAdapter.java:36)
	at com.carrotsearch.randomizedtesting.rules.StatementAdapter.evaluate(StatementAdapter.java:36)
	at org.apache.lucene.util.TestRuleAssertionsRequired$1.evaluate(TestRuleAssertionsRequired.java:54)
	at org.apache.lucene.util.TestRuleMarkFailure$1.evaluate(TestRuleMarkFailure.java:48)
	at org.apache.lucene.util.TestRuleIgnoreAfterMaxFailures$1.evaluate(TestRuleIgnoreAfterMaxFailures.java:65)
	at org.apache.lucene.util.TestRuleIgnoreTestSuites$1.evaluate(TestRuleIgnoreTestSuites.java:55)
	at com.carrotsearch.randomizedtesting.rules.StatementAdapter.evaluate(StatementAdapter.java:36)
	at com.carrotsearch.randomizedtesting.ThreadLeakControl$StatementRunner.run(ThreadLeakControl.java:367)
	at java.lang.Thread.run(Thread.java:745)


FAILED:  org.apache.solr.cloud.ShardRoutingTest.test

Error Message:
expected:<[b!doc1]> but was:<[]>

Stack Trace:
java.lang.AssertionError: expected:<[b!doc1]> but was:<[]>
	at __randomizedtesting.SeedInfo.seed([501C786580DF0D84:D84847BF2E23607C]:0)
	at org.junit.Assert.fail(Assert.java:93)
	at org.junit.Assert.failNotEquals(Assert.java:647)
	at org.junit.Assert.assertEquals(Assert.java:128)
	at org.junit.Assert.assertEquals(Assert.java:147)
	at org.apache.solr.cloud.AbstractFullDistribZkTestBase.doQuery(AbstractFullDistribZkTestBase.java:1469)
	at org.apache.solr.cloud.ShardRoutingTest.doRTG(ShardRoutingTest.java:330)
	at org.apache.solr.cloud.ShardRoutingTest.doHashingTest(ShardRoutingTest.java:141)
	at org.apache.solr.cloud.ShardRoutingTest.test(ShardRoutingTest.java:110)
	at sun.reflect.NativeMethodAccessorImpl.invoke0(Native Method)
	at sun.reflect.NativeMethodAccessorImpl.invoke(NativeMethodAccessorImpl.java:57)
	at sun.reflect.DelegatingMethodAccessorImpl.invoke(DelegatingMethodAccessorImpl.java:43)
	at java.lang.reflect.Method.invoke(Method.java:606)
	at com.carrotsearch.randomizedtesting.RandomizedRunner.invoke(RandomizedRunner.java:1764)
	at com.carrotsearch.randomizedtesting.RandomizedRunner$8.evaluate(RandomizedRunner.java:871)
	at com.carrotsearch.randomizedtesting.RandomizedRunner$9.evaluate(RandomizedRunner.java:907)
	at com.carrotsearch.randomizedtesting.RandomizedRunner$10.evaluate(RandomizedRunner.java:921)
	at org.apache.solr.BaseDistributedSearchTestCase$ShardsRepeatRule$ShardsFixedStatement.callStatement(BaseDistributedSearchTestCase.java:965)
	at org.apache.solr.BaseDistributedSearchTestCase$ShardsRepeatRule$ShardsStatement.evaluate(BaseDistributedSearchTestCase.java:940)
	at com.carrotsearch.randomizedtesting.rules.SystemPropertiesRestoreRule$1.evaluate(SystemPropertiesRestoreRule.java:57)
	at org.apache.lucene.util.TestRuleSetupTeardownChained$1.evaluate(TestRuleSetupTeardownChained.java:50)
	at org.apache.lucene.util.AbstractBeforeAfterRule$1.evaluate(AbstractBeforeAfterRule.java:46)
	at org.apache.lucene.util.TestRuleThreadAndTestName$1.evaluate(TestRuleThreadAndTestName.java:49)
	at org.apache.lucene.util.TestRuleIgnoreAfterMaxFailures$1.evaluate(TestRuleIgnoreAfterMaxFailures.java:65)
	at org.apache.lucene.util.TestRuleMarkFailure$1.evaluate(TestRuleMarkFailure.java:48)
	at com.carrotsearch.randomizedtesting.rules.StatementAdapter.evaluate(StatementAdapter.java:36)
	at com.carrotsearch.randomizedtesting.ThreadLeakControl$StatementRunner.run(ThreadLeakControl.java:367)
	at com.carrotsearch.randomizedtesting.ThreadLeakControl.forkTimeoutingTask(ThreadLeakControl.java:809)
	at com.carrotsearch.randomizedtesting.ThreadLeakControl$3.evaluate(ThreadLeakControl.java:460)
	at com.carrotsearch.randomizedtesting.RandomizedRunner.runSingleTest(RandomizedRunner.java:880)
	at com.carrotsearch.randomizedtesting.RandomizedRunner$5.evaluate(RandomizedRunner.java:781)
	at com.carrotsearch.randomizedtesting.RandomizedRunner$6.evaluate(RandomizedRunner.java:816)
	at com.carrotsearch.randomizedtesting.RandomizedRunner$7.evaluate(RandomizedRunner.java:827)
	at com.carrotsearch.randomizedtesting.rules.StatementAdapter.evaluate(StatementAdapter.java:36)
	at com.carrotsearch.randomizedtesting.rules.SystemPropertiesRestoreRule$1.evaluate(SystemPropertiesRestoreRule.java:57)
	at org.apache.lucene.util.AbstractBeforeAfterRule$1.evaluate(AbstractBeforeAfterRule.java:46)
	at com.carrotsearch.randomizedtesting.rules.StatementAdapter.evaluate(StatementAdapter.java:36)
	at org.apache.lucene.util.TestRuleStoreClassName$1.evaluate(TestRuleStoreClassName.java:42)
	at com.carrotsearch.randomizedtesting.rules.NoShadowingOrOverridesOnMethodsRule$1.evaluate(NoShadowingOrOverridesOnMethodsRule.java:40)
	at com.carrotsearch.randomizedtesting.rules.NoShadowingOrOverridesOnMethodsRule$1.evaluate(NoShadowingOrOverridesOnMethodsRule.java:40)
	at com.carrotsearch.randomizedtesting.rules.StatementAdapter.evaluate(StatementAdapter.java:36)
	at com.carrotsearch.randomizedtesting.rules.StatementAdapter.evaluate(StatementAdapter.java:36)
	at com.carrotsearch.randomizedtesting.rules.StatementAdapter.evaluate(StatementAdapter.java:36)
	at org.apache.lucene.util.TestRuleAssertionsRequired$1.evaluate(TestRuleAssertionsRequired.java:54)
	at org.apache.lucene.util.TestRuleMarkFailure$1.evaluate(TestRuleMarkFailure.java:48)
	at org.apache.lucene.util.TestRuleIgnoreAfterMaxFailures$1.evaluate(TestRuleIgnoreAfterMaxFailures.java:65)
	at org.apache.lucene.util.TestRuleIgnoreTestSuites$1.evaluate(TestRuleIgnoreTestSuites.java:55)
	at com.carrotsearch.randomizedtesting.rules.StatementAdapter.evaluate(StatementAdapter.java:36)
	at com.carrotsearch.randomizedtesting.ThreadLeakControl$StatementRunner.run(ThreadLeakControl.java:367)
	at java.lang.Thread.run(Thread.java:745)


FAILED:  org.apache.solr.cloud.ShardSplitTest.test

Error Message:
There are still nodes recoverying - waited for 330 seconds

Stack Trace:
java.lang.AssertionError: There are still nodes recoverying - waited for 330 seconds
	at __randomizedtesting.SeedInfo.seed([501C786580DF0D84:D84847BF2E23607C]:0)
	at org.junit.Assert.fail(Assert.java:93)
	at org.apache.solr.cloud.AbstractDistribZkTestBase.waitForRecoveriesToFinish(AbstractDistribZkTestBase.java:175)
	at org.apache.solr.cloud.AbstractDistribZkTestBase.waitForRecoveriesToFinish(AbstractDistribZkTestBase.java:136)
	at org.apache.solr.cloud.AbstractDistribZkTestBase.waitForRecoveriesToFinish(AbstractDistribZkTestBase.java:131)
	at org.apache.solr.cloud.AbstractFullDistribZkTestBase.waitForRecoveriesToFinish(AbstractFullDistribZkTestBase.java:825)
	at org.apache.solr.cloud.ShardSplitTest.splitByUniqueKeyTest(ShardSplitTest.java:219)
	at org.apache.solr.cloud.ShardSplitTest.test(ShardSplitTest.java:82)
	at sun.reflect.NativeMethodAccessorImpl.invoke0(Native Method)
	at sun.reflect.NativeMethodAccessorImpl.invoke(NativeMethodAccessorImpl.java:57)
	at sun.reflect.DelegatingMethodAccessorImpl.invoke(DelegatingMethodAccessorImpl.java:43)
	at java.lang.reflect.Method.invoke(Method.java:606)
	at com.carrotsearch.randomizedtesting.RandomizedRunner.invoke(RandomizedRunner.java:1764)
	at com.carrotsearch.randomizedtesting.RandomizedRunner$8.evaluate(RandomizedRunner.java:871)
	at com.carrotsearch.randomizedtesting.RandomizedRunner$9.evaluate(RandomizedRunner.java:907)
	at com.carrotsearch.randomizedtesting.RandomizedRunner$10.evaluate(RandomizedRunner.java:921)
	at org.apache.solr.BaseDistributedSearchTestCase$ShardsRepeatRule$ShardsFixedStatement.callStatement(BaseDistributedSearchTestCase.java:965)
	at org.apache.solr.BaseDistributedSearchTestCase$ShardsRepeatRule$ShardsStatement.evaluate(BaseDistributedSearchTestCase.java:940)
	at com.carrotsearch.randomizedtesting.rules.SystemPropertiesRestoreRule$1.evaluate(SystemPropertiesRestoreRule.java:57)
	at org.apache.lucene.util.TestRuleSetupTeardownChained$1.evaluate(TestRuleSetupTeardownChained.java:50)
	at org.apache.lucene.util.AbstractBeforeAfterRule$1.evaluate(AbstractBeforeAfterRule.java:46)
	at org.apache.lucene.util.TestRuleThreadAndTestName$1.evaluate(TestRuleThreadAndTestName.java:49)
	at org.apache.lucene.util.TestRuleIgnoreAfterMaxFailures$1.evaluate(TestRuleIgnoreAfterMaxFailures.java:65)
	at org.apache.lucene.util.TestRuleMarkFailure$1.evaluate(TestRuleMarkFailure.java:48)
	at com.carrotsearch.randomizedtesting.rules.StatementAdapter.evaluate(StatementAdapter.java:36)
	at com.carrotsearch.randomizedtesting.ThreadLeakControl$StatementRunner.run(ThreadLeakControl.java:367)
	at com.carrotsearch.randomizedtesting.ThreadLeakControl.forkTimeoutingTask(ThreadLeakControl.java:809)
	at com.carrotsearch.randomizedtesting.ThreadLeakControl$3.evaluate(ThreadLeakControl.java:460)
	at com.carrotsearch.randomizedtesting.RandomizedRunner.runSingleTest(RandomizedRunner.java:880)
	at com.carrotsearch.randomizedtesting.RandomizedRunner$5.evaluate(RandomizedRunner.java:781)
	at com.carrotsearch.randomizedtesting.RandomizedRunner$6.evaluate(RandomizedRunner.java:816)
	at com.carrotsearch.randomizedtesting.RandomizedRunner$7.evaluate(RandomizedRunner.java:827)
	at com.carrotsearch.randomizedtesting.rules.StatementAdapter.evaluate(StatementAdapter.java:36)
	at com.carrotsearch.randomizedtesting.rules.SystemPropertiesRestoreRule$1.evaluate(SystemPropertiesRestoreRule.java:57)
	at org.apache.lucene.util.AbstractBeforeAfterRule$1.evaluate(AbstractBeforeAfterRule.java:46)
	at com.carrotsearch.randomizedtesting.rules.StatementAdapter.evaluate(StatementAdapter.java:36)
	at org.apache.lucene.util.TestRuleStoreClassName$1.evaluate(TestRuleStoreClassName.java:42)
	at com.carrotsearch.randomizedtesting.rules.NoShadowingOrOverridesOnMethodsRule$1.evaluate(NoShadowingOrOverridesOnMethodsRule.java:40)
	at com.carrotsearch.randomizedtesting.rules.NoShadowingOrOverridesOnMethodsRule$1.evaluate(NoShadowingOrOverridesOnMethodsRule.java:40)
	at com.carrotsearch.randomizedtesting.rules.StatementAdapter.evaluate(StatementAdapter.java:36)
	at com.carrotsearch.randomizedtesting.rules.StatementAdapter.evaluate(StatementAdapter.java:36)
	at com.carrotsearch.randomizedtesting.rules.StatementAdapter.evaluate(StatementAdapter.java:36)
	at org.apache.lucene.util.TestRuleAssertionsRequired$1.evaluate(TestRuleAssertionsRequired.java:54)
	at org.apache.lucene.util.TestRuleMarkFailure$1.evaluate(TestRuleMarkFailure.java:48)
	at org.apache.lucene.util.TestRuleIgnoreAfterMaxFailures$1.evaluate(TestRuleIgnoreAfterMaxFailures.java:65)
	at org.apache.lucene.util.TestRuleIgnoreTestSuites$1.evaluate(TestRuleIgnoreTestSuites.java:55)
	at com.carrotsearch.randomizedtesting.rules.StatementAdapter.evaluate(StatementAdapter.java:36)
	at com.carrotsearch.randomizedtesting.ThreadLeakControl$StatementRunner.run(ThreadLeakControl.java:367)
	at java.lang.Thread.run(Thread.java:745)


FAILED:  org.apache.solr.cloud.TestAuthenticationFramework.testCollectionCreateSearchDelete

Error Message:
expected:<1> but was:<0>

Stack Trace:
java.lang.AssertionError: expected:<1> but was:<0>
	at __randomizedtesting.SeedInfo.seed([501C786580DF0D84:F3E6D6C00737E721]:0)
	at org.junit.Assert.fail(Assert.java:93)
	at org.junit.Assert.failNotEquals(Assert.java:647)
	at org.junit.Assert.assertEquals(Assert.java:128)
	at org.junit.Assert.assertEquals(Assert.java:472)
	at org.junit.Assert.assertEquals(Assert.java:456)
	at org.apache.solr.cloud.TestMiniSolrCloudCluster.testCollectionCreateSearchDelete(TestMiniSolrCloudCluster.java:159)
	at sun.reflect.NativeMethodAccessorImpl.invoke0(Native Method)
	at sun.reflect.NativeMethodAccessorImpl.invoke(NativeMethodAccessorImpl.java:57)
	at sun.reflect.DelegatingMethodAccessorImpl.invoke(DelegatingMethodAccessorImpl.java:43)
	at java.lang.reflect.Method.invoke(Method.java:606)
	at com.carrotsearch.randomizedtesting.RandomizedRunner.invoke(RandomizedRunner.java:1764)
	at com.carrotsearch.randomizedtesting.RandomizedRunner$8.evaluate(RandomizedRunner.java:871)
	at com.carrotsearch.randomizedtesting.RandomizedRunner$9.evaluate(RandomizedRunner.java:907)
	at com.carrotsearch.randomizedtesting.RandomizedRunner$10.evaluate(RandomizedRunner.java:921)
	at com.carrotsearch.randomizedtesting.rules.SystemPropertiesRestoreRule$1.evaluate(SystemPropertiesRestoreRule.java:57)
	at org.apache.lucene.util.TestRuleSetupTeardownChained$1.evaluate(TestRuleSetupTeardownChained.java:50)
	at org.apache.lucene.util.AbstractBeforeAfterRule$1.evaluate(AbstractBeforeAfterRule.java:46)
	at org.apache.lucene.util.TestRuleThreadAndTestName$1.evaluate(TestRuleThreadAndTestName.java:49)
	at org.apache.lucene.util.TestRuleIgnoreAfterMaxFailures$1.evaluate(TestRuleIgnoreAfterMaxFailures.java:65)
	at org.apache.lucene.util.TestRuleMarkFailure$1.evaluate(TestRuleMarkFailure.java:48)
	at com.carrotsearch.randomizedtesting.rules.StatementAdapter.evaluate(StatementAdapter.java:36)
	at com.carrotsearch.randomizedtesting.ThreadLeakControl$StatementRunner.run(ThreadLeakControl.java:367)
	at com.carrotsearch.randomizedtesting.ThreadLeakControl.forkTimeoutingTask(ThreadLeakControl.java:809)
	at com.carrotsearch.randomizedtesting.ThreadLeakControl$3.evaluate(ThreadLeakControl.java:460)
	at com.carrotsearch.randomizedtesting.RandomizedRunner.runSingleTest(RandomizedRunner.java:880)
	at com.carrotsearch.randomizedtesting.RandomizedRunner$5.evaluate(RandomizedRunner.java:781)
	at com.carrotsearch.randomizedtesting.RandomizedRunner$6.evaluate(RandomizedRunner.java:816)
	at com.carrotsearch.randomizedtesting.RandomizedRunner$7.evaluate(RandomizedRunner.java:827)
	at com.carrotsearch.randomizedtesting.rules.StatementAdapter.evaluate(StatementAdapter.java:36)
	at com.carrotsearch.randomizedtesting.rules.SystemPropertiesRestoreRule$1.evaluate(SystemPropertiesRestoreRule.java:57)
	at org.apache.lucene.util.AbstractBeforeAfterRule$1.evaluate(AbstractBeforeAfterRule.java:46)
	at com.carrotsearch.randomizedtesting.rules.StatementAdapter.evaluate(StatementAdapter.java:36)
	at org.apache.lucene.util.TestRuleStoreClassName$1.evaluate(TestRuleStoreClassName.java:42)
	at com.carrotsearch.randomizedtesting.rules.NoShadowingOrOverridesOnMethodsRule$1.evaluate(NoShadowingOrOverridesOnMethodsRule.java:40)
	at com.carrotsearch.randomizedtesting.rules.NoShadowingOrOverridesOnMethodsRule$1.evaluate(NoShadowingOrOverridesOnMethodsRule.java:40)
	at com.carrotsearch.randomizedtesting.rules.StatementAdapter.evaluate(StatementAdapter.java:36)
	at com.carrotsearch.randomizedtesting.rules.StatementAdapter.evaluate(StatementAdapter.java:36)
	at com.carrotsearch.randomizedtesting.rules.StatementAdapter.evaluate(StatementAdapter.java:36)
	at org.apache.lucene.util.TestRuleAssertionsRequired$1.evaluate(TestRuleAssertionsRequired.java:54)
	at org.apache.lucene.util.TestRuleMarkFailure$1.evaluate(TestRuleMarkFailure.java:48)
	at org.apache.lucene.util.TestRuleIgnoreAfterMaxFailures$1.evaluate(TestRuleIgnoreAfterMaxFailures.java:65)
	at org.apache.lucene.util.TestRuleIgnoreTestSuites$1.evaluate(TestRuleIgnoreTestSuites.java:55)
	at com.carrotsearch.randomizedtesting.rules.StatementAdapter.evaluate(StatementAdapter.java:36)
	at com.carrotsearch.randomizedtesting.ThreadLeakControl$StatementRunner.run(ThreadLeakControl.java:367)
	at java.lang.Thread.run(Thread.java:745)


FAILED:  org.apache.solr.cloud.TestDistribDocBasedVersion.test

Error Message:
expected:<{b!doc123=100}> but was:<{}>

Stack Trace:
java.lang.AssertionError: expected:<{b!doc123=100}> but was:<{}>
	at __randomizedtesting.SeedInfo.seed([501C786580DF0D84:D84847BF2E23607C]:0)
	at org.junit.Assert.fail(Assert.java:93)
	at org.junit.Assert.failNotEquals(Assert.java:647)
	at org.junit.Assert.assertEquals(Assert.java:128)
	at org.junit.Assert.assertEquals(Assert.java:147)
	at org.apache.solr.cloud.TestDistribDocBasedVersion.doRTG(TestDistribDocBasedVersion.java:329)
	at org.apache.solr.cloud.TestDistribDocBasedVersion.doTestDocVersions(TestDistribDocBasedVersion.java:179)
	at org.apache.solr.cloud.TestDistribDocBasedVersion.test(TestDistribDocBasedVersion.java:105)
	at sun.reflect.NativeMethodAccessorImpl.invoke0(Native Method)
	at sun.reflect.NativeMethodAccessorImpl.invoke(NativeMethodAccessorImpl.java:57)
	at sun.reflect.DelegatingMethodAccessorImpl.invoke(DelegatingMethodAccessorImpl.java:43)
	at java.lang.reflect.Method.invoke(Method.java:606)
	at com.carrotsearch.randomizedtesting.RandomizedRunner.invoke(RandomizedRunner.java:1764)
	at com.carrotsearch.randomizedtesting.RandomizedRunner$8.evaluate(RandomizedRunner.java:871)
	at com.carrotsearch.randomizedtesting.RandomizedRunner$9.evaluate(RandomizedRunner.java:907)
	at com.carrotsearch.randomizedtesting.RandomizedRunner$10.evaluate(RandomizedRunner.java:921)
	at org.apache.solr.BaseDistributedSearchTestCase$ShardsRepeatRule$ShardsFixedStatement.callStatement(BaseDistributedSearchTestCase.java:965)
	at org.apache.solr.BaseDistributedSearchTestCase$ShardsRepeatRule$ShardsStatement.evaluate(BaseDistributedSearchTestCase.java:940)
	at com.carrotsearch.randomizedtesting.rules.SystemPropertiesRestoreRule$1.evaluate(SystemPropertiesRestoreRule.java:57)
	at org.apache.lucene.util.TestRuleSetupTeardownChained$1.evaluate(TestRuleSetupTeardownChained.java:50)
	at org.apache.lucene.util.AbstractBeforeAfterRule$1.evaluate(AbstractBeforeAfterRule.java:46)
	at org.apache.lucene.util.TestRuleThreadAndTestName$1.evaluate(TestRuleThreadAndTestName.java:49)
	at org.apache.lucene.util.TestRuleIgnoreAfterMaxFailures$1.evaluate(TestRuleIgnoreAfterMaxFailures.java:65)
	at org.apache.lucene.util.TestRuleMarkFailure$1.evaluate(TestRuleMarkFailure.java:48)
	at com.carrotsearch.randomizedtesting.rules.StatementAdapter.evaluate(StatementAdapter.java:36)
	at com.carrotsearch.randomizedtesting.ThreadLeakControl$StatementRunner.run(ThreadLeakControl.java:367)
	at com.carrotsearch.randomizedtesting.ThreadLeakControl.forkTimeoutingTask(ThreadLeakControl.java:809)
	at com.carrotsearch.randomizedtesting.ThreadLeakControl$3.evaluate(ThreadLeakControl.java:460)
	at com.carrotsearch.randomizedtesting.RandomizedRunner.runSingleTest(RandomizedRunner.java:880)
	at com.carrotsearch.randomizedtesting.RandomizedRunner$5.evaluate(RandomizedRunner.java:781)
	at com.carrotsearch.randomizedtesting.RandomizedRunner$6.evaluate(RandomizedRunner.java:816)
	at com.carrotsearch.randomizedtesting.RandomizedRunner$7.evaluate(RandomizedRunner.java:827)
	at com.carrotsearch.randomizedtesting.rules.StatementAdapter.evaluate(StatementAdapter.java:36)
	at com.carrotsearch.randomizedtesting.rules.SystemPropertiesRestoreRule$1.evaluate(SystemPropertiesRestoreRule.java:57)
	at org.apache.lucene.util.AbstractBeforeAfterRule$1.evaluate(AbstractBeforeAfterRule.java:46)
	at com.carrotsearch.randomizedtesting.rules.StatementAdapter.evaluate(StatementAdapter.java:36)
	at org.apache.lucene.util.TestRuleStoreClassName$1.evaluate(TestRuleStoreClassName.java:42)
	at com.carrotsearch.randomizedtesting.rules.NoShadowingOrOverridesOnMethodsRule$1.evaluate(NoShadowingOrOverridesOnMethodsRule.java:40)
	at com.carrotsearch.randomizedtesting.rules.NoShadowingOrOverridesOnMethodsRule$1.evaluate(NoShadowingOrOverridesOnMethodsRule.java:40)
	at com.carrotsearch.randomizedtesting.rules.StatementAdapter.evaluate(StatementAdapter.java:36)
	at com.carrotsearch.randomizedtesting.rules.StatementAdapter.evaluate(StatementAdapter.java:36)
	at com.carrotsearch.randomizedtesting.rules.StatementAdapter.evaluate(StatementAdapter.java:36)
	at org.apache.lucene.util.TestRuleAssertionsRequired$1.evaluate(TestRuleAssertionsRequired.java:54)
	at org.apache.lucene.util.TestRuleMarkFailure$1.evaluate(TestRuleMarkFailure.java:48)
	at org.apache.lucene.util.TestRuleIgnoreAfterMaxFailures$1.evaluate(TestRuleIgnoreAfterMaxFailures.java:65)
	at org.apache.lucene.util.TestRuleIgnoreTestSuites$1.evaluate(TestRuleIgnoreTestSuites.java:55)
	at com.carrotsearch.randomizedtesting.rules.StatementAdapter.evaluate(StatementAdapter.java:36)
	at com.carrotsearch.randomizedtesting.ThreadLeakControl$StatementRunner.run(ThreadLeakControl.java:367)
	at java.lang.Thread.run(Thread.java:745)


FAILED:  org.apache.solr.schema.TestCloudSchemaless.test

Error Message:
QUERY FAILED: xpath=/response/arr[@name='fields']/lst/str[@name='name'][.='newTestFieldInt441']  request=/schema/fields?wt=xml  response=<?xml version="1.0" encoding="UTF-8"?> <response>  <lst name="responseHeader">   <int name="status">0</int>   <int name="QTime">16</int> </lst> <arr name="fields">   <lst>     <str name="name">_root_</str>     <str name="type">string</str>     <bool name="indexed">true</bool>     <bool name="stored">true</bool>     <bool name="multiValued">false</bool>   </lst>   <lst>     <str name="name">_version_</str>     <str name="type">long</str>     <bool name="indexed">true</bool>     <bool name="stored">true</bool>   </lst>   <lst>     <str name="name">constantField</str>     <str name="type">tdouble</str>   </lst>   <lst>     <str name="name">id</str>     <str name="type">string</str>     <bool name="indexed">true</bool>     <bool name="stored">true</bool>     <bool name="multiValued">false</bool>     <bool name="required">true</bool>     <bool name="uniqueKey">true</bool>   </lst>   <lst>     <str name="name">newTestFieldInt0</str>     <str name="type">tlong</str>   </lst>   <lst>     <str name="name">newTestFieldInt1</str>     <str name="type">tlong</str>   </lst>   <lst>     <str name="name">newTestFieldInt10</str>     <str name="type">tlong</str>   </lst>   <lst>     <str name="name">newTestFieldInt100</str>     <str name="type">tlong</str>   </lst>   <lst>     <str name="name">newTestFieldInt101</str>     <str name="type">tlong</str>   </lst>   <lst>     <str name="name">newTestFieldInt102</str>     <str name="type">tlong</str>   </lst>   <lst>     <str name="name">newTestFieldInt103</str>     <str name="type">tlong</str>   </lst>   <lst>     <str name="name">newTestFieldInt104</str>     <str name="type">tlong</str>   </lst>   <lst>     <str name="name">newTestFieldInt105</str>     <str name="type">tlong</str>   </lst>   <lst>     <str name="name">newTestFieldInt106</str>     <str name="type">tlong</str>   </lst>   <lst>     <str name="name">newTestFieldInt107</str>     <str name="type">tlong</str>   </lst>   <lst>     <str name="name">newTestFieldInt108</str>     <str name="type">tlong</str>   </lst>   <lst>     <str name="name">newTestFieldInt109</str>     <str name="type">tlong</str>   </lst>   <lst>     <str name="name">newTestFieldInt11</str>     <str name="type">tlong</str>   </lst>   <lst>     <str name="name">newTestFieldInt110</str>     <str name="type">tlong</str>   </lst>   <lst>     <str name="name">newTestFieldInt111</str>     <str name="type">tlong</str>   </lst>   <lst>     <str name="name">newTestFieldInt112</str>     <str name="type">tlong</str>   </lst>   <lst>     <str name="name">newTestFieldInt113</str>     <str name="type">tlong</str>   </lst>   <lst>     <str name="name">newTestFieldInt114</str>     <str name="type">tlong</str>   </lst>   <lst>     <str name="name">newTestFieldInt115</str>     <str name="type">tlong</str>   </lst>   <lst>     <str name="name">newTestFieldInt116</str>     <str name="type">tlong</str>   </lst>   <lst>     <str name="name">newTestFieldInt117</str>     <str name="type">tlong</str>   </lst>   <lst>     <str name="name">newTestFieldInt118</str>     <str name="type">tlong</str>   </lst>   <lst>     <str name="name">newTestFieldInt119</str>     <str name="type">tlong</str>   </lst>   <lst>     <str name="name">newTestFieldInt12</str>     <str name="type">tlong</str>   </lst>   <lst>     <str name="name">newTestFieldInt120</str>     <str name="type">tlong</str>   </lst>   <lst>     <str name="name">newTestFieldInt121</str>     <str name="type">tlong</str>   </lst>   <lst>     <str name="name">newTestFieldInt122</str>     <str name="type">tlong</str>   </lst>   <lst>     <str name="name">newTestFieldInt123</str>     <str name="type">tlong</str>   </lst>   <lst>     <str name="name">newTestFieldInt124</str>     <str name="type">tlong</str>   </lst>   <lst>     <str name="name">newTestFieldInt125</str>     <str name="type">tlong</str>   </lst>   <lst>     <str name="name">newTestFieldInt126</str>     <str name="type">tlong</str>   </lst>   <lst>     <str name="name">newTestFieldInt127</str>     <str name="type">tlong</str>   </lst>   <lst>     <str name="name">newTestFieldInt128</str>     <str name="type">tlong</str>   </lst>   <lst>     <str name="name">newTestFieldInt129</str>     <str name="type">tlong</str>   </lst>   <lst>     <str name="name">newTestFieldInt13</str>     <str name="type">tlong</str>   </lst>   <lst>     <str name="name">newTestFieldInt130</str>     <str name="type">tlong</str>   </lst>   <lst>     <str name="name">newTestFieldInt131</str>     <str name="type">tlong</str>   </lst>   <lst>     <str name="name">newTestFieldInt132</str>     <str name="type">tlong</str>   </lst>   <lst>     <str name="name">newTestFieldInt133</str>     <str name="type">tlong</str>   </lst>   <lst>     <str name="name">newTestFieldInt134</str>     <str name="type">tlong</str>   </lst>   <lst>     <str name="name">newTestFieldInt135</str>     <str name="type">tlong</str>   </lst>   <lst>     <str name="name">newTestFieldInt136</str>     <str name="type">tlong</str>   </lst>   <lst>     <str name="name">newTestFieldInt137</str>     <str name="type">tlong</str>   </lst>   <lst>     <str name="name">newTestFieldInt138</str>     <str name="type">tlong</str>   </lst>   <lst>     <str name="name">newTestFieldInt139</str>     <str name="type">tlong</str>   </lst>   <lst>     <str name="name">newTestFieldInt14</str>     <str name="type">tlong</str>   </lst>   <lst>     <str name="name">newTestFieldInt140</str>     <str name="type">tlong</str>   </lst>   <lst>     <str name="name">newTestFieldInt141</str>     <str name="type">tlong</str>   </lst>   <lst>     <str name="name">newTestFieldInt142</str>     <str name="type">tlong</str>   </lst>   <lst>     <str name="name">newTestFieldInt143</str>     <str name="type">tlong</str>   </lst>   <lst>     <str name="name">newTestFieldInt144</str>     <str name="type">tlong</str>   </lst>   <lst>     <str name="name">newTestFieldInt145</str>     <str name="type">tlong</str>   </lst>   <lst>     <str name="name">newTestFieldInt146</str>     <str name="type">tlong</str>   </lst>   <lst>     <str name="name">newTestFieldInt147</str>     <str name="type">tlong</str>   </lst>   <lst>     <str name="name">newTestFieldInt148</str>     <str name="type">tlong</str>   </lst>   <lst>     <str name="name">newTestFieldInt149</str>     <str name="type">tlong</str>   </lst>   <lst>     <str name="name">newTestFieldInt15</str>     <str name="type">tlong</str>   </lst>   <lst>     <str name="name">newTestFieldInt150</str>     <str name="type">tlong</str>   </lst>   <lst>     <str name="name">newTestFieldInt151</str>     <str name="type">tlong</str>   </lst>   <lst>     <str name="name">newTestFieldInt152</str>     <str name="type">tlong</str>   </lst>   <lst>     <str name="name">newTestFieldInt153</str>     <str name="type">tlong</str>   </lst>   <lst>     <str name="name">newTestFieldInt154</str>     <str name="type">tlong</str>   </lst>   <lst>     <str name="name">newTestFieldInt155</str>     <str name="type">tlong</str>   </lst>   <lst>     <str name="name">newTestFieldInt156</str>     <str name="type">tlong</str>   </lst>   <lst>     <str name="name">newTestFieldInt157</str>     <str name="type">tlong</str>   </lst>   <lst>     <str name="name">newTestFieldInt158</str>     <str name="type">tlong</str>   </lst>   <lst>     <str name="name">newTestFieldInt159</str>     <str name="type">tlong</str>   </lst>   <lst>     <str name="name">newTestFieldInt16</str>     <str name="type">tlong</str>   </lst>   <lst>     <str name="name">newTestFieldInt160</str>     <str name="type">tlong</str>   </lst>   <lst>     <str name="name">newTestFieldInt161</str>     <str name="type">tlong</str>   </lst>   <lst>     <str name="name">newTestFieldInt162</str>     <str name="type">tlong</str>   </lst>   <lst>     <str name="name">newTestFieldInt163</str>     <str name="type">tlong</str>   </lst>   <lst>     <str name="name">newTestFieldInt164</str>     <str name="type">tlong</str>   </lst>   <lst>     <str name="name">newTestFieldInt165</str>     <str name="type">tlong</str>   </lst>   <lst>     <str name="name">newTestFieldInt166</str>     <str name="type">tlong</str>   </lst>   <lst>     <str name="name">newTestFieldInt167</str>     <str name="type">tlong</str>   </lst>   <lst>     <str name="name">newTestFieldInt168</str>     <str name="type">tlong</str>   </lst>   <lst>     <str name="name">newTestFieldInt169</str>     <str name="type">tlong</str>   </lst>   <lst>     <str name="name">newTestFieldInt17</str>     <str name="type">tlong</str>   </lst>   <lst>     <str name="name">newTestFieldInt170</str>     <str name="type">tlong</str>   </lst>   <lst>     <str name="name">newTestFieldInt171</str>     <str name="type">tlong</str>   </lst>   <lst>     <str name="name">newTestFieldInt172</str>     <str name="type">tlong</str>   </lst>   <lst>     <str name="name">newTestFieldInt173</str>     <str name="type">tlong</str>   </lst>   <lst>     <str name="name">newTestFieldInt174</str>     <str name="type">tlong</str>   </lst>   <lst>     <str name="name">newTestFieldInt175</str>     <str name="type">tlong</str>   </lst>   <lst>     <str name="name">newTestFieldInt176</str>     <str name="type">tlong</str>   </lst>   <lst>     <str name="name">newTestFieldInt177</str>     <str name="type">tlong</str>   </lst>   <lst>     <str name="name">newTestFieldInt178</str>     <str name="type">tlong</str>   </lst>   <lst>     <str name="name">newTestFieldInt179</str>     <str name="type">tlong</str>   </lst>   <lst>     <str name="name">newTestFieldInt18</str>     <str name="type">tlong</str>   </lst>   <lst>     <str name="name">newTestFieldInt180</str>     <str name="type">tlong</str>   </lst>   <lst>     <str name="name">newTestFieldInt181</str>     <str name="type">tlong</str>   </lst>   <lst>     <str name="name">newTestFieldInt182</str>     <str name="type">tlong</str>   </lst>   <lst>     <str name="name">newTestFieldInt183</str>     <str name="type">tlong</str>   </lst>   <lst>     <str name="name">newTestFieldInt184</str>     <str name="type">tlong</str>   </lst>   <lst>     <str name="name">newTestFieldInt185</str>     <str name="type">tlong</str>   </lst>   <lst>     <str name="name">newTestFieldInt186</str>     <str name="type">tlong</str>   </lst>   <lst>     <str name="name">newTestFieldInt187</str>     <str name="type">tlong</str>   </lst>   <lst>     <str name="name">newTestFieldInt188</str>     <str name="type">tlong</str>   </lst>   <lst>     <str name="name">newTestFieldInt189</str>     <str name="type">tlong</str>   </lst>   <lst>     <str name="name">newTestFieldInt19</str>     <str name="type">tlong</str>   </lst>   <lst>     <str name="name">newTestFieldInt190</str>     <str name="type">tlong</str>   </lst>   <lst>     <str name="name">newTestFieldInt191</str>     <str name="type">tlong</str>   </lst>   <lst>     <str name="name">newTestFieldInt192</str>     <str name="type">tlong</str>   </lst>   <lst>     <str name="name">newTestFieldInt193</str>     <str name="type">tlong</str>   </lst>   <lst>     <str name="name">newTestFieldInt194</str>     <str name="type">tlong</str>   </lst>   <lst>     <str name="name">newTestFieldInt195</str>     <str name="type">tlong</str>   </lst>   <lst>     <str name="name">newTestFieldInt196</str>     <str name="type">tlong</str>   </lst>   <lst>     <str name="name">newTestFieldInt197</str>     <str name="type">tlong</str>   </lst>   <lst>     <str name="name">newTestFieldInt198</str>     <str name="type">tlong</str>   </lst>   <lst>     <str name="name">newTestFieldInt199</str>     <str name="type">tlong</str>   </lst>   <lst>     <str name="name">newTestFieldInt2</str>     <str name="type">tlong</str>   </lst>   <lst>     <str name="name">newTestFieldInt20</str>     <str name="type">tlong</str>   </lst>   <lst>     <str name="name">newTestFieldInt200</str>     <str name="type">tlong</str>   </lst>   <lst>     <str name="name">newTestFieldInt201</str>     <str name="type">tlong</str>   </lst>   <lst>     <str name="name">newTestFieldInt202</str>     <str name="type">tlong</str>   </lst>   <lst>     <str name="name">newTestFieldInt203</str>     <str name="type">tlong</str>   </lst>   <lst>     <str name="name">newTestFieldInt204</str>     <str name="type">tlong</str>   </lst>   <lst>     <str name="name">newTestFieldInt205</str>     <str name="type">tlong</str>   </lst>   <lst>     <str name="name">newTestFieldInt206</str>     <str name="type">tlong</str>   </lst>   <lst>     <str name="name">newTestFieldInt207</str>     <str name="type">tlong</str>   </lst>   <lst>     <str name="name">newTestFieldInt208</str>     <str name="type">tlong</str>   </lst>   <lst>     <str name="name">newTestFieldInt209</str>     <str name="type">tlong</str>   </lst>   <lst>     <str name="name">newTestFieldInt21</str>     <str name="type">tlong</str>   </lst>   <lst>     <str name="name">newTestFieldInt210</str>     <str name="type">tlong</str>   </lst>   <lst>     <str name="name">newTestFieldInt211</str>     <str name="type">tlong</str>   </lst>   <lst>     <str name="name">newTestFieldInt212</str>     <str name="type">tlong</str>   </lst>   <lst>     <str name="name">newTestFieldInt213</str>     <str name="type">tlong</str>   </lst>   <lst>     <str name="name">newTestFieldInt214</str>     <str name="type">tlong</str>   </lst>   <lst>     <str name="name">newTestFieldInt215</str>     <str name="type">tlong</str>   </lst>   <lst>     <str name="name">newTestFieldInt216</str>     <str name="type">tlong</str>   </lst>   <lst>     <str name="name">newTestFieldInt217</str>     <str name="type">tlong</str>   </lst>   <lst>     <str name="name">newTestFieldInt218</str>     <str name="type">tlong</str>   </lst>   <lst>     <str name="name">newTestFieldInt219</str>     <str name="type">tlong</str>   </lst>   <lst>     <str name="name">newTestFieldInt22</str>     <str name="type">tlong</str>   </lst>   <lst>     <str name="name">newTestFieldInt220</str>     <str name="type">tlong</str>   </lst>   <lst>     <str name="name">newTestFieldInt221</str>     <str name="type">tlong</str>   </lst>   <lst>     <str name="name">newTestFieldInt222</str>     <str name="type">tlong</str>   </lst>   <lst>     <str name="name">newTestFieldInt223</str>     <str name="type">tlong</str>   </lst>   <lst>     <str name="name">newTestFieldInt224</str>     <str name="type">tlong</str>   </lst>   <lst>     <str name="name">newTestFieldInt225</str>     <str name="type">tlong</str>   </lst>   <lst>     <str name="name">newTestFieldInt226</str>     <str name="type">tlong</str>   </lst>   <lst>     <str name="name">newTestFieldInt227</str>     <str name="type">tlong</str>   </lst>   <lst>     <str name="name">newTestFieldInt228</str>     <str name="type">tlong</str>   </lst>   <lst>     <str name="name">newTestFieldInt229</str>     <str name="type">tlong</str>   </lst>   <lst>     <str name="name">newTestFieldInt23</str>     <str name="type">tlong</str>   </lst>   <lst>     <str name="name">newTestFieldInt230</str>     <str name="type">tlong</str>   </lst>   <lst>     <str name="name">newTestFieldInt231</str>     <str name="type">tlong</str>   </lst>   <lst>     <str name="name">newTestFieldInt232</str>     <str name="type">tlong</str>   </lst>   <lst>     <str name="name">newTestFieldInt233</str>     <str name="type">tlong</str>   </lst>   <lst>     <str name="name">newTestFieldInt234</str>     <str name="type">tlong</str>   </lst>   <lst>     <str name="name">newTestFieldInt235</str>     <str name="type">tlong</str>   </lst>   <lst>     <str name="name">newTestFieldInt236</str>     <str name="type">tlong</str>   </lst>   <lst>     <str name="name">newTestFieldInt237</str>     <str name="type">tlong</str>   </lst>   <lst>     <str name="name">newTestFieldInt238</str>     <str name="type">tlong</str>   </lst>   <lst>     <str name="name">newTestFieldInt239</str>     <str name="type">tlong</str>   </lst>   <lst>     <str name="name">newTestFieldInt24</str>     <str name="type">tlong</str>   </lst>   <lst>     <str name="name">newTestFieldInt240</str>     <str name="type">tlong</str>   </lst>   <lst>     <str name="name">newTestFieldInt241</str>     <str name="type">tlong</str>   </lst>   <lst>     <str name="name">newTestFieldInt242</str>     <str name="type">tlong</str>   </lst>   <lst>     <str name="name">newTestFieldInt243</str>     <str name="type">tlong</str>   </lst>   <lst>     <str name="name">newTestFieldInt244</str>     <str name="type">tlong</str>   </lst>   <lst>     <str name="name">newTestFieldInt245</str>     <str name="type">tlong</str>   </lst>   <lst>     <str name="name">newTestFieldInt246</str>     <str name="type">tlong</str>   </lst>   <lst>     <str name="name">newTestFieldInt247</str>     <str name="type">tlong</str>   </lst>   <lst>     <str name="name">newTestFieldInt248</str>     <str name="type">tlong</str>   </lst>   <lst>     <str name="name">newTestFieldInt249</str>     <str name="type">tlong</str>   </lst>   <lst>     <str name="name">newTestFieldInt25</str>     <str name="type">tlong</str>   </lst>   <lst>     <str name="name">newTestFieldInt250</str>     <str name="type">tlong</str>   </lst>   <lst>     <str name="name">newTestFieldInt251</str>     <str name="type">tlong</str>   </lst>   <lst>     <str name="name">newTestFieldInt252</str>     <str name="type">tlong</str>   </lst>   <lst>     <str name="name">newTestFieldInt253</str>     <str name="type">tlong</str>   </lst>   <lst>     <str name="name">newTestFieldInt254</str>     <str name="type">tlong</str>   </lst>   <lst>     <str name="name">newTestFieldInt255</str>     <str name="type">tlong</str>   </lst>   <lst>     <str name="name">newTestFieldInt256</str>     <str name="type">tlong</str>   </lst>   <lst>     <str name="name">newTestFieldInt257</str>     <str name="type">tlong</str>   </lst>   <lst>     <str name="name">newTestFieldInt258</str>     <str name="type">tlong</str>   </lst>   <lst>     <str name="name">newTestFieldInt259</str>     <str name="type">tlong</str>   </lst>   <lst>     <str name="name">newTestFieldInt26</str>     <str name="type">tlong</str>   </lst>   <lst>     <str name="name">newTestFieldInt260</str>     <str name="type">tlong</str>   </lst>   <lst>     <str name="name">newTestFieldInt261</str>     <str name="type">tlong</str>   </lst>   <lst>     <str name="name">newTestFieldInt262</str>     <str name="type">tlong</str>   </lst>   <lst>     <str name="name">newTestFieldInt263</str>     <str name="type">tlong</str>   </lst>   <lst>     <str name="name">newTestFieldInt264</str>     <str name="type">tlong</str>   </lst>   <lst>     <str name="name">newTestFieldInt265</str>     <str name="type">tlong</str>   </lst>   <lst>     <str name="name">newTestFieldInt266</str>     <str name="type">tlong</str>   </lst>   <lst>     <str name="name">newTestFieldInt267</str>     <str name="type">tlong</str>   </lst>   <lst>     <str name="name">newTestFieldInt268</str>     <str name="type">tlong</str>   </lst>   <lst>     <str name="name">newTestFieldInt269</str>     <str name="type">tlong</str>   </lst>   <lst>     <str name="name">newTestFieldInt27</str>     <str name="type">tlong</str>   </lst>   <lst>     <str name="name">newTestFieldInt270</str>     <str name="type">tlong</str>   </lst>   <lst>     <str name="name">newTestFieldInt271</str>     <str name="type">tlong</str>   </lst>   <lst>     <str name="name">newTestFieldInt272</str>     <str name="type">tlong</str>   </lst>   <lst>     <str name="name">newTestFieldInt273</str>     <str name="type">tlong</str>   </lst>   <lst>     <str name="name">newTestFieldInt274</str>     <str name="type">tlong</str>   </lst>   <lst>     <str name="name">newTestFieldInt275</str>     <str name="type">tlong</str>   </lst>   <lst>     <str name="name">newTestFieldInt276</str>     <str name="type">tlong</str>   </lst>   <lst>     <str name="name">newTestFieldInt277</str>     <str name="type">tlong</str>   </lst>   <lst>     <str name="name">newTestFieldInt278</str>     <str name="type">tlong</str>   </lst>   <lst>     <str name="name">newTestFieldInt279</str>     <str name="type">tlong</str>   </lst>   <lst>     <str name="name">newTestFieldInt28</str>     <str name="type">tlong</str>   </lst>   <lst>     <str name="name">newTestFieldInt280</str>     <str name="type">tlong</str>   </lst>   <lst>     <str name="name">newTestFieldInt281</str>     <str name="type">tlong</str>   </lst>   <lst>     <str name="name">newTestFieldInt282</str>     <str name="type">tlong</str>   </lst>   <lst>     <str name="name">newTestFieldInt283</str>     <str name="type">tlong</str>   </lst>   <lst>     <str name="name">newTestFieldInt284</str>     <str name="type">tlong</str>   </lst>   <lst>     <str name="name">newTestFieldInt285</str>     <str name="type">tlong</str>   </lst>   <lst>     <str name="name">newTestFieldInt286</str>     <str name="type">tlong</str>   </lst>   <lst>     <str name="name">newTestFieldInt287</str>     <str name="type">tlong</str>   </lst>   <lst>     <str name="name">newTestFieldInt288</str>     <str name="type">tlong</str>   </lst>   <lst>     <str name="name">newTestFieldInt289</str>     <str name="type">tlong</str>   </lst>   <lst>     <str name="name">newTestFieldInt29</str>     <str name="type">tlong</str>   </lst>   <lst>     <str name="name">newTestFieldInt290</str>     <str name="type">tlong</str>   </lst>   <lst>     <str name="name">newTestFieldInt291</str>     <str name="type">tlong</str>   </lst>   <lst>     <str name="name">newTestFieldInt292</str>     <str name="type">tlong</str>   </lst>   <lst>     <str name="name">newTestFieldInt293</str>     <str name="type">tlong</str>   </lst>   <lst>     <str name="name">newTestFieldInt294</str>     <str name="type">tlong</str>   </lst>   <lst>     <str name="name">newTestFieldInt295</str>     <str name="type">tlong</str>   </lst>   <lst>     <str name="name">newTestFieldInt296</str>     <str name="type">tlong</str>   </lst>   <lst>     <str name="name">newTestFieldInt297</str>     <str name="type">tlong</str>   </lst>   <lst>     <str name="name">newTestFieldInt298</str>     <str name="type">tlong</str>   </lst>   <lst>     <str name="name">newTestFieldInt299</str>     <str name="type">tlong</str>   </lst>   <lst>     <str name="name">newTestFieldInt3</str>     <str name="type">tlong</str>   </lst>   <lst>     <str name="name">newTestFieldInt30</str>     <str name="type">tlong</str>   </lst>   <lst>     <str name="name">newTestFieldInt300</str>     <str name="type">tlong</str>   </lst>   <lst>     <str name="name">newTestFieldInt301</str>     <str name="type">tlong</str>   </lst>   <lst>     <str name="name">newTestFieldInt302</str>     <str name="type">tlong</str>   </lst>   <lst>     <str name="name">newTestFieldInt303</str>     <str name="type">tlong</str>   </lst>   <lst>     <str name="name">newTestFieldInt304</str>     <str name="type">tlong</str>   </lst>   <lst>     <str name="name">newTestFieldInt305</str>     <str name="type">tlong</str>   </lst>   <lst>     <str name="name">newTestFieldInt306</str>     <str name="type">tlong</str>   </lst>   <lst>     <str name="name">newTestFieldInt307</str>     <str name="type">tlong</str>   </lst>   <lst>     <str name="name">newTestFieldInt308</str>     <str name="type">tlong</str>   </lst>   <lst>     <str name="name">newTestFieldInt309</str>     <str name="type">tlong</str>   </lst>   <lst>     <str name="name">newTestFieldInt31</str>     <str name="type">tlong</str>   </lst>   <lst>     <str name="name">newTestFieldInt310</str>     <str name="type">tlong</str>   </lst>   <lst>     <str name="name">newTestFieldInt311</str>     <str name="type">tlong</str>   </lst>   <lst>     <str name="name">newTestFieldInt312</str>     <str name="type">tlong</str>   </lst>   <lst>     <str name="name">newTestFieldInt313</str>     <str name="type">tlong</str>   </lst>   <lst>     <str name="name">newTestFieldInt314</str>     <str name="type">tlong</str>   </lst>   <lst>     <str name="name">newTestFieldInt315</str>     <str name="type">tlong</str>   </lst>   <lst>     <str name="name">newTestFieldInt316</str>     <str name="type">tlong</str>   </lst>   <lst>     <str name="name">newTestFieldInt317</str>     <str name="type">tlong</str>   </lst>   <lst>     <str name="name">newTestFieldInt318</str>     <str name="type">tlong</str>   </lst>   <lst>     <str name="name">newTestFieldInt319</str>     <str name="type">tlong</str>   </lst>   <lst>     <str name="name">newTestFieldInt32</str>     <str name="type">tlong</str>   </lst>   <lst>     <str name="name">newTestFieldInt320</str>     <str name="type">tlong</str>   </lst>   <lst>     <str name="name">newTestFieldInt321</str>     <str name="type">tlong</str>   </lst>   <lst>     <str name="name">newTestFieldInt322</str>     <str name="type">tlong</str>   </lst>   <lst>     <str name="name">newTestFieldInt323</str>     <str name="type">tlong</str>   </lst>   <lst>     <str name="name">newTestFieldInt324</str>     <str name="type">tlong</str>   </lst>   <lst>     <str name="name">newTestFieldInt325</str>     <str name="type">tlong</str>   </lst>   <lst>     <str name="name">newTestFieldInt326</str>     <str name="type">tlong</str>   </lst>   <lst>     <str name="name">newTestFieldInt327</str>     <str name="type">tlong</str>   </lst>   <lst>     <str name="name">newTestFieldInt328</str>     <str name="type">tlong</str>   </lst>   <lst>     <str name="name">newTestFieldInt329</str>     <str name="type">tlong</str>   </lst>   <lst>     <str name="name">newTestFieldInt33</str>     <str name="type">tlong</str>   </lst>   <lst>     <str name="name">newTestFieldInt330</str>     <str name="type">tlong</str>   </lst>   <lst>     <str name="name">newTestFieldInt331</str>     <str name="type">tlong</str>   </lst>   <lst>     <str name="name">newTestFieldInt332</str>     <str name="type">tlong</str>   </lst>   <lst>     <str name="name">newTestFieldInt333</str>     <str name="type">tlong</str>   </lst>   <lst>     <str name="name">newTestFieldInt334</str>     <str name="type">tlong</str>   </lst>   <lst>     <str name="name">newTestFieldInt335</str>     <str name="type">tlong</str>   </lst>   <lst>     <str name="name">newTestFieldInt336</str>     <str name="type">tlong</str>   </lst>   <lst>     <str name="name">newTestFieldInt337</str>     <str name="type">tlong</str>   </lst>   <lst>     <str name="name">newTestFieldInt338</str>     <str name="type">tlong</str>   </lst>   <lst>     <str name="name">newTestFieldInt339</str>     <str name="type">tlong</str>   </lst>   <lst>     <str name="name">newTestFieldInt34</str>     <str name="type">tlong</str>   </lst>   <lst>     <str name="name">newTestFieldInt340</str>     <str name="type">tlong</str>   </lst>   <lst>     <str name="name">newTestFieldInt341</str>     <str name="type">tlong</str>   </lst>   <lst>     <str name="name">newTestFieldInt342</str>     <str name="type">tlong</str>   </lst>   <lst>     <str name="name">newTestFieldInt343</str>     <str name="type">tlong</str>   </lst>   <lst>     <str name="name">newTestFieldInt344</str>     <str name="type">tlong</str>   </lst>   <lst>     <str name="name">newTestFieldInt345</str>     <str name="type">tlong</str>   </lst>   <lst>     <str name="name">newTestFieldInt346</str>     <str name="type">tlong</str>   </lst>   <lst>     <str name="name">newTestFieldInt347</str>     <str name="type">tlong</str>   </lst>   <lst>     <str name="name">newTestFieldInt348</str>     <str name="type">tlong</str>   </lst>   <lst>     <str name="name">newTestFieldInt349</str>     <str name="type">tlong</str>   </lst>   <lst>     <str name="name">newTestFieldInt35</str>     <str name="type">tlong</str>   </lst>   <lst>     <str name="name">newTestFieldInt350</str>     <str name="type">tlong</str>   </lst>   <lst>     <str name="name">newTestFieldInt351</str>     <str name="type">tlong</str>   </lst>   <lst>     <str name="name">newTestFieldInt352</str>     <str name="type">tlong</str>   </lst>   <lst>     <str name="name">newTestFieldInt353</str>     <str name="type">tlong</str>   </lst>   <lst>     <str name="name">newTestFieldInt354</str>     <str name="type">tlong</str>   </lst>   <lst>     <str name="name">newTestFieldInt355</str>     <str name="type">tlong</str>   </lst>   <lst>     <str name="name">newTestFieldInt356</str>     <str name="type">tlong</str>   </lst>   <lst>     <str name="name">newTestFieldInt357</str>     <str name="type">tlong</str>   </lst>   <lst>     <str name="name">newTestFieldInt358</str>     <str name="type">tlong</str>   </lst>   <lst>     <str name="name">newTestFieldInt359</str>     <str name="type">tlong</str>   </lst>   <lst>     <str name="name">newTestFieldInt36</str>     <str name="type">tlong</str>   </lst>   <lst>     <str name="name">newTestFieldInt360</str>     <str name="type">tlong</str>   </lst>   <lst>     <str name="name">newTestFieldInt361</str>     <str name="type">tlong</str>   </lst>   <lst>     <str name="name">newTestFieldInt362</str>     <str name="type">tlong</str>   </lst>   <lst>     <str name="name">newTestFieldInt363</str>     <str name="type">tlong</str>   </lst>   <lst>     <str name="name">newTestFieldInt364</str>     <str name="type">tlong</str>   </lst>   <lst>     <str name="name">newTestFieldInt365</str>     <str name="type">tlong</str>   </lst>   <lst>     <str name="name">newTestFieldInt366</str>     <str name="type">tlong</str>   </lst>   <lst>     <str name="name">newTestFieldInt367</str>     <str name="type">tlong</str>   </lst>   <lst>     <str name="name">newTestFieldInt368</str>     <str name="type">tlong</str>   </lst>   <lst>     <str name="name">newTestFieldInt369</str>     <str name="type">tlong</str>   </lst>   <lst>     <str name="name">newTestFieldInt37</str>     <str name="type">tlong</str>   </lst>   <lst>     <str name="name">newTestFieldInt370</str>     <str name="type">tlong</str>   </lst>   <lst>     <str name="name">newTestFieldInt371</str>     <str name="type">tlong</str>   </lst>   <lst>     <str name="name">newTestFieldInt372</str>     <str name="type">tlong</str>   </lst>   <lst>     <str name="name">newTestFieldInt373</str>     <str name="type">tlong</str>   </lst>   <lst>     <str name="name">newTestFieldInt374</str>     <str name="type">tlong</str>   </lst>   <lst>     <str name="name">newTestFieldInt375</str>     <str name="type">tlong</str>   </lst>   <lst>     <str name="name">newTestFieldInt376</str>     <str name="type">tlong</str>   </lst>   <lst>     <str name="name">newTestFieldInt377</str>     <str name="type">tlong</str>   </lst>   <lst>     <str name="name">newTestFieldInt378</str>     <str name="type">tlong</str>   </lst>   <lst>     <str name="name">newTestFieldInt379</str>     <str name="type">tlong</str>   </lst>   <lst>     <str name="name">newTestFieldInt38</str>     <str name="type">tlong</str>   </lst>   <lst>     <str name="name">newTestFieldInt380</str>     <str name="type">tlong</str>   </lst>   <lst>     <str name="name">newTestFieldInt381</str>     <str name="type">tlong</str>   </lst>   <lst>     <str name="name">newTestFieldInt382</str>     <str name="type">tlong</str>   </lst>   <lst>     <str name="name">newTestFieldInt383</str>     <str name="type">tlong</str>   </lst>   <lst>     <str name="name">newTestFieldInt384</str>     <str name="type">tlong</str>   </lst>   <lst>     <str name="name">newTestFieldInt385</str>     <str name="type">tlong</str>   </lst>   <lst>     <str name="name">newTestFieldInt386</str>     <str name="type">tlong</str>   </lst>   <lst>     <str name="name">newTestFieldInt387</str>     <str name="type">tlong</str>   </lst>   <lst>     <str name="name">newTestFieldInt388</str>     <str name="type">tlong</str>   </lst>   <lst>     <str name="name">newTestFieldInt389</str>     <str name="type">tlong</str>   </lst>   <lst>     <str name="name">newTestFieldInt39</str>     <str name="type">tlong</str>   </lst>   <lst>     <str name="name">newTestFieldInt390</str>     <str name="type">tlong</str>   </lst>   <lst>     <str name="name">newTestFieldInt391</str>     <str name="type">tlong</str>   </lst>   <lst>     <str name="name">newTestFieldInt392</str>     <str name="type">tlong</str>   </lst>   <lst>     <str name="name">newTestFieldInt393</str>     <str name="type">tlong</str>   </lst>   <lst>     <str name="name">newTestFieldInt394</str>     <str name="type">tlong</str>   </lst>   <lst>     <str name="name">newTestFieldInt395</str>     <str name="type">tlong</str>   </lst>   <lst>     <str name="name">newTestFieldInt396</str>     <str name="type">tlong</str>   </lst>   <lst>     <str name="name">newTestFieldInt397</str>     <str name="type">tlong</str>   </lst>   <lst>     <str name="name">newTestFieldInt398</str>     <str name="type">tlong</str>   </lst>   <lst>     <str name="name">newTestFieldInt399</str>     <str name="type">tlong</str>   </lst>   <lst>     <str name="name">newTestFieldInt4</str>     <str name="type">tlong</str>   </lst>   <lst>     <str name="name">newTestFieldInt40</str>     <str name="type">tlong</str>   </lst>   <lst>     <str name="name">newTestFieldInt400</str>     <str name="type">tlong</str>   </lst>   <lst>     <str name="name">newTestFieldInt401</str>     <str name="type">tlong</str>   </lst>   <lst>     <str name="name">newTestFieldInt402</str>     <str name="type">tlong</str>   </lst>   <lst>     <str name="name">newTestFieldInt403</str>     <str name="type">tlong</str>   </lst>   <lst>     <str name="name">newTestFieldInt404</str>     <str name="type">tlong</str>   </lst>   <lst>     <str name="name">newTestFieldInt405</str>     <str name="type">tlong</str>   </lst>   <lst>     <str name="name">newTestFieldInt406</str>     <str name="type">tlong</str>   </lst>   <lst>     <str name="name">newTestFieldInt407</str>     <str name="type">tlong</str>   </lst>   <lst>     <str name="name">newTestFieldInt408</str>     <str name="type">tlong</str>   </lst>   <lst>     <str name="name">newTestFieldInt409</str>     <str name="type">tlong</str>   </lst>   <lst>     <str name="name">newTestFieldInt41</str>     <str name="type">tlong</str>   </lst>   <lst>     <str name="name">newTestFieldInt410</str>     <str name="type">tlong</str>   </lst>   <lst>     <str name="name">newTestFieldInt411</str>     <str name="type">tlong</str>   </lst>   <lst>     <str name="name">newTestFieldInt412</str>     <str name="type">tlong</str>   </lst>   <lst>     <str name="name">newTestFieldInt413</str>     <str name="type">tlong</str>   </lst>   <lst>     <str name="name">newTestFieldInt414</str>     <str name="type">tlong</str>   </lst>   <lst>     <str name="name">newTestFieldInt415</str>     <str name="type">tlong</str>   </lst>   <lst>     <str name="name">newTestFieldInt416</str>     <str name="type">tlong</str>   </lst>   <lst>     <str name="name">newTestFieldInt417</str>     <str name="type">tlong</str>   </lst>   <lst>     <str name="name">newTestFieldInt418</str>     <str name="type">tlong</str>   </lst>   <lst>     <str name="name">newTestFieldInt419</str>     <str name="type">tlong</str>   </lst>   <lst>     <str name="name">newTestFieldInt42</str>     <str name="type">tlong</str>   </lst>   <lst>     <str name="name">newTestFieldInt420</str>     <str name="type">tlong</str>   </lst>   <lst>     <str name="name">newTestFieldInt421</str>     <str name="type">tlong</str>   </lst>   <lst>     <str name="name">newTestFieldInt422</str>     <str name="type">tlong</str>   </lst>   <lst>     <str name="name">newTestFieldInt423</str>     <str name="type">tlong</str>   </lst>   <lst>     <str name="name">newTestFieldInt424</str>     <str name="type">tlong</str>   </lst>   <lst>     <str name="name">newTestFieldInt425</str>     <str name="type">tlong</str>   </lst>   <lst>     <str name="name">newTestFieldInt426</str>     <str name="type">tlong</str>   </lst>   <lst>     <str name="name">newTestFieldInt427</str>     <str name="type">tlong</str>   </lst>   <lst>     <str name="name">newTestFieldInt428</str>     <str name="type">tlong</str>   </lst>   <lst>     <str name="name">newTestFieldInt429</str>     <str name="type">tlong</str>   </lst>   <lst>     <str name="name">newTestFieldInt43</str>     <str name="type">tlong</str>   </lst>   <lst>     <str name="name">newTestFieldInt430</str>     <str name="type">tlong</str>   </lst>   <lst>     <str name="name">newTestFieldInt431</str>     <str name="type">tlong</str>   </lst>   <lst>     <str name="name">newTestFieldInt432</str>     <str name="type">tlong</str>   </lst>   <lst>     <str name="name">newTestFieldInt433</str>     <str name="type">tlong</str>   </lst>   <lst>     <str name="name">newTestFieldInt434</str>     <str name="type">tlong</str>   </lst>   <lst>     <str name="name">newTestFieldInt435</str>     <str name="type">tlong</str>   </lst>   <lst>     <str name="name">newTestFieldInt436</str>     <str name="type">tlong</str>   </lst>   <lst>     <str name="name">newTestFieldInt437</str>     <str name="type">tlong</str>   </lst>   <lst>     <str name="name">newTestFieldInt438</str>     <str name="type">tlong</str>   </lst>   <lst>     <str name="name">newTestFieldInt439</str>     <str name="type">tlong</str>   </lst>   <lst>     <str name="name">newTestFieldInt44</str>     <str name="type">tlong</str>   </lst>   <lst>     <str name="name">newTestFieldInt440</str>     <str name="type">tlong</str>   </lst>   <lst>     <str name="name">newTestFieldInt442</str>     <str name="type">tlong</str>   </lst>   <lst>     <str name="name">newTestFieldInt443</str>     <str name="type">tlong</str>   </lst>   <lst>     <str name="name">newTestFieldInt444</str>     <str name="type">tlong</str>   </lst>   <lst>     <str name="name">newTestFieldInt445</str>     <str name="type">tlong</str>   </lst>   <lst>     <str name="name">newTestFieldInt446</str>     <str name="type">tlong</str>   </lst>   <lst>     <str name="name">newTestFieldInt447</str>     <str name="type">tlong</str>   </lst>   <lst>     <str name="name">newTestFieldInt448</str>     <str name="type">tlong</str>   </lst>   <lst>     <str name="name">newTestFieldInt449</str>     <str name="type">tlong</str>   </lst>   <lst>     <str name="name">newTestFieldInt45</str>     <str name="type">tlong</str>   </lst>   <lst>     <str name="name">newTestFieldInt46</str>     <str name="type">tlong</str>   </lst>   <lst>     <str name="name">newTestFieldInt47</str>     <str name="type">tlong</str>   </lst>   <lst>     <str name="name">newTestFieldInt48</str>     <str name="type">tlong</str>   </lst>   <lst>     <str name="name">newTestFieldInt49</str>     <str name="type">tlong</str>   </lst>   <lst>     <str name="name">newTestFieldInt5</str>     <str name="type">tlong</str>   </lst>   <lst>     <str name="name">newTestFieldInt50</str>     <str name="type">tlong</str>   </lst>   <lst>     <str name="name">newTestFieldInt51</str>     <str name="type">tlong</str>   </lst>   <lst>     <str name="name">newTestFieldInt52</str>     <str name="type">tlong</str>   </lst>   <lst>     <str name="name">newTestFieldInt53</str>     <str name="type">tlong</str>   </lst>   <lst>     <str name="name">newTestFieldInt54</str>     <str name="type">tlong</str>   </lst>   <lst>     <str name="name">newTestFieldInt55</str>     <str name="type">tlong</str>   </lst>   <lst>     <str name="name">newTestFieldInt56</str>     <str name="type">tlong</str>   </lst>   <lst>     <str name="name">newTestFieldInt57</str>     <str name="type">tlong</str>   </lst>   <lst>     <str name="name">newTestFieldInt58</str>     <str name="type">tlong</str>   </lst>   <lst>     <str name="name">newTestFieldInt59</str>     <str name="type">tlong</str>   </lst>   <lst>     <str name="name">newTestFieldInt6</str>     <str name="type">tlong</str>   </lst>   <lst>     <str name="name">newTestFieldInt60</str>     <str name="type">tlong</str>   </lst>   <lst>     <str name="name">newTestFieldInt61</str>     <str name="type">tlong</str>   </lst>   <lst>     <str name="name">newTestFieldInt62</str>     <str name="type">tlong</str>   </lst>   <lst>     <str name="name">newTestFieldInt63</str>     <str name="type">tlong</str>   </lst>   <lst>     <str name="name">newTestFieldInt64</str>     <str name="type">tlong</str>   </lst>   <lst>     <str name="name">newTestFieldInt65</str>     <str name="type">tlong</str>   </lst>   <lst>     <str name="name">newTestFieldInt66</str>     <str name="type">tlong</str>   </lst>   <lst>     <str name="name">newTestFieldInt67</str>     <str name="type">tlong</str>   </lst>   <lst>     <str name="name">newTestFieldInt68</str>     <str name="type">tlong</str>   </lst>   <lst>     <str name="name">newTestFieldInt69</str>     <str name="type">tlong</str>   </lst>   <lst>     <str name="name">newTestFieldInt7</str>     <str name="type">tlong</str>   </lst>   <lst>     <str name="name">newTestFieldInt70</str>     <str name="type">tlong</str>   </lst>   <lst>     <str name="name">newTestFieldInt71</str>     <str name="type">tlong</str>   </lst>   <lst>     <str name="name">newTestFieldInt72</str>     <str name="type">tlong</str>   </lst>   <lst>     <str name="name">newTestFieldInt73</str>     <str name="type">tlong</str>   </lst>   <lst>     <str name="name">newTestFieldInt74</str>     <str name="type">tlong</str>   </lst>   <lst>     <str name="name">newTestFieldInt75</str>     <str name="type">tlong</str>   </lst>   <lst>     <str name="name">newTestFieldInt76</str>     <str name="type">tlong</str>   </lst>   <lst>     <str name="name">newTestFieldInt77</str>     <str name="type">tlong</str>   </lst>   <lst>     <str name="name">newTestFieldInt78</str>     <str name="type">tlong</str>   </lst>   <lst>     <str name="name">newTestFieldInt79</str>     <str name="type">tlong</str>   </lst>   <lst>     <str name="name">newTestFieldInt8</str>     <str name="type">tlong</str>   </lst>   <lst>     <str name="name">newTestFieldInt80</str>     <str name="type">tlong</str>   </lst>   <lst>     <str name="name">newTestFieldInt81</str>     <str name="type">tlong</str>   </lst>   <lst>     <str name="name">newTestFieldInt82</str>     <str name="type">tlong</str>   </lst>   <lst>     <str name="name">newTestFieldInt83</str>     <str name="type">tlong</str>   </lst>   <lst>     <str name="name">newTestFieldInt84</str>     <str name="type">tlong</str>   </lst>   <lst>     <str name="name">newTestFieldInt85</str>     <str name="type">tlong</str>   </lst>   <lst>     <str name="name">newTestFieldInt86</str>     <str name="type">tlong</str>   </lst>   <lst>     <str name="name">newTestFieldInt87</str>     <str name="type">tlong</str>   </lst>   <lst>     <str name="name">newTestFieldInt88</str>     <str name="type">tlong</str>   </lst>   <lst>     <str name="name">newTestFieldInt89</str>     <str name="type">tlong</str>   </lst>   <lst>     <str name="name">newTestFieldInt9</str>     <str name="type">tlong</str>   </lst>   <lst>     <str name="name">newTestFieldInt90</str>     <str name="type">tlong</str>   </lst>   <lst>     <str name="name">newTestFieldInt91</str>     <str name="type">tlong</str>   </lst>   <lst>     <str name="name">newTestFieldInt92</str>     <str name="type">tlong</str>   </lst>   <lst>     <str name="name">newTestFieldInt93</str>     <str name="type">tlong</str>   </lst>   <lst>     <str name="name">newTestFieldInt94</str>     <str name="type">tlong</str>   </lst>   <lst>     <str name="name">newTestFieldInt95</str>     <str name="type">tlong</str>   </lst>   <lst>     <str name="name">newTestFieldInt96</str>     <str name="type">tlong</str>   </lst>   <lst>     <str name="name">newTestFieldInt97</str>     <str name="type">tlong</str>   </lst>   <lst>     <str name="name">newTestFieldInt98</str>     <str name="type">tlong</str>   </lst>   <lst>     <str name="name">newTestFieldInt99</str>     <str name="type">tlong</str>   </lst> </arr> </response> 

Stack Trace:
java.lang.AssertionError: QUERY FAILED: xpath=/response/arr[@name='fields']/lst/str[@name='name'][.='newTestFieldInt441']  request=/schema/fields?wt=xml  response=<?xml version="1.0" encoding="UTF-8"?>
<response>

<lst name="responseHeader">
  <int name="status">0</int>
  <int name="QTime">16</int>
</lst>
<arr name="fields">
  <lst>
    <str name="name">_root_</str>
    <str name="type">string</str>
    <bool name="indexed">true</bool>
    <bool name="stored">true</bool>
    <bool name="multiValued">false</bool>
  </lst>
  <lst>
    <str name="name">_version_</str>
    <str name="type">long</str>
    <bool name="indexed">true</bool>
    <bool name="stored">true</bool>
  </lst>
  <lst>
    <str name="name">constantField</str>
    <str name="type">tdouble</str>
  </lst>
  <lst>
    <str name="name">id</str>
    <str name="type">string</str>
    <bool name="indexed">true</bool>
    <bool name="stored">true</bool>
    <bool name="multiValued">false</bool>
    <bool name="required">true</bool>
    <bool name="uniqueKey">true</bool>
  </lst>
  <lst>
    <str name="name">newTestFieldInt0</str>
    <str name="type">tlong</str>
  </lst>
  <lst>
    <str name="name">newTestFieldInt1</str>
    <str name="type">tlong</str>
  </lst>
  <lst>
    <str name="name">newTestFieldInt10</str>
    <str name="type">tlong</str>
  </lst>
  <lst>
    <str name="name">newTestFieldInt100</str>
    <str name="type">tlong</str>
  </lst>
  <lst>
    <str name="name">newTestFieldInt101</str>
    <str name="type">tlong</str>
  </lst>
  <lst>
    <str name="name">newTestFieldInt102</str>
    <str name="type">tlong</str>
  </lst>
  <lst>
    <str name="name">newTestFieldInt103</str>
    <str name="type">tlong</str>
  </lst>
  <lst>
    <str name="name">newTestFieldInt104</str>
    <str name="type">tlong</str>
  </lst>
  <lst>
    <str name="name">newTestFieldInt105</str>
    <str name="type">tlong</str>
  </lst>
  <lst>
    <str name="name">newTestFieldInt106</str>
    <str n

[...truncated too long message...]

        at org.eclipse.jetty.util.thread.QueuedThreadPool$3.run(QueuedThreadPool.java:555)
   [junit4]   2>         at java.lang.Thread.run(Thread.java:745)
   [junit4]   2>   18) Thread[id=22401, name=Thread-11009, state=TIMED_WAITING, group=TGRP-DistributedVersionInfoTest]
   [junit4]   2>         at java.lang.Thread.sleep(Native Method)
   [junit4]   2>         at org.apache.solr.cloud.AbstractFullDistribZkTestBase.sendDocsWithRetry(AbstractFullDistribZkTestBase.java:734)
   [junit4]   2>         at org.apache.solr.cloud.DistributedVersionInfoTest.sendDoc(DistributedVersionInfoTest.java:354)
   [junit4]   2>         at org.apache.solr.cloud.DistributedVersionInfoTest$1.run(DistributedVersionInfoTest.java:164)
   [junit4]   2> NOTE: test params are: codec=Asserting(Lucene54): {a_t=FSTOrd50, multiDefault=FSTOrd50, id=PostingsFormat(name=LuceneVarGapFixedInterval), intDefault=PostingsFormat(name=LuceneVarGapDocFreqInterval), timestamp=FSTOrd50, range_facet_l=FSTOrd50, range_facet_i_dv=FSTOrd50, text=BlockTreeOrds(blocksize=128), range_facet_l_dv=PostingsFormat(name=LuceneVarGapFixedInterval), _version_=PostingsFormat(name=LuceneVarGapDocFreqInterval)}, docValues:{timestamp=DocValuesFormat(name=Lucene54), range_facet_i_dv=DocValuesFormat(name=Lucene54), range_facet_l_dv=DocValuesFormat(name=Asserting)}, sim=RandomSimilarityProvider(queryNorm=true,coord=no): {}, locale=en_MT, timezone=Brazil/Acre
   [junit4]   2> NOTE: SunOS 5.11 x86/Oracle Corporation 1.7.0_91 (32-bit)/cpus=3,threads=42,free=102908272,total=536870912
   [junit4]   2> NOTE: All tests run in this JVM: [DirectSolrConnectionTest, TestReload, OpenCloseCoreStressTest, ConcurrentDeleteAndCreateCollectionTest, TestSolrDeletionPolicy2, TestInfoStreamLogging, SynonymTokenizerTest, HdfsUnloadDistributedZkTest, TestUtils, TestReversedWildcardFilterFactory, TestSystemIdResolver, TestCopyFieldCollectionResource, TestPKIAuthenticationPlugin, TestFieldTypeCollectionResource, BasicFunctionalityTest, HighlighterConfigTest, TestHdfsUpdateLog, DistribCursorPagingTest, HdfsChaosMonkeySafeLeaderTest, BlockJoinFacetSimpleTest, SolrPluginUtilsTest, TestBadConfig, SuggesterTest, DeleteInactiveReplicaTest, SortSpecParsingTest, OutputWriterTest, DistributedMLTComponentTest, DateFieldTest, AddSchemaFieldsUpdateProcessorFactoryTest, TestClassicSimilarityFactory, TestMissingGroups, DateMathParserTest, CachingDirectoryFactoryTest, TestSortByMinMaxFunction, ZkSolrClientTest, DistributedFacetPivotWhiteBoxTest, RAMDirectoryFactoryTest, TestFieldCollectionResource, TestCSVResponseWriter, TestComplexPhraseQParserPlugin, WordBreakSolrSpellCheckerTest, RequestHandlersTest, TestDocBasedVersionConstraints, TestWriterPerf, TestSolrCloudWithKerberosAlt, CoreMergeIndexesAdminHandlerTest, FacetPivotSmallTest, StressHdfsTest, VMParamsZkACLAndCredentialsProvidersTest, TestPivotHelperCode, ConjunctionSolrSpellCheckerTest, SpellCheckCollatorTest, TestDistributedStatsComponentCardinality, MinimalSchemaTest, TestFreeTextSuggestions, TestScoreJoinQPScore, HdfsRecoveryZkTest, NotRequiredUniqueKeyTest, TestDynamicLoading, TestRecoveryHdfs, SecurityConfHandlerTest, TestValueSourceCache, RecoveryAfterSoftCommitTest, BufferStoreTest, TestCollationField, ReplicationFactorTest, TestMinMaxOnMultiValuedField, UniqFieldsUpdateProcessorFactoryTest, LeaderInitiatedRecoveryOnCommitTest, DebugComponentTest, TestQuerySenderListener, TestSolrQueryParserResource, CleanupOldIndexTest, RollingRestartTest, PKIAuthenticationIntegrationTest, TestManagedResourceStorage, AsyncMigrateRouteKeyTest, SpellingQueryConverterTest, UpdateRequestProcessorFactoryTest, TestStressRecovery, DistributedDebugComponentTest, EnumFieldTest, TestCollectionAPI, TestShardHandlerFactory, TestLeaderElectionZkExpiry, SuggesterWFSTTest, TestIndexSearcher, TestCustomDocTransformer, TestFoldingMultitermQuery, DistanceFunctionTest, TestCharFilters, ZkStateReaderTest, CoreAdminCreateDiscoverTest, SignatureUpdateProcessorFactoryTest, SmileWriterTest, SolrCoreCheckLockOnStartupTest, FullSolrCloudDistribCmdsTest, TestCloudManagedSchemaConcurrent, TestLRUStatsCache, OutOfBoxZkACLAndCredentialsProvidersTest, TestDynamicFieldCollectionResource, TestRandomForceMergePolicy, TestBinaryResponseWriter, NumericFieldsTest, BasicZkTest, TestTrieFacet, SolrInfoMBeanTest, TestManagedStopFilterFactory, TestConfigSetProperties, TestSmileRequest, DistribJoinFromCollectionTest, TermVectorComponentDistributedTest, TestSolrDynamicMBean, TestCloudInspectUtil, ConvertedLegacyTest, HdfsNNFailoverTest, TestCollationFieldDocValues, TestMiniSolrCloudCluster, TestSolrIndexConfig, AssignTest, DistributedQueryComponentOptimizationTest, AnalyticsQueryTest, EchoParamsTest, SearchHandlerTest, TestBlendedInfixSuggestions, TestFuzzyAnalyzedSuggestions, PreAnalyzedUpdateProcessorTest, TestSolrQueryParser, TestNRTOpen, RequestLoggingTest, TestSchemaNameResource, FileUtilsTest, TestBulkSchemaConcurrent, TestSha256AuthenticationProvider, CacheHeaderTest, TestLMJelinekMercerSimilarityFactory, TestEmbeddedSolrServerConstructors, TestSimpleTrackingShardHandler, BasicDistributedZkTest, ChaosMonkeySafeLeaderTest, BasicDistributedZk2Test, UnloadDistributedZkTest, CollectionsAPIDistributedZkTest, SyncSliceTest, LeaderElectionIntegrationTest, RecoveryZkTest, ClusterStateUpdateTest, TestRandomFaceting, TestZkChroot, TestRandomDVFaceting, ShardRoutingCustomTest, AutoCommitTest, TestDistributedGrouping, TestRecovery, DistributedSpellCheckComponentTest, ZkControllerTest, TestRealTimeGet, TestJoin, TestStressVersions, HardAutoCommitTest, DistributedTermsComponentTest, TestRangeQuery, SimpleFacetsTest, TestSolr4Spatial, SolrCoreTest, StatsComponentTest, SpellCheckComponentTest, TestGroupingSearch, SolrCmdDistributorTest, PeerSyncTest, BadIndexSchemaTest, TestSort, TestFiltering, TestFunctionQuery, DirectUpdateHandlerTest, SoftAutoCommitTest, ShowFileRequestHandlerTest, CurrencyFieldOpenExchangeTest, SolrIndexSplitterTest, SimplePostToolTest, TestCoreDiscovery, TestExtendedDismaxParser, SuggesterFSTTest, CoreAdminHandlerTest, SuggesterTSTTest, TestTrie, SpatialFilterTest, TestCSVLoader, NoCacheHeaderTest, SchemaVersionSpecificBehaviorTest, TestPseudoReturnFields, TestUpdate, FieldMutatingUpdateProcessorTest, TestAtomicUpdateErrorCases, TestWordDelimiterFilterFactory, QueryEqualityTest, DirectUpdateHandlerOptimizeTest, DefaultValueUpdateProcessorTest, StatelessScriptUpdateProcessorFactoryTest, SortByFunctionTest, DocValuesMultiTest, TestSolrDeletionPolicy1, XsltUpdateRequestHandlerTest, LukeRequestHandlerTest, DisMaxRequestHandlerTest, TestQueryUtils, DirectSolrSpellCheckerTest, DocumentAnalysisRequestHandlerTest, TestQueryTypes, TestOmitPositions, FileBasedSpellCheckerTest, TermsComponentTest, XmlUpdateRequestHandlerTest, DocumentBuilderTest, TermVectorComponentTest, TestIndexingPerformance, RequiredFieldsTest, FieldAnalysisRequestHandlerTest, FastVectorHighlighterTest, IndexSchemaRuntimeFieldTest, LoggingHandlerTest, JSONWriterTest, QueryParsingTest, JsonLoaderTest, BinaryUpdateRequestHandlerTest, TestPHPSerializedResponseWriter, PingRequestHandlerTest, CSVRequestHandlerTest, TestComponentsName, CopyFieldTest, ResponseLogComponentTest, BadComponentTest, MultiTermTest, TestDocSet, TestBinaryField, TestElisionMultitermQuery, TestConfig, ExternalFileFieldSortTest, TestSolrCoreProperties, TestLuceneMatchVersion, SpellPossibilityIteratorTest, TestXIncludeConfig, TestDFRSimilarityFactory, TestPerFieldSimilarity, TestBM25SimilarityFactory, TestFastWriter, ResourceLoaderTest, TestFastOutputStream, OpenExchangeRatesOrgProviderTest, PluginInfoTest, TestFastLRUCache, PrimUtilsTest, TestSuggestSpellingConverter, TestSolrJ, TestDocumentBuilder, ZkNodePropsTest, SliceStateTest, UUIDFieldTest, TestRTGBase, DistributedIntervalFacetingTest, TestCrossCoreJoin, TestDistributedMissingSort, TestHighlightDedupGrouping, TestTolerantSearch, ActionThrottleTest, CloudExitableDirectoryReaderTest, CollectionReloadTest, CollectionTooManyReplicasTest, ConnectionManagerTest, DeleteReplicaTest, DeleteShardTest, DistributedQueueTest, DistributedVersionInfoTest]
   [junit4]   2> NOTE: reproduce with: ant test  -Dtestcase=DistributedVersionInfoTest -Dtests.seed=501C786580DF0D84 -Dtests.slow=true -Dtests.locale=en_MT -Dtests.timezone=Brazil/Acre -Dtests.asserts=true -Dtests.file.encoding=US-ASCII
   [junit4] ERROR   0.00s J1 | DistributedVersionInfoTest (suite) <<<
   [junit4]    > Throwable #1: java.lang.Exception: Suite timeout exceeded (>= 7200000 msec).
   [junit4]    > 	at __randomizedtesting.SeedInfo.seed([501C786580DF0D84]:0)
   [junit4] Completed [562/562 (12!)] on J1 in 7226.38s, 1 test, 2 errors <<< FAILURES!

[...truncated 19 lines...]
BUILD FAILED
/export/home/jenkins/workspace/Lucene-Solr-5.x-Solaris/build.xml:794: The following error occurred while executing this line:
/export/home/jenkins/workspace/Lucene-Solr-5.x-Solaris/build.xml:738: The following error occurred while executing this line:
/export/home/jenkins/workspace/Lucene-Solr-5.x-Solaris/build.xml:59: The following error occurred while executing this line:
/export/home/jenkins/workspace/Lucene-Solr-5.x-Solaris/solr/build.xml:233: The following error occurred while executing this line:
/export/home/jenkins/workspace/Lucene-Solr-5.x-Solaris/solr/common-build.xml:526: The following error occurred while executing this line:
/export/home/jenkins/workspace/Lucene-Solr-5.x-Solaris/lucene/common-build.xml:1444: The following error occurred while executing this line:
/export/home/jenkins/workspace/Lucene-Solr-5.x-Solaris/lucene/common-build.xml:1000: There were test failures: 562 suites (7 ignored), 2231 tests, 2 suite-level errors, 1 error, 10 failures, 54 ignored (39 assumptions) [seed: 501C786580DF0D84]

Total time: 201 minutes 47 seconds
Build step 'Invoke Ant' marked build as failure
Archiving artifacts
[WARNINGS] Skipping publisher since build result is FAILURE
Recording test results
Email was triggered for: Failure - Any
Sending email for trigger: Failure - Any



Mime
View raw message