lucene-dev mailing list archives

Site index · List index
Message view « Date » · « Thread »
Top « Date » · « Thread »
From Policeman Jenkins Server <jenk...@thetaphi.de>
Subject [JENKINS-EA] Lucene-Solr-5.x-Linux (64bit/jdk-9-ea+95) - Build # 15162 - Failure!
Date Wed, 06 Jan 2016 14:27:01 GMT
Build: http://jenkins.thetaphi.de/job/Lucene-Solr-5.x-Linux/15162/
Java: 64bit/jdk-9-ea+95 -XX:+UseCompressedOops -XX:+UseSerialGC -XX:-CompactStrings

1 tests failed.
FAILED:  org.apache.solr.cloud.CollectionsAPIDistributedZkTest.test

Error Message:
Captured an uncaught exception in thread: Thread[id=5390, name=collection0, state=RUNNABLE, group=TGRP-CollectionsAPIDistributedZkTest]

Stack Trace:
com.carrotsearch.randomizedtesting.UncaughtExceptionError: Captured an uncaught exception in thread: Thread[id=5390, name=collection0, state=RUNNABLE, group=TGRP-CollectionsAPIDistributedZkTest]
Caused by: org.apache.solr.client.solrj.impl.HttpSolrClient$RemoteSolrException: Error from server at http://127.0.0.1:34781/xvvd/m: collection already exists: awholynewstresscollection_collection0_0
	at __randomizedtesting.SeedInfo.seed([7A6E51F7D7DA9D09]:0)
	at org.apache.solr.client.solrj.impl.HttpSolrClient.executeMethod(HttpSolrClient.java:575)
	at org.apache.solr.client.solrj.impl.HttpSolrClient.request(HttpSolrClient.java:241)
	at org.apache.solr.client.solrj.impl.HttpSolrClient.request(HttpSolrClient.java:230)
	at org.apache.solr.client.solrj.impl.LBHttpSolrClient.doRequest(LBHttpSolrClient.java:372)
	at org.apache.solr.client.solrj.impl.LBHttpSolrClient.request(LBHttpSolrClient.java:325)
	at org.apache.solr.client.solrj.impl.CloudSolrClient.sendRequest(CloudSolrClient.java:1100)
	at org.apache.solr.client.solrj.impl.CloudSolrClient.requestWithRetryOnStaleState(CloudSolrClient.java:871)
	at org.apache.solr.client.solrj.impl.CloudSolrClient.request(CloudSolrClient.java:807)
	at org.apache.solr.client.solrj.SolrClient.request(SolrClient.java:1220)
	at org.apache.solr.cloud.AbstractFullDistribZkTestBase.createCollection(AbstractFullDistribZkTestBase.java:1574)
	at org.apache.solr.cloud.AbstractFullDistribZkTestBase.createCollection(AbstractFullDistribZkTestBase.java:1595)
	at org.apache.solr.cloud.CollectionsAPIDistributedZkTest$1CollectionThread.run(CollectionsAPIDistributedZkTest.java:881)




Build Log:
[...truncated 10643 lines...]
   [junit4] Suite: org.apache.solr.cloud.CollectionsAPIDistributedZkTest
   [junit4]   2> Creating dataDir: /home/jenkins/workspace/Lucene-Solr-5.x-Linux/solr/build/solr-core/test/J0/temp/solr.cloud.CollectionsAPIDistributedZkTest_7A6E51F7D7DA9D09-001/init-core-data-001
   [junit4]   2> 571790 INFO  (SUITE-CollectionsAPIDistributedZkTest-seed#[7A6E51F7D7DA9D09]-worker) [    ] o.a.s.SolrTestCaseJ4 Randomized ssl (false) and clientAuth (false)
   [junit4]   2> 571790 INFO  (SUITE-CollectionsAPIDistributedZkTest-seed#[7A6E51F7D7DA9D09]-worker) [    ] o.a.s.BaseDistributedSearchTestCase Setting hostContext system property: /xvvd/m
   [junit4]   2> 571791 INFO  (TEST-CollectionsAPIDistributedZkTest.test-seed#[7A6E51F7D7DA9D09]) [    ] o.a.s.c.ZkTestServer STARTING ZK TEST SERVER
   [junit4]   2> 571791 INFO  (Thread-2135) [    ] o.a.s.c.ZkTestServer client port:0.0.0.0/0.0.0.0:0
   [junit4]   2> 571792 INFO  (Thread-2135) [    ] o.a.s.c.ZkTestServer Starting server
   [junit4]   2> 571892 INFO  (TEST-CollectionsAPIDistributedZkTest.test-seed#[7A6E51F7D7DA9D09]) [    ] o.a.s.c.ZkTestServer start zk server on port:58415
   [junit4]   2> 571892 INFO  (TEST-CollectionsAPIDistributedZkTest.test-seed#[7A6E51F7D7DA9D09]) [    ] o.a.s.c.c.SolrZkClient Using default ZkCredentialsProvider
   [junit4]   2> 571892 INFO  (TEST-CollectionsAPIDistributedZkTest.test-seed#[7A6E51F7D7DA9D09]) [    ] o.a.s.c.c.ConnectionManager Waiting for client to connect to ZooKeeper
   [junit4]   2> 571895 INFO  (zkCallback-591-thread-1) [    ] o.a.s.c.c.ConnectionManager Watcher org.apache.solr.common.cloud.ConnectionManager@220d39bb name:ZooKeeperConnection Watcher:127.0.0.1:58415 got event WatchedEvent state:SyncConnected type:None path:null path:null type:None
   [junit4]   2> 571895 INFO  (TEST-CollectionsAPIDistributedZkTest.test-seed#[7A6E51F7D7DA9D09]) [    ] o.a.s.c.c.ConnectionManager Client is connected to ZooKeeper
   [junit4]   2> 571895 INFO  (TEST-CollectionsAPIDistributedZkTest.test-seed#[7A6E51F7D7DA9D09]) [    ] o.a.s.c.c.SolrZkClient Using default ZkACLProvider
   [junit4]   2> 571895 INFO  (TEST-CollectionsAPIDistributedZkTest.test-seed#[7A6E51F7D7DA9D09]) [    ] o.a.s.c.c.SolrZkClient makePath: /solr
   [junit4]   2> 571896 INFO  (TEST-CollectionsAPIDistributedZkTest.test-seed#[7A6E51F7D7DA9D09]) [    ] o.a.s.c.c.SolrZkClient Using default ZkCredentialsProvider
   [junit4]   2> 571897 INFO  (TEST-CollectionsAPIDistributedZkTest.test-seed#[7A6E51F7D7DA9D09]) [    ] o.a.s.c.c.ConnectionManager Waiting for client to connect to ZooKeeper
   [junit4]   2> 571897 INFO  (zkCallback-592-thread-1) [    ] o.a.s.c.c.ConnectionManager Watcher org.apache.solr.common.cloud.ConnectionManager@72837e05 name:ZooKeeperConnection Watcher:127.0.0.1:58415/solr got event WatchedEvent state:SyncConnected type:None path:null path:null type:None
   [junit4]   2> 571897 INFO  (TEST-CollectionsAPIDistributedZkTest.test-seed#[7A6E51F7D7DA9D09]) [    ] o.a.s.c.c.ConnectionManager Client is connected to ZooKeeper
   [junit4]   2> 571898 INFO  (TEST-CollectionsAPIDistributedZkTest.test-seed#[7A6E51F7D7DA9D09]) [    ] o.a.s.c.c.SolrZkClient Using default ZkACLProvider
   [junit4]   2> 571898 INFO  (TEST-CollectionsAPIDistributedZkTest.test-seed#[7A6E51F7D7DA9D09]) [    ] o.a.s.c.c.SolrZkClient makePath: /collections/collection1
   [junit4]   2> 571898 INFO  (TEST-CollectionsAPIDistributedZkTest.test-seed#[7A6E51F7D7DA9D09]) [    ] o.a.s.c.c.SolrZkClient makePath: /collections/collection1/shards
   [junit4]   2> 571899 INFO  (TEST-CollectionsAPIDistributedZkTest.test-seed#[7A6E51F7D7DA9D09]) [    ] o.a.s.c.c.SolrZkClient makePath: /collections/control_collection
   [junit4]   2> 571899 INFO  (TEST-CollectionsAPIDistributedZkTest.test-seed#[7A6E51F7D7DA9D09]) [    ] o.a.s.c.c.SolrZkClient makePath: /collections/control_collection/shards
   [junit4]   2> 571899 INFO  (TEST-CollectionsAPIDistributedZkTest.test-seed#[7A6E51F7D7DA9D09]) [    ] o.a.s.c.AbstractZkTestCase put /home/jenkins/workspace/Lucene-Solr-5.x-Linux/solr/core/src/test-files/solr/collection1/conf/solrconfig-tlog.xml to /configs/conf1/solrconfig.xml
   [junit4]   2> 571899 INFO  (TEST-CollectionsAPIDistributedZkTest.test-seed#[7A6E51F7D7DA9D09]) [    ] o.a.s.c.c.SolrZkClient makePath: /configs/conf1/solrconfig.xml
   [junit4]   2> 571900 INFO  (TEST-CollectionsAPIDistributedZkTest.test-seed#[7A6E51F7D7DA9D09]) [    ] o.a.s.c.AbstractZkTestCase put /home/jenkins/workspace/Lucene-Solr-5.x-Linux/solr/core/src/test-files/solr/collection1/conf/schema.xml to /configs/conf1/schema.xml
   [junit4]   2> 571901 INFO  (TEST-CollectionsAPIDistributedZkTest.test-seed#[7A6E51F7D7DA9D09]) [    ] o.a.s.c.c.SolrZkClient makePath: /configs/conf1/schema.xml
   [junit4]   2> 571901 INFO  (TEST-CollectionsAPIDistributedZkTest.test-seed#[7A6E51F7D7DA9D09]) [    ] o.a.s.c.AbstractZkTestCase put /home/jenkins/workspace/Lucene-Solr-5.x-Linux/solr/core/src/test-files/solr/collection1/conf/solrconfig.snippet.randomindexconfig.xml to /configs/conf1/solrconfig.snippet.randomindexconfig.xml
   [junit4]   2> 571901 INFO  (TEST-CollectionsAPIDistributedZkTest.test-seed#[7A6E51F7D7DA9D09]) [    ] o.a.s.c.c.SolrZkClient makePath: /configs/conf1/solrconfig.snippet.randomindexconfig.xml
   [junit4]   2> 571902 INFO  (TEST-CollectionsAPIDistributedZkTest.test-seed#[7A6E51F7D7DA9D09]) [    ] o.a.s.c.AbstractZkTestCase put /home/jenkins/workspace/Lucene-Solr-5.x-Linux/solr/core/src/test-files/solr/collection1/conf/stopwords.txt to /configs/conf1/stopwords.txt
   [junit4]   2> 571902 INFO  (TEST-CollectionsAPIDistributedZkTest.test-seed#[7A6E51F7D7DA9D09]) [    ] o.a.s.c.c.SolrZkClient makePath: /configs/conf1/stopwords.txt
   [junit4]   2> 571902 INFO  (TEST-CollectionsAPIDistributedZkTest.test-seed#[7A6E51F7D7DA9D09]) [    ] o.a.s.c.AbstractZkTestCase put /home/jenkins/workspace/Lucene-Solr-5.x-Linux/solr/core/src/test-files/solr/collection1/conf/protwords.txt to /configs/conf1/protwords.txt
   [junit4]   2> 571902 INFO  (TEST-CollectionsAPIDistributedZkTest.test-seed#[7A6E51F7D7DA9D09]) [    ] o.a.s.c.c.SolrZkClient makePath: /configs/conf1/protwords.txt
   [junit4]   2> 571903 INFO  (TEST-CollectionsAPIDistributedZkTest.test-seed#[7A6E51F7D7DA9D09]) [    ] o.a.s.c.AbstractZkTestCase put /home/jenkins/workspace/Lucene-Solr-5.x-Linux/solr/core/src/test-files/solr/collection1/conf/currency.xml to /configs/conf1/currency.xml
   [junit4]   2> 571903 INFO  (TEST-CollectionsAPIDistributedZkTest.test-seed#[7A6E51F7D7DA9D09]) [    ] o.a.s.c.c.SolrZkClient makePath: /configs/conf1/currency.xml
   [junit4]   2> 571903 INFO  (TEST-CollectionsAPIDistributedZkTest.test-seed#[7A6E51F7D7DA9D09]) [    ] o.a.s.c.AbstractZkTestCase put /home/jenkins/workspace/Lucene-Solr-5.x-Linux/solr/core/src/test-files/solr/collection1/conf/enumsConfig.xml to /configs/conf1/enumsConfig.xml
   [junit4]   2> 571904 INFO  (TEST-CollectionsAPIDistributedZkTest.test-seed#[7A6E51F7D7DA9D09]) [    ] o.a.s.c.c.SolrZkClient makePath: /configs/conf1/enumsConfig.xml
   [junit4]   2> 571904 INFO  (TEST-CollectionsAPIDistributedZkTest.test-seed#[7A6E51F7D7DA9D09]) [    ] o.a.s.c.AbstractZkTestCase put /home/jenkins/workspace/Lucene-Solr-5.x-Linux/solr/core/src/test-files/solr/collection1/conf/open-exchange-rates.json to /configs/conf1/open-exchange-rates.json
   [junit4]   2> 571904 INFO  (TEST-CollectionsAPIDistributedZkTest.test-seed#[7A6E51F7D7DA9D09]) [    ] o.a.s.c.c.SolrZkClient makePath: /configs/conf1/open-exchange-rates.json
   [junit4]   2> 571905 INFO  (TEST-CollectionsAPIDistributedZkTest.test-seed#[7A6E51F7D7DA9D09]) [    ] o.a.s.c.AbstractZkTestCase put /home/jenkins/workspace/Lucene-Solr-5.x-Linux/solr/core/src/test-files/solr/collection1/conf/mapping-ISOLatin1Accent.txt to /configs/conf1/mapping-ISOLatin1Accent.txt
   [junit4]   2> 571905 INFO  (TEST-CollectionsAPIDistributedZkTest.test-seed#[7A6E51F7D7DA9D09]) [    ] o.a.s.c.c.SolrZkClient makePath: /configs/conf1/mapping-ISOLatin1Accent.txt
   [junit4]   2> 571905 INFO  (TEST-CollectionsAPIDistributedZkTest.test-seed#[7A6E51F7D7DA9D09]) [    ] o.a.s.c.AbstractZkTestCase put /home/jenkins/workspace/Lucene-Solr-5.x-Linux/solr/core/src/test-files/solr/collection1/conf/old_synonyms.txt to /configs/conf1/old_synonyms.txt
   [junit4]   2> 571905 INFO  (TEST-CollectionsAPIDistributedZkTest.test-seed#[7A6E51F7D7DA9D09]) [    ] o.a.s.c.c.SolrZkClient makePath: /configs/conf1/old_synonyms.txt
   [junit4]   2> 571906 INFO  (TEST-CollectionsAPIDistributedZkTest.test-seed#[7A6E51F7D7DA9D09]) [    ] o.a.s.c.AbstractZkTestCase put /home/jenkins/workspace/Lucene-Solr-5.x-Linux/solr/core/src/test-files/solr/collection1/conf/synonyms.txt to /configs/conf1/synonyms.txt
   [junit4]   2> 571906 INFO  (TEST-CollectionsAPIDistributedZkTest.test-seed#[7A6E51F7D7DA9D09]) [    ] o.a.s.c.c.SolrZkClient makePath: /configs/conf1/synonyms.txt
   [junit4]   2> 571966 INFO  (TEST-CollectionsAPIDistributedZkTest.test-seed#[7A6E51F7D7DA9D09]) [    ] o.a.s.SolrTestCaseJ4 Writing core.properties file to /home/jenkins/workspace/Lucene-Solr-5.x-Linux/solr/build/solr-core/test/J0/temp/solr.cloud.CollectionsAPIDistributedZkTest_7A6E51F7D7DA9D09-001/control-001/cores/collection1
   [junit4]   2> 571967 INFO  (TEST-CollectionsAPIDistributedZkTest.test-seed#[7A6E51F7D7DA9D09]) [    ] o.e.j.s.Server jetty-9.2.13.v20150730
   [junit4]   2> 571968 INFO  (TEST-CollectionsAPIDistributedZkTest.test-seed#[7A6E51F7D7DA9D09]) [    ] o.e.j.s.h.ContextHandler Started o.e.j.s.ServletContextHandler@3fb84efe{/xvvd/m,null,AVAILABLE}
   [junit4]   2> 571969 INFO  (TEST-CollectionsAPIDistributedZkTest.test-seed#[7A6E51F7D7DA9D09]) [    ] o.e.j.s.ServerConnector Started ServerConnector@264b5365{HTTP/1.1}{127.0.0.1:34781}
   [junit4]   2> 571969 INFO  (TEST-CollectionsAPIDistributedZkTest.test-seed#[7A6E51F7D7DA9D09]) [    ] o.e.j.s.Server Started @573581ms
   [junit4]   2> 571969 INFO  (TEST-CollectionsAPIDistributedZkTest.test-seed#[7A6E51F7D7DA9D09]) [    ] o.a.s.c.s.e.JettySolrRunner Jetty properties: {solr.data.dir=/home/jenkins/workspace/Lucene-Solr-5.x-Linux/solr/build/solr-core/test/J0/temp/solr.cloud.CollectionsAPIDistributedZkTest_7A6E51F7D7DA9D09-001/tempDir-001/control/data, hostContext=/xvvd/m, hostPort=34781, coreRootDirectory=/home/jenkins/workspace/Lucene-Solr-5.x-Linux/solr/build/solr-core/test/J0/../../../../../../../../../home/jenkins/workspace/Lucene-Solr-5.x-Linux/solr/build/solr-core/test/J0/temp/solr.cloud.CollectionsAPIDistributedZkTest_7A6E51F7D7DA9D09-001/control-001/cores}
   [junit4]   2> 571970 INFO  (TEST-CollectionsAPIDistributedZkTest.test-seed#[7A6E51F7D7DA9D09]) [    ] o.a.s.s.SolrDispatchFilter SolrDispatchFilter.init(): sun.misc.Launcher$AppClassLoader@694f9431
   [junit4]   2> 571970 INFO  (TEST-CollectionsAPIDistributedZkTest.test-seed#[7A6E51F7D7DA9D09]) [    ] o.a.s.c.SolrResourceLoader new SolrResourceLoader for directory: '/home/jenkins/workspace/Lucene-Solr-5.x-Linux/solr/build/solr-core/test/J0/temp/solr.cloud.CollectionsAPIDistributedZkTest_7A6E51F7D7DA9D09-001/control-001'
   [junit4]   2> 571970 INFO  (TEST-CollectionsAPIDistributedZkTest.test-seed#[7A6E51F7D7DA9D09]) [    ] o.a.s.c.SolrResourceLoader JNDI not configured for solr (NoInitialContextEx)
   [junit4]   2> 571970 INFO  (TEST-CollectionsAPIDistributedZkTest.test-seed#[7A6E51F7D7DA9D09]) [    ] o.a.s.c.SolrResourceLoader solr home defaulted to 'solr/' (could not find system property or JNDI)
   [junit4]   2> 571970 INFO  (TEST-CollectionsAPIDistributedZkTest.test-seed#[7A6E51F7D7DA9D09]) [    ] o.a.s.c.c.SolrZkClient Using default ZkCredentialsProvider
   [junit4]   2> 571971 INFO  (TEST-CollectionsAPIDistributedZkTest.test-seed#[7A6E51F7D7DA9D09]) [    ] o.a.s.c.c.ConnectionManager Waiting for client to connect to ZooKeeper
   [junit4]   2> 571971 INFO  (zkCallback-593-thread-1) [    ] o.a.s.c.c.ConnectionManager Watcher org.apache.solr.common.cloud.ConnectionManager@701ce765 name:ZooKeeperConnection Watcher:127.0.0.1:58415/solr got event WatchedEvent state:SyncConnected type:None path:null path:null type:None
   [junit4]   2> 571971 INFO  (TEST-CollectionsAPIDistributedZkTest.test-seed#[7A6E51F7D7DA9D09]) [    ] o.a.s.c.c.ConnectionManager Client is connected to ZooKeeper
   [junit4]   2> 571972 INFO  (TEST-CollectionsAPIDistributedZkTest.test-seed#[7A6E51F7D7DA9D09]) [    ] o.a.s.c.c.SolrZkClient Using default ZkACLProvider
   [junit4]   2> 571972 INFO  (TEST-CollectionsAPIDistributedZkTest.test-seed#[7A6E51F7D7DA9D09]) [    ] o.a.s.s.SolrDispatchFilter Loading solr.xml from SolrHome (not found in ZooKeeper)
   [junit4]   2> 571972 INFO  (TEST-CollectionsAPIDistributedZkTest.test-seed#[7A6E51F7D7DA9D09]) [    ] o.a.s.c.SolrXmlConfig Loading container configuration from /home/jenkins/workspace/Lucene-Solr-5.x-Linux/solr/build/solr-core/test/J0/temp/solr.cloud.CollectionsAPIDistributedZkTest_7A6E51F7D7DA9D09-001/control-001/solr.xml
   [junit4]   2> 571975 INFO  (TEST-CollectionsAPIDistributedZkTest.test-seed#[7A6E51F7D7DA9D09]) [    ] o.a.s.c.CorePropertiesLocator Config-defined core root directory: /home/jenkins/workspace/Lucene-Solr-5.x-Linux/solr/build/solr-core/test/J0/../../../../../../../../../home/jenkins/workspace/Lucene-Solr-5.x-Linux/solr/build/solr-core/test/J0/temp/solr.cloud.CollectionsAPIDistributedZkTest_7A6E51F7D7DA9D09-001/control-001/cores
   [junit4]   2> 571975 INFO  (TEST-CollectionsAPIDistributedZkTest.test-seed#[7A6E51F7D7DA9D09]) [    ] o.a.s.c.CoreContainer New CoreContainer 239388310
   [junit4]   2> 571975 INFO  (TEST-CollectionsAPIDistributedZkTest.test-seed#[7A6E51F7D7DA9D09]) [    ] o.a.s.c.CoreContainer Loading cores into CoreContainer [instanceDir=/home/jenkins/workspace/Lucene-Solr-5.x-Linux/solr/build/solr-core/test/J0/temp/solr.cloud.CollectionsAPIDistributedZkTest_7A6E51F7D7DA9D09-001/control-001]
   [junit4]   2> 571975 WARN  (TEST-CollectionsAPIDistributedZkTest.test-seed#[7A6E51F7D7DA9D09]) [    ] o.a.s.c.CoreContainer Couldn't add files from /home/jenkins/workspace/Lucene-Solr-5.x-Linux/solr/build/solr-core/test/J0/temp/solr.cloud.CollectionsAPIDistributedZkTest_7A6E51F7D7DA9D09-001/control-001/lib to classpath: /home/jenkins/workspace/Lucene-Solr-5.x-Linux/solr/build/solr-core/test/J0/temp/solr.cloud.CollectionsAPIDistributedZkTest_7A6E51F7D7DA9D09-001/control-001/lib
   [junit4]   2> 571976 INFO  (TEST-CollectionsAPIDistributedZkTest.test-seed#[7A6E51F7D7DA9D09]) [    ] o.a.s.h.c.HttpShardHandlerFactory created with socketTimeout : 90000,urlScheme : ,connTimeout : 15000,maxConnectionsPerHost : 20,maxConnections : 10000,corePoolSize : 0,maximumPoolSize : 2147483647,maxThreadIdleTime : 5,sizeOfQueue : -1,fairnessPolicy : false,useRetries : false,
   [junit4]   2> 571976 INFO  (TEST-CollectionsAPIDistributedZkTest.test-seed#[7A6E51F7D7DA9D09]) [    ] o.a.s.u.UpdateShardHandler Creating UpdateShardHandler HTTP client with params: socketTimeout=340000&connTimeout=45000&retry=true
   [junit4]   2> 571977 INFO  (TEST-CollectionsAPIDistributedZkTest.test-seed#[7A6E51F7D7DA9D09]) [    ] o.a.s.l.LogWatcher SLF4J impl is org.slf4j.impl.Log4jLoggerFactory
   [junit4]   2> 571977 INFO  (TEST-CollectionsAPIDistributedZkTest.test-seed#[7A6E51F7D7DA9D09]) [    ] o.a.s.l.LogWatcher Registering Log Listener [Log4j (org.slf4j.impl.Log4jLoggerFactory)]
   [junit4]   2> 571977 INFO  (TEST-CollectionsAPIDistributedZkTest.test-seed#[7A6E51F7D7DA9D09]) [    ] o.a.s.c.ZkContainer Zookeeper client=127.0.0.1:58415/solr
   [junit4]   2> 571977 INFO  (TEST-CollectionsAPIDistributedZkTest.test-seed#[7A6E51F7D7DA9D09]) [    ] o.a.s.c.ZkController zkHost includes chroot
   [junit4]   2> 571977 INFO  (TEST-CollectionsAPIDistributedZkTest.test-seed#[7A6E51F7D7DA9D09]) [    ] o.a.s.c.c.SolrZkClient Using default ZkCredentialsProvider
   [junit4]   2> 571977 INFO  (TEST-CollectionsAPIDistributedZkTest.test-seed#[7A6E51F7D7DA9D09]) [    ] o.a.s.c.c.ConnectionManager Waiting for client to connect to ZooKeeper
   [junit4]   2> 571978 INFO  (zkCallback-595-thread-1) [    ] o.a.s.c.c.ConnectionManager Watcher org.apache.solr.common.cloud.ConnectionManager@34e354ff name:ZooKeeperConnection Watcher:127.0.0.1:58415 got event WatchedEvent state:SyncConnected type:None path:null path:null type:None
   [junit4]   2> 571979 INFO  (TEST-CollectionsAPIDistributedZkTest.test-seed#[7A6E51F7D7DA9D09]) [    ] o.a.s.c.c.ConnectionManager Client is connected to ZooKeeper
   [junit4]   2> 571979 INFO  (TEST-CollectionsAPIDistributedZkTest.test-seed#[7A6E51F7D7DA9D09]) [    ] o.a.s.c.c.SolrZkClient Using default ZkACLProvider
   [junit4]   2> 571979 INFO  (TEST-CollectionsAPIDistributedZkTest.test-seed#[7A6E51F7D7DA9D09]) [    ] o.a.s.c.c.ConnectionManager Waiting for client to connect to ZooKeeper
   [junit4]   2> 571980 INFO  (zkCallback-596-thread-1) [    ] o.a.s.c.c.ConnectionManager Watcher org.apache.solr.common.cloud.ConnectionManager@711159fd name:ZooKeeperConnection Watcher:127.0.0.1:58415/solr got event WatchedEvent state:SyncConnected type:None path:null path:null type:None
   [junit4]   2> 571980 INFO  (TEST-CollectionsAPIDistributedZkTest.test-seed#[7A6E51F7D7DA9D09]) [    ] o.a.s.c.c.ConnectionManager Client is connected to ZooKeeper
   [junit4]   2> 571981 INFO  (TEST-CollectionsAPIDistributedZkTest.test-seed#[7A6E51F7D7DA9D09]) [    ] o.a.s.c.c.SolrZkClient makePath: /overseer/queue
   [junit4]   2> 571981 INFO  (TEST-CollectionsAPIDistributedZkTest.test-seed#[7A6E51F7D7DA9D09]) [    ] o.a.s.c.c.SolrZkClient makePath: /overseer/collection-queue-work
   [junit4]   2> 571982 INFO  (TEST-CollectionsAPIDistributedZkTest.test-seed#[7A6E51F7D7DA9D09]) [    ] o.a.s.c.c.SolrZkClient makePath: /overseer/collection-map-running
   [junit4]   2> 571983 INFO  (TEST-CollectionsAPIDistributedZkTest.test-seed#[7A6E51F7D7DA9D09]) [    ] o.a.s.c.c.SolrZkClient makePath: /overseer/collection-map-completed
   [junit4]   2> 571983 INFO  (TEST-CollectionsAPIDistributedZkTest.test-seed#[7A6E51F7D7DA9D09]) [    ] o.a.s.c.c.SolrZkClient makePath: /overseer/collection-map-failure
   [junit4]   2> 571985 INFO  (TEST-CollectionsAPIDistributedZkTest.test-seed#[7A6E51F7D7DA9D09]) [    ] o.a.s.c.c.SolrZkClient makePath: /live_nodes
   [junit4]   2> 571985 INFO  (TEST-CollectionsAPIDistributedZkTest.test-seed#[7A6E51F7D7DA9D09]) [    ] o.a.s.c.c.SolrZkClient makePath: /aliases.json
   [junit4]   2> 571985 INFO  (TEST-CollectionsAPIDistributedZkTest.test-seed#[7A6E51F7D7DA9D09]) [    ] o.a.s.c.c.SolrZkClient makePath: /clusterstate.json
   [junit4]   2> 571986 INFO  (TEST-CollectionsAPIDistributedZkTest.test-seed#[7A6E51F7D7DA9D09]) [    ] o.a.s.c.c.SolrZkClient makePath: /security.json
   [junit4]   2> 571986 INFO  (TEST-CollectionsAPIDistributedZkTest.test-seed#[7A6E51F7D7DA9D09]) [    ] o.a.s.c.ZkController Register node as live in ZooKeeper:/live_nodes/127.0.0.1:34781_xvvd%2Fm
   [junit4]   2> 571986 INFO  (TEST-CollectionsAPIDistributedZkTest.test-seed#[7A6E51F7D7DA9D09]) [    ] o.a.s.c.c.SolrZkClient makePath: /live_nodes/127.0.0.1:34781_xvvd%2Fm
   [junit4]   2> 571987 INFO  (TEST-CollectionsAPIDistributedZkTest.test-seed#[7A6E51F7D7DA9D09]) [    ] o.a.s.c.c.SolrZkClient makePath: /overseer_elect
   [junit4]   2> 571987 INFO  (TEST-CollectionsAPIDistributedZkTest.test-seed#[7A6E51F7D7DA9D09]) [    ] o.a.s.c.c.SolrZkClient makePath: /overseer_elect/election
   [junit4]   2> 571987 INFO  (TEST-CollectionsAPIDistributedZkTest.test-seed#[7A6E51F7D7DA9D09]) [    ] o.a.s.c.Overseer Overseer (id=null) closing
   [junit4]   2> 571987 INFO  (TEST-CollectionsAPIDistributedZkTest.test-seed#[7A6E51F7D7DA9D09]) [    ] o.a.s.c.LeaderElector Joined leadership election with path: /overseer_elect/election/95164123797258244-127.0.0.1:34781_xvvd%2Fm-n_0000000000
   [junit4]   2> 571988 INFO  (TEST-CollectionsAPIDistributedZkTest.test-seed#[7A6E51F7D7DA9D09]) [    ] o.a.s.c.OverseerElectionContext I am going to be the leader 127.0.0.1:34781_xvvd%2Fm
   [junit4]   2> 571988 INFO  (TEST-CollectionsAPIDistributedZkTest.test-seed#[7A6E51F7D7DA9D09]) [    ] o.a.s.c.c.SolrZkClient makePath: /overseer_elect/leader
   [junit4]   2> 571988 INFO  (TEST-CollectionsAPIDistributedZkTest.test-seed#[7A6E51F7D7DA9D09]) [    ] o.a.s.c.Overseer Overseer (id=95164123797258244-127.0.0.1:34781_xvvd%2Fm-n_0000000000) starting
   [junit4]   2> 571989 INFO  (TEST-CollectionsAPIDistributedZkTest.test-seed#[7A6E51F7D7DA9D09]) [    ] o.a.s.c.c.SolrZkClient makePath: /overseer/queue-work
   [junit4]   2> 571990 INFO  (TEST-CollectionsAPIDistributedZkTest.test-seed#[7A6E51F7D7DA9D09]) [    ] o.a.s.c.OverseerAutoReplicaFailoverThread Starting OverseerAutoReplicaFailoverThread autoReplicaFailoverWorkLoopDelay=10000 autoReplicaFailoverWaitAfterExpiration=10000 autoReplicaFailoverBadNodeExpiration=60000
   [junit4]   2> 571991 INFO  (TEST-CollectionsAPIDistributedZkTest.test-seed#[7A6E51F7D7DA9D09]) [    ] o.a.s.c.c.ZkStateReader Updating cluster state from ZooKeeper... 
   [junit4]   2> 571991 INFO  (OverseerCollectionConfigSetProcessor-95164123797258244-127.0.0.1:34781_xvvd%2Fm-n_0000000000) [    ] o.a.s.c.OverseerTaskProcessor Process current queue of overseer operations
   [junit4]   2> 571991 INFO  (OverseerStateUpdate-95164123797258244-127.0.0.1:34781_xvvd%2Fm-n_0000000000) [    ] o.a.s.c.Overseer Starting to work on the main queue
   [junit4]   2> 571997 INFO  (TEST-CollectionsAPIDistributedZkTest.test-seed#[7A6E51F7D7DA9D09]) [    ] o.a.s.c.CoreContainer Security conf doesn't exist. Skipping setup for authorization module.
   [junit4]   2> 571997 INFO  (TEST-CollectionsAPIDistributedZkTest.test-seed#[7A6E51F7D7DA9D09]) [    ] o.a.s.c.CoreContainer No authentication plugin used.
   [junit4]   2> 571997 INFO  (TEST-CollectionsAPIDistributedZkTest.test-seed#[7A6E51F7D7DA9D09]) [    ] o.a.s.c.CorePropertiesLocator Looking for core definitions underneath /home/jenkins/workspace/Lucene-Solr-5.x-Linux/solr/build/solr-core/test/J0/../../../../../../../../../home/jenkins/workspace/Lucene-Solr-5.x-Linux/solr/build/solr-core/test/J0/temp/solr.cloud.CollectionsAPIDistributedZkTest_7A6E51F7D7DA9D09-001/control-001/cores
   [junit4]   2> 571998 INFO  (TEST-CollectionsAPIDistributedZkTest.test-seed#[7A6E51F7D7DA9D09]) [    ] o.a.s.c.CoreDescriptor Created CoreDescriptor: {name=collection1, config=solrconfig.xml, transient=false, schema=schema.xml, loadOnStartup=true, configSetProperties=configsetprops.json, collection=control_collection, coreNodeName=, dataDir=data/, shard=}
   [junit4]   2> 571998 INFO  (TEST-CollectionsAPIDistributedZkTest.test-seed#[7A6E51F7D7DA9D09]) [    ] o.a.s.c.CorePropertiesLocator Found core collection1 in /home/jenkins/workspace/Lucene-Solr-5.x-Linux/solr/build/solr-core/test/J0/../../../../../../../../../home/jenkins/workspace/Lucene-Solr-5.x-Linux/solr/build/solr-core/test/J0/temp/solr.cloud.CollectionsAPIDistributedZkTest_7A6E51F7D7DA9D09-001/control-001/cores/collection1
   [junit4]   2> 571998 INFO  (TEST-CollectionsAPIDistributedZkTest.test-seed#[7A6E51F7D7DA9D09]) [    ] o.a.s.c.CorePropertiesLocator Found 1 core definitions
   [junit4]   2> 571998 INFO  (TEST-CollectionsAPIDistributedZkTest.test-seed#[7A6E51F7D7DA9D09]) [    ] o.a.s.s.SolrDispatchFilter user.dir=/home/jenkins/workspace/Lucene-Solr-5.x-Linux/solr/build/solr-core/test/J0
   [junit4]   2> 571998 INFO  (TEST-CollectionsAPIDistributedZkTest.test-seed#[7A6E51F7D7DA9D09]) [    ] o.a.s.s.SolrDispatchFilter SolrDispatchFilter.init() done
   [junit4]   2> 571998 INFO  (coreLoadExecutor-2177-thread-1) [    ] o.a.s.c.ZkController publishing state=down
   [junit4]   2> 571998 INFO  (coreLoadExecutor-2177-thread-1) [    ] o.a.s.c.ZkController numShards not found on descriptor - reading it from system property
   [junit4]   2> 571999 INFO  (coreLoadExecutor-2177-thread-1) [    ] o.a.s.c.ZkController look for our core node name
   [junit4]   2> 571999 INFO  (OverseerStateUpdate-95164123797258244-127.0.0.1:34781_xvvd%2Fm-n_0000000000) [    ] o.a.s.c.Overseer processMessage: queueSize: 1, message = {
   [junit4]   2>   "core":"collection1",
   [junit4]   2>   "roles":null,
   [junit4]   2>   "base_url":"http://127.0.0.1:34781/xvvd/m",
   [junit4]   2>   "node_name":"127.0.0.1:34781_xvvd%2Fm",
   [junit4]   2>   "numShards":"1",
   [junit4]   2>   "state":"down",
   [junit4]   2>   "shard":null,
   [junit4]   2>   "collection":"control_collection",
   [junit4]   2>   "operation":"state"} current state version: 0
   [junit4]   2> 572000 INFO  (OverseerStateUpdate-95164123797258244-127.0.0.1:34781_xvvd%2Fm-n_0000000000) [    ] o.a.s.c.o.ReplicaMutator Update state numShards=1 message={
   [junit4]   2>   "core":"collection1",
   [junit4]   2>   "roles":null,
   [junit4]   2>   "base_url":"http://127.0.0.1:34781/xvvd/m",
   [junit4]   2>   "node_name":"127.0.0.1:34781_xvvd%2Fm",
   [junit4]   2>   "numShards":"1",
   [junit4]   2>   "state":"down",
   [junit4]   2>   "shard":null,
   [junit4]   2>   "collection":"control_collection",
   [junit4]   2>   "operation":"state"}
   [junit4]   2> 572000 INFO  (OverseerStateUpdate-95164123797258244-127.0.0.1:34781_xvvd%2Fm-n_0000000000) [    ] o.a.s.c.o.ClusterStateMutator building a new cName: control_collection
   [junit4]   2> 572000 INFO  (OverseerStateUpdate-95164123797258244-127.0.0.1:34781_xvvd%2Fm-n_0000000000) [    ] o.a.s.c.o.ReplicaMutator Assigning new node to shard shard=shard1
   [junit4]   2> 572001 INFO  (zkCallback-596-thread-1) [    ] o.a.s.c.c.ZkStateReader A cluster state change: [WatchedEvent state:SyncConnected type:NodeDataChanged path:/clusterstate.json], has occurred - updating... (live nodes size: [1])
   [junit4]   2> 573000 INFO  (coreLoadExecutor-2177-thread-1) [    ] o.a.s.c.ZkController waiting to find shard id in clusterstate for collection1
   [junit4]   2> 573000 INFO  (coreLoadExecutor-2177-thread-1) [    ] o.a.s.c.ZkController Check for collection zkNode:control_collection
   [junit4]   2> 573000 INFO  (coreLoadExecutor-2177-thread-1) [    ] o.a.s.c.ZkController Collection zkNode exists
   [junit4]   2> 573000 INFO  (coreLoadExecutor-2177-thread-1) [    ] o.a.s.c.c.ZkStateReader Load collection config from: [/collections/control_collection]
   [junit4]   2> 573000 INFO  (coreLoadExecutor-2177-thread-1) [    ] o.a.s.c.c.ZkStateReader path=[/collections/control_collection] [configName]=[conf1] specified config exists in ZooKeeper
   [junit4]   2> 573000 INFO  (coreLoadExecutor-2177-thread-1) [    ] o.a.s.c.SolrResourceLoader new SolrResourceLoader for directory: '/home/jenkins/workspace/Lucene-Solr-5.x-Linux/solr/build/solr-core/test/J0/temp/solr.cloud.CollectionsAPIDistributedZkTest_7A6E51F7D7DA9D09-001/control-001/cores/collection1'
   [junit4]   2> 573001 INFO  (coreLoadExecutor-2177-thread-1) [    ] o.a.s.c.SolrResourceLoader JNDI not configured for solr (NoInitialContextEx)
   [junit4]   2> 573001 INFO  (coreLoadExecutor-2177-thread-1) [    ] o.a.s.c.SolrResourceLoader solr home defaulted to 'solr/' (could not find system property or JNDI)
   [junit4]   2> 573002 INFO  (coreLoadExecutor-2177-thread-1) [    ] o.a.s.c.Config loaded config solrconfig.xml with version 0 
   [junit4]   2> 573006 INFO  (coreLoadExecutor-2177-thread-1) [    ] o.a.s.c.SolrConfig current version of requestparams : -1
   [junit4]   2> 573033 INFO  (coreLoadExecutor-2177-thread-1) [    ] o.a.s.c.SolrConfig Using Lucene MatchVersion: 5.5.0
   [junit4]   2> 573039 INFO  (coreLoadExecutor-2177-thread-1) [    ] o.a.s.c.SolrConfig Loaded SolrConfig: solrconfig.xml
   [junit4]   2> 573042 INFO  (coreLoadExecutor-2177-thread-1) [    ] o.a.s.s.IndexSchema [collection1] Schema name=test
   [junit4]   2> 573100 INFO  (coreLoadExecutor-2177-thread-1) [    ] o.a.s.s.OpenExchangeRatesOrgProvider Initialized with rates=open-exchange-rates.json, refreshInterval=1440.
   [junit4]   2> 573104 INFO  (coreLoadExecutor-2177-thread-1) [    ] o.a.s.s.IndexSchema default search field in schema is text
   [junit4]   2> 573105 INFO  (coreLoadExecutor-2177-thread-1) [    ] o.a.s.s.IndexSchema unique key field: id
   [junit4]   2> 573108 INFO  (coreLoadExecutor-2177-thread-1) [    ] o.a.s.s.FileExchangeRateProvider Reloading exchange rates from file currency.xml
   [junit4]   2> 573109 INFO  (coreLoadExecutor-2177-thread-1) [    ] o.a.s.s.FileExchangeRateProvider Reloading exchange rates from file currency.xml
   [junit4]   2> 573110 INFO  (coreLoadExecutor-2177-thread-1) [    ] o.a.s.s.OpenExchangeRatesOrgProvider Reloading exchange rates from open-exchange-rates.json
   [junit4]   2> 573110 INFO  (coreLoadExecutor-2177-thread-1) [    ] o.a.s.s.OpenExchangeRatesOrgProvider Reloading exchange rates from open-exchange-rates.json
   [junit4]   2> 573111 INFO  (coreLoadExecutor-2177-thread-1) [    ] o.a.s.c.ConfigSetProperties Did not find ConfigSet properties, assuming default properties: Can't find resource 'configsetprops.json' in classpath or '/configs/conf1', cwd=/home/jenkins/workspace/Lucene-Solr-5.x-Linux/solr/build/solr-core/test/J0
   [junit4]   2> 573111 INFO  (coreLoadExecutor-2177-thread-1) [    ] o.a.s.c.CoreContainer Creating SolrCore 'collection1' using configuration from collection control_collection
   [junit4]   2> 573111 INFO  (coreLoadExecutor-2177-thread-1) [    ] o.a.s.c.SolrCore org.apache.solr.core.MockDirectoryFactory
   [junit4]   2> 573111 INFO  (coreLoadExecutor-2177-thread-1) [    ] o.a.s.c.SolrCore [[collection1] ] Opening new SolrCore at [/home/jenkins/workspace/Lucene-Solr-5.x-Linux/solr/build/solr-core/test/J0/temp/solr.cloud.CollectionsAPIDistributedZkTest_7A6E51F7D7DA9D09-001/control-001/cores/collection1], dataDir=[/home/jenkins/workspace/Lucene-Solr-5.x-Linux/solr/build/solr-core/test/J0/../../../../../../../../../home/jenkins/workspace/Lucene-Solr-5.x-Linux/solr/build/solr-core/test/J0/temp/solr.cloud.CollectionsAPIDistributedZkTest_7A6E51F7D7DA9D09-001/control-001/cores/collection1/data/]
   [junit4]   2> 573111 INFO  (coreLoadExecutor-2177-thread-1) [    ] o.a.s.c.JmxMonitoredMap JMX monitoring is enabled. Adding Solr mbeans to JMX Server: com.sun.jmx.mbeanserver.JmxMBeanServer@20efba64
   [junit4]   2> 573112 INFO  (coreLoadExecutor-2177-thread-1) [    ] o.a.s.c.CachingDirectoryFactory return new directory for /home/jenkins/workspace/Lucene-Solr-5.x-Linux/solr/build/solr-core/test/J0/../../../../../../../../../home/jenkins/workspace/Lucene-Solr-5.x-Linux/solr/build/solr-core/test/J0/temp/solr.cloud.CollectionsAPIDistributedZkTest_7A6E51F7D7DA9D09-001/control-001/cores/collection1/data
   [junit4]   2> 573112 INFO  (coreLoadExecutor-2177-thread-1) [    ] o.a.s.c.SolrCore New index directory detected: old=null new=/home/jenkins/workspace/Lucene-Solr-5.x-Linux/solr/build/solr-core/test/J0/../../../../../../../../../home/jenkins/workspace/Lucene-Solr-5.x-Linux/solr/build/solr-core/test/J0/temp/solr.cloud.CollectionsAPIDistributedZkTest_7A6E51F7D7DA9D09-001/control-001/cores/collection1/data/index/
   [junit4]   2> 573112 WARN  (coreLoadExecutor-2177-thread-1) [    ] o.a.s.c.SolrCore [collection1] Solr index directory '/home/jenkins/workspace/Lucene-Solr-5.x-Linux/solr/build/solr-core/test/J0/../../../../../../../../../home/jenkins/workspace/Lucene-Solr-5.x-Linux/solr/build/solr-core/test/J0/temp/solr.cloud.CollectionsAPIDistributedZkTest_7A6E51F7D7DA9D09-001/control-001/cores/collection1/data/index' doesn't exist. Creating new index...
   [junit4]   2> 573112 INFO  (coreLoadExecutor-2177-thread-1) [    ] o.a.s.c.CachingDirectoryFactory return new directory for /home/jenkins/workspace/Lucene-Solr-5.x-Linux/solr/build/solr-core/test/J0/../../../../../../../../../home/jenkins/workspace/Lucene-Solr-5.x-Linux/solr/build/solr-core/test/J0/temp/solr.cloud.CollectionsAPIDistributedZkTest_7A6E51F7D7DA9D09-001/control-001/cores/collection1/data/index
   [junit4]   2> 573113 INFO  (coreLoadExecutor-2177-thread-1) [    ] o.a.s.u.RandomMergePolicy RandomMergePolicy wrapping class org.apache.lucene.index.TieredMergePolicy: [TieredMergePolicy: maxMergeAtOnce=36, maxMergeAtOnceExplicit=41, maxMergedSegmentMB=48.5146484375, floorSegmentMB=1.9306640625, forceMergeDeletesPctAllowed=4.679818497659437, segmentsPerTier=25.0, maxCFSSegmentSizeMB=8.796093022207999E12, noCFSRatio=0.19767874273082464
   [junit4]   2> 573113 INFO  (coreLoadExecutor-2177-thread-1) [    ] o.a.s.c.SolrDeletionPolicy SolrDeletionPolicy.onCommit: commits: num=1
   [junit4]   2> 	commit{dir=MockDirectoryWrapper(RAMDirectory@7e64b088 lockFactory=org.apache.lucene.store.SingleInstanceLockFactory@5e864b82),segFN=segments_1,generation=1}
   [junit4]   2> 573113 INFO  (coreLoadExecutor-2177-thread-1) [    ] o.a.s.c.SolrDeletionPolicy newest commit generation = 1
   [junit4]   2> 573113 INFO  (OldIndexDirectoryCleanupThreadForCore-collection1) [    ] o.a.s.c.SolrCore Looking for old index directories to cleanup for core collection1 in /home/jenkins/workspace/Lucene-Solr-5.x-Linux/solr/build/solr-core/test/J0/../../../../../../../../../home/jenkins/workspace/Lucene-Solr-5.x-Linux/solr/build/solr-core/test/J0/temp/solr.cloud.CollectionsAPIDistributedZkTest_7A6E51F7D7DA9D09-001/control-001/cores/collection1/data/
   [junit4]   2> 573113 WARN  (OldIndexDirectoryCleanupThreadForCore-collection1) [    ] o.a.s.c.DirectoryFactory /home/jenkins/workspace/Lucene-Solr-5.x-Linux/solr/build/solr-core/test/J0/../../../../../../../../../home/jenkins/workspace/Lucene-Solr-5.x-Linux/solr/build/solr-core/test/J0/temp/solr.cloud.CollectionsAPIDistributedZkTest_7A6E51F7D7DA9D09-001/control-001/cores/collection1/data/ does not point to a valid data directory; skipping clean-up of old index directories.
   [junit4]   2> 573115 INFO  (coreLoadExecutor-2177-thread-1) [    ] o.a.s.u.p.UpdateRequestProcessorChain creating updateRequestProcessorChain "nodistrib"
   [junit4]   2> 573115 INFO  (coreLoadExecutor-2177-thread-1) [    ] o.a.s.u.p.UpdateRequestProcessorChain creating updateRequestProcessorChain "dedupe"
   [junit4]   2> 573115 INFO  (coreLoadExecutor-2177-thread-1) [    ] o.a.s.u.p.UpdateRequestProcessorChain inserting DistributedUpdateProcessorFactory into updateRequestProcessorChain "dedupe"
   [junit4]   2> 573115 INFO  (coreLoadExecutor-2177-thread-1) [    ] o.a.s.u.p.UpdateRequestProcessorChain creating updateRequestProcessorChain "stored_sig"
   [junit4]   2> 573115 INFO  (coreLoadExecutor-2177-thread-1) [    ] o.a.s.u.p.UpdateRequestProcessorChain inserting DistributedUpdateProcessorFactory into updateRequestProcessorChain "stored_sig"
   [junit4]   2> 573115 INFO  (coreLoadExecutor-2177-thread-1) [    ] o.a.s.u.p.UpdateRequestProcessorChain creating updateRequestProcessorChain "distrib-dup-test-chain-explicit"
   [junit4]   2> 573116 INFO  (coreLoadExecutor-2177-thread-1) [    ] o.a.s.u.p.UpdateRequestProcessorChain creating updateRequestProcessorChain "distrib-dup-test-chain-implicit"
   [junit4]   2> 573116 INFO  (coreLoadExecutor-2177-thread-1) [    ] o.a.s.u.p.UpdateRequestProcessorChain inserting DistributedUpdateProcessorFactory into updateRequestProcessorChain "distrib-dup-test-chain-implicit"
   [junit4]   2> 573116 INFO  (coreLoadExecutor-2177-thread-1) [    ] o.a.s.c.SolrCore no updateRequestProcessorChain defined as default, creating implicit default
   [junit4]   2> 573116 WARN  (coreLoadExecutor-2177-thread-1) [    ] o.a.s.c.RequestHandlers INVALID paramSet a in requestHandler {type = requestHandler,name = /dump,class = DumpRequestHandler,args = {defaults={a=A,b=B}}}
   [junit4]   2> 573117 INFO  (coreLoadExecutor-2177-thread-1) [    ] o.a.s.h.l.XMLLoader xsltCacheLifetimeSeconds=60
   [junit4]   2> 573118 INFO  (coreLoadExecutor-2177-thread-1) [    ] o.a.s.h.l.XMLLoader xsltCacheLifetimeSeconds=60
   [junit4]   2> 573118 INFO  (coreLoadExecutor-2177-thread-1) [    ] o.a.s.h.l.XMLLoader xsltCacheLifetimeSeconds=60
   [junit4]   2> 573119 INFO  (coreLoadExecutor-2177-thread-1) [    ] o.a.s.h.l.XMLLoader xsltCacheLifetimeSeconds=60
   [junit4]   2> 573120 INFO  (coreLoadExecutor-2177-thread-1) [    ] o.a.s.c.RequestHandlers Registered paths: /admin/mbeans,standard,/dump,/update/csv,/update/json/docs,/admin/luke,/admin/segments,/get,/admin/system,/replication,/admin/properties,/config,/schema,/admin/plugins,/admin/logging,/update/json,/admin/threads,/admin/ping,/update,/admin/file
   [junit4]   2> 573120 INFO  (coreLoadExecutor-2177-thread-1) [    ] o.a.s.c.SolrCore Using default statsCache cache: org.apache.solr.search.stats.LocalStatsCache
   [junit4]   2> 573120 INFO  (coreLoadExecutor-2177-thread-1) [    ] o.a.s.u.UpdateHandler Using UpdateLog implementation: org.apache.solr.update.UpdateLog
   [junit4]   2> 573120 INFO  (coreLoadExecutor-2177-thread-1) [    ] o.a.s.u.UpdateLog Initializing UpdateLog: dataDir= defaultSyncLevel=FLUSH numRecordsToKeep=100 maxNumLogsToKeep=10 numVersionBuckets=65536
   [junit4]   2> 573121 INFO  (coreLoadExecutor-2177-thread-1) [    ] o.a.s.u.CommitTracker Hard AutoCommit: disabled
   [junit4]   2> 573121 INFO  (coreLoadExecutor-2177-thread-1) [    ] o.a.s.u.CommitTracker Soft AutoCommit: disabled
   [junit4]   2> 573121 INFO  (coreLoadExecutor-2177-thread-1) [    ] o.a.s.u.RandomMergePolicy RandomMergePolicy wrapping class org.apache.lucene.index.TieredMergePolicy: [TieredMergePolicy: maxMergeAtOnce=23, maxMergeAtOnceExplicit=39, maxMergedSegmentMB=33.4599609375, floorSegmentMB=0.4423828125, forceMergeDeletesPctAllowed=20.292964238450317, segmentsPerTier=47.0, maxCFSSegmentSizeMB=8.796093022207999E12, noCFSRatio=1.0
   [junit4]   2> 573121 INFO  (coreLoadExecutor-2177-thread-1) [    ] o.a.s.c.SolrDeletionPolicy SolrDeletionPolicy.onInit: commits: num=1
   [junit4]   2> 	commit{dir=MockDirectoryWrapper(RAMDirectory@7e64b088 lockFactory=org.apache.lucene.store.SingleInstanceLockFactory@5e864b82),segFN=segments_1,generation=1}
   [junit4]   2> 573121 INFO  (coreLoadExecutor-2177-thread-1) [    ] o.a.s.c.SolrDeletionPolicy newest commit generation = 1
   [junit4]   2> 573121 INFO  (coreLoadExecutor-2177-thread-1) [    ] o.a.s.s.SolrIndexSearcher Opening Searcher@4479893c[collection1] main
   [junit4]   2> 573122 INFO  (coreLoadExecutor-2177-thread-1) [    ] o.a.s.c.c.ZkStateReader Load collection config from: [/collections/control_collection]
   [junit4]   2> 573122 INFO  (coreLoadExecutor-2177-thread-1) [    ] o.a.s.c.c.ZkStateReader path=[/collections/control_collection] [configName]=[conf1] specified config exists in ZooKeeper
   [junit4]   2> 573122 INFO  (coreLoadExecutor-2177-thread-1) [    ] o.a.s.r.ManagedResourceStorage Setting up ZooKeeper-based storage for the RestManager with znodeBase: /configs/conf1
   [junit4]   2> 573122 INFO  (coreLoadExecutor-2177-thread-1) [    ] o.a.s.r.ManagedResourceStorage Configured ZooKeeperStorageIO with znodeBase: /configs/conf1
   [junit4]   2> 573122 INFO  (coreLoadExecutor-2177-thread-1) [    ] o.a.s.r.RestManager Initializing RestManager with initArgs: {}
   [junit4]   2> 573122 INFO  (coreLoadExecutor-2177-thread-1) [    ] o.a.s.r.ManagedResourceStorage Reading _rest_managed.json using ZooKeeperStorageIO:path=/configs/conf1
   [junit4]   2> 573122 INFO  (coreLoadExecutor-2177-thread-1) [    ] o.a.s.r.ManagedResourceStorage No data found for znode /configs/conf1/_rest_managed.json
   [junit4]   2> 573122 INFO  (coreLoadExecutor-2177-thread-1) [    ] o.a.s.r.ManagedResourceStorage Loaded null at path _rest_managed.json using ZooKeeperStorageIO:path=/configs/conf1
   [junit4]   2> 573122 INFO  (coreLoadExecutor-2177-thread-1) [    ] o.a.s.r.RestManager Initializing 0 registered ManagedResources
   [junit4]   2> 573122 INFO  (coreLoadExecutor-2177-thread-1) [    ] o.a.s.h.ReplicationHandler Commits will be reserved for  10000
   [junit4]   2> 573123 INFO  (searcherExecutor-2178-thread-1) [    ] o.a.s.c.SolrCore [collection1] Registered new searcher Searcher@4479893c[collection1] main{ExitableDirectoryReader(UninvertingDirectoryReader())}
   [junit4]   2> 573123 INFO  (coreLoadExecutor-2177-thread-1) [    ] o.a.s.u.UpdateLog Looking up max value of version field to seed version buckets
   [junit4]   2> 573123 INFO  (coreLoadExecutor-2177-thread-1) [    ] o.a.s.u.VersionInfo Refreshing highest value of _version_ for 65536 version buckets from index
   [junit4]   2> 573123 INFO  (coreLoadExecutor-2177-thread-1) [    ] o.a.s.u.VersionInfo No terms found for _version_, cannot seed version bucket highest value from index
   [junit4]   2> 573123 INFO  (coreLoadExecutor-2177-thread-1) [    ] o.a.s.u.UpdateLog Could not find max version in index or recent updates, using new clock 1522625982150737920
   [junit4]   2> 573125 INFO  (coreLoadExecutor-2177-thread-1) [    ] o.a.s.u.UpdateLog Took 2.0ms to seed version buckets with highest version 1522625982150737920
   [junit4]   2> 573125 INFO  (coreLoadExecutor-2177-thread-1) [    ] o.a.s.c.ZkController watch zkdir /configs/conf1
   [junit4]   2> 573125 INFO  (coreLoadExecutor-2177-thread-1) [    ] o.a.s.c.CoreContainer registering core: collection1
   [junit4]   2> 573125 INFO  (coreZkRegister-2171-thread-1) [    ] o.a.s.c.ZkController Register replica - core:collection1 address:http://127.0.0.1:34781/xvvd/m collection:control_collection shard:shard1
   [junit4]   2> 573126 INFO  (coreZkRegister-2171-thread-1) [    ] o.a.s.c.c.SolrZkClient makePath: /collections/control_collection/leader_elect/shard1/election
   [junit4]   2> 573127 INFO  (coreZkRegister-2171-thread-1) [    ] o.a.s.c.LeaderElector Joined leadership election with path: /collections/control_collection/leader_elect/shard1/election/95164123797258244-core_node1-n_0000000000
   [junit4]   2> 573127 INFO  (coreZkRegister-2171-thread-1) [    ] o.a.s.c.ShardLeaderElectionContext Running the leader process for shard=shard1 and weAreReplacement=false and leaderVoteWait=180000
   [junit4]   2> 573127 INFO  (coreZkRegister-2171-thread-1) [    ] o.a.s.c.ShardLeaderElectionContext Enough replicas found to continue.
   [junit4]   2> 573127 INFO  (coreZkRegister-2171-thread-1) [    ] o.a.s.c.ShardLeaderElectionContext I may be the new leader - try and sync
   [junit4]   2> 573127 INFO  (coreZkRegister-2171-thread-1) [    ] o.a.s.c.SyncStrategy Sync replicas to http://127.0.0.1:34781/xvvd/m/collection1/
   [junit4]   2> 573127 INFO  (coreZkRegister-2171-thread-1) [    ] o.a.s.c.SyncStrategy Sync Success - now sync replicas to me
   [junit4]   2> 573127 INFO  (coreZkRegister-2171-thread-1) [    ] o.a.s.c.SyncStrategy http://127.0.0.1:34781/xvvd/m/collection1/ has no replicas
   [junit4]   2> 573127 INFO  (OverseerStateUpdate-95164123797258244-127.0.0.1:34781_xvvd%2Fm-n_0000000000) [    ] o.a.s.c.Overseer processMessage: queueSize: 1, message = {
   [junit4]   2>   "operation":"leader",
   [junit4]   2>   "shard":"shard1",
   [junit4]   2>   "collection":"control_collection"} current state version: 1
   [junit4]   2> 573128 INFO  (coreZkRegister-2171-thread-1) [    ] o.a.s.c.c.SolrZkClient makePath: /collections/control_collection/leaders/shard1
   [junit4]   2> 573129 INFO  (coreZkRegister-2171-thread-1) [    ] o.a.s.c.ShardLeaderElectionContextBase Creating leader registration node
   [junit4]   2> 573129 INFO  (coreZkRegister-2171-thread-1) [    ] o.a.s.c.ShardLeaderElectionContext I am the new leader: http://127.0.0.1:34781/xvvd/m/collection1/ shard1
   [junit4]   2> 573130 INFO  (OverseerStateUpdate-95164123797258244-127.0.0.1:34781_xvvd%2Fm-n_0000000000) [    ] o.a.s.c.Overseer processMessage: queueSize: 1, message = {
   [junit4]   2>   "operation":"leader",
   [junit4]   2>   "shard":"shard1",
   [junit4]   2>   "collection":"control_collection",
   [junit4]   2>   "base_url":"http://127.0.0.1:34781/xvvd/m",
   [junit4]   2>   "core":"collection1",
   [junit4]   2>   "state":"active"} current state version: 1
   [junit4]   2> 573231 INFO  (zkCallback-596-thread-1) [    ] o.a.s.c.c.ZkStateReader A cluster state change: [WatchedEvent state:SyncConnected type:NodeDataChanged path:/clusterstate.json], has occurred - updating... (live nodes size: [1])
   [junit4]   2> 573280 INFO  (coreZkRegister-2171-thread-1) [    ] o.a.s.c.ZkController We are http://127.0.0.1:34781/xvvd/m/collection1/ and leader is http://127.0.0.1:34781/xvvd/m/collection1/
   [junit4]   2> 573280 INFO  (coreZkRegister-2171-thread-1) [    ] o.a.s.c.ZkController No LogReplay needed for core=collection1 baseURL=http://127.0.0.1:34781/xvvd/m
   [junit4]   2> 573280 INFO  (coreZkRegister-2171-thread-1) [    ] o.a.s.c.ZkController I am the leader, no recovery necessary
   [junit4]   2> 573280 INFO  (coreZkRegister-2171-thread-1) [    ] o.a.s.c.ZkController publishing state=active
   [junit4]   2> 573280 INFO  (coreZkRegister-2171-thread-1) [    ] o.a.s.c.ZkController numShards not found on descriptor - reading it from system property
   [junit4]   2> 573281 INFO  (OverseerStateUpdate-95164123797258244-127.0.0.1:34781_xvvd%2Fm-n_0000000000) [    ] o.a.s.c.Overseer processMessage: queueSize: 1, message = {
   [junit4]   2>   "core":"collection1",
   [junit4]   2>   "core_node_name":"core_node1",
   [junit4]   2>   "roles":null,
   [junit4]   2>   "base_url":"http://127.0.0.1:34781/xvvd/m",
   [junit4]   2>   "node_name":"127.0.0.1:34781_xvvd%2Fm",
   [junit4]   2>   "numShards":"1",
   [junit4]   2>   "state":"active",
   [junit4]   2>   "shard":"shard1",
   [junit4]   2>   "collection":"control_collection",
   [junit4]   2>   "operation":"state"} current state version: 2
   [junit4]   2> 573282 INFO  (OverseerStateUpdate-95164123797258244-127.0.0.1:34781_xvvd%2Fm-n_0000000000) [    ] o.a.s.c.o.ReplicaMutator Update state numShards=1 message={
   [junit4]   2>   "core":"collection1",
   [junit4]   2>   "core_node_name":"core_node1",
   [junit4]   2>   "roles":null,
   [junit4]   2>   "base_url":"http://127.0.0.1:34781/xvvd/m",
   [junit4]   2>   "node_name":"127.0.0.1:34781_xvvd%2Fm",
   [junit4]   2>   "numShards":"1",
   [junit4]   2>   "state":"active",
   [junit4]   2>   "shard":"shard1",
   [junit4]   2>   "collection":"control_collection",
   [junit4]   2>   "operation":"state"}
   [junit4]   2> 573383 INFO  (zkCallback-596-thread-2) [    ] o.a.s.c.c.ZkStateReader A cluster state change: [WatchedEvent state:SyncConnected type:NodeDataChanged path:/clusterstate.json], has occurred - updating... (live nodes size: [1])
   [junit4]   2> 573500 INFO  (TEST-CollectionsAPIDistributedZkTest.test-seed#[7A6E51F7D7DA9D09]) [    ] o.a.s.c.c.SolrZkClient Using default ZkCredentialsProvider
   [junit4]   2> 573500 INFO  (TEST-CollectionsAPIDistributedZkTest.test-seed#[7A6E51F7D7DA9D09]) [    ] o.a.s.c.c.ConnectionManager Waiting for client to connect to ZooKeeper
   [junit4]   2> 573501 INFO  (zkCallback-598-thread-1) [    ] o.a.s.c.c.ConnectionManager Watcher org.apache.solr.common.cloud.ConnectionManager@b38b8c6 name:ZooKeeperConnection Watcher:127.0.0.1:58415/solr got event WatchedEvent state:SyncConnected type:None path:null path:null type:None
   [junit4]   2> 573501 INFO  (TEST-CollectionsAPIDistributedZkTest.test-seed#[7A6E51F7D7DA9D09]) [    ] o.a.s.c.c.ConnectionManager Client is connected to ZooKeeper
   [junit4]   2> 573501 INFO  (TEST-CollectionsAPIDistributedZkTest.test-seed#[7A6E51F7D7DA9D09]) [    ] o.a.s.c.c.SolrZkClient Using default ZkACLProvider
   [junit4]   2> 573501 INFO  (TEST-CollectionsAPIDistributedZkTest.test-seed#[7A6E51F7D7DA9D09]) [    ] o.a.s.c.c.ZkStateReader Updating cluster state from ZooKeeper... 
   [junit4]   2> 573502 INFO  (TEST-CollectionsAPIDistributedZkTest.test-seed#[7A6E51F7D7DA9D09]) [    ] o.a.s.c.ChaosMonkey monkey: init - expire sessions:false cause connection loss:false
   [junit4]   2> 573502 INFO  (TEST-CollectionsAPIDistributedZkTest.test-seed#[7A6E51F7D7DA9D09]) [    ] o.a.s.c.AbstractFullDistribZkTestBase Creating collection1 with stateFormat=2
   [junit4]   2> 573502 INFO  (TEST-CollectionsAPIDistributedZkTest.test-seed#[7A6E51F7D7DA9D09]) [    ] o.a.s.c.c.SolrZkClient Using default ZkCredentialsProvider
   [junit4]   2> 573503 INFO  (TEST-CollectionsAPIDistributedZkTest.test-seed#[7A6E51F7D7DA9D09]) [    ] o.a.s.c.c.ConnectionManager Waiting for client to connect to ZooKeeper
   [junit4]   2> 573503 INFO  (zkCallback-599-thread-1) [    ] o.a.s.c.c.ConnectionManager Watcher org.apache.solr.common.cloud.ConnectionManager@3f32c12c name:ZooKeeperConnection Watcher:127.0.0.1:58415/solr got event WatchedEvent state:SyncConnected type:None path:null path:null type:None
   [junit4]   2> 573503 INFO  (TEST-CollectionsAPIDistributedZkTest.test-seed#[7A6E51F7D7DA9D09]) [    ] o.a.s.c.c.ConnectionManager Client is connected to ZooKeeper
   [junit4]   2> 573504 INFO  (TEST-CollectionsAPIDistributedZkTest.test-seed#[7A6E51F7D7DA9D09]) [    ] o.a.s.c.c.SolrZkClient Using default ZkACLProvider
   [junit4]   2> 573505 INFO  (OverseerStateUpdate-95164123797258244-127.0.0.1:34781_xvvd%2Fm-n_0000000000) [    ] o.a.s.c.Overseer processMessage: queueSize: 1, message = {
   [junit4]   2>   "operation":"create",
   [junit4]   2>   "name":"collection1",
   [junit4]   2>   "numShards":"2",
   [junit4]   2>   "stateFormat":"2"} current state version: 3
   [junit4]   2> 573505 INFO  (OverseerStateUpdate-95164123797258244-127.0.0.1:34781_xvvd%2Fm-n_0000000000) [    ] o.a.s.c.o.ClusterStateMutator building a new cName: collection1
   [junit4]   2> 573557 INFO  (TEST-CollectionsAPIDistributedZkTest.test-seed#[7A6E51F7D7DA9D09]) [    ] o.a.s.SolrTestCaseJ4 Writing core.properties file to /home/jenkins/workspace/Lucene-Solr-5.x-Linux/solr/build/solr-core/test/J0/temp/solr.cloud.CollectionsAPIDistributedZkTest_7A6E51F7D7DA9D09-001/shard-1-001/cores/collection1
   [junit4]   2> 573558 INFO  (TEST-CollectionsAPIDistributedZkTest.test-seed#[7A6E51F7D7DA9D09]) [    ] o.a.s.c.AbstractFullDistribZkTestBase create jetty 1 in directory /home/jenkins/workspace/Lucene-Solr-5.x-Linux/solr/build/solr-core/test/J0/temp/solr.cloud.CollectionsAPIDistributedZkTest_7A6E51F7D7DA9D09-001/shard-1-001
   [junit4]   2> 573558 INFO  (TEST-CollectionsAPIDistributedZkTest.test-seed#[7A6E51F7D7DA9D09]) [    ] o.e.j.s.Server jetty-9.2.13.v20150730
   [junit4]   2> 573559 INFO  (TEST-CollectionsAPIDistributedZkTest.test-seed#[7A6E51F7D7DA9D09]) [    ] o.e.j.s.h.ContextHandler Started o.e.j.s.ServletContextHandler@668bd115{/xvvd/m,null,AVAILABLE}
   [junit4]   2> 573559 INFO  (TEST-CollectionsAPIDistributedZkTest.test-seed#[7A6E51F7D7DA9D09]) [    ] o.e.j.s.ServerConnector Started ServerConnector@4c975be1{HTTP/1.1}{127.0.0.1:39086}
   [junit4]   2> 573559 INFO  (TEST-CollectionsAPIDistributedZkTest.test-seed#[7A6E51F7D7DA9D09]) [    ] o.e.j.s.Server Started @575171ms
   [junit4]   2> 573559 INFO  (TEST-CollectionsAPIDistributedZkTest.test-seed#[7A6E51F7D7DA9D09]) [    ] o.a.s.c.s.e.JettySolrRunner Jetty properties: {solr.data.dir=/home/jenkins/workspace/Lucene-Solr-5.x-Linux/solr/build/solr-core/test/J0/temp/solr.cloud.CollectionsAPIDistributedZkTest_7A6E51F7D7DA9D09-001/tempDir-001/jetty1, solrconfig=solrconfig.xml, hostContext=/xvvd/m, hostPort=39086, coreRootDirectory=/home/jenkins/workspace/Lucene-Solr-5.x-Linux/solr/build/solr-core/test/J0/../../../../../../../../../home/jenkins/workspace/Lucene-Solr-5.x-Linux/solr/build/solr-core/test/J0/temp/solr.cloud.CollectionsAPIDistributedZkTest_7A6E51F7D7DA9D09-001/shard-1-001/cores}
   [junit4]   2> 573559 INFO  (TEST-CollectionsAPIDistributedZkTest.test-seed#[7A6E51F7D7DA9D09]) [    ] o.a.s.s.SolrDispatchFilter SolrDispatchFilter.init(): sun.misc.Launcher$AppClassLoader@694f9431
   [junit4]   2> 573559 INFO  (TEST-CollectionsAPIDistributedZkTest.test-seed#[7A6E51F7D7DA9D09]) [    ] o.a.s.c.SolrResourceLoader new SolrResourceLoader for directory: '/home/jenkins/workspace/Lucene-Solr-5.x-Linux/solr/build/solr-core/test/J0/temp/solr.cloud.CollectionsAPIDistributedZkTest_7A6E51F7D7DA9D09-001/shard-1-001'
   [junit4]   2> 573560 INFO  (TEST-CollectionsAPIDistributedZkTest.test-seed#[7A6E51F7D7DA9D09]) [    ] o.a.s.c.SolrResourceLoader JNDI not configured for solr (NoInitialContextEx)
   [junit4]   2> 573560 INFO  (TEST-CollectionsAPIDistributedZkTest.test-seed#[7A6E51F7D7DA9D09]) [    ] o.a.s.c.SolrResourceLoader solr home defaulted to 'solr/' (could not find system property or JNDI)
   [junit4]   2> 573560 INFO  (TEST-CollectionsAPIDistributedZkTest.test-seed#[7A6E51F7D7DA9D09]) [    ] o.a.s.c.c.SolrZkClient Using default ZkCredentialsProvider
   [junit4]   2> 573560 INFO  (TEST-CollectionsAPIDistributedZkTest.test-seed#[7A6E51F7D7DA9D09]) [    ] o.a.s.c.c.ConnectionManager Waiting for client to connect to ZooKeeper
   [junit4]   2> 573561 INFO  (zkCallback-600-thread-1) [    ] o.a.s.c.c.ConnectionManager Watcher org.apache.solr.common.cloud.ConnectionManager@523a57ed name:ZooKeeperConnection Watcher:127.0.0.1:58415/solr got event WatchedEvent state:SyncConnected type:None path:null path:null type:None
   [junit4]   2> 573561 INFO  (TEST-CollectionsAPIDistributedZkTest.test-seed#[7A6E51F7D7DA9D09]) [    ] o.a.s.c.c.ConnectionManager Client is connected to ZooKeeper
   [junit4]   2> 573561 INFO  (TEST-CollectionsAPIDistributedZkTest.test-seed#[7A6E51F7D7DA9D09]) [    ] o.a.s.c.c.SolrZkClient Using default ZkACLProvider
   [junit4]   2> 573562 INFO  (TEST-CollectionsAPIDistributedZkTest.test-seed#[7A6E51F7D7DA9D09]) [    ] o.a.s.s.SolrDispatchFilter Loading solr.xml from SolrHome (not found in ZooKeeper)
   [junit4]   2> 573562 INFO  (TEST-CollectionsAPIDistributedZkTest.test-seed#[7A6E51F7D7DA9D09]) [    ] o.a.s.c.SolrXmlConfig Loading container configuration from /home/jenkins/workspace/Lucene-Solr-5.x-Linux/solr/build/solr-core/test/J0/temp/solr.cloud.CollectionsAPIDistributedZkTest_7A6E51F7D7DA9D09-001/shard-1-001/solr.xml
   [junit4]   2> 573564 INFO  (TEST-CollectionsAPIDistributedZkTest.test-seed#[7A6E51F7D7DA9D09]) [    ] o.a.s.c.CorePropertiesLocator Config-defined core root directory: /home/jenkins/workspace/Lucene-Solr-5.x-Linux/solr/build/solr-core/test/J0/../../../../../../../../../home/jenkins/workspace/Lucene-Solr-5.x-Linux/solr/build/solr-core/test/J0/temp/solr.cloud.CollectionsAPIDistributedZkTest_7A6E51F7D7DA9D09-001/shard-1-001/cores
   [junit4]   2> 573564 INFO  (TEST-CollectionsAPIDistributedZkTest.test-seed#[7A6E51F7D7DA9D09]) [    ] o.a.s.c.CoreContainer New CoreContainer 1983553491
   [junit4]   2> 573564 INFO  (TEST-CollectionsAPIDistributedZkTest.test-seed#[7A6E51F7D7DA9D09]) [    ] o.a.s.c.CoreContainer Loading cores into CoreContainer [instanceDir=/home/jenkins/workspace/Lucene-Solr-5.x-Linux/solr/build/solr-core/test/J0/temp/solr.cloud.CollectionsAPIDistributedZkTest_7A6E51F7D7DA9D09-001/shard-1-001]
   [junit4]   2> 573564 WARN  (TEST-CollectionsAPIDistributedZkTest.test-seed#[7A6E51F7D7DA9D09]) [    ] o.a.s.c.CoreContainer Couldn't add files from /home/jenkins/workspace/Lucene-Solr-5.x-Linux/solr/build/solr-core/test/J0/temp/solr.cloud.CollectionsAPIDistributedZkTest_7A6E51F7D7DA9D09-001/shard-1-001/lib to classpath: /home/jenkins/workspace/Lucene-Solr-5.x-Linux/solr/build/solr-core/test/J0/temp/solr.cloud.CollectionsAPIDistributedZkTest_7A6E51F7D7DA9D09-001/shard-1-001/lib
   [junit4]   2> 573565 INFO  (TEST-CollectionsAPIDistributedZkTest.test-seed#[7A6E51F7D7DA9D09]) [    ] o.a.s.h.c.HttpShardHandlerFactory created with socketTimeout : 90000,urlScheme : ,connTimeout : 15000,maxConnectionsPerHost : 20,maxConnections : 10000,corePoolSize : 0,maximumPoolSize : 2147483647,maxThreadIdleTime : 5,sizeOfQueue : -1,fairnessPolicy : false,useRetries : false,
   [junit4]   2> 573565 INFO  (TEST-CollectionsAPIDistributedZkTest.test-seed#[7A6E51F7D7DA9D09]) [    ] o.a.s.u.UpdateShardHandler Creating UpdateShardHandler HTTP client with params: socketTimeout=340000&connTimeout=45000&retry=true
   [junit4]   2> 573566 INFO  (TEST-CollectionsAPIDistributedZkTest.test-seed#[7A6E51F7D7DA9D09]) [    ] o.a.s.l.LogWatcher SLF4J impl is org.slf4j.impl.Log4jLoggerFactory
   [junit4]   2> 573566 INFO  (TEST-CollectionsAPIDistributedZkTest.test-seed#[7A6E51F7D7DA9D09]) [    ] o.a.s.l.LogWatcher Registering Log Listener [Log4j (org.slf4j.impl.Log4jLoggerFactory)]
   [junit4]   2> 573566 INFO  (TEST-CollectionsAPIDistributedZkTest.test-seed#[7A6E51F7D7DA9D09]) [    ] o.a.s.c.ZkContainer Zookeeper client=127.0.0.1:58415/solr
   [junit4]   2> 573566 INFO  (TEST-CollectionsAPIDistributedZkTest.test-seed#[7A6E51F7D7DA9D09]) [    ] o.a.s.c.ZkController zkHost includes chroot
   [junit4]   2> 573566 INFO  (TEST-CollectionsAPIDistributedZkTest.test-seed#[7A6E51F7D7DA9D09]) [    ] o.a.s.c.c.SolrZkClient Using default ZkCredentialsProvider
   [junit4]   2> 573566 INFO  (TEST-CollectionsAPIDistributedZkTest.test-seed#[7A6E51F7D7DA9D09]) [    ] o.a.s.c.c.ConnectionManager Waiting for client to connect to ZooKeeper
   [junit4]   2> 573567 INFO  (zkCallback-602-thread-1) [    ] o.a.s.c.c.ConnectionManager Watcher org.apache.solr.common.cloud.ConnectionManager@7cb3163e name:ZooKeeperConnection Watcher:127.0.0.1:58415 got event WatchedEvent state:SyncConnected type:None path:null path:null type:None
   [junit4]   2> 573568 INFO  (TEST-CollectionsAPIDistributedZkTest.test-seed#[7A6E51F7D7DA9D09]) [    ] o.a.s.c.c.ConnectionManager Client is connected to ZooKeeper
   [junit4]   2> 573568 INFO  (TEST-CollectionsAPIDistributedZkTest.test-seed#[7A6E51F7D7DA9D09]) [    ] o.a.s.c.c.SolrZkClient Using default ZkACLProvider
   [junit4]   2> 573569 INFO  (TEST-CollectionsAPIDistributedZkTest.test-seed#[7A6E51F7D7DA9D09]) [    ] o.a.s.c.c.ConnectionManager Waiting for client to connect to ZooKeeper
   [junit4]   2> 573570 INFO  (zkCallback-603-thread-1) [    ] o.a.s.c.c.ConnectionManager Watcher org.apache.solr.common.cloud.ConnectionManager@522dd986 name:ZooKeeperConnection Watcher:127.0.0.1:58415/solr got event WatchedEvent state:SyncConnected type:None path:null path:null type:None
   [junit4]   2> 573570 INFO  (TEST-CollectionsAPIDistributedZkTest.test-seed#[7A6E51F7D7DA9D09]) [    ] o.a.s.c.c.ConnectionManager Client is connected to ZooKeeper
   [junit4]   2> 573571 INFO  (TEST-CollectionsAPIDistributedZkTest.test-seed#[7A6E51F7D7DA9D09]) [    ] o.a.s.c.c.ZkStateReader Updating cluster state from ZooKeeper... 
   [junit4]   2> 573606 INFO  (OverseerStateUpdate-95164123797258244-127.0.0.1:34781_xvvd%2Fm-n_0000000000) [    ] o.a.s.c.o.ZkStateWriter going to create_collection /collections/collection1/state.json
   [junit4]   2> 574573 INFO  (TEST-CollectionsAPIDistributedZkTest.test-seed#[7A6E51F7D7DA9D09]) [    ] o.a.s.c.ZkController Register node as live in ZooKeeper:/live_nodes/127.0.0.1:39086_xvvd%2Fm
   [junit4]   2> 574574 INFO  (TEST-CollectionsAPIDistributedZkTest.test-seed#[7A6E51F7D7DA9D09]) [    ] o.a.s.c.c.SolrZkClient makePath: /live_nodes/127.0.0.1:39086_xvvd%2Fm
   [junit4]   2> 574574 INFO  (zkCallback-596-thread-2) [    ] o.a.s.c.c.ZkStateReader A live node change: [WatchedEvent state:SyncConnected type:NodeChildrenChanged path:/live_nodes], has occurred - updating... (live nodes size: [1])
   [junit4]   2> 574574 INFO  (zkCallback-603-thread-1) [    ] o.a.s.c.c.ZkStateReader A live node change: [WatchedEvent state:SyncConnected type:NodeChildrenChanged path:/live_nodes], has occurred - updating... (live nodes size: [1])
   [junit4]   2> 574574 INFO  (zkCallback-598-thread-1) [    ] o.a.s.c.c.ZkStateReader A live node change: [WatchedEvent state:SyncConnected type:NodeChildrenChanged path:/live_nodes], has occurred - updating... (live nodes size: [1])
   [junit4]   2> 574575 INFO  (TEST-CollectionsAPIDistributedZkTest.test-seed#[7A6E51F7D7DA9D09]) [    ] o.a.s.c.Overseer Overseer (id=null) closing
   [junit4]   2> 574575 INFO  (TEST-CollectionsAPIDistributedZkTest.test-seed#[7A6E51F7D7DA9D09]) [    ] o.a.s.c.LeaderElector Joined leadership election with path: /overseer_elect/election/95164123797258249-127.0.0.1:39086_xvvd%2Fm-n_0000000001
   [junit4]   2> 574575 INFO  (TEST-CollectionsAPIDistributedZkTest.test-seed#[7A6E51F7D7DA9D09]) [    ] o.a.s.c.LeaderElector Watching path /overseer_elect/election/95164123797258244-127.0.0.1:34781_xvvd%2Fm-n_0000000000 to know if I could be the leader
   [junit4]   2> 574583 INFO  (TEST-CollectionsAPIDistributedZkTest.test-seed#[7A6E51F7D7DA9D09]) [    ] o.a.s.c.CoreContainer Security conf doesn't exist. Skipping setup for authorization module.
   [junit4]   2> 574583 INFO  (TEST-CollectionsAPIDistributedZkTest.test-seed#[7A6E51F7D7DA9D09]) [    ] o.a.s.c.CoreContainer No authentication plugin used.
   [junit4]   2> 574583 INFO  (TEST-CollectionsAPIDistributedZkTest.test-seed#[7A6E51F7D7DA9D09]) [    ] o.a.s.c.CorePropertiesLocator Looking for core definitions underneath /home/jenkins/workspace/Lucene-Solr-5.x-Linux/solr/build/solr-core/test/J0/../../../../../../../../../home/jenkins/workspace/Lucene-Solr-5.x-Linux/solr/build/solr-core/test/J0/temp/solr.cloud.CollectionsAPIDistributedZkTest_7A6E51F7D7DA9D09-001/shard-1-001/cores
   [junit4]   2> 574583 INFO  (TEST-CollectionsAPIDistributedZkTest.test-seed#[7A6E51F7D7DA9D09]) [    ] o.a.s.c.CoreDescriptor Created CoreDescriptor: {name=collection1, config=solrconfig.xml, transient=false, schema=schema.xml, loadOnStartup=true, configSetProperties=configsetprops.json, collection=collection1, coreNodeName=, dataDir=data/, shard=}
   [junit4]   2> 574584 INFO  (TEST-CollectionsAPIDistributedZkTest.test-seed#[7A6E51F7D7DA9D09]) [    ] o.a.s.c.CorePropertiesLocator Found core collection1 in /home/jenkins/workspace/Lucene-Solr-5.x-Linux/solr/build/solr-core/test/J0/../../../../../../../../../home/jenkins/workspace/Lucene-Solr-5.x-Linux/solr/build/solr-core/test/J0/temp/solr.cloud.CollectionsAPIDistributedZkTest_7A6E51F7D7DA9D09-001/shard-1-001/cores/collection1
   [junit4]   2> 574584 INFO  (TEST-CollectionsAPIDistributedZkTest.test-seed#[7A6E51F7D7DA9D09]) [    ] o.a.s.c.CorePropertiesLocator Found 1 core definitions
   [junit4]   2> 574584 INFO  (TEST-CollectionsAPIDistributedZkTest.test-seed#[7A6E51F7D7DA9D09]) [    ] o.a.s.s.SolrDispatchFilter user.dir=/home/jenkins/workspace/Lucene-Solr-5.x-Linux/solr/build/solr-core/test/J0
   [junit4]   2> 574584 INFO  (TEST-CollectionsAPIDistributedZkTest.test-seed#[7A6E51F7D7DA9D09]) [    ] o.a.s.s.SolrDispatchFilter SolrDispatchFilter.init() done
   [junit4]   2> 574584 INFO  (coreLoadExecutor-2188-thread-1) [    ] o.a.s.c.ZkController publishing state=down
   [junit4]   2> 574584 INFO  (coreLoadExecutor-2188-thread-1) [    ] o.a.s.c.ZkController numShards not found on descriptor - reading it from system property
   [junit4]   2> 574585 INFO  (coreLoadExecutor-2188-thread-1) [    ] o.a.s.c.ZkController Registering watch for collection collection1
   [junit4]   2> 574585 INFO  (coreLoadExecutor-2188-thread-1) [    ] o.a.s.c.c.ZkStateReader addZkWatch [collection1]
   [junit4]   2> 574585 INFO  (OverseerStateUpdate-95164123797258244-127.0.0.1:34781_xvvd%2Fm-n_0000000000) [    ] o.a.s.c.Overseer processMessage: queueSize: 1, message = {
   [junit4]   2>   "core":"collection1",
   [junit4]   2>   "roles":null,
   [junit4]   2>   "base_url":"http://127.0.0.1:39086/xvvd/m",
   [junit4]   2>   "node_name":"127.0.0.1:39086_xvvd%2Fm",
   [junit4]   2>   "numShards":"2",
   [junit4]   2>   "state":"down",
   [junit4]   2>   "shard":null,
   [junit4]   2>   "collection":"collection1",
   [junit4]   2>   "operation":"state"} current state version: 3
   [junit4]   2> 574585 INFO  (coreLoadExecutor-2188-thread-1) [    ] o.a.s.c.c.ZkStateReader Add data for [collection1] ver [0]
   [junit4]   2> 574585 INFO  (coreLoadExecutor-2188-thread-1) [    ] o.a.s.c.ZkController look for our core node name
   [junit4]   2> 574585 INFO  (OverseerStateUpdate-95164123797258244-127.0.0.1:34781_xvvd%2Fm-n_0000000000) [    ] o.a.s.c.o.ReplicaMutator Update state numShards=2 message={
   [junit4]   2>   "core":"collection1",
   [junit4]   2>   "roles":null,
   [junit4]   2>   "base_url":"http://127.0.0.1:39086/xvvd/m",
   [junit4]   2>   "node_name":"127.0.0.1:39086_xvvd%2Fm",
   [junit4]   2>   "numShards":"2",
   [junit4]   2>   "state":"down",
   [junit4]   2>   "shard":null,
   [junit4]   2>   "collection":"collection1",
   [junit4]   2>   "operation":"state"}
   [junit4]   2> 574585 INFO  (OverseerStateUpdate-95164123797258244-127.0.0.1:34781_xvvd%2Fm-n_0000000000) [    ] o.a.s.c.o.ReplicaMutator Collection already exists with numShards=2
   [junit4]   2> 574585 INFO  (OverseerStateUpdate-95164123797258244-127.0.0.1:34781_xvvd%2Fm-n_0000000000) [    ] o.a.s.c.o.ReplicaMutator Assigning new node to shard shard=shard2
   [junit4]   2> 574686 INFO  (OverseerStateUpdate-95164123797258244-127.0.0.1:34781_xvvd%2Fm-n_0000000000) [    ] o.a.s.c.o.ZkStateWriter going to update_collection /collections/collection1/state.json version: 0
   [junit4]   2> 574686 INFO  (zkCallback-603-thread-1) [    ] o.a.s.c.c.ZkStateReader A cluster state change: [WatchedEvent state:SyncConnected type:NodeDataChanged path:/collections/collection1/state.json] for collection [collection1] has occurred - updating... (live nodes size: [2])
   [junit4]   2> 574687 INFO  (zkCallback-603-thread-1) [    ] o.a.s.c.c.ZkStateReader Updating data for [collection1] from [0] to [1]
   [junit4]   2> 575585 INFO  (coreLoadExecutor-2188-thread-1) [    ] o.a.s.c.ZkController waiting to find shard id in clusterstate for collection1
   [junit4]   2> 575585 INFO  (coreLoadExecutor-2188-thread-1) [    ] o.a.s.c.ZkController Check for collection zkNode:collection1
   [junit4]   2> 575586 INFO  (coreLoadExecutor-2188-thread-1) [    ] o.a.s.c.ZkController Collection zkNode exists
   [junit4]   2> 575586 INFO  (coreLoadExecutor-2188-thread-1) [    ] o.a.s.c.c.ZkStateReader Load collection config from: [/collections/collection1]
   [junit4]   2> 575586 INFO  (coreLoadExecutor-2188-thread-1) [    ] o.a.s.c.c.ZkStateReader path=[/collections/collection1] [configName]=[conf1] specified config exists in ZooKeeper
   [junit4]   2> 575586 INFO  (coreLoadExecutor-2188-thread-1) [    ] o.a.s.c.SolrResourceLoader new SolrResourceLoader for directory: '/home/jenkins/workspace/Lucene-Solr-5.x-Linux/solr/build/solr-core/test/J0/temp/solr.cloud.CollectionsAPIDistributedZkTest_7A6E51F7D7DA9D09-001/shard-1-001/cores/collection1'
   [junit4]   2> 575586 INFO  (coreLoadExecutor-2188-thread-1) [    ] o.a.s.c.SolrResourceLoader JNDI not configured for solr (NoInitialContextEx)
   [junit4]   2> 575586 INFO  (coreLoadExecutor-2188-thread-1) [    ] o.a.s.c.SolrResourceLoader solr home defaulted to 'solr/' (could not find system property or JNDI)
   [junit4]   2> 575587 INFO  (coreLoadExecutor-2188-thread-1) [    ] o.a.s.c.Config loaded config solrconfig.xml with version 0 
   [junit4]   2> 575591 INFO  (coreLoadExecutor-2188-thread-1) [    ] o.a.s.c.SolrConfig current version of requestparams : -1
   [junit4]   2> 575594 INFO  (coreLoadExecutor-2188-thread-1) [    ] o.a.s.c.SolrConfig Using Lucene MatchVersion: 5.5.0
   [junit4]   2> 575599 INFO  (coreLoadExecutor-2188-thread-1) [    ] o.a.s.c.SolrConfig Loaded SolrConfig: solrconfig.xml
   [junit4]   2> 575602 INFO  (coreLoadExecutor-2188-thread-1) [    ] o.a.s.s.IndexSchema [collection1] Schema name=test
   [junit4]   2> 575663 INFO  (coreLoadExecutor-2188-thread-1) [    ] o.a.s.s.OpenExchangeRatesOrgProvider Initialized with rates=open-exchange-rates.json, refreshInterval=1440.
   [junit4]   2> 575666 INFO  (coreLoadExecutor-2188-thread-1) [    ] o.a.s.s.IndexSchema default search field in schema is text
   [junit4]   2> 575667 INFO  (coreLoadExecutor-2188-thread-1) [    ] o.a.s.s.IndexSchema unique key field: id
   [junit4]   2> 575670 INFO  (coreLoadExecutor-2188-thread-1) [    ] o.a.s.s.FileExchangeRateProvider Reloading exchange rates from file currency.xml
   [junit4]   2> 575672 INFO  (coreLoadExecutor-2188-thread-1) [    ] o.a.s.s.FileExchangeRateProvider Reloading exchange rates from file currency.xml
   [junit4]   2> 575672 INFO  (coreLoadExecutor-2188-thread-1) [    ] o.a.s.s.OpenExchangeRatesOrgProvider Reloading exchange rates from open-exchange-rates.json
   [junit4]   2> 575673 INFO  (coreLoadExecutor-2188-thread-1) [    ] o.a.s.s.OpenExchangeRatesOrgProvider Reloading exchange rates from open-exchange-rates.json
   [junit4]   2> 575673 INFO  (coreLoadExecutor-2188-thread-1) [    ] o.a.s.c.ConfigSetProperties Did not find ConfigSet properties, assuming default properties: Can't find resource 'configsetprops.json' in classpath or '/configs/conf1', cwd=/home/jenkins/workspace/Lucene-Solr-5.x-Linux/solr/build/solr-core/test/J0
   [junit4]   2> 575673 INFO  (coreLoadExecutor-2188-thread-1) [    ] o.a.s.c.CoreContainer Creating SolrCore 'collection1' using configuration from collection collection1
   [junit4]   2> 575674 INFO  (coreLoadExecutor-2188-thread-1) [    ] o.a.s.c.SolrCore org.apache.solr.core.MockDirectoryFactory
   [junit4]   2> 575674 INFO  (coreLoadExecutor-2188-thread-1) [    ] o.a.s.c.SolrCore [[collection1] ] Opening new SolrCore at [/home/jenkins/workspace/Lucene-Solr-5.x-Linux/solr/build/solr-core/test/J0/temp/solr.cloud.CollectionsAPIDistributedZkTest_7A6E51F7D7DA9D09-001/shard-1-001/cores/collection1], dataDir=[/home/jenkins/workspace/Lucene-Solr-5.x-Linux/solr/build/solr-core/test/J0/../../../../../../../../../home/jenkins/workspace/Lucene-Solr-5.x-Linux/solr/build/solr-core/test/J0/temp/solr.cloud.CollectionsAPIDistributedZkTest_7A6E51F7D7DA9D09-001/shard-1-001/cores/collection1/data/]
   [junit4]   2> 575674 INFO  (coreLoadExecutor-2188-thread-1) [    ] o.a.s.c.JmxMonitoredMap JMX monitoring is enabled. Adding Solr mbeans to JMX Server: com.sun.jmx.mbeanserver.JmxMBeanServer@20efba64
   [junit4]   2> 575674 INFO  (coreLoadExecutor-2188-thread-1) [    ] o.a.s.c.CachingDirectoryFactory return new directory for /home/jenkins/workspace/Lucene-Solr-5.x-Linux/solr/build/solr-core/test/J0/../../../../../../../../../home/jenkins/workspace/Lucene-Solr-5.x-Linux/solr/build/solr-core/test/J0/temp/solr.cloud.CollectionsAPIDistributedZkTest_7A6E51F7D7DA9D09-001/shard-1-001/cores/collection1/data
   [junit4]   2> 575674 INFO  (coreLoadExecutor-2188-thread-1) [    ] o.a.s.c.SolrCore New index directory detected: old=null new=/home/jenkins/workspace/Lucene-Solr-5.x-Linux/solr/build/solr-core/test/J0/../../../../../../../../../home/jenkins/workspace/Lucene-Solr-5.x-Linux/solr/build/solr-core/test/J0/temp/solr.cloud.CollectionsAPIDistributedZkTest_7A6E51F7D7DA9D09-001/shard-1-001/cores/collection1/data/index/
   [junit4]   2> 575674 WARN  (coreLoadExecutor-2188-thread-1) [    ] o.a.s.c.SolrCore [collection1] Solr index directory '/home/jenkins/workspace/Lucene-Solr-5.x-Linux/solr/build/solr-core/test/J0/../../../../../../../../../home/jenkins/workspace/Lucene-Solr-5.x-Linux/solr/build/solr-core/test/J0/temp/solr.cloud.CollectionsAPIDistributedZkTest_7A6E51F7D7DA9D09-001/shard-1-001/cores/collection1/data/index' doesn't exist. Creating new index...
   [junit4]   2> 575674 INFO  (coreLoadExecutor-2188-thread-1) [    ] o.a.s.c.CachingDirectoryFactory return new directory for /home/jenkins/workspace/Lucene-Solr-5.x-Linux/solr/build/solr-core/test/J0/../../../../../../../../../home/jenkins/workspace/Lucene-Solr-5.x-Linux/solr/build/solr-core/test/J0/temp/solr.cloud.CollectionsAPIDistributedZkTest_7A6E51F7D7DA9D09-001/shard-1-001/cores/collection1/data/index
   [junit4]   2> 575674 INFO  (coreLoadExecutor-2188-thread-1) [    ] o.a.s.u.RandomMergePolicy RandomMergePolicy wrapping class org.apache.lucene.index.TieredMergePolicy: [TieredMergePolicy: maxMergeAtOnce=36, maxMergeAtOnceExplicit=41, maxMergedSegmentMB=48.5146484375, floorSegmentMB=1.9306640625, forceMergeDeletesPctAllowed=4.679818497659437, segmentsPerTier=25.0, maxCFSSegmentSizeMB=8.796093022207999E12, noCFSRatio=0.19767874273082464
   [junit4]   2> 575675 INFO  (coreLoadExecutor-2188-thread-1) [    ] o.a.s.c.SolrDeletionPolicy SolrDeletionPolicy.onCommit: commits: num=1
   [junit4]   2> 	commit{dir=MockDirectoryWrapper(RAMDirectory@42c77ff7 lockFactory=org.apache.lucene.store.SingleInstanceLockFactory@25d56c1f),segFN=segments_1,generation=1}
   [junit4]   2> 575675 INFO  (coreLoadExecutor-2188-thread-1) [    ] o.a.s.c.SolrDeletionPolicy newest commit generation = 1
   [junit4]   2> 575675 INFO  (OldIndexDirectoryCleanupThreadForCore-collection1) [    ] o.a.s.c.SolrCore Looking for old index directories to cleanup for core collection1 in /home/jenkins/workspace/Lucene-Solr-5.x-Linux/solr/build/solr-core/test/J0/../../../../../../../../../home/jenkins/workspace/Lucene-Solr-5.x-Linux/solr/build/solr-core/test/J0/temp/solr.cloud.CollectionsAPIDistributedZkTest_7A6E51F7D7DA9D09-001/shard-1-001/cores/collection1/data/
   [junit4]   2> 575675 WARN  (OldIndexDirectoryCleanupThreadForCore-collection1) [    ] o.a.s.c.DirectoryFactory /home/jenkins/workspace/Lucene-Solr-5.x-Linux/solr/build/solr-core/test/J0/../../../../../../../../../home/jenkins/workspace/Lucene-Solr-5.x-Linux/solr/build/solr-core/test/J0/temp/solr.cloud.CollectionsAPIDistributedZkTest_7A6E51F7D7DA9D09-001/shard-1-001/cores/collection1/data/ does not point to a valid data directory; skipping clean-up of old index directories.
   [junit4]   2> 575677 INFO  (coreLoadExecutor-2188-thread-1) [    ] o.a.s.u.p.UpdateRequestProcessorChain creating updateRequestProcessorChain "nodistrib"
   [junit4]   2> 575678 INFO  (coreLoadExecutor-2188-thread-1) [    ] o.a.s.u.p.UpdateRequestProcessorChain creating updateRequestProcessorChain "dedupe"
   [junit4]   2> 575678 INFO  (coreLoadExecutor-2188-thread-1) [    ] o.a.s.u.p.UpdateRequestProcessorChain inserting DistributedUpdateProcessorFactory into updateRequestProcessorChain "dedupe"
   [junit4]   2> 575678 INFO  (coreLoadExecutor-2188-thread-1) [    ] o.a.s.u.p.UpdateRequestProcessorChain creating updateRequestProcessorChain "stored_sig"
   [junit4]   2> 575678 INFO  (coreLoadExecutor-2188-thread-1) [    ] o.a.s.u.p.UpdateRequestProcessorChain inserting DistributedUpdateProcessorFactory into updateRequestProcessorChain "stored_sig"
   [junit4]   2> 575678 INFO  (coreLoadExecutor-2188-thread-1) [    ] o.a.s.u.p.UpdateRequestProcessorChain creating updateRequestProcessorChain "distrib-dup-test-chain-explicit"
   [junit4]   2> 575678 INFO  (coreLoadExecutor-2188-thread-1) [    ] o.a.s.u.p.UpdateRequestProcessorChain creating updateRequestProcessorChain "distrib-dup-test-chain-implicit"
   [junit4]   2> 575678 INFO  (coreLoadExecutor-2188-thread-1) [    ] o.a.s.u.p.UpdateRequestProcessorChain inserting DistributedUpdateProcessorFactory into updateRequestProcessorChain "distrib-dup-test-chain-implicit"
   [junit4]   2> 575678 INFO  (coreLoadExecutor-2188-thread-1) [    ] o.a.s.c.SolrCore no updateRequestProcessorChain defined as default, creating implicit default
   [junit4]   2> 575678 WARN  (coreLoadExecutor-2188-thread-1) [    ] o.a.s.c.RequestHandlers INVALID paramSet a in requestHandler {type = requestHandler,name = /dump,class = DumpRequestHandler,args = {defaults={a=A,b=B}}}
   [junit4]   2> 575679 INFO  (coreLoadExecutor-2188-thread-1) [    ] o.a.s.h.l.XMLLoader xsltCacheLifetimeSeconds=60
   [junit4]   2> 575680 INFO  (coreLoadExecutor-2188-thread-1) [    ] o.a.s.h.l.XMLLoader xsltCacheLifetimeSeconds=60
   [junit4]   2> 575680 INFO  (coreLoadExecutor-2188-thread-1) [    ] o.a.s.h.l.XMLLoader xsltCacheLifetimeSeconds=60
   [junit4]   2> 575681 INFO  (coreLoadExecutor-2188-thread-1) [    ] o.a.s.h.l.XMLLoader xsltCacheLifetimeSeconds=60
   [junit4]   2> 575682 INFO  (coreLoadExecutor-2188-thread-1) [    ] o.a.s.c.RequestHandlers Registered paths: /admin/mbeans,standard,/dump,/update/csv,/update/json/docs,/admin/luke,/admin/segments,/get,/admin/system,/replication,/admin/properties,/config,/schema,/admin/plugins,/admin/logging,/update/json,/admin/threads,/admin/ping,/update,/admin/file
   [junit4]   2> 575683 INFO  (coreLoadExecutor-2188-thread-1) [    ] o.a.s.c.SolrCore Using default statsCache cache: org.apache.solr.search.stats.LocalStatsCache
   [junit4]   2> 575683 INFO  (coreLoadExecutor-2188-thread-1) [    ] o.a.s.u.UpdateHandler Using UpdateLog implementation: org.apache.solr.update.UpdateLog
   [junit4]   2> 575683 INFO  (coreLoadExecutor-2188-thread-1) [    ] o.a.s.u.UpdateLog Initializing UpdateLog: dataDir= defaultSyncLevel=FLUSH numRecordsToKeep=100 maxNumLogsToKeep=10 numVersionBuckets=65536
   [junit4]   2> 575684 INFO  (coreLoadExecutor-2188-thread-1) [    ] o.a.s.u.CommitTracker Hard AutoCommit: disabled
   [junit4]   2> 575684 INFO  (coreLoadExecutor-2188-thread-1) [    ] o.a.s.u.CommitTracker Soft AutoCommit: disabled
   [junit4]   2> 575685 INFO  (coreLoadExecutor-2188-thread-1) [    ] o.a.s.u.RandomMergePolicy RandomMergePolicy wrapping class org.apache.lucene.index.TieredMergePolicy: [TieredMergePolicy: maxMergeAtOnce=23, maxMergeAtOnceExplicit=39, maxMergedSegmentMB=33.4599609375, floorSegmentMB=0.4423828125, forceMergeDeletesPctAllowed=20.292964238450317, segmentsPerTier=47.0, maxCFSSegmentSizeMB=8.796093022207999E12, noCFSRatio=1.0
   [junit4]   2> 575685 INFO  (coreLoadExecutor-2188-thread-1) [    ] o.a.s.c.SolrDeletionPolicy SolrDeletionPolicy.onInit: commits: num=1
   [junit4]   2> 	commit{dir=MockDirectoryWrapper(RAMDirectory@42c77ff7 lockFactory=org.apache.lucene.store.SingleInstanceLockFactory@25d56c1f),segFN=segments_1,generation=1}
   [junit4]   2> 575685 INFO  (coreLoadExecutor-2188-thread-1) [    ] o.a.s.c.SolrDeletionPolicy newest commit generation = 1
   [junit4]   2> 575685 INFO  (coreLoadExecutor-2188-thread-1) [    ] o.a.s.s.SolrIndexSearcher Opening Searcher@15e11dd7[collection1] main
   [junit4]   2> 575685 INFO  (coreLoadExecutor-2188-thread-1) [    ] o.a.s.c.c.ZkStateReader Load collection config from: [/collections/collection1]
   [junit4]   2> 575685 INFO  (coreLoadExecutor-2188-thread-1) [    ] o.a.s.c.c.ZkStateReader path=[/collections/collection1] [configName]=[conf1] specified config exists in ZooKeeper
   [junit4]   2> 575685 INFO  (coreLoadExecutor-2188-thread-1) [    ] o.a.s.r.ManagedResourceStorage Setting up ZooKeeper-based storage for the RestManager with znodeBase: /configs/conf1
   [junit4]   2> 575685 INFO  (coreLoadExecutor-2188-thread-1) [    ] o.a.s.r.ManagedResourceStorage Configured ZooKeeperStorageIO with znodeBase: /configs/conf1
   [junit4]   2> 575685 INFO  (coreLoadExecutor-2188-thread-1) [    ] o.a.s.r.RestManager Initializing RestManager with initArgs: {}
   [junit4]   2> 575686 INFO  (coreLoadExecutor-2188-thread-1) [    ] o.a.s.r.ManagedResourceStorage Reading _rest_managed.json using ZooKeeperStorageIO:path=/configs/conf1
   [junit4]   2> 575686 INFO  (coreLoadExecutor-2188-thread-1) [    ] o.a.s.r.ManagedResourceStorage No data found for znode /configs/conf1/_rest_managed.json
   [junit4]   2> 575686 INFO  (coreLoadExecutor-2188-thread-1) [    ] o.a.s.r.ManagedResourceStorage Loaded null at path _rest_managed.json using ZooKeeperStorageIO:path=/configs/conf1
   [junit4]   2> 575686 INFO  (coreLoadExecutor-2188-thread-1) [    ] o.a.s.r.RestManager Initializing 0 registered ManagedResources
   [junit4]   2> 575686 INFO  (coreLoadExecutor-2188-thread-1) [    ] o.a.s.h.ReplicationHandler Commits will be reserved for  10000
   [junit4]   2> 575686 INFO  (searcherExecutor-2189-thread-1) [    ] o.a.s.c.SolrCore [collection1] Registered new searcher Searcher@15e11dd7[collection1] main{ExitableDirectoryReader(UninvertingDirectoryReader())}
   [junit4]   2> 575686 INFO  (coreLoadExecutor-2188-thread-1) [    ] o.a.s.u.UpdateLog Looking up max value of version field to seed version buckets
   [junit4]   2> 575686 INFO  (coreLoadExecutor-2188-thread-1) [    ] o.a.s.u.VersionInfo Refreshing highest value of _version_ for 65536 version buckets from index
   [junit4]   2> 575686 INFO  (coreLoadExecutor-2188-thread-1) [    ] o.a.s.u.VersionInfo No terms found for _version_, cannot seed version bucket highest value from index
   [junit4]   2> 575686 INFO  (coreLoadExecutor-2188-thread-1) [    ] o.a.s.u.UpdateLog Could not find max version in index or recent updates, using new clock 1522625984838238208
   [junit4]   2> 575688 INFO  (coreLoadExecutor-2188-thread-1) [    ] o.a.s.u.UpdateLog Took 1.0ms to seed version buckets with highest version 1522625984838238208
   [junit4]   2> 575688 INFO  (coreLoadExecutor-2188-thread-1) [    ] o.a.s.c.ZkController watch zkdir /configs/conf1
   [junit4]   2> 575689 INFO  (coreLoadExecutor-2188-thread-1) [    ] o.a.s.c.CoreContainer registering core: collection1
   [junit4]   2> 575689 INFO  (coreZkRegister-2183-thread-1) [    ] o.a.s.c.ZkController Register replica - core:collection1 address:http://127.0.0.1:39086/xvvd/m collection:collection1 shard:shard2
   [junit4]   2> 575689 INFO  (coreZkRegister-2183-thread-1) [    ] o.a.s.c.c.SolrZkClient makePath: /collections/collection1/leader_elect/shard2/election
   [junit4]   2> 575691 INFO  (coreZkRegister-2183-thread-1) [    ] o.a.s.c.LeaderElector Joined leadership election with path: /collections/collection1/leader_elect/shard2/election/95164123797258249-core_node1-n_0000000000
   [junit4]   2> 575691 INFO  (coreZkRegister-2183-thread-1) [    ] o.a.s.c.ShardLeaderElectionContext Running the leader process for shard=shard2 and weAreReplacement=false and leaderVoteWait=180000
   [junit4]   2> 575691 INFO  (coreZkRegister-2183-thread-1) [    ] o.a.s.c.ShardLeaderElectionContext Enough replicas found to continue.
   [junit4]   2> 575691 INFO  (coreZkRegister-2183-thread-1) [    ] o.a.s.c.ShardLeaderElectionContext I may be the new leader - try and sync
   [junit4]   2> 575691 INFO  (coreZkRegister-2183-thread-1) [    ] o.a.s.c.SyncStrategy Sync replicas to http://127.0.0.1:39086/xvvd/m/collection1/
   [junit4]   2> 575691 INFO  (coreZkRegister-2183-thread-1) [    ] o.a.s.c.SyncStrategy Sync Success - now sync replicas to me
   [junit4]   2> 575691 INFO  (coreZkRegister-2183-thread-1) [    ] o.a.s.c.SyncStrategy http://127.0.0.1:39086/xvvd/m/collection1/ has no replicas
   [junit4]   2> 575692 INFO  (OverseerStateUpdate-95164123797258244-127.0.0.1:34781_xvvd%2Fm-n_0000000000) [    ] o.a.s.c.Overseer processMessage: queueSize: 1, message = {
   [junit4]   2>   "operation":"leader",
   [junit4]   2>   "shard":"shard2",
   [junit4]   2>   "collection":"collection1"} current state version: 3
   [junit4]   2> 575693 INFO  (coreZkRegister-2183-thread-1) [    ] o.a.s.c.c.SolrZkClient makePath: /collections/collection1/leaders/shard2
   [junit4]   2> 575695 INFO  (coreZkRegister-2183-thread-1) [    ] o.a.s.c.ShardLeaderElectionContextBase Creating leader registration node
   [junit4]   2> 575697 INFO  (coreZkRegister-2183-thread-1) [    ] o.a.s.c.ShardLeaderElectionContext I am the new leader: http://127.0.0.1:39086/xvvd/m/collection1/ shard2
   [junit4]   2> 575698 INFO  (OverseerStateUpdate-95164123797258244-127.0.0.1:34781_xvvd%2Fm-n_0000000000) [    ] o.a.s.c.Overseer processMessage: queueSize: 1, message = {
   [junit4]   2>   "operation":"leader",
   [junit4]   2>   "shard":"shard2",
   [junit4]   2>   "collection":"collection1",
   [junit4]   2>   "base_url":"http://127.0.0.1:39086/xvvd/m",
   [junit4]   2>   "core":"collection1",
   [junit4]   2>   "state":"active"} current state version: 3
   [junit4]   2> 575800 INFO  (OverseerStateUpdate-95164123797258244-127.0.0.1:34781_xvvd%2Fm-n_0000000000) [    ] o.a.s.c.o.ZkStateWriter going to update_collection /collections/collection1/state.json version: 1
   [junit4]   2> 575800 INFO  (zkCallback-603-thread-1) [    ] o.a.s.c.c.ZkStateReader A cluster state change: [WatchedEvent state:SyncConnected type:NodeDataChanged path:/collections/collection1/state.json] for collection [collection1] has occurred - updating... (live nodes size: [2])
   [junit4]   2> 575801 INFO  (zkCallback-603-thread-1) [    ] o.a.s.c.c.ZkStateReader Updating data for [collection1] from [1] to [2]
   [junit4]   2> 575849 INFO  (coreZkRegister-2183-thread-1) [    ] o.a.s.c.ZkController We are http://127.0.0.1:39086/xvvd/m/collection1/ and leader is http://127.0.0.1:39086/xvvd/m/collection1/
   [junit4]   2> 575849 INFO  (coreZkRegister-2183-thread-1) [    ] o.a.s.c.ZkController No LogReplay needed for core=collection1 baseURL=http://127.0.0.1:39086/xvvd/m
   [junit4]   2> 575850 INFO  (coreZkRegister-2183-thread-1) [    ] o.a.s.c.ZkController I am the leader, no recovery necessary
   [junit4]   2> 575850 INFO  (coreZkRegister-2183-thread-1) [    ] o.a.s.c.ZkController publishing state=active
   [junit4]   2> 575850 INFO  (coreZkRegister-2183-thread-1) [    ] o.a.s.c.ZkController numShards not found on descriptor - reading it from system property
   [junit4]   2> 575851 INFO  (OverseerStateUpdate-95164123797258244-127.0.0.1:34781_xvvd%2Fm-n_0000000000) [    ] o.a.s.c.Overseer processMessage: queueSize: 1, message = {
   [junit4]   2>   "core":"collection1",
   [junit4]   2>   "core_node_name":"core_node1",
   [junit4]   2>   "roles":null,
   [junit4]   2>   "base_url":"http://127.0.0.1:39086/xvvd/m",
   [junit4]   2>   "node_name":"127.0.0.1:39086_xvvd%2Fm",
   [junit4]   2>   "numShards":"2",
   [junit4]   2>   "state":"active",
   [junit4]   2>   "shard":"shard2",
   [junit4]   2>   "collection":"collection1",
   [junit4]   2>   "operation":"state"} current state version: 3
   [junit4]   2> 575851 INFO  (OverseerStateUpdate-95164123797258244-127.0.0.1:34781_xvvd%2Fm-n_0000000000) [    ] o.a.s.c.o.ReplicaMutator Update state numShards=2 message={
   [junit4]   2>   "core":"collection1",
   [junit4]   2>   "core_node_name":"core_node1",
   [junit4]   2>   "roles":null,
   [junit4]   2>   "base_url":"http://127.0.0.1:39086/xvvd/m",
   [junit4]   2>   "node_name":"127.0.0.1:39086_xvvd%2Fm",
   [junit4]   2>   "numShards":"2",
   [junit4]   2>   "state":"active",
   [junit4]   2>   "shard":"shard2",
   [junit4]   2>   "collection":"collection1",
   [junit4]   2>   "operation":"state"}
   [junit4]   2> 575952 INFO  (OverseerStateUpdate-95164123797258244-127.0.0.1:34781_xvvd%2Fm-n_0000000000) [    ] o.a.s.c.o.ZkStateWriter going to update_collection /collections/collection1/state.json version: 2
   [junit4]   2> 575953 INFO  (zkCallback-603-thread-1) [    ] o.a.s.c.c.ZkStateReader A cluster state change: [WatchedEvent state:SyncConnected type:NodeDataChanged path:/collections/collection1/state.json] for collection [collection1] has occurred - updating... (live nodes size: [2])
   [junit4]   2> 575953 INFO  (zkCallback-603-thread-1) [    ] o.a.s.c.c.ZkStateReader Updating data for [collection1] from [2] to [3]
   [junit4]   2> 576171 INFO  (TEST-CollectionsAPIDistributedZkTest.test-seed#[7A6E51F7D7DA9D09]) [    ] o.a.s.SolrTestCaseJ4 Writing core.properties file to /home/jenkins/workspace/Lucene-Solr-5.x-Linux/solr/build/solr-core/test/J0/temp/solr.cloud.CollectionsAPIDistributedZkTest_7A6E51F7D7DA9D09-001/shard-2-001/cores/collection1
   [junit4]   2> 576171 INFO  (TEST-CollectionsAPIDistributedZkTest.test-seed#[7A6E51F7D7DA9D09]) [    ] o.a.s.c.AbstractFullDistribZkTestBase create jetty 2 in directory /home/jenkins/workspace/Lucene-Solr-5.x-Linux/solr/build/solr-core/test/J0/temp/solr.cloud.CollectionsAPIDistributedZkTest_7A6E51F7D7DA9D09-001/shard-2-001
   [junit4]   2> 576172 INFO  (TEST-CollectionsAPIDistributedZkTest.test-seed#[7A6E51F7D7DA9D09]) [    ] o.e.j.s.Server jetty-9.2.13.v20150730
   [junit4]   2> 576173 INFO  (TEST-CollectionsAPIDistributedZkTest.test-seed#[7A6E51F7D7DA9D09]) [    ] o.e.j.s.h.ContextHandler Started o.e.j.s.ServletContextHandler@196db818{/xvvd/m,null,AVAILABLE}
   [junit4]   2> 576174 INFO  (TEST-CollectionsAPIDistributedZkTest.test-seed#[7A6E51F7D7DA9D09]) [    ] o.e.j.s.ServerConnector Started ServerConnector@b8034b5{HTTP/1.1}{127.0.0.1:53361}
   [junit4]   2> 576174 INFO  (TEST-CollectionsAPIDistributedZkTest.test-seed#[7A6E51F7D7DA9D09]) [    ] o.e.j.s.Server Started @577786ms
   [junit4]   2> 576174 INFO  (TEST-CollectionsAPIDistributedZkTest.test-seed#[7A6E51F7D7DA9D09]) [    ] o.a.s.c.s.e.JettySolrRunner Jetty properties: {solr.data.dir=/home/jenkins/workspace/Lucene-Solr-5.x-Linux/solr/build/solr-core/test/J0/temp/solr.cloud.CollectionsAPIDistributedZkTest_7A6E51F7D7DA9D09-001/tempDir-00

[...truncated too long message...]

edcollection2/leader_elect/shard2/election/95164123797258255-core_node8-n_0000000000
   [junit4]   2> 	2	/solr/collections/awholynewcollection_0/leader_elect/shard2/election/95164123797258263-core_node3-n_0000000003
   [junit4]   2> 	2	/solr/collections/nodes_used_collection/leader_elect/shard1/election/95164123797258252-core_node4-n_0000000000
   [junit4]   2> 	2	/solr/collections/awholynewstresscollection_collection0_0/state.json
   [junit4]   2> 	2	/solr/collections/acollectionafterbaddelete/state.json
   [junit4]   2> 	2	/solr/collections/awholynewcollection_2/state.json
   [junit4]   2> 	2	/solr/collections/halfdeletedcollection2/leader_elect/shard3/election/95164123797258258-core_node4-n_0000000000
   [junit4]   2> 	2	/solr/collections/awholynewcollection_0/leader_elect/shard1/election/95164123797258252-core_node1-n_0000000000
   [junit4]   2> 	2	/solr/collections/awholynewcollection_0/leader_elect/shard3/election/95164123797258244-core_node10-n_0000000000
   [junit4]   2> 	2	/solr/collections/halfdeletedcollection/state.json
   [junit4]   2> 
   [junit4]   2> Maximum concurrent children watches above limit:
   [junit4]   2> 
   [junit4]   2> 	15	/solr/collections
   [junit4]   2> 	13	/solr/live_nodes
   [junit4]   2> 	3	/solr/overseer/queue
   [junit4]   2> 	3	/solr/overseer/collection-queue-work
   [junit4]   2> 
   [junit4]   2> NOTE: reproduce with: ant test  -Dtestcase=CollectionsAPIDistributedZkTest -Dtests.method=test -Dtests.seed=7A6E51F7D7DA9D09 -Dtests.multiplier=3 -Dtests.slow=true -Dtests.locale=mk -Dtests.timezone=JST -Dtests.asserts=true -Dtests.file.encoding=US-ASCII
   [junit4] ERROR    204s J0 | CollectionsAPIDistributedZkTest.test <<<
   [junit4]    > Throwable #1: com.carrotsearch.randomizedtesting.UncaughtExceptionError: Captured an uncaught exception in thread: Thread[id=5390, name=collection0, state=RUNNABLE, group=TGRP-CollectionsAPIDistributedZkTest]
   [junit4]    > Caused by: org.apache.solr.client.solrj.impl.HttpSolrClient$RemoteSolrException: Error from server at http://127.0.0.1:34781/xvvd/m: collection already exists: awholynewstresscollection_collection0_0
   [junit4]    > 	at __randomizedtesting.SeedInfo.seed([7A6E51F7D7DA9D09]:0)
   [junit4]    > 	at org.apache.solr.client.solrj.impl.HttpSolrClient.executeMethod(HttpSolrClient.java:575)
   [junit4]    > 	at org.apache.solr.client.solrj.impl.HttpSolrClient.request(HttpSolrClient.java:241)
   [junit4]    > 	at org.apache.solr.client.solrj.impl.HttpSolrClient.request(HttpSolrClient.java:230)
   [junit4]    > 	at org.apache.solr.client.solrj.impl.LBHttpSolrClient.doRequest(LBHttpSolrClient.java:372)
   [junit4]    > 	at org.apache.solr.client.solrj.impl.LBHttpSolrClient.request(LBHttpSolrClient.java:325)
   [junit4]    > 	at org.apache.solr.client.solrj.impl.CloudSolrClient.sendRequest(CloudSolrClient.java:1100)
   [junit4]    > 	at org.apache.solr.client.solrj.impl.CloudSolrClient.requestWithRetryOnStaleState(CloudSolrClient.java:871)
   [junit4]    > 	at org.apache.solr.client.solrj.impl.CloudSolrClient.request(CloudSolrClient.java:807)
   [junit4]    > 	at org.apache.solr.client.solrj.SolrClient.request(SolrClient.java:1220)
   [junit4]    > 	at org.apache.solr.cloud.AbstractFullDistribZkTestBase.createCollection(AbstractFullDistribZkTestBase.java:1574)
   [junit4]    > 	at org.apache.solr.cloud.AbstractFullDistribZkTestBase.createCollection(AbstractFullDistribZkTestBase.java:1595)
   [junit4]    > 	at org.apache.solr.cloud.CollectionsAPIDistributedZkTest$1CollectionThread.run(CollectionsAPIDistributedZkTest.java:881)Throwable #2: com.carrotsearch.randomizedtesting.UncaughtExceptionError: Captured an uncaught exception in thread: Thread[id=5391, name=collection1, state=RUNNABLE, group=TGRP-CollectionsAPIDistributedZkTest]
   [junit4]    > Caused by: org.apache.solr.client.solrj.impl.HttpSolrClient$RemoteSolrException: Error from server at http://127.0.0.1:34781/xvvd/m: Could not find collection : awholynewstresscollection_collection1_0
   [junit4]    > 	at __randomizedtesting.SeedInfo.seed([7A6E51F7D7DA9D09]:0)
   [junit4]    > 	at org.apache.solr.client.solrj.impl.HttpSolrClient.executeMethod(HttpSolrClient.java:575)
   [junit4]    > 	at org.apache.solr.client.solrj.impl.HttpSolrClient.request(HttpSolrClient.java:241)
   [junit4]    > 	at org.apache.solr.client.solrj.impl.HttpSolrClient.request(HttpSolrClient.java:230)
   [junit4]    > 	at org.apache.solr.client.solrj.impl.LBHttpSolrClient.doRequest(LBHttpSolrClient.java:372)
   [junit4]    > 	at org.apache.solr.client.solrj.impl.LBHttpSolrClient.request(LBHttpSolrClient.java:325)
   [junit4]    > 	at org.apache.solr.client.solrj.impl.CloudSolrClient.sendRequest(CloudSolrClient.java:1100)
   [junit4]    > 	at org.apache.solr.client.solrj.impl.CloudSolrClient.requestWithRetryOnStaleState(CloudSolrClient.java:871)
   [junit4]    > 	at org.apache.solr.client.solrj.impl.CloudSolrClient.request(CloudSolrClient.java:807)
   [junit4]    > 	at org.apache.solr.client.solrj.SolrClient.request(SolrClient.java:1220)
   [junit4]    > 	at org.apache.solr.cloud.CollectionsAPIDistributedZkTest$1CollectionThread.run(CollectionsAPIDistributedZkTest.java:888)
   [junit4]   2> 775813 INFO  (SUITE-CollectionsAPIDistributedZkTest-seed#[7A6E51F7D7DA9D09]-worker) [    ] o.a.s.SolrTestCaseJ4 ###deleteCore
   [junit4]   2> Jan 06, 2016 2:11:35 PM com.carrotsearch.randomizedtesting.ThreadLeakControl checkThreadLeaks
   [junit4]   2> WARNING: Will linger awaiting termination of 1 leaked thread(s).
   [junit4]   2> NOTE: test params are: codec=Asserting(Lucene54): {other_tl1=PostingsFormat(name=LuceneFixedGap), range_facet_l_dv=FSTOrd50, _version_=PostingsFormat(name=LuceneFixedGap), multiDefault=PostingsFormat(name=Asserting), a_t=PostingsFormat(name=LuceneFixedGap), intDefault=PostingsFormat(name=LuceneFixedGap), a_i1=PostingsFormat(name=LuceneFixedGap), id=FSTOrd50, range_facet_i_dv=PostingsFormat(name=LuceneFixedGap), text=PostingsFormat(name=LuceneVarGapDocFreqInterval), range_facet_l=PostingsFormat(name=LuceneFixedGap), timestamp=PostingsFormat(name=LuceneFixedGap)}, docValues:{range_facet_l_dv=DocValuesFormat(name=Asserting), range_facet_i_dv=DocValuesFormat(name=Lucene54), timestamp=DocValuesFormat(name=Lucene54)}, sim=DefaultSimilarity, locale=mk, timezone=JST
   [junit4]   2> NOTE: Linux 3.19.0-42-generic amd64/Oracle Corporation 9-ea (64-bit)/cpus=12,threads=1,free=186462864,total=518979584
   [junit4]   2> NOTE: All tests run in this JVM: [XsltUpdateRequestHandlerTest, TestStressUserVersions, SignatureUpdateProcessorFactoryTest, DistributedFacetPivotLargeTest, TestRTimerTree, TestSolrDynamicMBean, ResourceLoaderTest, TestPhraseSuggestions, HdfsChaosMonkeyNothingIsSafeTest, BasicZkTest, JsonLoaderTest, TestCSVLoader, PeerSyncTest, SOLR749Test, ExitableDirectoryReaderTest, TestDynamicFieldCollectionResource, BufferStoreTest, RuleEngineTest, TestSolr4Spatial, QueryEqualityTest, SSLMigrationTest, TestFaceting, JSONWriterTest, TestRandomDVFaceting, ParsingFieldUpdateProcessorsTest, TestArbitraryIndexDir, URLClassifyProcessorTest, TestValueSourceCache, TestBadConfig, TestHighlightDedupGrouping, CloneFieldUpdateProcessorFactoryTest, TestReqParamsAPI, TestBinaryField, TestSolrConfigHandlerConcurrent, TestFoldingMultitermQuery, FileBasedSpellCheckerTest, DistributedFacetPivotSmallTest, TestIBSimilarityFactory, TestRTGBase, HdfsUnloadDistributedZkTest, TestIntervalFaceting, TestMiniSolrCloudCluster, TestOmitPositions, DisMaxRequestHandlerTest, SparseHLLTest, SolrCloudExampleTest, SolrRequestParserTest, TestCloudInspectUtil, TestLMDirichletSimilarityFactory, ZkNodePropsTest, TestExactSharedStatsCache, TestDocSet, TestJoin, DocumentAnalysisRequestHandlerTest, TestFastOutputStream, BlockJoinFacetSimpleTest, TestInitQParser, CurrencyFieldOpenExchangeTest, TestMinMaxOnMultiValuedField, TestCustomDocTransformer, ReturnFieldsTest, PrimUtilsTest, TestReloadAndDeleteDocs, TestManagedResourceStorage, TestBlobHandler, ChangedSchemaMergeTest, ReplicationFactorTest, DistributedSpellCheckComponentTest, LeaderElectionIntegrationTest, TestRangeQuery, AlternateDirectoryTest, PingRequestHandlerTest, TestDistributedStatsComponentCardinality, RankQueryTest, UUIDFieldTest, TestRandomFaceting, TestCollationFieldDocValues, TestCloudManagedSchema, DeleteShardTest, TestSolrQueryParserDefaultOperatorResource, TestSolrQueryResponse, TestSmileRequest, TestFieldResource, TestFunctionQuery, TestMiniSolrCloudClusterSSL, OutputWriterTest, ConfigSetsAPITest, TestAtomicUpdateErrorCases, TestClassicSimilarityFactory, AnalysisAfterCoreReloadTest, IndexSchemaRuntimeFieldTest, BasicDistributedZkTest, CollectionsAPIDistributedZkTest]
   [junit4] Completed [255/562 (1!)] on J0 in 204.87s, 1 test, 1 error <<< FAILURES!

[...truncated 955 lines...]
BUILD FAILED
/home/jenkins/workspace/Lucene-Solr-5.x-Linux/build.xml:794: The following error occurred while executing this line:
/home/jenkins/workspace/Lucene-Solr-5.x-Linux/build.xml:738: The following error occurred while executing this line:
/home/jenkins/workspace/Lucene-Solr-5.x-Linux/build.xml:59: The following error occurred while executing this line:
/home/jenkins/workspace/Lucene-Solr-5.x-Linux/solr/build.xml:233: The following error occurred while executing this line:
/home/jenkins/workspace/Lucene-Solr-5.x-Linux/solr/common-build.xml:526: The following error occurred while executing this line:
/home/jenkins/workspace/Lucene-Solr-5.x-Linux/lucene/common-build.xml:1444: The following error occurred while executing this line:
/home/jenkins/workspace/Lucene-Solr-5.x-Linux/lucene/common-build.xml:1000: There were test failures: 562 suites (7 ignored), 2231 tests, 1 error, 84 ignored (39 assumptions) [seed: 7A6E51F7D7DA9D09]

Total time: 48 minutes 19 seconds
Build step 'Invoke Ant' marked build as failure
Archiving artifacts
[WARNINGS] Skipping publisher since build result is FAILURE
Recording test results
Email was triggered for: Failure - Any
Sending email for trigger: Failure - Any



Mime
View raw message