lucene-dev mailing list archives

Site index · List index
Message view « Date » · « Thread »
Top « Date » · « Thread »
From Policeman Jenkins Server <jenk...@thetaphi.de>
Subject [JENKINS] Lucene-Solr-trunk-Solaris (64bit/jdk1.8.0) - Build # 353 - Still Failing!
Date Mon, 25 Jan 2016 04:12:55 GMT
Build: http://jenkins.thetaphi.de/job/Lucene-Solr-trunk-Solaris/353/
Java: 64bit/jdk1.8.0 -XX:-UseCompressedOops -XX:+UseConcMarkSweepGC

1 tests failed.
FAILED:  org.apache.solr.spelling.suggest.SuggesterWFSTTest.testReload

Error Message:
Exception during query

Stack Trace:
java.lang.RuntimeException: Exception during query
	at __randomizedtesting.SeedInfo.seed([7C26059C3B3C7FA2:BBD67D9FF17F87B0]:0)
	at org.apache.solr.SolrTestCaseJ4.assertQ(SolrTestCaseJ4.java:755)
	at org.apache.solr.SolrTestCaseJ4.assertQ(SolrTestCaseJ4.java:722)
	at org.apache.solr.spelling.suggest.SuggesterTest.testReload(SuggesterTest.java:91)
	at sun.reflect.NativeMethodAccessorImpl.invoke0(Native Method)
	at sun.reflect.NativeMethodAccessorImpl.invoke(NativeMethodAccessorImpl.java:62)
	at sun.reflect.DelegatingMethodAccessorImpl.invoke(DelegatingMethodAccessorImpl.java:43)
	at java.lang.reflect.Method.invoke(Method.java:497)
	at com.carrotsearch.randomizedtesting.RandomizedRunner.invoke(RandomizedRunner.java:1764)
	at com.carrotsearch.randomizedtesting.RandomizedRunner$8.evaluate(RandomizedRunner.java:871)
	at com.carrotsearch.randomizedtesting.RandomizedRunner$9.evaluate(RandomizedRunner.java:907)
	at com.carrotsearch.randomizedtesting.RandomizedRunner$10.evaluate(RandomizedRunner.java:921)
	at com.carrotsearch.randomizedtesting.rules.SystemPropertiesRestoreRule$1.evaluate(SystemPropertiesRestoreRule.java:57)
	at org.apache.lucene.util.TestRuleSetupTeardownChained$1.evaluate(TestRuleSetupTeardownChained.java:50)
	at org.apache.lucene.util.AbstractBeforeAfterRule$1.evaluate(AbstractBeforeAfterRule.java:46)
	at org.apache.lucene.util.TestRuleThreadAndTestName$1.evaluate(TestRuleThreadAndTestName.java:49)
	at org.apache.lucene.util.TestRuleIgnoreAfterMaxFailures$1.evaluate(TestRuleIgnoreAfterMaxFailures.java:65)
	at org.apache.lucene.util.TestRuleMarkFailure$1.evaluate(TestRuleMarkFailure.java:48)
	at com.carrotsearch.randomizedtesting.rules.StatementAdapter.evaluate(StatementAdapter.java:36)
	at com.carrotsearch.randomizedtesting.ThreadLeakControl$StatementRunner.run(ThreadLeakControl.java:367)
	at com.carrotsearch.randomizedtesting.ThreadLeakControl.forkTimeoutingTask(ThreadLeakControl.java:809)
	at com.carrotsearch.randomizedtesting.ThreadLeakControl$3.evaluate(ThreadLeakControl.java:460)
	at com.carrotsearch.randomizedtesting.RandomizedRunner.runSingleTest(RandomizedRunner.java:880)
	at com.carrotsearch.randomizedtesting.RandomizedRunner$5.evaluate(RandomizedRunner.java:781)
	at com.carrotsearch.randomizedtesting.RandomizedRunner$6.evaluate(RandomizedRunner.java:816)
	at com.carrotsearch.randomizedtesting.RandomizedRunner$7.evaluate(RandomizedRunner.java:827)
	at com.carrotsearch.randomizedtesting.rules.StatementAdapter.evaluate(StatementAdapter.java:36)
	at com.carrotsearch.randomizedtesting.rules.SystemPropertiesRestoreRule$1.evaluate(SystemPropertiesRestoreRule.java:57)
	at org.apache.lucene.util.AbstractBeforeAfterRule$1.evaluate(AbstractBeforeAfterRule.java:46)
	at com.carrotsearch.randomizedtesting.rules.StatementAdapter.evaluate(StatementAdapter.java:36)
	at org.apache.lucene.util.TestRuleStoreClassName$1.evaluate(TestRuleStoreClassName.java:42)
	at com.carrotsearch.randomizedtesting.rules.NoShadowingOrOverridesOnMethodsRule$1.evaluate(NoShadowingOrOverridesOnMethodsRule.java:40)
	at com.carrotsearch.randomizedtesting.rules.NoShadowingOrOverridesOnMethodsRule$1.evaluate(NoShadowingOrOverridesOnMethodsRule.java:40)
	at com.carrotsearch.randomizedtesting.rules.StatementAdapter.evaluate(StatementAdapter.java:36)
	at com.carrotsearch.randomizedtesting.rules.StatementAdapter.evaluate(StatementAdapter.java:36)
	at com.carrotsearch.randomizedtesting.rules.StatementAdapter.evaluate(StatementAdapter.java:36)
	at org.apache.lucene.util.TestRuleAssertionsRequired$1.evaluate(TestRuleAssertionsRequired.java:54)
	at org.apache.lucene.util.TestRuleMarkFailure$1.evaluate(TestRuleMarkFailure.java:48)
	at org.apache.lucene.util.TestRuleIgnoreAfterMaxFailures$1.evaluate(TestRuleIgnoreAfterMaxFailures.java:65)
	at org.apache.lucene.util.TestRuleIgnoreTestSuites$1.evaluate(TestRuleIgnoreTestSuites.java:55)
	at com.carrotsearch.randomizedtesting.rules.StatementAdapter.evaluate(StatementAdapter.java:36)
	at com.carrotsearch.randomizedtesting.ThreadLeakControl$StatementRunner.run(ThreadLeakControl.java:367)
	at java.lang.Thread.run(Thread.java:745)
Caused by: java.lang.RuntimeException: REQUEST FAILED: xpath=//lst[@name='spellcheck']/lst[@name='suggestions']/lst[@name='ac']/int[@name='numFound'][.='2']
	xml response was: <?xml version="1.0" encoding="UTF-8"?>
<response>
<lst name="responseHeader"><int name="status">0</int><int name="QTime">0</int></lst><lst name="spellcheck"><lst name="suggestions"/></lst>
</response>

	request was:q=ac&qt=/suggest_wfst&spellcheck.onlyMorePopular=true&spellcheck.count=2&wt=xml
	at org.apache.solr.SolrTestCaseJ4.assertQ(SolrTestCaseJ4.java:748)
	... 41 more




Build Log:
[...truncated 10312 lines...]
   [junit4] Suite: org.apache.solr.spelling.suggest.SuggesterWFSTTest
   [junit4]   2> Creating dataDir: /export/home/jenkins/workspace/Lucene-Solr-trunk-Solaris/solr/build/solr-core/test/J1/temp/solr.spelling.suggest.SuggesterWFSTTest_7C26059C3B3C7FA2-001/init-core-data-001
   [junit4]   2> 1773954 INFO  (SUITE-SuggesterWFSTTest-seed#[7C26059C3B3C7FA2]-worker) [    ] o.a.s.SolrTestCaseJ4 Randomized ssl (false) and clientAuth (false)
   [junit4]   2> 1773954 INFO  (SUITE-SuggesterWFSTTest-seed#[7C26059C3B3C7FA2]-worker) [    ] o.a.s.SolrTestCaseJ4 ####initCore
   [junit4]   2> 1773954 INFO  (SUITE-SuggesterWFSTTest-seed#[7C26059C3B3C7FA2]-worker) [    ] o.a.s.c.SolrResourceLoader new SolrResourceLoader for directory: '/export/home/jenkins/workspace/Lucene-Solr-trunk-Solaris/solr/core/src/test-files/solr/collection1'
   [junit4]   2> 1773954 INFO  (SUITE-SuggesterWFSTTest-seed#[7C26059C3B3C7FA2]-worker) [    ] o.a.s.c.SolrResourceLoader JNDI not configured for solr (NoInitialContextEx)
   [junit4]   2> 1773954 INFO  (SUITE-SuggesterWFSTTest-seed#[7C26059C3B3C7FA2]-worker) [    ] o.a.s.c.SolrResourceLoader using system property solr.solr.home: /export/home/jenkins/workspace/Lucene-Solr-trunk-Solaris/solr/core/src/test-files/solr
   [junit4]   2> 1773955 INFO  (SUITE-SuggesterWFSTTest-seed#[7C26059C3B3C7FA2]-worker) [    ] o.a.s.c.SolrResourceLoader Adding 'file:/export/home/jenkins/workspace/Lucene-Solr-trunk-Solaris/solr/core/src/test-files/solr/collection1/lib/classes/' to classloader
   [junit4]   2> 1773955 INFO  (SUITE-SuggesterWFSTTest-seed#[7C26059C3B3C7FA2]-worker) [    ] o.a.s.c.SolrResourceLoader Adding 'file:/export/home/jenkins/workspace/Lucene-Solr-trunk-Solaris/solr/core/src/test-files/solr/collection1/lib/README' to classloader
   [junit4]   2> 1773975 INFO  (SUITE-SuggesterWFSTTest-seed#[7C26059C3B3C7FA2]-worker) [    ] o.a.s.c.SolrConfig current version of requestparams : -1
   [junit4]   2> 1773978 INFO  (SUITE-SuggesterWFSTTest-seed#[7C26059C3B3C7FA2]-worker) [    ] o.a.s.c.SolrConfig Using Lucene MatchVersion: 6.0.0
   [junit4]   2> 1773985 INFO  (SUITE-SuggesterWFSTTest-seed#[7C26059C3B3C7FA2]-worker) [    ] o.a.s.c.SolrConfig Loaded SolrConfig: solrconfig-spellchecker.xml
   [junit4]   2> 1773987 INFO  (SUITE-SuggesterWFSTTest-seed#[7C26059C3B3C7FA2]-worker) [    ] o.a.s.s.IndexSchema [null] Schema name=Solr SpellCheck Test
   [junit4]   2> 1773990 INFO  (SUITE-SuggesterWFSTTest-seed#[7C26059C3B3C7FA2]-worker) [    ] o.a.s.s.IndexSchema default search field in schema is text
   [junit4]   2> 1773990 INFO  (SUITE-SuggesterWFSTTest-seed#[7C26059C3B3C7FA2]-worker) [    ] o.a.s.s.IndexSchema query parser default operator is OR
   [junit4]   2> 1773991 INFO  (SUITE-SuggesterWFSTTest-seed#[7C26059C3B3C7FA2]-worker) [    ] o.a.s.s.IndexSchema unique key field: id
   [junit4]   2> 1773992 INFO  (SUITE-SuggesterWFSTTest-seed#[7C26059C3B3C7FA2]-worker) [    ] o.a.s.c.SolrResourceLoader JNDI not configured for solr (NoInitialContextEx)
   [junit4]   2> 1773992 INFO  (SUITE-SuggesterWFSTTest-seed#[7C26059C3B3C7FA2]-worker) [    ] o.a.s.c.SolrResourceLoader using system property solr.solr.home: /export/home/jenkins/workspace/Lucene-Solr-trunk-Solaris/solr/core/src/test-files/solr
   [junit4]   2> 1773992 INFO  (SUITE-SuggesterWFSTTest-seed#[7C26059C3B3C7FA2]-worker) [    ] o.a.s.c.SolrResourceLoader new SolrResourceLoader for directory: '/export/home/jenkins/workspace/Lucene-Solr-trunk-Solaris/solr/core/src/test-files/solr'
   [junit4]   2> 1773992 INFO  (SUITE-SuggesterWFSTTest-seed#[7C26059C3B3C7FA2]-worker) [    ] o.a.s.c.SolrResourceLoader JNDI not configured for solr (NoInitialContextEx)
   [junit4]   2> 1773992 INFO  (SUITE-SuggesterWFSTTest-seed#[7C26059C3B3C7FA2]-worker) [    ] o.a.s.c.SolrResourceLoader using system property solr.solr.home: /export/home/jenkins/workspace/Lucene-Solr-trunk-Solaris/solr/core/src/test-files/solr
   [junit4]   2> 1773992 INFO  (SUITE-SuggesterWFSTTest-seed#[7C26059C3B3C7FA2]-worker) [    ] o.a.s.c.CoreContainer New CoreContainer 1371202726
   [junit4]   2> 1773992 INFO  (SUITE-SuggesterWFSTTest-seed#[7C26059C3B3C7FA2]-worker) [    ] o.a.s.c.CoreContainer Loading cores into CoreContainer [instanceDir=/export/home/jenkins/workspace/Lucene-Solr-trunk-Solaris/solr/core/src/test-files/solr]
   [junit4]   2> 1773993 WARN  (SUITE-SuggesterWFSTTest-seed#[7C26059C3B3C7FA2]-worker) [    ] o.a.s.c.CoreContainer Couldn't add files from /export/home/jenkins/workspace/Lucene-Solr-trunk-Solaris/solr/core/src/test-files/solr/lib to classpath: /export/home/jenkins/workspace/Lucene-Solr-trunk-Solaris/solr/core/src/test-files/solr/lib
   [junit4]   2> 1773993 INFO  (SUITE-SuggesterWFSTTest-seed#[7C26059C3B3C7FA2]-worker) [    ] o.a.s.h.c.HttpShardHandlerFactory created with socketTimeout : 600000,connTimeout : 60000,maxConnectionsPerHost : 20,maxConnections : 10000,corePoolSize : 0,maximumPoolSize : 2147483647,maxThreadIdleTime : 5,sizeOfQueue : -1,fairnessPolicy : false,useRetries : false,
   [junit4]   2> 1773994 INFO  (SUITE-SuggesterWFSTTest-seed#[7C26059C3B3C7FA2]-worker) [    ] o.a.s.u.UpdateShardHandler Creating UpdateShardHandler HTTP client with params: socketTimeout=30000&connTimeout=30000&retry=true
   [junit4]   2> 1773994 INFO  (SUITE-SuggesterWFSTTest-seed#[7C26059C3B3C7FA2]-worker) [    ] o.a.s.l.LogWatcher SLF4J impl is org.slf4j.impl.Log4jLoggerFactory
   [junit4]   2> 1773994 INFO  (SUITE-SuggesterWFSTTest-seed#[7C26059C3B3C7FA2]-worker) [    ] o.a.s.l.LogWatcher Registering Log Listener [Log4j (org.slf4j.impl.Log4jLoggerFactory)]
   [junit4]   2> 1773994 INFO  (SUITE-SuggesterWFSTTest-seed#[7C26059C3B3C7FA2]-worker) [    ] o.a.s.c.CoreContainer Security conf doesn't exist. Skipping setup for authorization module.
   [junit4]   2> 1773994 INFO  (SUITE-SuggesterWFSTTest-seed#[7C26059C3B3C7FA2]-worker) [    ] o.a.s.c.CoreContainer No authentication plugin used.
   [junit4]   2> 1773996 INFO  (SUITE-SuggesterWFSTTest-seed#[7C26059C3B3C7FA2]-worker) [    ] o.a.s.c.CoreDescriptor Created CoreDescriptor: {name=collection1, config=solrconfig-spellchecker.xml, transient=false, schema=schema-spellchecker.xml, loadOnStartup=true, configSetProperties=configsetprops.json, collection=collection1, dataDir=/export/home/jenkins/workspace/Lucene-Solr-trunk-Solaris/solr/build/solr-core/test/J1/temp/solr.spelling.suggest.SuggesterWFSTTest_7C26059C3B3C7FA2-001/init-core-data-001, shard=shard1}
   [junit4]   2> 1773996 INFO  (coreLoadExecutor-5190-thread-1) [    ] o.a.s.c.SolrResourceLoader new SolrResourceLoader for directory: '/export/home/jenkins/workspace/Lucene-Solr-trunk-Solaris/solr/core/src/test-files/solr/collection1'
   [junit4]   2> 1773996 INFO  (coreLoadExecutor-5190-thread-1) [    ] o.a.s.c.SolrResourceLoader JNDI not configured for solr (NoInitialContextEx)
   [junit4]   2> 1773996 INFO  (coreLoadExecutor-5190-thread-1) [    ] o.a.s.c.SolrResourceLoader using system property solr.solr.home: /export/home/jenkins/workspace/Lucene-Solr-trunk-Solaris/solr/core/src/test-files/solr
   [junit4]   2> 1773996 INFO  (coreLoadExecutor-5190-thread-1) [    ] o.a.s.c.SolrResourceLoader Adding 'file:/export/home/jenkins/workspace/Lucene-Solr-trunk-Solaris/solr/core/src/test-files/solr/collection1/lib/classes/' to classloader
   [junit4]   2> 1773996 INFO  (coreLoadExecutor-5190-thread-1) [    ] o.a.s.c.SolrResourceLoader Adding 'file:/export/home/jenkins/workspace/Lucene-Solr-trunk-Solaris/solr/core/src/test-files/solr/collection1/lib/README' to classloader
   [junit4]   2> 1774018 INFO  (coreLoadExecutor-5190-thread-1) [    ] o.a.s.c.SolrConfig current version of requestparams : -1
   [junit4]   2> 1774021 INFO  (coreLoadExecutor-5190-thread-1) [    ] o.a.s.c.SolrConfig Using Lucene MatchVersion: 6.0.0
   [junit4]   2> 1774026 INFO  (coreLoadExecutor-5190-thread-1) [    ] o.a.s.c.SolrConfig Loaded SolrConfig: solrconfig-spellchecker.xml
   [junit4]   2> 1774029 INFO  (coreLoadExecutor-5190-thread-1) [    ] o.a.s.s.IndexSchema [collection1] Schema name=Solr SpellCheck Test
   [junit4]   2> 1774032 INFO  (coreLoadExecutor-5190-thread-1) [    ] o.a.s.s.IndexSchema default search field in schema is text
   [junit4]   2> 1774032 INFO  (coreLoadExecutor-5190-thread-1) [    ] o.a.s.s.IndexSchema query parser default operator is OR
   [junit4]   2> 1774032 INFO  (coreLoadExecutor-5190-thread-1) [    ] o.a.s.s.IndexSchema unique key field: id
   [junit4]   2> 1774035 INFO  (coreLoadExecutor-5190-thread-1) [    ] o.a.s.c.ConfigSetProperties Did not find ConfigSet properties, assuming default properties: Can't find resource 'configsetprops.json' in classpath or '/export/home/jenkins/workspace/Lucene-Solr-trunk-Solaris/solr/core/src/test-files/solr/collection1'
   [junit4]   2> 1774035 INFO  (coreLoadExecutor-5190-thread-1) [    ] o.a.s.c.CoreContainer Creating SolrCore 'collection1' using configuration from instancedir /export/home/jenkins/workspace/Lucene-Solr-trunk-Solaris/solr/core/src/test-files/solr/collection1
   [junit4]   2> 1774035 INFO  (coreLoadExecutor-5190-thread-1) [    x:collection1] o.a.s.c.SolrCore org.apache.solr.core.MockFSDirectoryFactory
   [junit4]   2> 1774035 INFO  (coreLoadExecutor-5190-thread-1) [    x:collection1] o.a.s.c.SolrCore [[collection1] ] Opening new SolrCore at [/export/home/jenkins/workspace/Lucene-Solr-trunk-Solaris/solr/core/src/test-files/solr/collection1], dataDir=[/export/home/jenkins/workspace/Lucene-Solr-trunk-Solaris/solr/build/solr-core/test/J1/temp/solr.spelling.suggest.SuggesterWFSTTest_7C26059C3B3C7FA2-001/init-core-data-001/]
   [junit4]   2> 1774035 INFO  (coreLoadExecutor-5190-thread-1) [    x:collection1] o.a.s.c.SolrCore JMX monitoring not detected for core: collection1
   [junit4]   2> 1774036 INFO  (coreLoadExecutor-5190-thread-1) [    x:collection1] o.a.s.c.CachingDirectoryFactory return new directory for /export/home/jenkins/workspace/Lucene-Solr-trunk-Solaris/solr/build/solr-core/test/J1/temp/solr.spelling.suggest.SuggesterWFSTTest_7C26059C3B3C7FA2-001/init-core-data-001
   [junit4]   2> 1774036 INFO  (coreLoadExecutor-5190-thread-1) [    x:collection1] o.a.s.c.SolrCore New index directory detected: old=null new=/export/home/jenkins/workspace/Lucene-Solr-trunk-Solaris/solr/build/solr-core/test/J1/temp/solr.spelling.suggest.SuggesterWFSTTest_7C26059C3B3C7FA2-001/init-core-data-001/index/
   [junit4]   2> 1774036 WARN  (coreLoadExecutor-5190-thread-1) [    x:collection1] o.a.s.c.SolrCore [collection1] Solr index directory '/export/home/jenkins/workspace/Lucene-Solr-trunk-Solaris/solr/build/solr-core/test/J1/temp/solr.spelling.suggest.SuggesterWFSTTest_7C26059C3B3C7FA2-001/init-core-data-001/index' doesn't exist. Creating new index...
   [junit4]   2> 1774037 INFO  (coreLoadExecutor-5190-thread-1) [    x:collection1] o.a.s.c.CachingDirectoryFactory return new directory for /export/home/jenkins/workspace/Lucene-Solr-trunk-Solaris/solr/build/solr-core/test/J1/temp/solr.spelling.suggest.SuggesterWFSTTest_7C26059C3B3C7FA2-001/init-core-data-001/index
   [junit4]   2> 1774037 INFO  (coreLoadExecutor-5190-thread-1) [    x:collection1] o.a.s.u.RandomMergePolicy RandomMergePolicy wrapping class org.apache.lucene.index.LogByteSizeMergePolicy: [LogByteSizeMergePolicy: minMergeSize=1677721, mergeFactor=42, maxMergeSize=2147483648, maxMergeSizeForForcedMerge=9223372036854775807, calibrateSizeByDeletes=false, maxMergeDocs=2147483647, maxCFSSegmentSizeMB=8.796093022207999E12, noCFSRatio=0.6233899832079214]
   [junit4]   2> 1774050 INFO  (coreLoadExecutor-5190-thread-1) [    x:collection1] o.a.s.c.SolrDeletionPolicy SolrDeletionPolicy.onCommit: commits: num=1
   [junit4]   2> 	commit{dir=MockDirectoryWrapper(MMapDirectory@/export/home/jenkins/workspace/Lucene-Solr-trunk-Solaris/solr/build/solr-core/test/J1/temp/solr.spelling.suggest.SuggesterWFSTTest_7C26059C3B3C7FA2-001/init-core-data-001/index lockFactory=org.apache.lucene.store.SingleInstanceLockFactory@1db91802),segFN=segments_1,generation=1}
   [junit4]   2> 1774050 INFO  (coreLoadExecutor-5190-thread-1) [    x:collection1] o.a.s.c.SolrDeletionPolicy newest commit generation = 1
   [junit4]   2> 1774052 INFO  (OldIndexDirectoryCleanupThreadForCore-collection1) [    x:collection1] o.a.s.c.SolrCore Looking for old index directories to cleanup for core collection1 in /export/home/jenkins/workspace/Lucene-Solr-trunk-Solaris/solr/build/solr-core/test/J1/temp/solr.spelling.suggest.SuggesterWFSTTest_7C26059C3B3C7FA2-001/init-core-data-001/
   [junit4]   2> 1774053 INFO  (coreLoadExecutor-5190-thread-1) [    x:collection1] o.a.s.c.SolrCore no updateRequestProcessorChain defined as default, creating implicit default
   [junit4]   2> 1774056 INFO  (coreLoadExecutor-5190-thread-1) [    x:collection1] o.a.s.h.l.XMLLoader xsltCacheLifetimeSeconds=60
   [junit4]   2> 1774056 INFO  (coreLoadExecutor-5190-thread-1) [    x:collection1] o.a.s.h.l.XMLLoader xsltCacheLifetimeSeconds=60
   [junit4]   2> 1774067 INFO  (coreLoadExecutor-5190-thread-1) [    x:collection1] o.a.s.h.l.XMLLoader xsltCacheLifetimeSeconds=60
   [junit4]   2> 1774074 INFO  (coreLoadExecutor-5190-thread-1) [    x:collection1] o.a.s.h.l.XMLLoader xsltCacheLifetimeSeconds=60
   [junit4]   2> 1774076 INFO  (coreLoadExecutor-5190-thread-1) [    x:collection1] o.a.s.c.RequestHandlers Registered paths: /admin/mbeans,standard,/update/json/docs,/admin/luke,/export,/get,/suggest_fst,/admin/properties,/update/json,/admin/threads,/suggest_wfst,/suggest_tst,/update/csv,/sql,/admin/segments,/admin/system,/suggest,/replication,/config,/stream,/schema,/admin/plugins,/admin/logging,/admin/ping,/update,/admin/file
   [junit4]   2> 1774076 INFO  (coreLoadExecutor-5190-thread-1) [    x:collection1] o.a.s.c.SolrCore Using default statsCache cache: org.apache.solr.search.stats.LocalStatsCache
   [junit4]   2> 1774076 INFO  (coreLoadExecutor-5190-thread-1) [    x:collection1] o.a.s.u.CommitTracker Hard AutoCommit: disabled
   [junit4]   2> 1774076 INFO  (coreLoadExecutor-5190-thread-1) [    x:collection1] o.a.s.u.CommitTracker Soft AutoCommit: disabled
   [junit4]   2> 1774077 INFO  (coreLoadExecutor-5190-thread-1) [    x:collection1] o.a.s.u.RandomMergePolicy RandomMergePolicy wrapping class org.apache.lucene.index.LogDocMergePolicy: [LogDocMergePolicy: minMergeSize=1000, mergeFactor=49, maxMergeSize=9223372036854775807, maxMergeSizeForForcedMerge=9223372036854775807, calibrateSizeByDeletes=false, maxMergeDocs=2147483647, maxCFSSegmentSizeMB=8.796093022207999E12, noCFSRatio=0.43224846807719286]
   [junit4]   2> 1774078 INFO  (coreLoadExecutor-5190-thread-1) [    x:collection1] o.a.s.c.SolrDeletionPolicy SolrDeletionPolicy.onInit: commits: num=1
   [junit4]   2> 	commit{dir=MockDirectoryWrapper(MMapDirectory@/export/home/jenkins/workspace/Lucene-Solr-trunk-Solaris/solr/build/solr-core/test/J1/temp/solr.spelling.suggest.SuggesterWFSTTest_7C26059C3B3C7FA2-001/init-core-data-001/index lockFactory=org.apache.lucene.store.SingleInstanceLockFactory@1db91802),segFN=segments_1,generation=1}
   [junit4]   2> 1774078 INFO  (coreLoadExecutor-5190-thread-1) [    x:collection1] o.a.s.c.SolrDeletionPolicy newest commit generation = 1
   [junit4]   2> 1774078 INFO  (coreLoadExecutor-5190-thread-1) [    x:collection1] o.a.s.s.SolrIndexSearcher Opening [Searcher@65cfdb98[collection1] main]
   [junit4]   2> 1774078 WARN  (coreLoadExecutor-5190-thread-1) [    x:collection1] o.a.s.r.ManagedResourceStorage Cannot write to config directory /export/home/jenkins/workspace/Lucene-Solr-trunk-Solaris/solr/core/src/test-files/solr/collection1/conf; switching to use InMemory storage instead.
   [junit4]   2> 1774079 INFO  (coreLoadExecutor-5190-thread-1) [    x:collection1] o.a.s.r.RestManager Initializing RestManager with initArgs: {}
   [junit4]   2> 1774079 INFO  (coreLoadExecutor-5190-thread-1) [    x:collection1] o.a.s.r.ManagedResourceStorage Reading _rest_managed.json using InMemoryStorage
   [junit4]   2> 1774079 INFO  (coreLoadExecutor-5190-thread-1) [    x:collection1] o.a.s.r.RestManager Initializing 0 registered ManagedResources
   [junit4]   2> 1774079 INFO  (coreLoadExecutor-5190-thread-1) [    x:collection1] o.a.s.h.c.SpellCheckComponent Initializing spell checkers
   [junit4]   2> 1774079 INFO  (coreLoadExecutor-5190-thread-1) [    x:collection1] o.a.s.s.s.Suggester init: {name=suggest,classname=org.apache.solr.spelling.suggest.Suggester,lookupImpl=org.apache.solr.spelling.suggest.jaspell.JaspellLookup,field=suggest,storeDir=suggest,buildOnCommit=true,threshold=0.0}
   [junit4]   2> 1774079 INFO  (coreLoadExecutor-5190-thread-1) [    x:collection1] o.a.s.s.s.j.JaspellLookupFactory init: {name=suggest,classname=org.apache.solr.spelling.suggest.Suggester,lookupImpl=org.apache.solr.spelling.suggest.jaspell.JaspellLookup,field=suggest,storeDir=suggest,buildOnCommit=true,threshold=0.0}
   [junit4]   2> 1774079 INFO  (coreLoadExecutor-5190-thread-1) [    x:collection1] o.a.s.h.c.SpellCheckComponent Registering newSearcher listener for spellchecker: suggest
   [junit4]   2> 1774079 INFO  (coreLoadExecutor-5190-thread-1) [    x:collection1] o.a.s.h.c.SpellCheckComponent No queryConverter defined, using default converter
   [junit4]   2> 1774080 INFO  (coreLoadExecutor-5190-thread-1) [    x:collection1] o.a.s.h.c.SpellCheckComponent Initializing spell checkers
   [junit4]   2> 1774080 INFO  (coreLoadExecutor-5190-thread-1) [    x:collection1] o.a.s.s.s.Suggester init: {name=suggest_tst,classname=org.apache.solr.spelling.suggest.Suggester,lookupImpl=org.apache.solr.spelling.suggest.tst.TSTLookup,field=suggest,storeDir=suggest_tst,buildOnCommit=true,threshold=0.0}
   [junit4]   2> 1774080 INFO  (coreLoadExecutor-5190-thread-1) [    x:collection1] o.a.s.h.c.SpellCheckComponent Registering newSearcher listener for spellchecker: suggest_tst
   [junit4]   2> 1774080 INFO  (coreLoadExecutor-5190-thread-1) [    x:collection1] o.a.s.h.c.SpellCheckComponent No queryConverter defined, using default converter
   [junit4]   2> 1774080 INFO  (coreLoadExecutor-5190-thread-1) [    x:collection1] o.a.s.h.c.SpellCheckComponent Initializing spell checkers
   [junit4]   2> 1774080 INFO  (coreLoadExecutor-5190-thread-1) [    x:collection1] o.a.s.s.s.Suggester init: {name=suggest_fst,classname=org.apache.solr.spelling.suggest.Suggester,lookupImpl=org.apache.solr.spelling.suggest.fst.FSTLookup,field=suggest,storeDir=suggest_fst,buildOnCommit=true,weightBuckets=5,exactMatchFirst=true}
   [junit4]   2> 1774080 INFO  (coreLoadExecutor-5190-thread-1) [    x:collection1] o.a.s.h.c.SpellCheckComponent Registering newSearcher listener for spellchecker: suggest_fst
   [junit4]   2> 1774080 INFO  (coreLoadExecutor-5190-thread-1) [    x:collection1] o.a.s.h.c.SpellCheckComponent No queryConverter defined, using default converter
   [junit4]   2> 1774080 INFO  (coreLoadExecutor-5190-thread-1) [    x:collection1] o.a.s.h.c.SpellCheckComponent Initializing spell checkers
   [junit4]   2> 1774080 INFO  (coreLoadExecutor-5190-thread-1) [    x:collection1] o.a.s.s.s.Suggester init: {name=suggest_wfst,classname=org.apache.solr.spelling.suggest.Suggester,lookupImpl=org.apache.solr.spelling.suggest.fst.WFSTLookupFactory,field=suggest,storeDir=suggest_wfst,buildOnCommit=true,exactMatchFirst=true}
   [junit4]   2> 1774081 INFO  (coreLoadExecutor-5190-thread-1) [    x:collection1] o.a.s.h.c.SpellCheckComponent Registering newSearcher listener for spellchecker: suggest_wfst
   [junit4]   2> 1774081 INFO  (coreLoadExecutor-5190-thread-1) [    x:collection1] o.a.s.h.c.SpellCheckComponent No queryConverter defined, using default converter
   [junit4]   2> 1774081 INFO  (coreLoadExecutor-5190-thread-1) [    x:collection1] o.a.s.h.ReplicationHandler Commits will be reserved for  10000
   [junit4]   2> 1774081 INFO  (coreLoadExecutor-5190-thread-1) [    x:collection1] o.a.s.c.CoreContainer registering core: collection1
   [junit4]   2> 1774082 INFO  (SUITE-SuggesterWFSTTest-seed#[7C26059C3B3C7FA2]-worker) [    ] o.a.s.SolrTestCaseJ4 ####initCore end
   [junit4]   2> 1774084 INFO  (TEST-SuggesterWFSTTest.testReload-seed#[7C26059C3B3C7FA2]) [    ] o.a.s.SolrTestCaseJ4 ###Starting testReload
   [junit4]   2> 1774085 INFO  (TEST-SuggesterWFSTTest.testReload-seed#[7C26059C3B3C7FA2]) [    ] o.a.s.u.p.LogUpdateProcessorFactory [collection1]  webapp=null path=null params={}{add=[1]} 0 0
   [junit4]   2> 1774086 INFO  (TEST-SuggesterWFSTTest.testReload-seed#[7C26059C3B3C7FA2]) [    ] o.a.s.u.p.LogUpdateProcessorFactory [collection1]  webapp=null path=null params={}{add=[2]} 0 0
   [junit4]   2> 1774087 INFO  (TEST-SuggesterWFSTTest.testReload-seed#[7C26059C3B3C7FA2]) [    ] o.a.s.u.p.LogUpdateProcessorFactory [collection1]  webapp=null path=null params={}{add=[3]} 0 0
   [junit4]   2> 1774087 INFO  (TEST-SuggesterWFSTTest.testReload-seed#[7C26059C3B3C7FA2]) [    ] o.a.s.u.DirectUpdateHandler2 start commit{,optimize=false,openSearcher=true,waitSearcher=true,expungeDeletes=false,softCommit=false,prepareCommit=false}
   [junit4]   2> 1774130 INFO  (TEST-SuggesterWFSTTest.testReload-seed#[7C26059C3B3C7FA2]) [    ] o.a.s.c.SolrDeletionPolicy SolrDeletionPolicy.onCommit: commits: num=2
   [junit4]   2> 	commit{dir=MockDirectoryWrapper(MMapDirectory@/export/home/jenkins/workspace/Lucene-Solr-trunk-Solaris/solr/build/solr-core/test/J1/temp/solr.spelling.suggest.SuggesterWFSTTest_7C26059C3B3C7FA2-001/init-core-data-001/index lockFactory=org.apache.lucene.store.SingleInstanceLockFactory@1db91802),segFN=segments_1,generation=1}
   [junit4]   2> 	commit{dir=MockDirectoryWrapper(MMapDirectory@/export/home/jenkins/workspace/Lucene-Solr-trunk-Solaris/solr/build/solr-core/test/J1/temp/solr.spelling.suggest.SuggesterWFSTTest_7C26059C3B3C7FA2-001/init-core-data-001/index lockFactory=org.apache.lucene.store.SingleInstanceLockFactory@1db91802),segFN=segments_2,generation=2}
   [junit4]   2> 1774130 INFO  (TEST-SuggesterWFSTTest.testReload-seed#[7C26059C3B3C7FA2]) [    ] o.a.s.c.SolrDeletionPolicy newest commit generation = 2
   [junit4]   2> 1774130 WARN  (TEST-SuggesterWFSTTest.testReload-seed#[7C26059C3B3C7FA2]) [    ] o.a.s.c.SolrCore [collection1] PERFORMANCE WARNING: Overlapping onDeckSearchers=2
   [junit4]   2> 1774133 INFO  (TEST-SuggesterWFSTTest.testReload-seed#[7C26059C3B3C7FA2]) [    ] o.a.s.s.SolrIndexSearcher Opening [Searcher@4a6b879b[collection1] main]
   [junit4]   2> 1774133 INFO  (TEST-SuggesterWFSTTest.testReload-seed#[7C26059C3B3C7FA2]) [    ] o.a.s.u.DirectUpdateHandler2 end_commit_flush
   [junit4]   2> 1774137 INFO  (searcherExecutor-5191-thread-1-processing-x:collection1) [    x:collection1] o.a.s.h.c.SpellCheckComponent Loading spell index for spellchecker: suggest
   [junit4]   2> 1774138 INFO  (searcherExecutor-5191-thread-1-processing-x:collection1) [    x:collection1] o.a.s.s.s.Suggester reload()
   [junit4]   2> 1774138 ERROR (searcherExecutor-5191-thread-1-processing-x:collection1) [    x:collection1] o.a.s.h.c.SpellCheckComponent Exception in reloading spell check index for spellchecker: suggest
   [junit4]   2> java.io.FileNotFoundException: /export/home/jenkins/workspace/Lucene-Solr-trunk-Solaris/solr/build/solr-core/test/J1/temp/solr.spelling.suggest.SuggesterWFSTTest_7C26059C3B3C7FA2-001/init-core-data-001/suggest/jaspell.dat (No such file or directory)
   [junit4]   2> 	at java.io.FileInputStream.open0(Native Method)
   [junit4]   2> 	at java.io.FileInputStream.open(FileInputStream.java:195)
   [junit4]   2> 	at java.io.FileInputStream.<init>(FileInputStream.java:138)
   [junit4]   2> 	at org.apache.solr.spelling.suggest.Suggester.reload(Suggester.java:183)
   [junit4]   2> 	at org.apache.solr.handler.component.SpellCheckComponent$SpellCheckerListener.newSearcher(SpellCheckComponent.java:819)
   [junit4]   2> 	at org.apache.solr.core.SolrCore$5.call(SolrCore.java:1850)
   [junit4]   2> 	at java.util.concurrent.FutureTask.run(FutureTask.java:266)
   [junit4]   2> 	at org.apache.solr.common.util.ExecutorUtil$MDCAwareThreadPoolExecutor$1.run(ExecutorUtil.java:232)
   [junit4]   2> 	at java.util.concurrent.ThreadPoolExecutor.runWorker(ThreadPoolExecutor.java:1142)
   [junit4]   2> 	at java.util.concurrent.ThreadPoolExecutor$Worker.run(ThreadPoolExecutor.java:617)
   [junit4]   2> 	at java.lang.Thread.run(Thread.java:745)
   [junit4]   2> 1774138 INFO  (searcherExecutor-5191-thread-1-processing-x:collection1) [    x:collection1] o.a.s.h.c.SpellCheckComponent Loading spell index for spellchecker: suggest_tst
   [junit4]   2> 1774138 INFO  (searcherExecutor-5191-thread-1-processing-x:collection1) [    x:collection1] o.a.s.s.s.Suggester reload()
   [junit4]   2> 1774138 ERROR (searcherExecutor-5191-thread-1-processing-x:collection1) [    x:collection1] o.a.s.h.c.SpellCheckComponent Exception in reloading spell check index for spellchecker: suggest_tst
   [junit4]   2> java.io.FileNotFoundException: /export/home/jenkins/workspace/Lucene-Solr-trunk-Solaris/solr/build/solr-core/test/J1/temp/solr.spelling.suggest.SuggesterWFSTTest_7C26059C3B3C7FA2-001/init-core-data-001/suggest_tst/tst.dat (No such file or directory)
   [junit4]   2> 	at java.io.FileInputStream.open0(Native Method)
   [junit4]   2> 	at java.io.FileInputStream.open(FileInputStream.java:195)
   [junit4]   2> 	at java.io.FileInputStream.<init>(FileInputStream.java:138)
   [junit4]   2> 	at org.apache.solr.spelling.suggest.Suggester.reload(Suggester.java:183)
   [junit4]   2> 	at org.apache.solr.handler.component.SpellCheckComponent$SpellCheckerListener.newSearcher(SpellCheckComponent.java:819)
   [junit4]   2> 	at org.apache.solr.core.SolrCore$5.call(SolrCore.java:1850)
   [junit4]   2> 	at java.util.concurrent.FutureTask.run(FutureTask.java:266)
   [junit4]   2> 	at org.apache.solr.common.util.ExecutorUtil$MDCAwareThreadPoolExecutor$1.run(ExecutorUtil.java:232)
   [junit4]   2> 	at java.util.concurrent.ThreadPoolExecutor.runWorker(ThreadPoolExecutor.java:1142)
   [junit4]   2> 	at java.util.concurrent.ThreadPoolExecutor$Worker.run(ThreadPoolExecutor.java:617)
   [junit4]   2> 	at java.lang.Thread.run(Thread.java:745)
   [junit4]   2> 1774140 INFO  (searcherExecutor-5191-thread-1-processing-x:collection1) [    x:collection1] o.a.s.h.c.SpellCheckComponent Loading spell index for spellchecker: suggest_fst
   [junit4]   2> 1774140 INFO  (searcherExecutor-5191-thread-1-processing-x:collection1) [    x:collection1] o.a.s.s.s.Suggester reload()
   [junit4]   2> 1774140 ERROR (searcherExecutor-5191-thread-1-processing-x:collection1) [    x:collection1] o.a.s.h.c.SpellCheckComponent Exception in reloading spell check index for spellchecker: suggest_fst
   [junit4]   2> java.io.FileNotFoundException: /export/home/jenkins/workspace/Lucene-Solr-trunk-Solaris/solr/build/solr-core/test/J1/temp/solr.spelling.suggest.SuggesterWFSTTest_7C26059C3B3C7FA2-001/init-core-data-001/suggest_fst/fst.bin (No such file or directory)
   [junit4]   2> 	at java.io.FileInputStream.open0(Native Method)
   [junit4]   2> 	at java.io.FileInputStream.open(FileInputStream.java:195)
   [junit4]   2> 	at java.io.FileInputStream.<init>(FileInputStream.java:138)
   [junit4]   2> 	at org.apache.solr.spelling.suggest.Suggester.reload(Suggester.java:183)
   [junit4]   2> 	at org.apache.solr.handler.component.SpellCheckComponent$SpellCheckerListener.newSearcher(SpellCheckComponent.java:819)
   [junit4]   2> 	at org.apache.solr.core.SolrCore$5.call(SolrCore.java:1850)
   [junit4]   2> 	at java.util.concurrent.FutureTask.run(FutureTask.java:266)
   [junit4]   2> 	at org.apache.solr.common.util.ExecutorUtil$MDCAwareThreadPoolExecutor$1.run(ExecutorUtil.java:232)
   [junit4]   2> 	at java.util.concurrent.ThreadPoolExecutor.runWorker(ThreadPoolExecutor.java:1142)
   [junit4]   2> 	at java.util.concurrent.ThreadPoolExecutor$Worker.run(ThreadPoolExecutor.java:617)
   [junit4]   2> 	at java.lang.Thread.run(Thread.java:745)
   [junit4]   2> 1774141 INFO  (searcherExecutor-5191-thread-1-processing-x:collection1) [    x:collection1] o.a.s.h.c.SpellCheckComponent Loading spell index for spellchecker: suggest_wfst
   [junit4]   2> 1774141 INFO  (searcherExecutor-5191-thread-1-processing-x:collection1) [    x:collection1] o.a.s.s.s.Suggester reload()
   [junit4]   2> 1774141 ERROR (searcherExecutor-5191-thread-1-processing-x:collection1) [    x:collection1] o.a.s.h.c.SpellCheckComponent Exception in reloading spell check index for spellchecker: suggest_wfst
   [junit4]   2> java.io.FileNotFoundException: /export/home/jenkins/workspace/Lucene-Solr-trunk-Solaris/solr/build/solr-core/test/J1/temp/solr.spelling.suggest.SuggesterWFSTTest_7C26059C3B3C7FA2-001/init-core-data-001/suggest_wfst/wfst.bin (No such file or directory)
   [junit4]   2> 	at java.io.FileInputStream.open0(Native Method)
   [junit4]   2> 	at java.io.FileInputStream.open(FileInputStream.java:195)
   [junit4]   2> 	at java.io.FileInputStream.<init>(FileInputStream.java:138)
   [junit4]   2> 	at org.apache.solr.spelling.suggest.Suggester.reload(Suggester.java:183)
   [junit4]   2> 	at org.apache.solr.handler.component.SpellCheckComponent$SpellCheckerListener.newSearcher(SpellCheckComponent.java:819)
   [junit4]   2> 	at org.apache.solr.core.SolrCore$5.call(SolrCore.java:1850)
   [junit4]   2> 	at java.util.concurrent.FutureTask.run(FutureTask.java:266)
   [junit4]   2> 	at org.apache.solr.common.util.ExecutorUtil$MDCAwareThreadPoolExecutor$1.run(ExecutorUtil.java:232)
   [junit4]   2> 	at java.util.concurrent.ThreadPoolExecutor.runWorker(ThreadPoolExecutor.java:1142)
   [junit4]   2> 	at java.util.concurrent.ThreadPoolExecutor$Worker.run(ThreadPoolExecutor.java:617)
   [junit4]   2> 	at java.lang.Thread.run(Thread.java:745)
   [junit4]   2> 1774141 INFO  (searcherExecutor-5191-thread-1-processing-x:collection1) [    x:collection1] o.a.s.c.SolrCore [collection1] Registered new searcher Searcher@65cfdb98[collection1] main{ExitableDirectoryReader(UninvertingDirectoryReader())}
   [junit4]   2> 1774141 INFO  (searcherExecutor-5191-thread-1) [    ] o.a.s.h.c.SpellCheckComponent Loading spell index for spellchecker: suggest
   [junit4]   2> 1774141 INFO  (searcherExecutor-5191-thread-1) [    ] o.a.s.s.s.Suggester reload()
   [junit4]   2> 1774141 ERROR (searcherExecutor-5191-thread-1) [    ] o.a.s.h.c.SpellCheckComponent Exception in reloading spell check index for spellchecker: suggest
   [junit4]   2> java.io.FileNotFoundException: /export/home/jenkins/workspace/Lucene-Solr-trunk-Solaris/solr/build/solr-core/test/J1/temp/solr.spelling.suggest.SuggesterWFSTTest_7C26059C3B3C7FA2-001/init-core-data-001/suggest/jaspell.dat (No such file or directory)
   [junit4]   2> 	at java.io.FileInputStream.open0(Native Method)
   [junit4]   2> 	at java.io.FileInputStream.open(FileInputStream.java:195)
   [junit4]   2> 	at java.io.FileInputStream.<init>(FileInputStream.java:138)
   [junit4]   2> 	at org.apache.solr.spelling.suggest.Suggester.reload(Suggester.java:183)
   [junit4]   2> 	at org.apache.solr.handler.component.SpellCheckComponent$SpellCheckerListener.newSearcher(SpellCheckComponent.java:819)
   [junit4]   2> 	at org.apache.solr.core.SolrCore$5.call(SolrCore.java:1850)
   [junit4]   2> 	at java.util.concurrent.FutureTask.run(FutureTask.java:266)
   [junit4]   2> 	at org.apache.solr.common.util.ExecutorUtil$MDCAwareThreadPoolExecutor$1.run(ExecutorUtil.java:232)
   [junit4]   2> 	at java.util.concurrent.ThreadPoolExecutor.runWorker(ThreadPoolExecutor.java:1142)
   [junit4]   2> 	at java.util.concurrent.ThreadPoolExecutor$Worker.run(ThreadPoolExecutor.java:617)
   [junit4]   2> 	at java.lang.Thread.run(Thread.java:745)
   [junit4]   2> 1774143 INFO  (searcherExecutor-5191-thread-1) [    ] o.a.s.h.c.SpellCheckComponent Loading spell index for spellchecker: suggest_tst
   [junit4]   2> 1774143 INFO  (searcherExecutor-5191-thread-1) [    ] o.a.s.s.s.Suggester reload()
   [junit4]   2> 1774143 ERROR (searcherExecutor-5191-thread-1) [    ] o.a.s.h.c.SpellCheckComponent Exception in reloading spell check index for spellchecker: suggest_tst
   [junit4]   2> java.io.FileNotFoundException: /export/home/jenkins/workspace/Lucene-Solr-trunk-Solaris/solr/build/solr-core/test/J1/temp/solr.spelling.suggest.SuggesterWFSTTest_7C26059C3B3C7FA2-001/init-core-data-001/suggest_tst/tst.dat (No such file or directory)
   [junit4]   2> 	at java.io.FileInputStream.open0(Native Method)
   [junit4]   2> 	at java.io.FileInputStream.open(FileInputStream.java:195)
   [junit4]   2> 	at java.io.FileInputStream.<init>(FileInputStream.java:138)
   [junit4]   2> 	at org.apache.solr.spelling.suggest.Suggester.reload(Suggester.java:183)
   [junit4]   2> 	at org.apache.solr.handler.component.SpellCheckComponent$SpellCheckerListener.newSearcher(SpellCheckComponent.java:819)
   [junit4]   2> 	at org.apache.solr.core.SolrCore$5.call(SolrCore.java:1850)
   [junit4]   2> 	at java.util.concurrent.FutureTask.run(FutureTask.java:266)
   [junit4]   2> 	at org.apache.solr.common.util.ExecutorUtil$MDCAwareThreadPoolExecutor$1.run(ExecutorUtil.java:232)
   [junit4]   2> 	at java.util.concurrent.ThreadPoolExecutor.runWorker(ThreadPoolExecutor.java:1142)
   [junit4]   2> 	at java.util.concurrent.ThreadPoolExecutor$Worker.run(ThreadPoolExecutor.java:617)
   [junit4]   2> 	at java.lang.Thread.run(Thread.java:745)
   [junit4]   2> 1774143 INFO  (searcherExecutor-5191-thread-1) [    ] o.a.s.h.c.SpellCheckComponent Loading spell index for spellchecker: suggest_fst
   [junit4]   2> 1774143 INFO  (searcherExecutor-5191-thread-1) [    ] o.a.s.s.s.Suggester reload()
   [junit4]   2> 1774143 ERROR (searcherExecutor-5191-thread-1) [    ] o.a.s.h.c.SpellCheckComponent Exception in reloading spell check index for spellchecker: suggest_fst
   [junit4]   2> java.io.FileNotFoundException: /export/home/jenkins/workspace/Lucene-Solr-trunk-Solaris/solr/build/solr-core/test/J1/temp/solr.spelling.suggest.SuggesterWFSTTest_7C26059C3B3C7FA2-001/init-core-data-001/suggest_fst/fst.bin (No such file or directory)
   [junit4]   2> 	at java.io.FileInputStream.open0(Native Method)
   [junit4]   2> 	at java.io.FileInputStream.open(FileInputStream.java:195)
   [junit4]   2> 	at java.io.FileInputStream.<init>(FileInputStream.java:138)
   [junit4]   2> 	at org.apache.solr.spelling.suggest.Suggester.reload(Suggester.java:183)
   [junit4]   2> 	at org.apache.solr.handler.component.SpellCheckComponent$SpellCheckerListener.newSearcher(SpellCheckComponent.java:819)
   [junit4]   2> 	at org.apache.solr.core.SolrCore$5.call(SolrCore.java:1850)
   [junit4]   2> 	at java.util.concurrent.FutureTask.run(FutureTask.java:266)
   [junit4]   2> 	at org.apache.solr.common.util.ExecutorUtil$MDCAwareThreadPoolExecutor$1.run(ExecutorUtil.java:232)
   [junit4]   2> 	at java.util.concurrent.ThreadPoolExecutor.runWorker(ThreadPoolExecutor.java:1142)
   [junit4]   2> 	at java.util.concurrent.ThreadPoolExecutor$Worker.run(ThreadPoolExecutor.java:617)
   [junit4]   2> 	at java.lang.Thread.run(Thread.java:745)
   [junit4]   2> 1774143 INFO  (searcherExecutor-5191-thread-1) [    ] o.a.s.h.c.SpellCheckComponent Loading spell index for spellchecker: suggest_wfst
   [junit4]   2> 1774143 INFO  (searcherExecutor-5191-thread-1) [    ] o.a.s.s.s.Suggester reload()
   [junit4]   2> 1774144 ERROR (searcherExecutor-5191-thread-1) [    ] o.a.s.h.c.SpellCheckComponent Exception in reloading spell check index for spellchecker: suggest_wfst
   [junit4]   2> java.io.FileNotFoundException: /export/home/jenkins/workspace/Lucene-Solr-trunk-Solaris/solr/build/solr-core/test/J1/temp/solr.spelling.suggest.SuggesterWFSTTest_7C26059C3B3C7FA2-001/init-core-data-001/suggest_wfst/wfst.bin (No such file or directory)
   [junit4]   2> 	at java.io.FileInputStream.open0(Native Method)
   [junit4]   2> 	at java.io.FileInputStream.open(FileInputStream.java:195)
   [junit4]   2> 	at java.io.FileInputStream.<init>(FileInputStream.java:138)
   [junit4]   2> 	at org.apache.solr.spelling.suggest.Suggester.reload(Suggester.java:183)
   [junit4]   2> 	at org.apache.solr.handler.component.SpellCheckComponent$SpellCheckerListener.newSearcher(SpellCheckComponent.java:819)
   [junit4]   2> 	at org.apache.solr.core.SolrCore$5.call(SolrCore.java:1850)
   [junit4]   2> 	at java.util.concurrent.FutureTask.run(FutureTask.java:266)
   [junit4]   2> 	at org.apache.solr.common.util.ExecutorUtil$MDCAwareThreadPoolExecutor$1.run(ExecutorUtil.java:232)
   [junit4]   2> 	at java.util.concurrent.ThreadPoolExecutor.runWorker(ThreadPoolExecutor.java:1142)
   [junit4]   2> 	at java.util.concurrent.ThreadPoolExecutor$Worker.run(ThreadPoolExecutor.java:617)
   [junit4]   2> 	at java.lang.Thread.run(Thread.java:745)
   [junit4]   2> 1774144 INFO  (searcherExecutor-5191-thread-1) [    ] o.a.s.c.SolrCore [collection1] Registered new searcher Searcher@4a6b879b[collection1] main{ExitableDirectoryReader(UninvertingDirectoryReader(Uninverting(_0(6.0.0):c3)))}
   [junit4]   2> 1774144 INFO  (TEST-SuggesterWFSTTest.testReload-seed#[7C26059C3B3C7FA2]) [    ] o.a.s.u.p.LogUpdateProcessorFactory [collection1]  webapp=null path=null params={}{commit=} 0 57
   [junit4]   2> 1774144 INFO  (TEST-SuggesterWFSTTest.testReload-seed#[7C26059C3B3C7FA2]) [    ] o.a.s.SolrTestCaseJ4 ###deleteCore
   [junit4]   2> 1774144 INFO  (TEST-SuggesterWFSTTest.testReload-seed#[7C26059C3B3C7FA2]) [    ] o.a.s.c.CoreContainer Shutting down CoreContainer instance=1371202726
   [junit4]   2> 1774145 INFO  (TEST-SuggesterWFSTTest.testReload-seed#[7C26059C3B3C7FA2]) [    x:collection1] o.a.s.c.SolrCore [collection1]  CLOSING SolrCore org.apache.solr.core.SolrCore@27d0274e
   [junit4]   2> 1774145 INFO  (TEST-SuggesterWFSTTest.testReload-seed#[7C26059C3B3C7FA2]) [    x:collection1] o.a.s.u.DirectUpdateHandler2 closing DirectUpdateHandler2{commits=1,autocommits=0,soft autocommits=0,optimizes=0,rollbacks=0,expungeDeletes=0,docsPending=0,adds=0,deletesById=0,deletesByQuery=0,errors=0,cumulative_adds=3,cumulative_deletesById=0,cumulative_deletesByQuery=0,cumulative_errors=0}
   [junit4]   2> 1774145 INFO  (TEST-SuggesterWFSTTest.testReload-seed#[7C26059C3B3C7FA2]) [    x:collection1] o.a.s.u.SolrCoreState Closing SolrCoreState
   [junit4]   2> 1774145 INFO  (TEST-SuggesterWFSTTest.testReload-seed#[7C26059C3B3C7FA2]) [    x:collection1] o.a.s.u.DefaultSolrCoreState SolrCoreState ref count has reached 0 - closing IndexWriter
   [junit4]   2> 1774145 INFO  (TEST-SuggesterWFSTTest.testReload-seed#[7C26059C3B3C7FA2]) [    x:collection1] o.a.s.u.DefaultSolrCoreState closing IndexWriter with IndexWriterCloser
   [junit4]   2> 1774145 INFO  (TEST-SuggesterWFSTTest.testReload-seed#[7C26059C3B3C7FA2]) [    x:collection1] o.a.s.c.SolrCore [collection1] Closing main searcher on request.
   [junit4]   2> 1774146 INFO  (TEST-SuggesterWFSTTest.testReload-seed#[7C26059C3B3C7FA2]) [    x:collection1] o.a.s.c.CachingDirectoryFactory Closing MockFSDirectoryFactory - 2 directories currently being tracked
   [junit4]   2> 1774146 INFO  (TEST-SuggesterWFSTTest.testReload-seed#[7C26059C3B3C7FA2]) [    x:collection1] o.a.s.c.CachingDirectoryFactory looking to close /export/home/jenkins/workspace/Lucene-Solr-trunk-Solaris/solr/build/solr-core/test/J1/temp/solr.spelling.suggest.SuggesterWFSTTest_7C26059C3B3C7FA2-001/init-core-data-001/index [CachedDir<<refCount=0;path=/export/home/jenkins/workspace/Lucene-Solr-trunk-Solaris/solr/build/solr-core/test/J1/temp/solr.spelling.suggest.SuggesterWFSTTest_7C26059C3B3C7FA2-001/init-core-data-001/index;done=false>>]
   [junit4]   2> 1774146 INFO  (TEST-SuggesterWFSTTest.testReload-seed#[7C26059C3B3C7FA2]) [    x:collection1] o.a.s.c.CachingDirectoryFactory Closing directory: /export/home/jenkins/workspace/Lucene-Solr-trunk-Solaris/solr/build/solr-core/test/J1/temp/solr.spelling.suggest.SuggesterWFSTTest_7C26059C3B3C7FA2-001/init-core-data-001/index
   [junit4]   2> 1774149 INFO  (TEST-SuggesterWFSTTest.testReload-seed#[7C26059C3B3C7FA2]) [    x:collection1] o.a.s.c.CachingDirectoryFactory looking to close /export/home/jenkins/workspace/Lucene-Solr-trunk-Solaris/solr/build/solr-core/test/J1/temp/solr.spelling.suggest.SuggesterWFSTTest_7C26059C3B3C7FA2-001/init-core-data-001 [CachedDir<<refCount=0;path=/export/home/jenkins/workspace/Lucene-Solr-trunk-Solaris/solr/build/solr-core/test/J1/temp/solr.spelling.suggest.SuggesterWFSTTest_7C26059C3B3C7FA2-001/init-core-data-001;done=false>>]
   [junit4]   2> 1774149 INFO  (TEST-SuggesterWFSTTest.testReload-seed#[7C26059C3B3C7FA2]) [    x:collection1] o.a.s.c.CachingDirectoryFactory Closing directory: /export/home/jenkins/workspace/Lucene-Solr-trunk-Solaris/solr/build/solr-core/test/J1/temp/solr.spelling.suggest.SuggesterWFSTTest_7C26059C3B3C7FA2-001/init-core-data-001
   [junit4]   2> 1774149 INFO  (TEST-SuggesterWFSTTest.testReload-seed#[7C26059C3B3C7FA2]) [    x:collection1] o.a.s.SolrTestCaseJ4 ####initCore
   [junit4]   2> 1774149 INFO  (TEST-SuggesterWFSTTest.testReload-seed#[7C26059C3B3C7FA2]) [    x:collection1] o.a.s.c.SolrResourceLoader new SolrResourceLoader for directory: '/export/home/jenkins/workspace/Lucene-Solr-trunk-Solaris/solr/core/src/test-files/solr/collection1'
   [junit4]   2> 1774149 INFO  (TEST-SuggesterWFSTTest.testReload-seed#[7C26059C3B3C7FA2]) [    x:collection1] o.a.s.c.SolrResourceLoader JNDI not configured for solr (NoInitialContextEx)
   [junit4]   2> 1774149 INFO  (TEST-SuggesterWFSTTest.testReload-seed#[7C26059C3B3C7FA2]) [    x:collection1] o.a.s.c.SolrResourceLoader using system property solr.solr.home: /export/home/jenkins/workspace/Lucene-Solr-trunk-Solaris/solr/core/src/test-files/solr
   [junit4]   2> 1774150 INFO  (TEST-SuggesterWFSTTest.testReload-seed#[7C26059C3B3C7FA2]) [    x:collection1] o.a.s.c.SolrResourceLoader Adding 'file:/export/home/jenkins/workspace/Lucene-Solr-trunk-Solaris/solr/core/src/test-files/solr/collection1/lib/classes/' to classloader
   [junit4]   2> 1774150 INFO  (TEST-SuggesterWFSTTest.testReload-seed#[7C26059C3B3C7FA2]) [    x:collection1] o.a.s.c.SolrResourceLoader Adding 'file:/export/home/jenkins/workspace/Lucene-Solr-trunk-Solaris/solr/core/src/test-files/solr/collection1/lib/README' to classloader
   [junit4]   2> 1774170 INFO  (TEST-SuggesterWFSTTest.testReload-seed#[7C26059C3B3C7FA2]) [    x:collection1] o.a.s.c.SolrConfig current version of requestparams : -1
   [junit4]   2> 1774174 INFO  (TEST-SuggesterWFSTTest.testReload-seed#[7C26059C3B3C7FA2]) [    x:collection1] o.a.s.c.SolrConfig Using Lucene MatchVersion: 6.0.0
   [junit4]   2> 1774198 INFO  (TEST-SuggesterWFSTTest.testReload-seed#[7C26059C3B3C7FA2]) [    x:collection1] o.a.s.c.SolrConfig Loaded SolrConfig: solrconfig-spellchecker.xml
   [junit4]   2> 1774202 INFO  (TEST-SuggesterWFSTTest.testReload-seed#[7C26059C3B3C7FA2]) [    x:collection1] o.a.s.s.IndexSchema [null] Schema name=test
   [junit4]   2> 1774281 INFO  (TEST-SuggesterWFSTTest.testReload-seed#[7C26059C3B3C7FA2]) [    x:collection1] o.a.s.s.OpenExchangeRatesOrgProvider Initialized with rates=open-exchange-rates.json, refreshInterval=1440.
   [junit4]   2> 1774285 INFO  (TEST-SuggesterWFSTTest.testReload-seed#[7C26059C3B3C7FA2]) [    x:collection1] o.a.s.s.IndexSchema default search field in schema is text
   [junit4]   2> 1774285 INFO  (TEST-SuggesterWFSTTest.testReload-seed#[7C26059C3B3C7FA2]) [    x:collection1] o.a.s.s.IndexSchema unique key field: id
   [junit4]   2> 1774291 INFO  (TEST-SuggesterWFSTTest.testReload-seed#[7C26059C3B3C7FA2]) [    x:collection1] o.a.s.s.FileExchangeRateProvider Reloading exchange rates from file currency.xml
   [junit4]   2> 1774293 INFO  (TEST-SuggesterWFSTTest.testReload-seed#[7C26059C3B3C7FA2]) [    x:collection1] o.a.s.s.FileExchangeRateProvider Reloading exchange rates from file currency.xml
   [junit4]   2> 1774294 INFO  (TEST-SuggesterWFSTTest.testReload-seed#[7C26059C3B3C7FA2]) [    x:collection1] o.a.s.s.OpenExchangeRatesOrgProvider Reloading exchange rates from open-exchange-rates.json
   [junit4]   2> 1774294 INFO  (TEST-SuggesterWFSTTest.testReload-seed#[7C26059C3B3C7FA2]) [    x:collection1] o.a.s.s.OpenExchangeRatesOrgProvider Reloading exchange rates from open-exchange-rates.json
   [junit4]   2> 1774295 INFO  (TEST-SuggesterWFSTTest.testReload-seed#[7C26059C3B3C7FA2]) [    x:collection1] o.a.s.c.SolrResourceLoader JNDI not configured for solr (NoInitialContextEx)
   [junit4]   2> 1774295 INFO  (TEST-SuggesterWFSTTest.testReload-seed#[7C26059C3B3C7FA2]) [    x:collection1] o.a.s.c.SolrResourceLoader using system property solr.solr.home: /export/home/jenkins/workspace/Lucene-Solr-trunk-Solaris/solr/core/src/test-files/solr
   [junit4]   2> 1774295 INFO  (TEST-SuggesterWFSTTest.testReload-seed#[7C26059C3B3C7FA2]) [    x:collection1] o.a.s.c.SolrResourceLoader new SolrResourceLoader for directory: '/export/home/jenkins/workspace/Lucene-Solr-trunk-Solaris/solr/core/src/test-files/solr'
   [junit4]   2> 1774295 INFO  (TEST-SuggesterWFSTTest.testReload-seed#[7C26059C3B3C7FA2]) [    x:collection1] o.a.s.c.SolrResourceLoader JNDI not configured for solr (NoInitialContextEx)
   [junit4]   2> 1774295 INFO  (TEST-SuggesterWFSTTest.testReload-seed#[7C26059C3B3C7FA2]) [    x:collection1] o.a.s.c.SolrResourceLoader using system property solr.solr.home: /export/home/jenkins/workspace/Lucene-Solr-trunk-Solaris/solr/core/src/test-files/solr
   [junit4]   2> 1774295 INFO  (TEST-SuggesterWFSTTest.testReload-seed#[7C26059C3B3C7FA2]) [    x:collection1] o.a.s.c.CoreContainer New CoreContainer 1095626431
   [junit4]   2> 1774295 INFO  (TEST-SuggesterWFSTTest.testReload-seed#[7C26059C3B3C7FA2]) [    x:collection1] o.a.s.c.CoreContainer Loading cores into CoreContainer [instanceDir=/export/home/jenkins/workspace/Lucene-Solr-trunk-Solaris/solr/core/src/test-files/solr]
   [junit4]   2> 1774296 WARN  (TEST-SuggesterWFSTTest.testReload-seed#[7C26059C3B3C7FA2]) [    x:collection1] o.a.s.c.CoreContainer Couldn't add files from /export/home/jenkins/workspace/Lucene-Solr-trunk-Solaris/solr/core/src/test-files/solr/lib to classpath: /export/home/jenkins/workspace/Lucene-Solr-trunk-Solaris/solr/core/src/test-files/solr/lib
   [junit4]   2> 1774296 INFO  (TEST-SuggesterWFSTTest.testReload-seed#[7C26059C3B3C7FA2]) [    x:collection1] o.a.s.h.c.HttpShardHandlerFactory created with socketTimeout : 600000,connTimeout : 60000,maxConnectionsPerHost : 20,maxConnections : 10000,corePoolSize : 0,maximumPoolSize : 2147483647,maxThreadIdleTime : 5,sizeOfQueue : -1,fairnessPolicy : false,useRetries : false,
   [junit4]   2> 1774297 INFO  (TEST-SuggesterWFSTTest.testReload-seed#[7C26059C3B3C7FA2]) [    x:collection1] o.a.s.u.UpdateShardHandler Creating UpdateShardHandler HTTP client with params: socketTimeout=30000&connTimeout=30000&retry=true
   [junit4]   2> 1774297 INFO  (TEST-SuggesterWFSTTest.testReload-seed#[7C26059C3B3C7FA2]) [    x:collection1] o.a.s.l.LogWatcher SLF4J impl is org.slf4j.impl.Log4jLoggerFactory
   [junit4]   2> 1774297 INFO  (TEST-SuggesterWFSTTest.testReload-seed#[7C26059C3B3C7FA2]) [    x:collection1] o.a.s.l.LogWatcher Registering Log Listener [Log4j (org.slf4j.impl.Log4jLoggerFactory)]
   [junit4]   2> 1774297 INFO  (TEST-SuggesterWFSTTest.testReload-seed#[7C26059C3B3C7FA2]) [    x:collection1] o.a.s.c.CoreContainer Security conf doesn't exist. Skipping setup for authorization module.
   [junit4]   2> 1774297 INFO  (TEST-SuggesterWFSTTest.testReload-seed#[7C26059C3B3C7FA2]) [    x:collection1] o.a.s.c.CoreContainer No authentication plugin used.
   [junit4]   2> 1774298 INFO  (TEST-SuggesterWFSTTest.testReload-seed#[7C26059C3B3C7FA2]) [    x:collection1] o.a.s.c.CoreDescriptor Created CoreDescriptor: {name=collection1, config=solrconfig-spellchecker.xml, transient=false, schema=schema.xml, loadOnStartup=true, configSetProperties=configsetprops.json, collection=collection1, dataDir=/export/home/jenkins/workspace/Lucene-Solr-trunk-Solaris/solr/build/solr-core/test/J1/temp/solr.spelling.suggest.SuggesterWFSTTest_7C26059C3B3C7FA2-001/init-core-data-001, shard=shard1}
   [junit4]   2> 1774299 INFO  (coreLoadExecutor-5200-thread-1-processing-x:collection1) [    x:collection1] o.a.s.c.SolrResourceLoader new SolrResourceLoader for directory: '/export/home/jenkins/workspace/Lucene-Solr-trunk-Solaris/solr/core/src/test-files/solr/collection1'
   [junit4]   2> 1774299 INFO  (coreLoadExecutor-5200-thread-1-processing-x:collection1) [    x:collection1] o.a.s.c.SolrResourceLoader JNDI not configured for solr (NoInitialContextEx)
   [junit4]   2> 1774299 INFO  (coreLoadExecutor-5200-thread-1-processing-x:collection1) [    x:collection1] o.a.s.c.SolrResourceLoader using system property solr.solr.home: /export/home/jenkins/workspace/Lucene-Solr-trunk-Solaris/solr/core/src/test-files/solr
   [junit4]   2> 1774299 INFO  (coreLoadExecutor-5200-thread-1-processing-x:collection1) [    x:collection1] o.a.s.c.SolrResourceLoader Adding 'file:/export/home/jenkins/workspace/Lucene-Solr-trunk-Solaris/solr/core/src/test-files/solr/collection1/lib/classes/' to classloader
   [junit4]   2> 1774299 INFO  (coreLoadExecutor-5200-thread-1-processing-x:collection1) [    x:collection1] o.a.s.c.SolrResourceLoader Adding 'file:/export/home/jenkins/workspace/Lucene-Solr-trunk-Solaris/solr/core/src/test-files/solr/collection1/lib/README' to classloader
   [junit4]   2> 1774315 INFO  (coreLoadExecutor-5200-thread-1-processing-x:collection1) [    x:collection1] o.a.s.c.SolrConfig current version of requestparams : -1
   [junit4]   2> 1774318 INFO  (coreLoadExecutor-5200-thread-1-processing-x:collection1) [    x:collection1] o.a.s.c.SolrConfig Using Lucene MatchVersion: 6.0.0
   [junit4]   2> 1774346 INFO  (coreLoadExecutor-5200-thread-1-processing-x:collection1) [    x:collection1] o.a.s.c.SolrConfig Loaded SolrConfig: solrconfig-spellchecker.xml
   [junit4]   2> 1774350 INFO  (coreLoadExecutor-5200-thread-1-processing-x:collection1) [    x:collection1] o.a.s.s.IndexSchema [collection1] Schema name=test
   [junit4]   2> 1774529 INFO  (coreLoadExecutor-5200-thread-1-processing-x:collection1) [    x:collection1] o.a.s.s.OpenExchangeRatesOrgProvider Initialized with rates=open-exchange-rates.json, refreshInterval=1440.
   [junit4]   2> 1774533 INFO  (coreLoadExecutor-5200-thread-1-processing-x:collection1) [    x:collection1] o.a.s.s.IndexSchema default search field in schema is text
   [junit4]   2> 1774534 INFO  (coreLoadExecutor-5200-thread-1-processing-x:collection1) [    x:collection1] o.a.s.s.IndexSchema unique key field: id
   [junit4]   2> 1774536 INFO  (coreLoadExecutor-5200-thread-1-processing-x:collection1) [    x:collection1] o.a.s.s.FileExchangeRateProvider Reloading exchange rates from file currency.xml
   [junit4]   2> 1774537 INFO  (coreLoadExecutor-5200-thread-1-processing-x:collection1) [    x:collection1] o.a.s.s.FileExchangeRateProvider Reloading exchange rates from file currency.xml
   [junit4]   2> 1774539 INFO  (coreLoadExecutor-5200-thread-1-processing-x:collection1) [    x:collection1] o.a.s.s.OpenExchangeRatesOrgProvider Reloading exchange rates from open-exchange-rates.json
   [junit4]   2> 1774539 INFO  (coreLoadExecutor-5200-thread-1-processing-x:collection1) [    x:collection1] o.a.s.s.OpenExchangeRatesOrgProvider Reloading exchange rates from open-exchange-rates.json
   [junit4]   2> 1774541 INFO  (coreLoadExecutor-5200-thread-1-processing-x:collection1) [    x:collection1] o.a.s.c.ConfigSetProperties Did not find ConfigSet properties, assuming default properties: Can't find resource 'configsetprops.json' in classpath or '/export/home/jenkins/workspace/Lucene-Solr-trunk-Solaris/solr/core/src/test-files/solr/collection1'
   [junit4]   2> 1774541 INFO  (coreLoadExecutor-5200-thread-1-processing-x:collection1) [    x:collection1] o.a.s.c.CoreContainer Creating SolrCore 'collection1' using configuration from instancedir /export/home/jenkins/workspace/Lucene-Solr-trunk-Solaris/solr/core/src/test-files/solr/collection1
   [junit4]   2> 1774541 INFO  (coreLoadExecutor-5200-thread-1-processing-x:collection1) [    x:collection1] o.a.s.c.SolrCore org.apache.solr.core.MockFSDirectoryFactory
   [junit4]   2> 1774541 INFO  (coreLoadExecutor-5200-thread-1-processing-x:collection1) [    x:collection1] o.a.s.c.SolrCore [[collection1] ] Opening new SolrCore at [/export/home/jenkins/workspace/Lucene-Solr-trunk-Solaris/solr/core/src/test-files/solr/collection1], dataDir=[/export/home/jenkins/workspace/Lucene-Solr-trunk-Solaris/solr/build/solr-core/test/J1/temp/solr.spelling.suggest.SuggesterWFSTTest_7C26059C3B3C7FA2-001/init-core-data-001/]
   [junit4]   2> 1774541 INFO  (coreLoadExecutor-5200-thread-1-processing-x:collection1) [    x:collection1] o.a.s.c.SolrCore JMX monitoring not detected for core: collection1
   [junit4]   2> 1774541 INFO  (coreLoadExecutor-5200-thread-1-processing-x:collection1) [    x:collection1] o.a.s.c.CachingDirectoryFactory return new directory for /export/home/jenkins/workspace/Lucene-Solr-trunk-Solaris/solr/build/solr-core/test/J1/temp/solr.spelling.suggest.SuggesterWFSTTest_7C26059C3B3C7FA2-001/init-core-data-001
   [junit4]   2> 1774542 INFO  (coreLoadExecutor-5200-thread-1-processing-x:collection1) [    x:collection1] o.a.s.c.SolrCore New index directory detected: old=null new=/export/home/jenkins/workspace/Lucene-Solr-trunk-Solaris/solr/build/solr-core/test/J1/temp/solr.spelling.suggest.SuggesterWFSTTest_7C26059C3B3C7FA2-001/init-core-data-001/index/
   [junit4]   2> 1774544 INFO  (coreLoadExecutor-5200-thread-1-processing-x:collection1) [    x:collection1] o.a.s.c.SolrCore no updateRequestProcessorChain defined as default, creating implicit default
   [junit4]   2> 1774545 INFO  (coreLoadExecutor-5200-thread-1-processing-x:collection1) [    x:collection1] o.a.s.h.l.XMLLoader xsltCacheLifetimeSeconds=60
   [junit4]   2> 1774546 INFO  (coreLoadExecutor-5200-thread-1-processing-x:collection1) [    x:collection1] o.a.s.h.l.XMLLoader xsltCacheLifetimeSeconds=60
   [junit4]   2> 1774547 INFO  (coreLoadExecutor-5200-thread-1-processing-x:collection1) [    x:collection1] o.a.s.h.l.XMLLoader xsltCacheLifetimeSeconds=60
   [junit4]   2> 1774547 INFO  (coreLoadExecutor-5200-thread-1-processing-x:collection1) [    x:collection1] o.a.s.h.l.XMLLoader xsltCacheLifetimeSeconds=60
   [junit4]   2> 1774549 INFO  (coreLoadExecutor-5200-thread-1-processing-x:collection1) [    x:collection1] o.a.s.c.RequestHandlers Registered paths: /admin/mbeans,standard,/update/json/docs,/admin/luke,/export,/get,/suggest_fst,/admin/properties,/update/json,/admin/threads,/suggest_wfst,/suggest_tst,/update/csv,/sql,/admin/segments,/admin/system,/suggest,/replication,/config,/stream,/schema,/admin/plugins,/admin/logging,/admin/ping,/update,/admin/file
   [junit4]   2> 1774549 INFO  (coreLoadExecutor-5200-thread-1-processing-x:collection1) [    x:collection1] o.a.s.c.SolrCore Using default statsCache cache: org.apache.solr.search.stats.LocalStatsCache
   [junit4]   2> 1774549 INFO  (coreLoadExecutor-5200-thread-1-processing-x:collection1) [    x:collection1] o.a.s.u.CommitTracker Hard AutoCommit: disabled
   [junit4]   2> 1774549 INFO  (coreLoadExecutor-5200-thread-1-processing-x:collection1) [    x:collection1] o.a.s.u.CommitTracker Soft AutoCommit: disabled
   [junit4]   2> 1774549 INFO  (OldIndexDirectoryCleanupThreadForCore-collection1) [    x:collection1] o.a.s.c.SolrCore Looking for old index directories to cleanup for core collection1 in /export/home/jenkins/workspace/Lucene-Solr-trunk-Solaris/solr/build/solr-core/test/J1/temp/solr.spelling.suggest.SuggesterWFSTTest_7C26059C3B3C7FA2-001/init-core-data-001/
   [junit4]   2> 1774551 INFO  (coreLoadExecutor-5200-thread-1-processing-x:collection1) [    x:collection1] o.a.s.c.CachingDirectoryFactory return new directory for /export/home/jenkins/workspace/Lucene-Solr-trunk-Solaris/solr/build/solr-core/test/J1/temp/solr.spelling.suggest.SuggesterWFSTTest_7C26059C3B3C7FA2-001/init-core-data-001/index
   [junit4]   2> 1774551 INFO  (coreLoadExecutor-5200-thread-1-processing-x:collection1) [    x:collection1] o.a.s.u.RandomMergePolicy RandomMergePolicy wrapping class org.apache.lucene.index.LogByteSizeMergePolicy: [LogByteSizeMergePolicy: minMergeSize=1677721, mergeFactor=42, maxMergeSize=2147483648, maxMergeSizeForForcedMerge=9223372036854775807, calibrateSizeByDeletes=false, maxMergeDocs=2147483647, maxCFSSegmentSizeMB=8.796093022207999E12, noCFSRatio=0.6233899832079214]
   [junit4]   2> 1774553 INFO  (coreLoadExecutor-5200-thread-1-processing-x:collection1) [    x:collection1] o.a.s.c.SolrDeletionPolicy SolrDeletionPolicy.onInit: commits: num=1
   [junit4]   2> 	commit{dir=MockDirectoryWrapper(MMapDirectory@/export/home/jenkins/workspace/Lucene-Solr-trunk-Solaris/solr/build/solr-core/test/J1/temp/solr.spelling.suggest.SuggesterWFSTTest_7C26059C3B3C7FA2-001/init-core-data-001/index lockFactory=org.apache.lucene.store.SingleInstanceLockFactory@3f3c46fb),segFN=segments_2,generation=2}
   [junit4]   2> 1774553 INFO  (coreLoadExecutor-5200-thread-1-processing-x:collection1) [    x:collection1] o.a.s.c.SolrDeletionPolicy newest commit generation = 2
   [junit4]   2> 1774554 INFO  (coreLoadExecutor-5200-thread-1-processing-x:collection1) [    x:collection1] o.a.s.s.SolrIndexSearcher Opening [Searcher@299679e0[collection1] main]
   [junit4]   2> 1774554 WARN  (coreLoadExecutor-5200-thread-1-processing-x:collection1) [    x:collection1] o.a.s.r.ManagedResourceStorage Cannot write to config directory /export/home/jenkins/workspace/Lucene-Solr-trunk-Solaris/solr/core/src/test-files/solr/collection1/conf; switching to use InMemory storage instead.
   [junit4]   2> 1774554 INFO  (coreLoadExecutor-5200-thread-1-processing-x:collection1) [    x:collection1] o.a.s.r.RestManager Initializing RestManager with initArgs: {}
   [junit4]   2> 1774555 INFO  (coreLoadExecutor-5200-thread-1-processing-x:collection1) [    x:collection1] o.a.s.r.ManagedResourceStorage Reading _rest_managed.json using InMemoryStorage
   [junit4]   2> 1774555 INFO  (coreLoadExecutor-5200-thread-1-processing-x:collection1) [    x:collection1] o.a.s.r.RestManager Initializing 0 registered ManagedResources
   [junit4]   2> 1774555 INFO  (coreLoadExecutor-5200-thread-1-processing-x:collection1) [    x:collection1] o.a.s.h.c.SpellCheckComponent Initializing spell checkers
   [junit4]   2> 1774555 INFO  (coreLoadExecutor-5200-thread-1-processing-x:collection1) [    x:collection1] o.a.s.s.s.Suggester init: {name=suggest,classname=org.apache.solr.spelling.suggest.Suggester,lookupImpl=org.apache.solr.spelling.suggest.jaspell.JaspellLookup,field=suggest,storeDir=suggest,buildOnCommit=true,threshold=0.0}
   [junit4]   2> 1774555 INFO  (coreLoadExecutor-5200-thread-1-processing-x:collection1) [    x:collection1] o.a.s.s.s.j.JaspellLookupFactory init: {name=suggest,classname=org.apache.solr.spelling.suggest.Suggester,lookupImpl=org.apache.solr.spelling.suggest.jaspell.JaspellLookup,field=suggest,storeDir=suggest,buildOnCommit=true,threshold=0.0}
   [junit4]   2> 1774555 WARN  (coreLoadExecutor-5200-thread-1-processing-x:collection1) [    x:collection1] o.a.s.s.s.Suggester Loading stored lookup data failed
   [junit4]   2> java.io.FileNotFoundException: /export/home/jenkins/workspace/Lucene-Solr-trunk-Solaris/solr/build/solr-core/test/J1/temp/solr.spelling.suggest.SuggesterWFSTTest_7C26059C3B3C7FA2-001/init-core-data-001/suggest/jaspell.dat (No such file or directory)
   [junit4]   2> 	at java.io.FileInputStream.open0(Native Method)
   [junit4]   2> 	at java.io.FileInputStream.open(FileInputStream.java:195)
   [junit4]   2> 	at java.io.FileInputStream.<init>(FileInputStream.java:138)
   [junit4]   2> 	at org.apache.solr.spelling.suggest.Suggester.init(Suggester.java:136)
   [junit4]   2> 	at org.apache.solr.handler.component.SpellCheckComponent.addSpellChecker(SpellCheckComponent.java:763)
   [junit4]   2> 	at org.apache.solr.handler.component.SpellCheckComponent.inform(SpellCheckComponent.java:717)
   [junit4]   2> 	at org.apache.solr.core.SolrResourceLoader.inform(SolrResourceLoader.java:676)
   [junit4]   2> 	at org.apache.solr.core.SolrCore.<init>(SolrCore.java:801)
   [junit4]   2> 	at org.apache.solr.core.SolrCore.<init>(SolrCore.java:659)
   [junit4]   2> 	at org.apache.solr.core.CoreContainer.create(CoreContainer.java:817)
   [junit4]   2> 	at org.apache.solr.core.CoreContainer.access$000(CoreContainer.java:87)
   [junit4]   2> 	at org.apache.solr.core.CoreContainer$1.call(CoreContainer.java:467)
   [junit4]   2> 	at org.apache.solr.core.CoreContainer$1.call(CoreContainer.java:458)
   [junit4]   2> 	at java.util.concurrent.FutureTask.run(FutureTask.java:266)
   [junit4]   2> 	at org.apache.solr.common.util.ExecutorUtil$MDCAwareThreadPoolExecutor$1.run(ExecutorUtil.java:232)
   [junit4]   2> 	at java.util.concurrent.ThreadPoolExecutor.runWorker(ThreadPoolExecutor.java:1142)
   [junit4]   2> 	at java.util.concurrent.ThreadPoolExecutor$Worker.run(ThreadPoolExecutor.java:617)
   [junit4]   2> 	at java.lang.Thread.run(Thread.java:745)
   [junit4]   2> 1774555 INFO  (coreLoadExecutor-5200-thread-1-processing-x:collection1) [    x:collection1] o.a.s.h.c.SpellCheckComponent Registering newSearcher listener for spellchecker: suggest
   [junit4]   2> 1774555 INFO  (coreLoadExecutor-5200-thread-1-processing-x:collection1) [    x:collection1] o.a.s.h.c.SpellCheckComponent No queryConverter defined, using default converter
   [junit4]   2> 1774556 INFO  (coreLoadExecutor-5200-thread-1-processing-x:collection1) [    x:collection1] o.a.s.h.c.SpellCheckComponent Initializing spell checkers
   [junit4]   2> 1774556 INFO  (coreLoadExecutor-5200-thread-1-processing-x:collection1) [    x:collection1] o.a.s.s.s.Suggester init: {name=suggest_tst,classname=org.apache.solr.spelling.suggest.Suggester,lookupImpl=org.apache.solr.spelling.suggest.tst.TSTLookup,field=suggest,storeDir=suggest_tst,buildOnCommit=true,threshold=0.0}
   [junit4]   2> 1774556 WARN  (coreLoadExecutor-5200-thread-1-processing-x:collection1) [    x:collection1] o.a.s.s.s.Suggester Loading stored lookup data failed
   [junit4]   2> java.io.FileNotFoundException: /export/home/jenkins/workspace/Lucene-Solr-trunk-Solaris/solr/build/solr-core/test/J1/temp/solr.spelling.suggest.SuggesterWFSTTest_7C26059C3B3C7FA2-001/init-core-data-001/suggest_tst/tst.dat (No such file or directory)
   [junit4]   2> 	at java.io.FileInputStream.open0(Native Method)
   [junit4]   2> 	at java.io.FileInputStream.open(FileInputStream.java:195)
   [junit4]   2> 	at java.io.FileInputStream.<init>(FileInputStream.java:138)
   [junit4]   2> 	at org.apache.solr.spelling.suggest.Suggester.init(Suggester.java:136)
   [junit4]   2> 	at org.apache.solr.handler.component.SpellCheckComponent.addSpellChecker(SpellCheckComponent.java:763)
   [junit4]   2> 	at org.apache.solr.handler.component.SpellCheckComponent.inform(SpellCheckComponent.java:717)
   [junit4]   2> 	at org.apache.solr.core.SolrResourceLoader.inform(SolrResourceLoader.java:676)
   [junit4]   2> 	at org.apache.solr.core.SolrCore.<init>(SolrCore.java:801)
   [junit4]   2> 	at org.apache.solr.core.SolrCore.<init>(SolrCore.java:659)
   [junit4]   2> 	at org.apache.solr.core.CoreContainer.create(CoreContainer.java:817)
   [junit4]   2> 	at org.apache.solr.core.CoreContainer.access$000(CoreContainer.java:87)
   [junit4]   2> 	at org.apache.solr.core.CoreContainer$1.call(CoreContainer.java:467)
   [junit4]   2> 	at org.apache.solr.core.CoreContainer$1.call(CoreContainer.java:458)
   [junit4]   2> 	at java.util.concurrent.FutureTask.run(FutureTask.java:266)
   [junit4]   2> 	at org.apache.solr.common.util.ExecutorUtil$MDCAwareThreadPoolExecutor$1.run(ExecutorUtil.java:232)
   [junit4]   2> 	at java.util.concurrent.ThreadPoolExecutor.runWorker(ThreadPoolExecutor.java:1142)
   [junit4]   2> 	at java.util.concurrent.ThreadPoolExecutor$Worker.run(ThreadPoolExecutor.java:617)
   [junit4]   2> 	at java.lang.Thread.run(Thread.java:745)
   [junit4]   2> 1774556 INFO  (coreLoadExecutor-5200-thread-1-processing-x:collection1) [    x:collection1] o.a.s.h.c.SpellCheckComponent Registering newSearcher listener for spellchecker: suggest_tst
   [junit4]   2> 1774556 INFO  (coreLoadExecutor-5200-thread-1-processing-x:collection1) [    x:collection1] o.a.s.h.c.SpellCheckComponent No queryConverter defined, using default converter
   [junit4]   2> 1774556 INFO  (coreLoadExecutor-5200-thread-1-processing-x:collection1) [    x:collection1] o.a.s.h.c.SpellCheckComponent Initializing spell checkers
   [junit4]   2> 1774556 INFO  (coreLoadExecutor-5200-thread-1-processing-x:collection1) [    x:collection1] o.a.s.s.s.Suggester init: {name=suggest_fst,classname=org.apache.solr.spelling.suggest.Suggester,lookupImpl=org.apache.solr.spelling.suggest.fst.FSTLookup,field=suggest,storeDir=suggest_fst,buildOnCommit=true,weightBuckets=5,exactMatchFirst=true}
   [junit4]   2> 1774557 WARN  (coreLoadExecutor-5200-thread-1-processing-x:collection1) [    x:collection1] o.a.s.s.s.Suggester Loading stored lookup data failed
   [junit4]   2> java.io.FileNotFoundException: /export/home/jenkins/workspace/Lucene-Solr-trunk-Solaris/solr/build/solr-core/test/J1/temp/solr.spelling.suggest.SuggesterWFSTTest_7C26059C3B3C7FA2-001/init-core-data-001/suggest_fst/fst.bin (No such file or directory)
   [junit4]   2> 	at java.io.FileInputStream.open0(Native Method)
   [junit4]   2> 	at java.io.FileInputStream.open(FileInputStream.java:195)
   [junit4]   2> 	at java.io.FileInputStream.<init>(FileInputStream.java:138)
   [junit4]   2> 	at org.apache.solr.spelling.suggest.Suggester.init(Suggester.java:136)
   [junit4]   2> 	at org.apache.solr.handler.component.SpellCheckComponent.addSpellChecker(SpellCheckComponent.java:763)
   [junit4]   2> 	at org.apache.solr.handler.component.SpellCheckComponent.inform(SpellCheckComponent.java:717)
   [junit4]   2> 	at org.apache.solr.core.SolrResourceLoader.inform(SolrResourceLoader.java:676)
   [junit4]   2> 	at org.apache.solr.core.SolrCore.<init>(SolrCore.java:801)
   [junit4]   2> 	at org.apache.solr.core.SolrCore.<init>(SolrCore.java:659)
   [junit4]   2> 	at org.apache.solr.core.CoreContainer.create(CoreContainer.java:817)
   [junit4]   2> 	at org.apache.solr.core.CoreContainer.access$000(CoreContainer.java:87)
   [junit4]   2> 	at org.apache.solr.core.CoreContainer$1.call(CoreContainer.java:467)
   [junit4]   2> 	at org.apache.solr.core.CoreContainer$1.call(CoreContainer.java:458)
   [junit4]   2> 	at java.util.concurrent.FutureTask.run(FutureTask.java:266)
   [junit4]   2> 	at org.apache.solr.common.util.ExecutorUtil$MDCAwareThreadPoolExecutor$1.run(ExecutorUtil.java:232)
   [junit4]   2> 	at java.util.concurrent.ThreadPoolExecutor.runWorker(ThreadPoolExecutor.java:1142)
   [junit4]   2> 	at java.util.concurrent.ThreadPoolExecutor$Worker.run(ThreadPoolExecutor.java:617)
   [junit4]   2> 	at java.lang.Thread.run(Thread.java:745)
   [junit4]   2> 1774557 INFO  (coreLoadExecutor-5200-thread-1-processing-x:collection1) [    x:collection1] o.a.s.h.c.SpellCheckComponent Registering newSearcher listener for spellchecker: suggest_fst
   [junit4]   2> 1774557 INFO  (coreLoadExecutor-5200-thread-1-processing-x:collection1) [    x:collection1] o.a.s.h.c.SpellCheckComponent No queryConverter defined, using default converter
   [junit4]   2> 1774557 INFO  (coreLoadExecutor-5200-thread-1-processing-x:collection1) [    x:collection1] o.a.s.h.c.SpellCheckComponent Initializing spell checkers
   [junit4]   2> 1774557 INFO  (coreLoadExecutor-5200-thread-1-processing-x:collection1) [    x:collection1] o.a.s.s.s.Suggester init: {name=suggest_wfst,classname=org.apache.solr.spelling.suggest.Suggester,lookupImpl=org.apache.solr.spelling.suggest.fst.WFSTLookupFactory,field=suggest,storeDir=suggest_wfst,buildOnCommit=true,exactMatchFirst=true}
   [junit4]   2> 1774558 WARN  (coreLoadExecutor-5200-thread-1-processing-x:collection1) [    x:collection1] o.a.s.s.s.Suggester Loading stored lookup data failed
   [junit4]   2> java.io.FileNotFoundException: /export/home/jenkins/workspace/Lucene-Solr-trunk-Solaris/solr/build/solr-core/test/J1/temp/solr.spelling.suggest.SuggesterWFSTTest_7C26059C3B3C7FA2-001/init-core-data-001/suggest_wfst/wfst.bin (No such file or directory)
   [junit4]   2> 	at java.io.FileInputStream.open0(Native Method)
   [junit4]   2> 	at java.io.FileInputStream.open(FileInputStream.java:195)
   [junit4]   2> 	at java.io.FileInputStream.<init>(FileInputStream.java:138)
   [junit4]   2> 	at org.apache.solr.spelling.suggest.Suggester.init(Suggester.java:136)
   [junit4]   2> 	at org.apache.solr.handler.component.SpellCheckComponent.addSpellChecker(SpellCheckComponent.java:763)
   [junit4]   2> 	at org.apache.solr.handler.component.SpellCheckComponent.inform(SpellCheckComponent.java:717)
   [junit4]   2> 	at org.apache.solr.core.SolrResourceLoader.inform(SolrResourceLoader.java:676)
   [junit4]   2> 	at org.apache.solr.core.SolrCore.<init>(SolrCore.java:801)
   [junit4]   2> 	at org.apache.solr.core.SolrCore.<init>(SolrCore.java:659)
   [junit4]   2> 	at org.apache.solr.core.CoreContainer.create(CoreContainer.java:817)
   [junit4]   2> 	at org.apache.solr.core.CoreContainer.access$000(CoreContainer.java:87)
   [junit4]   2> 	at org.apache.solr.core.CoreContainer$1.call(CoreContainer.java:467)
   [junit4]   2> 	at org.apache.solr.core.CoreContainer$1.call(CoreContainer.java:458)
   [junit4]   2> 	at java.util.concurrent.FutureTask.run(FutureTask.java:266)
   [junit4]   2> 	at org.apache.solr.common.util.ExecutorUtil$MDCAwareThreadPoolExecutor$1.run(ExecutorUtil.java:232)
   [junit4]   2> 	at java.util.concurrent.ThreadPoolExecutor.runWorker(ThreadPoolExecutor.java:1142)
   [junit4]   2> 	at java.util.concurrent.ThreadPoolExecutor$Worker.run(ThreadPoolExecutor.java:617)
   [junit4]   2> 	at java.lang.Thread.run(Thread.java:745)
   [junit4]   2> 1774558 INFO  (coreLoadExecutor-5200-thread-1-processing-x:collection1) [    x:collection1] o.a.s.h.c.SpellCheckComponent Registering newSearcher listener for spellchecker: suggest_wfst
   [junit4]   2> 1774558 INFO  (coreLoadExecutor-5200-thread-1-processing-x:collection1) [    x:collection1] o.a.s.h.c.SpellCheckComponent No queryConverter defined, using default converter
   [junit4]   2> 1774558 INFO  (coreLoadExecutor-5200-thread-1-processing-x:collection1) [    x:collection1] o.a.s.h.ReplicationHandler Commits will be reserved for  10000
   [junit4]   2> 1774558 INFO  (coreLoadExecutor-5200-thread-1-processing-x:collection1) [    x:collection1] o.a.s.c.CoreContainer registering core: collection1
   [junit4]   2> 1774558 INFO  (searcherExecutor-5201-thread-1-processing-x:collection1) [    x:collection1] o.a.s.h.c.SpellCheckComponent Loading spell index for spellchecker: suggest
   [junit4]   2> 1774558 INFO  (searcherExecutor-5201-thread-1-processing-x:collection1) [    x:collection1] o.a.s.s.s.Suggester reload()
   [junit4]   2> 1774559 ERROR (searcherExecutor-5201-thread-1-processing-x:collection1) [    x:collection1] o.a.s.h.c.SpellCheckComponent Exception in reloading spell check index for spellchecker: suggest
   [junit4]   2> java.io.FileNotFoundException: /export/home/jenkins/workspace/Lucene-Solr-trunk-Solaris/solr/build/solr-core/test/J1/temp/solr.spelling.suggest.SuggesterWFSTTest_7C26059C3B3C7FA2-001/init-core-data-001/suggest/jaspell.dat (No such file or directory)
   [junit4]   2> 	at java.io.FileInputStream.open0(Native Method)
   [junit4]   2> 	at java.io.FileInputStream.open(FileInputStream.java:195)
   [junit4]   2> 	at java.io.FileInputStream.<init>(FileInputStream.java:138)
   [junit4]   2> 	at org.apache.solr.spelling.suggest.Suggester.reload(Suggester.java:183)
   [junit4]   2> 	at org.apache.solr.handler.component.SpellCheckComponent$SpellCheckerListener.newSearcher(SpellCheckComponent.java:819)
   [junit4]   2> 	at org.apache.solr.core.SolrCore$5.call(SolrCore.java:1850)
   [junit4]   2> 	at java.util.concurrent.FutureTask.run(FutureTask.java:266)
   [junit4]   2> 	at org.apache.solr.common.util.ExecutorUtil$MDCAwareThreadPoolExecutor$1.run(ExecutorUtil.java:232)
   [junit4]   2> 	at java.util.concurrent.ThreadPoolExecutor.runWorker(ThreadPoolExecutor.java:1142)
   [junit4]   2> 	at java.util.concurrent.ThreadPoolExecutor$Worker.run(ThreadPoolExecutor.java:617)
   [junit4]   2> 	at java.lang.Thread.run(Thread.java:745)
   [junit4]   2> 1774559 INFO  (searcherExecutor-5201-thread-1-processing-x:collection1) [    x:collection1] o.a.s.h.c.SpellCheckComponent Loading spell index for spellchecker: suggest_tst
   [junit4]   2> 1774559 INFO  (searcherExecutor-5201-thread-1-processing-x:collection1) [    x:collection1] o.a.s.s.s.Suggester reload()
   [junit4]   2> 1774559 ERROR (searcherExecutor-5201-thread-1-processing-x:collection1) [    x:collection1] o.a.s.h.c.SpellCheckComponent Exception in reloading spell check index for spellchecker: suggest_tst
   [junit4]   2> java.io.FileNotFoundException: /export/home/jenkins/workspace/Lucene-Solr-trunk-Solaris/solr/build/solr-core/test/J1/temp/solr.spelling.suggest.SuggesterWFSTTest_7C26059C3B3C7FA2-001/init-core-data-001/suggest_tst/tst.dat (No such file or directory)
   [junit4]   2> 	at java.io.FileInputStream.open0(Native Method)
   [junit4]   2> 	at java.io.FileInputStream.open(FileInputStream.java:195)
   [junit4]   2> 	at java.io.FileInputStream.<init>(FileInputStream.java:138)
   [junit4]   2> 	at org.apache.solr.spelling.suggest.Suggester.reload(Suggester.java:183)
   [junit4]   2> 	at org.apache.solr.handler.component.SpellCheckComponent$SpellCheckerListener.newSearcher(SpellCheckComponent.java:819)
   [junit4]   2> 	at org.apache.solr.core.SolrCore$5.call(SolrCore.java:1850)
   [junit4]   2> 	at java.util.concurrent.FutureTask.run(FutureTask.java:266)
   [junit4]   2> 	at org.apache.solr.common.util.ExecutorUtil$MDCAwareThreadPoolExecutor$1.run(ExecutorUtil.java:232)
   [junit4]   2> 	at java.util.concurrent.ThreadPoolExecutor.runWorker(ThreadPoolExecutor.java:1142)
   [junit4]   2> 	at java.util.concurrent.ThreadPoolExecutor$Worker.run(ThreadPoolExecutor.java:617)
   [junit4]   2> 	at java.lang.Thread.run(Thread.java:745)
   [junit4]   2> 1774559 INFO  (searcherExecutor-5201-thread-1-processing-x:collection1) [    x:collection1] o.a.s.h.c.SpellCheckComponent Loading spell index for spellchecker: suggest_fst
   [junit4]   2> 1774559 INFO  (searcherExecutor-5201-thread-1-processing-x:collection1) [    x:collection1] o.a.s.s.s.Suggester reload()
   [junit4]   2> 1774560 ERROR (searcherExecutor-5201-thread-1-processing-x:collection1) [    x:collection1] o.a.s.h.c.SpellCheckComponent Exception in reloading spell check index for spellchecker: suggest_fst
   [junit4]   2> java.io.FileNotFoundException: /export/home/jenkins/workspace/Lucene-Solr-trunk-Solaris/solr/build/solr-core/test/J1/temp/solr.spelling.suggest.SuggesterWFSTTest_7C26059C3B3C7FA2-001/init-core-data-001/suggest_fst/fst.bin (No such file or directory)
   [junit4]   2> 	at java.io.FileInputStream.open0(Native Method)
   [junit4]   2> 	at java.io.FileInputStream.open(FileInputStream.java:195)
   [junit4]   2> 	at java.io.FileInputStream.<init>(FileInputStream.java:138)
   [junit4]   2> 	at org.apache.solr.spelling.suggest.Suggester.reload(Suggester.java:183)
   [junit4]   2> 	at org.apache.solr.handler.component.SpellCheckComponent$SpellCheckerListener.newSearcher(SpellCheckComponent.java:819)
   [junit4]   2> 	at org.apache.solr.core.SolrCore$5.call(SolrCore.java:1850)
   [junit4]   2> 	at java.util.concurrent.FutureTask.run(FutureTask.java:266)
   [junit4]   2> 	at org.apache.solr.common.util.ExecutorUtil$MDCAwareThreadPoolExecutor$1.run(ExecutorUtil.java:232)
   [junit4]   2> 	at java.util.concurrent.ThreadPoolExecutor.runWorker(ThreadPoolExecutor.java:1142)
   [junit4]   2> 	at java.util.concurrent.ThreadPoolExecutor$Worker.run(ThreadPoolExecutor.java:617)
   [junit4]   2> 	at java.lang.Thread.run(Thread.java:745)
   [junit4]   2> 1774560 INFO  (searcherExecutor-5201-thread-1-processing-x:collection1) [    x:collection1] o.a.s.h.c.SpellCheckComponent Loading spell index for spellchecker: suggest_wfst
   [junit4]   2> 1774560 INFO  (TEST-SuggesterWFSTTest.testReload-seed#[7C26059C3B3C7FA2]) [    x:collection1] o.a.s.SolrTestCaseJ4 ####initCore end
   [junit4]   2> 1774560 INFO  (searcherExecutor-5201-thread-1-processing-x:collection1) [    x:collection1] o.a.s.s.s.Suggester reload()
   [junit4]   2> 1774560 ERROR (searcherExecutor-5201-thread-1-processing-x:collection1) [    x:collection1] o.a.s.h.c.SpellCheckComponent Exception in reloading spell check index for spellchecker: suggest_wfst
   [junit4]   2> java.io.FileNotFoundException: /export/home/jenkins/workspace/Lucene-Solr-trunk-Solaris/solr/build/solr-core/test/J1/temp/solr.spelling.suggest.SuggesterWFSTTest_7C26059C3B3C7FA2-001/init-core-data-001/suggest_wfst/wfst.bin (No such file or directory)
   [junit4]   2> 	at java.io.FileInputStream.open0(Native Method)
   [junit4]   2> 	at java.io.FileInputStream.open(FileInputStream.java:195)
   [junit4]   2> 	at java.io.FileInputStream.<init>(FileInputStream.java:138)
   [junit4]   2> 	at org.apache.solr.spelling.suggest.Suggester.reload(Suggester.java:183)
   [junit4]   2> 	at org.apache.solr.handler.component.SpellCheckComponent$SpellCheckerListener.newSearcher(SpellCheckComponent.java:819)
   [junit4]   2> 	at org.apache.solr.core.SolrCore$5.call(SolrCore.java:1850)
   [junit4]   2> 	at java.util.concurrent.FutureTask.run(FutureTask.java:266)
   [junit4]   2> 	at org.apache.solr.common.util.ExecutorUtil$MDCAwareThreadPoolExecutor$1.run(ExecutorUtil.java:232)
   [junit4]   2> 	at java.util.concurrent.ThreadPoolExecutor.runWorker(ThreadPoolExecutor.java:1142)
   [junit4]   2> 	at java.util.concurrent.ThreadPoolExecutor$Worker.run(ThreadPoolExecutor.java:617)
   [junit4]   2> 	at java.lang.Thread.run(Thread.java:745)
   [junit4]   2> 1774560 INFO  (searcherExecutor-5201-thread-1-processing-x:collection1) [    x:collection1] o.a.s.c.SolrCore [collection1] Registered new searcher Searcher@299679e0[collection1] main{ExitableDirectoryReader(UninvertingDirectoryReader(Uninverting(_0(6.0.0):c3)))}
   [junit4]   2> 1774561 INFO  (TEST-SuggesterWFSTTest.testReload-seed#[7C26059C3B3C7FA2]) [    x:collection1] o.a.s.c.S.Request [collection1]  webapp=null path=null params={q=ac&qt=/suggest_wfst&spellcheck.onlyMorePopular=true&spellcheck.count=2&wt=xml} status=0 QTime=0
   [junit4]   2> 1774561 ERROR (TEST-SuggesterWFSTTest.testReload-seed#[7C26059C3B3C7FA2]) [    x:collection1] o.a.s.SolrTestCaseJ4 REQUEST FAILED: xpath=//lst[@name='spellcheck']/lst[@name='suggestions']/lst[@name='ac']/int[@name='numFound'][.='2']
   [junit4]   2> 	xml response was: <?xml version="1.0" encoding="UTF-8"?>
   [junit4]   2> <response>
   [junit4]   2> <lst name="responseHeader"><int name="status">0</int><int name="QTime">0</int></lst><lst name="spellcheck"><lst name="suggestions"/></lst>
   [junit4]   2> </response>
   [junit4]   2> 
   [junit4]   2> 	request was:q=ac&qt=/suggest_wfst&spellcheck.onlyMorePopular=true&spellcheck.count=2&wt=xml
   [junit4]   2> 1774561 ERROR (TEST-SuggesterWFSTTest.testReload-seed#[7C26059C3B3C7FA2]) [    x:collection1] o.a.s.SolrTestCaseJ4 REQUEST FAILED: q=ac&qt=/suggest_wfst&spellcheck.onlyMorePopular=true&spellcheck.count=2&wt=xml:java.lang.RuntimeException: REQUEST FAILED: xpath=//lst[@name='spellcheck']/lst[@name='suggestions']/lst[@name='ac']/int[@name='numFound'][.='2']
   [junit4]   2> 	xml response was: <?xml version="1.0" encoding="UTF-8"?>
   [junit4]   2> <response>
   [junit4]   2> <lst name="responseHeader"><int name="status">0</int><int name="QTime">0</int></lst><lst name="spellcheck"><lst name="suggestions"/></lst>
   [junit4]   2> </response>
   [junit4]   2> 
   [junit4]   2> 	request was:q=ac&qt=/suggest_wfst&spellcheck.onlyMorePopular=true&spellcheck.count=2&wt=xml
   [junit4]   2> 	at org.apache.solr.SolrTestCaseJ4.assertQ(SolrTestCaseJ4.java:748)
   [junit4]   2> 	at org.apache.solr.SolrTestCaseJ4.assertQ(SolrTestCaseJ4.java:722)
   [junit4]   2> 	at org.apache.solr.spelling.suggest.SuggesterTest.testReload(SuggesterTest.java:91)
   [junit4]   2> 	at sun.reflect.NativeMethodAccessorImpl.invoke0(Native Method)
   [junit4]   2> 	at sun.reflect.NativeMethodAccessorImpl.invoke(NativeMethodAccessorImpl.java:62)
   [junit4]   2> 	at sun.reflect.DelegatingMethodAccessorImpl.invoke(DelegatingMethodAccessorImpl.java:43)
   [junit4]   2> 	at java.lang.reflect.Method.invoke(Method.java:497)
   [junit4]   2> 	at com.carrotsearch.randomizedtesting.RandomizedRunner.invoke(RandomizedRunner.java:1764)
   [junit4]   2> 	at com.carrotsearch.randomizedtesting.RandomizedRunner$8.evaluate(RandomizedRunner.java:871)
   [junit4]   2> 	at com.carrotsearch.randomizedtesting.RandomizedRunner$9.evaluate(RandomizedRunner.java:907)
   [junit4]   2> 	at com.carrotsearch.randomizedtesting.RandomizedRunner$10.evaluate(RandomizedRunner.java:921)
   [junit4]   2> 	at com.carrotsearch.randomizedtesting.rules.SystemPropertiesRestoreRule$1.evaluate(SystemPropertiesRestoreRule.java:57)
   [junit4]   2> 	at org.apache.lucene.util.TestRuleSetupTeardownChained$1.evaluate(TestRuleSetupTeardownChained.java:50)
   [junit4]   2> 	at org.apache.lucene.util.AbstractBeforeAfterRule$1.evaluate(AbstractBeforeAfterRule.java:46)
   [junit4]   2> 	at org.apache.lucene.util.TestRuleThreadAndTestName$1.evaluate(TestRuleThreadAndTestName.java:49)
   [junit4]   2> 	at org.apache.lucene.util.TestRuleIgnoreAfterMaxFailures$1.evaluate(TestRuleIgnoreAfterMaxFailures.java:65)
   [junit4]   2> 	at org.apache.lucene.util.TestRuleMarkFailure$1.evaluate(TestRuleMarkFailure.java:48)
   [junit4]   2> 	at com.carrotsearch.randomizedtesting.rules.StatementAdapter.evaluate(StatementAdapter.java:36)
   [junit4]   2> 	at com.carrotsearch.randomizedtesting.ThreadLeakControl$StatementRunner.run(ThreadLeakControl.java:367)
   [junit4]   2> 	at com.carrotsearch.randomizedtesting.ThreadLeakControl.forkTimeoutingTask(ThreadLeakControl.java:809)
   [junit4]   2> 	at com.carrotsearch.randomizedtesting.ThreadLeakControl$3.evaluate(ThreadLeakControl.java:460)
   [junit4]   2> 	at com.carrotsearch.randomizedtesting.RandomizedRunner.runSingleTest(RandomizedRunner.java:880)
   [junit4]   2> 	at com.carrotsearch.randomizedtesting.RandomizedRunner$5.evaluate(RandomizedRunner.java:781)
   [junit4]   2> 	at com.carrotsearch.randomizedtesting.RandomizedRunner$6.evaluate(RandomizedRunner.java:816)
   [junit4]   2> 	at com.carrotsearch.randomizedtesting.RandomizedRunner$7.evaluate(RandomizedRunner.java:827)
   [junit4]   2> 	at com.carrotsearch.randomizedtesting.rules.StatementAdapter.evaluate(StatementAdapter.java:36)
   [junit4]   2> 	at com.carrotsearch.randomizedtesting.rules.SystemPropertiesRestoreRule$1.evaluate(SystemPropertiesRestoreRule.java:57)
   [junit4]   2> 	at org.apache.lucene.util.AbstractBeforeAfterRule$1.evaluate(AbstractBeforeAfterRule.java:46)
   [junit4]   2> 	at com.carrotsearch.randomizedtesting.rules.StatementAdapter.evaluate(StatementAdapter.java:36)
   [junit4]   2> 	at org.apache.lucene.util.TestRuleStoreClassName$1.evaluate(TestRuleStoreClassName.java:42)
   [junit4]   2> 	at com.carrotsearch.randomizedtesting.rules.NoShadowingOrOverridesOnMethodsRule$1.evaluate(NoShadowingOrOverridesOnMethodsRule.java:40)
   [junit4]   2> 	at com.carrotsearch.randomizedtesting.rules.NoShadowingOrOverridesOnMethodsRule$1.evaluate(NoShadowingOrOverridesOnMethodsRule.java:40)
   [junit4]   2> 	at com.carrotsearch.randomizedtesting.rules.StatementAdapter.evaluate(StatementAdapter.java:36)
   [junit4]   2> 	at com.carrotsearch.randomizedtesting.rules.StatementAdapter.evaluate(StatementAdapter.java:36)
   [junit4]   2> 	at com.carrotsearch.randomizedtesting.rules.StatementAdapter.evaluate(StatementAdapter.java:36)
   [junit4]   2> 	at org.apache.lucene.util.TestRuleAssertionsRequired$1.evaluate(TestRuleAssertionsRequired.java:54)
   [junit4]   2> 	at org.apache.lucene.util.TestRuleMarkFailure$1.evaluate(TestRuleMarkFailure.java:48)
   [junit4]   2> 	at org.apache.lucene.util.TestRuleIgnoreAfterMaxFailures$1.evaluate(TestRuleIgnoreAfterMaxFailures.java:65)
   [junit4]   2> 	at org.apache.lucene.util.TestRuleIgnoreTestSuites$1.evaluate(TestRuleIgnoreTestSuites.java:55)
   [junit4]   2> 	at com.carrotsearch.randomizedtesting.rules.StatementAdapter.evaluate(StatementAdapter.java:36)
   [junit4]   2> 	at com.carrotsearch.randomizedtesting.ThreadLeakControl$StatementRunner.run(ThreadLeakControl.java:367)
   [junit4]   2> 	at java.lang.Thread.run(Thread.java:745)
   [junit4]   2> 
   [junit4]   2> 1774562 INFO  (TEST-SuggesterWFSTTest.testReload-seed#[7C26059C3B3C7FA2]) [    x:collection1] o.a.s.SolrTestCaseJ4 ###Ending testReload
   [junit4]   2> NOTE: reproduce with: ant test  -Dtestcase=SuggesterWFSTTest -Dtests.method=testReload -Dtests.seed=7C26059C3B3C7FA2 -Dtests.slow=true -Dtests.locale=cs-CZ -Dtests.timezone=Africa/Porto-Novo -Dtests.asserts=true -Dtests.file.encoding=US-ASCII
   [junit4] ERROR   0.51s J1 | SuggesterWFSTTest.testReload <<<
   [junit4]    > Throwable #1: java.lang.RuntimeException: Exception during query
   [junit4]    > 	at

[...truncated too long message...]

nit4]   2> 1774870 INFO  (TEST-SuggesterWFSTTest.testRebuild-seed#[7C26059C3B3C7FA2]) [    x:collection1] o.a.s.SolrTestCaseJ4 ###Ending testRebuild
   [junit4]   2> 1774870 INFO  (SUITE-SuggesterWFSTTest-seed#[7C26059C3B3C7FA2]-worker) [    x:collection1] o.a.s.SolrTestCaseJ4 ###deleteCore
   [junit4]   2> 1774870 INFO  (SUITE-SuggesterWFSTTest-seed#[7C26059C3B3C7FA2]-worker) [    x:collection1] o.a.s.c.CoreContainer Shutting down CoreContainer instance=1095626431
   [junit4]   2> 1774870 INFO  (SUITE-SuggesterWFSTTest-seed#[7C26059C3B3C7FA2]-worker) [    x:collection1] o.a.s.c.SolrCore [collection1]  CLOSING SolrCore org.apache.solr.core.SolrCore@76259109
   [junit4]   2> 1774870 INFO  (SUITE-SuggesterWFSTTest-seed#[7C26059C3B3C7FA2]-worker) [    x:collection1] o.a.s.u.DirectUpdateHandler2 closing DirectUpdateHandler2{commits=3,autocommits=0,soft autocommits=0,optimizes=0,rollbacks=0,expungeDeletes=0,docsPending=0,adds=0,deletesById=0,deletesByQuery=0,errors=0,cumulative_adds=7,cumulative_deletesById=0,cumulative_deletesByQuery=0,cumulative_errors=0}
   [junit4]   2> 1774870 INFO  (SUITE-SuggesterWFSTTest-seed#[7C26059C3B3C7FA2]-worker) [    x:collection1] o.a.s.u.SolrCoreState Closing SolrCoreState
   [junit4]   2> 1774870 INFO  (SUITE-SuggesterWFSTTest-seed#[7C26059C3B3C7FA2]-worker) [    x:collection1] o.a.s.u.DefaultSolrCoreState SolrCoreState ref count has reached 0 - closing IndexWriter
   [junit4]   2> 1774870 INFO  (SUITE-SuggesterWFSTTest-seed#[7C26059C3B3C7FA2]-worker) [    x:collection1] o.a.s.u.DefaultSolrCoreState closing IndexWriter with IndexWriterCloser
   [junit4]   2> 1774871 INFO  (SUITE-SuggesterWFSTTest-seed#[7C26059C3B3C7FA2]-worker) [    x:collection1] o.a.s.c.SolrCore [collection1] Closing main searcher on request.
   [junit4]   2> 1774871 INFO  (SUITE-SuggesterWFSTTest-seed#[7C26059C3B3C7FA2]-worker) [    x:collection1] o.a.s.c.CachingDirectoryFactory Closing MockFSDirectoryFactory - 2 directories currently being tracked
   [junit4]   2> 1774872 INFO  (SUITE-SuggesterWFSTTest-seed#[7C26059C3B3C7FA2]-worker) [    x:collection1] o.a.s.c.CachingDirectoryFactory looking to close /export/home/jenkins/workspace/Lucene-Solr-trunk-Solaris/solr/build/solr-core/test/J1/temp/solr.spelling.suggest.SuggesterWFSTTest_7C26059C3B3C7FA2-001/init-core-data-001 [CachedDir<<refCount=0;path=/export/home/jenkins/workspace/Lucene-Solr-trunk-Solaris/solr/build/solr-core/test/J1/temp/solr.spelling.suggest.SuggesterWFSTTest_7C26059C3B3C7FA2-001/init-core-data-001;done=false>>]
   [junit4]   2> 1774872 INFO  (SUITE-SuggesterWFSTTest-seed#[7C26059C3B3C7FA2]-worker) [    x:collection1] o.a.s.c.CachingDirectoryFactory Closing directory: /export/home/jenkins/workspace/Lucene-Solr-trunk-Solaris/solr/build/solr-core/test/J1/temp/solr.spelling.suggest.SuggesterWFSTTest_7C26059C3B3C7FA2-001/init-core-data-001
   [junit4]   2> 1774872 INFO  (SUITE-SuggesterWFSTTest-seed#[7C26059C3B3C7FA2]-worker) [    x:collection1] o.a.s.c.CachingDirectoryFactory looking to close /export/home/jenkins/workspace/Lucene-Solr-trunk-Solaris/solr/build/solr-core/test/J1/temp/solr.spelling.suggest.SuggesterWFSTTest_7C26059C3B3C7FA2-001/init-core-data-001/index [CachedDir<<refCount=0;path=/export/home/jenkins/workspace/Lucene-Solr-trunk-Solaris/solr/build/solr-core/test/J1/temp/solr.spelling.suggest.SuggesterWFSTTest_7C26059C3B3C7FA2-001/init-core-data-001/index;done=false>>]
   [junit4]   2> 1774872 INFO  (SUITE-SuggesterWFSTTest-seed#[7C26059C3B3C7FA2]-worker) [    x:collection1] o.a.s.c.CachingDirectoryFactory Closing directory: /export/home/jenkins/workspace/Lucene-Solr-trunk-Solaris/solr/build/solr-core/test/J1/temp/solr.spelling.suggest.SuggesterWFSTTest_7C26059C3B3C7FA2-001/init-core-data-001/index
   [junit4]   2> NOTE: leaving temporary files on disk at: /export/home/jenkins/workspace/Lucene-Solr-trunk-Solaris/solr/build/solr-core/test/J1/temp/solr.spelling.suggest.SuggesterWFSTTest_7C26059C3B3C7FA2-001
   [junit4]   2> NOTE: test params are: codec=Asserting(Lucene60): {spell=FST50, range_facet_l_dv=PostingsFormat(name=Asserting), multiDefault=FST50, intDefault=PostingsFormat(name=Direct), id=PostingsFormat(name=Asserting), suggest=FST50, text=Lucene50(blocksize=128), range_facet_i_dv=PostingsFormat(name=Direct), range_facet_l=PostingsFormat(name=Direct), timestamp=PostingsFormat(name=Direct)}, docValues:{range_facet_l_dv=DocValuesFormat(name=Asserting), range_facet_i_dv=DocValuesFormat(name=Direct), timestamp=DocValuesFormat(name=Direct)}, sim=ClassicSimilarity, locale=cs-CZ, timezone=Africa/Porto-Novo
   [junit4]   2> NOTE: SunOS 5.11 amd64/Oracle Corporation 1.8.0_66 (64-bit)/cpus=3,threads=1,free=231915616,total=461438976
   [junit4]   2> NOTE: All tests run in this JVM: [TestSolrIndexConfig, OpenExchangeRatesOrgProviderTest, AsyncCallRequestStatusResponseTest, CloudMLTQParserTest, BadIndexSchemaTest, SpellPossibilityIteratorTest, DateFieldTest, DeleteReplicaTest, SuggesterTSTTest, CollectionsAPIDistributedZkTest, TestClassicSimilarityFactory, TestLeaderElectionZkExpiry, TestRandomFaceting, NoCacheHeaderTest, TestBinaryField, TestDefaultStatsCache, DistanceUnitsTest, DirectSolrConnectionTest, CSVRequestHandlerTest, QueryResultKeyTest, SolrCoreCheckLockOnStartupTest, TestCoreDiscovery, TestWriterPerf, BasicZkTest, SolrPluginUtilsTest, TestComplexPhraseQParserPlugin, ConjunctionSolrSpellCheckerTest, TestScoreJoinQPScore, CoreAdminHandlerTest, SynonymTokenizerTest, BadCopyFieldTest, ParsingFieldUpdateProcessorsTest, TestSmileRequest, CacheHeaderTest, TestPerFieldSimilarity, TestIndexingPerformance, SuggesterTest, StressHdfsTest, TermVectorComponentDistributedTest, ConvertedLegacyTest, TestTrie, TestBlobHandler, TestJettySolrRunner, DistributedQueryComponentOptimizationTest, TestStandardQParsers, VMParamsZkACLAndCredentialsProvidersTest, TestQueryUtils, TestBinaryResponseWriter, TestTestInjection, TestCollectionAPI, TestOmitPositions, TestCrossCoreJoin, TestMacros, TestQuerySenderListener, TestDistributedGrouping, FileBasedSpellCheckerTest, MultiTermTest, TestNonDefinedSimilarityFactory, TestSchemaManager, SuggestComponentContextFilterQueryTest, TestPHPSerializedResponseWriter, TestSolrCoreProperties, SmileWriterTest, DistributedFacetPivotLargeTest, ChaosMonkeySafeLeaderTest, DistributedMLTComponentTest, MergeStrategyTest, HdfsBasicDistributedZkTest, ResourceLoaderTest, FacetPivotSmallTest, TestMiniSolrCloudCluster, TestFieldSortValues, PKIAuthenticationIntegrationTest, DistribJoinFromCollectionTest, TestBlendedInfixSuggestions, HLLSerializationTest, TestUseDocValuesAsStored2, DebugComponentTest, TestSearcherReuse, FieldAnalysisRequestHandlerTest, SpellCheckCollatorTest, DistributedDebugComponentTest, JavabinLoaderTest, TestRequestStatusCollectionAPI, SortByFunctionTest, DistributedTermsComponentTest, TestSolrCloudWithKerberosAlt, SecurityConfHandlerTest, IndexSchemaRuntimeFieldTest, DataDrivenBlockJoinTest, TestFieldCollectionResource, CoreMergeIndexesAdminHandlerTest, TestInitParams, TestReload, TestRecovery, DefaultValueUpdateProcessorTest, TestCollationFieldDocValues, HdfsNNFailoverTest, TestExactSharedStatsCache, TestBulkSchemaConcurrent, TestFastOutputStream, WordBreakSolrSpellCheckerTest, SharedFSAutoReplicaFailoverTest, CdcrReplicationHandlerTest, LoggingHandlerTest, TestDistributedStatsComponentCardinality, TestRandomRequestDistribution, SearchHandlerTest, TestZkChroot, TestSolrQueryParserResource, DirectUpdateHandlerOptimizeTest, CoreAdminCreateDiscoverTest, TermVectorComponentTest, TestReversedWildcardFilterFactory, LeaderElectionIntegrationTest, CachingDirectoryFactoryTest, SignatureUpdateProcessorFactoryTest, OutputWriterTest, TestSolrQueryParser, FieldMutatingUpdateProcessorTest, TestFieldTypeCollectionResource, TestFoldingMultitermQuery, AtomicUpdatesTest, LeaderInitiatedRecoveryOnCommitTest, MinimalSchemaTest, TestRealTimeGet, DocExpirationUpdateProcessorFactoryTest, ExplicitHLLTest, TestCollationField, TestRTimerTree, MigrateRouteKeyTest, TestFiltering, TestDynamicFieldCollectionResource, OverseerCollectionConfigSetProcessorTest, CurrencyFieldOpenExchangeTest, FullSolrCloudDistribCmdsTest, CollectionReloadTest, TestManagedResourceStorage, EchoParamsTest, AnalysisErrorHandlingTest, BasicDistributedZkTest, BasicDistributedZk2Test, OpenCloseCoreStressTest, OverseerTest, ShardRoutingTest, ZkSolrClientTest, TestRandomDVFaceting, ZkCLITest, ShardRoutingCustomTest, TestDistributedSearch, ShowFileRequestHandlerTest, SolrIndexSplitterTest, SimplePostToolTest, AnalysisAfterCoreReloadTest, TestExtendedDismaxParser, SuggesterFSTTest, SuggesterWFSTTest]
   [junit4] Completed [331/577 (1!)] on J1 in 0.95s, 4 tests, 1 error <<< FAILURES!

[...truncated 787 lines...]
BUILD FAILED
/export/home/jenkins/workspace/Lucene-Solr-trunk-Solaris/build.xml:740: The following error occurred while executing this line:
/export/home/jenkins/workspace/Lucene-Solr-trunk-Solaris/build.xml:684: The following error occurred while executing this line:
/export/home/jenkins/workspace/Lucene-Solr-trunk-Solaris/build.xml:59: The following error occurred while executing this line:
/export/home/jenkins/workspace/Lucene-Solr-trunk-Solaris/solr/build.xml:233: The following error occurred while executing this line:
/export/home/jenkins/workspace/Lucene-Solr-trunk-Solaris/solr/common-build.xml:524: The following error occurred while executing this line:
/export/home/jenkins/workspace/Lucene-Solr-trunk-Solaris/lucene/common-build.xml:1424: The following error occurred while executing this line:
/export/home/jenkins/workspace/Lucene-Solr-trunk-Solaris/lucene/common-build.xml:981: There were test failures: 577 suites (8 ignored), 2316 tests, 1 error, 85 ignored (70 assumptions) [seed: 7C26059C3B3C7FA2]

Total time: 66 minutes 44 seconds
Build step 'Invoke Ant' marked build as failure
Archiving artifacts
[WARNINGS] Skipping publisher since build result is FAILURE
Recording test results
Email was triggered for: Failure - Any
Sending email for trigger: Failure - Any



Mime
View raw message