lucene-dev mailing list archives

Site index · List index
Message view « Date » · « Thread »
Top « Date » · « Thread »
From Policeman Jenkins Server <jenk...@thetaphi.de>
Subject [JENKINS] Lucene-Solr-5.x-Solaris (multiarch/jdk1.7.0) - Build # 340 - Failure!
Date Mon, 18 Jan 2016 16:24:47 GMT
Build: http://jenkins.thetaphi.de/job/Lucene-Solr-5.x-Solaris/340/
Java: multiarch/jdk1.7.0 -d32 -client -XX:+UseParallelGC

1 tests failed.
FAILED:  org.apache.lucene.search.grouping.GroupingSearchTest.testBasic

Error Message:


Stack Trace:
java.lang.AssertionError
	at __randomizedtesting.SeedInfo.seed([C28D37C4F2A6FEAB:69772AD12D7A7885]:0)
	at org.junit.Assert.fail(Assert.java:92)
	at org.junit.Assert.assertTrue(Assert.java:43)
	at org.junit.Assert.assertTrue(Assert.java:54)
	at org.apache.lucene.search.grouping.GroupingSearchTest.testBasic(GroupingSearchTest.java:148)
	at sun.reflect.NativeMethodAccessorImpl.invoke0(Native Method)
	at sun.reflect.NativeMethodAccessorImpl.invoke(NativeMethodAccessorImpl.java:57)
	at sun.reflect.DelegatingMethodAccessorImpl.invoke(DelegatingMethodAccessorImpl.java:43)
	at java.lang.reflect.Method.invoke(Method.java:606)
	at com.carrotsearch.randomizedtesting.RandomizedRunner.invoke(RandomizedRunner.java:1764)
	at com.carrotsearch.randomizedtesting.RandomizedRunner$8.evaluate(RandomizedRunner.java:871)
	at com.carrotsearch.randomizedtesting.RandomizedRunner$9.evaluate(RandomizedRunner.java:907)
	at com.carrotsearch.randomizedtesting.RandomizedRunner$10.evaluate(RandomizedRunner.java:921)
	at org.apache.lucene.util.TestRuleSetupTeardownChained$1.evaluate(TestRuleSetupTeardownChained.java:50)
	at org.apache.lucene.util.AbstractBeforeAfterRule$1.evaluate(AbstractBeforeAfterRule.java:46)
	at org.apache.lucene.util.TestRuleThreadAndTestName$1.evaluate(TestRuleThreadAndTestName.java:49)
	at org.apache.lucene.util.TestRuleIgnoreAfterMaxFailures$1.evaluate(TestRuleIgnoreAfterMaxFailures.java:65)
	at org.apache.lucene.util.TestRuleMarkFailure$1.evaluate(TestRuleMarkFailure.java:48)
	at com.carrotsearch.randomizedtesting.rules.StatementAdapter.evaluate(StatementAdapter.java:36)
	at com.carrotsearch.randomizedtesting.ThreadLeakControl$StatementRunner.run(ThreadLeakControl.java:367)
	at com.carrotsearch.randomizedtesting.ThreadLeakControl.forkTimeoutingTask(ThreadLeakControl.java:809)
	at com.carrotsearch.randomizedtesting.ThreadLeakControl$3.evaluate(ThreadLeakControl.java:460)
	at com.carrotsearch.randomizedtesting.RandomizedRunner.runSingleTest(RandomizedRunner.java:880)
	at com.carrotsearch.randomizedtesting.RandomizedRunner$5.evaluate(RandomizedRunner.java:781)
	at com.carrotsearch.randomizedtesting.RandomizedRunner$6.evaluate(RandomizedRunner.java:816)
	at com.carrotsearch.randomizedtesting.RandomizedRunner$7.evaluate(RandomizedRunner.java:827)
	at org.apache.lucene.util.AbstractBeforeAfterRule$1.evaluate(AbstractBeforeAfterRule.java:46)
	at com.carrotsearch.randomizedtesting.rules.StatementAdapter.evaluate(StatementAdapter.java:36)
	at org.apache.lucene.util.TestRuleStoreClassName$1.evaluate(TestRuleStoreClassName.java:42)
	at com.carrotsearch.randomizedtesting.rules.NoShadowingOrOverridesOnMethodsRule$1.evaluate(NoShadowingOrOverridesOnMethodsRule.java:40)
	at com.carrotsearch.randomizedtesting.rules.NoShadowingOrOverridesOnMethodsRule$1.evaluate(NoShadowingOrOverridesOnMethodsRule.java:40)
	at com.carrotsearch.randomizedtesting.rules.StatementAdapter.evaluate(StatementAdapter.java:36)
	at com.carrotsearch.randomizedtesting.rules.StatementAdapter.evaluate(StatementAdapter.java:36)
	at com.carrotsearch.randomizedtesting.rules.StatementAdapter.evaluate(StatementAdapter.java:36)
	at org.apache.lucene.util.TestRuleAssertionsRequired$1.evaluate(TestRuleAssertionsRequired.java:54)
	at org.apache.lucene.util.TestRuleMarkFailure$1.evaluate(TestRuleMarkFailure.java:48)
	at org.apache.lucene.util.TestRuleIgnoreAfterMaxFailures$1.evaluate(TestRuleIgnoreAfterMaxFailures.java:65)
	at org.apache.lucene.util.TestRuleIgnoreTestSuites$1.evaluate(TestRuleIgnoreTestSuites.java:55)
	at com.carrotsearch.randomizedtesting.rules.StatementAdapter.evaluate(StatementAdapter.java:36)
	at com.carrotsearch.randomizedtesting.ThreadLeakControl$StatementRunner.run(ThreadLeakControl.java:367)
	at java.lang.Thread.run(Thread.java:745)




Build Log:
[...truncated 6721 lines...]
   [junit4] Suite: org.apache.lucene.search.grouping.GroupingSearchTest
   [junit4]   2> NOTE: reproduce with: ant test  -Dtestcase=GroupingSearchTest -Dtests.method=testBasic
-Dtests.seed=C28D37C4F2A6FEAB -Dtests.slow=true -Dtests.locale=ja-JP-u-ca-japanese-x-lvariant-JP
-Dtests.timezone=GMT -Dtests.asserts=true -Dtests.file.encoding=ISO-8859-1
   [junit4] FAILURE 0.05s J0 | GroupingSearchTest.testBasic <<<
   [junit4]    > Throwable #1: java.lang.AssertionError
   [junit4]    > 	at __randomizedtesting.SeedInfo.seed([C28D37C4F2A6FEAB:69772AD12D7A7885]:0)
   [junit4]    > 	at org.apache.lucene.search.grouping.GroupingSearchTest.testBasic(GroupingSearchTest.java:148)
   [junit4]    > 	at java.lang.Thread.run(Thread.java:745)
   [junit4]   2> NOTE: test params are: codec=Asserting(Lucene54): {author=BlockTreeOrds(blocksize=128),
groupend=Lucene50(blocksize=128), content=PostingsFormat(name=Memory doPackFST= true), group=BlockTreeOrds(blocksize=128)},
docValues:{author=DocValuesFormat(name=Asserting), group=DocValuesFormat(name=Asserting)},
sim=RandomSimilarity(queryNorm=false,coord=yes): {author=DFR I(n)B1, content=DFI, group=IB
LL-D3(800.0)}, locale=ja-JP-u-ca-japanese-x-lvariant-JP, timezone=GMT
   [junit4]   2> NOTE: SunOS 5.11 x86/Oracle Corporation 1.7.0_91 (32-bit)/cpus=3,threads=1,free=71958032,total=193986560
   [junit4]   2> NOTE: All tests run in this JVM: [DistinctValuesCollectorTest, TestGrouping,
GroupingSearchTest]
   [junit4] Completed [5/6 (1!)] on J0 in 0.08s, 2 tests, 1 failure <<< FAILURES!

[...truncated 13 lines...]
BUILD FAILED
/export/home/jenkins/workspace/Lucene-Solr-5.x-Solaris/build.xml:794: The following error
occurred while executing this line:
/export/home/jenkins/workspace/Lucene-Solr-5.x-Solaris/build.xml:738: The following error
occurred while executing this line:
/export/home/jenkins/workspace/Lucene-Solr-5.x-Solaris/build.xml:59: The following error occurred
while executing this line:
/export/home/jenkins/workspace/Lucene-Solr-5.x-Solaris/lucene/build.xml:472: The following
error occurred while executing this line:
/export/home/jenkins/workspace/Lucene-Solr-5.x-Solaris/lucene/common-build.xml:2240: The following
error occurred while executing this line:
/export/home/jenkins/workspace/Lucene-Solr-5.x-Solaris/lucene/module-build.xml:58: The following
error occurred while executing this line:
/export/home/jenkins/workspace/Lucene-Solr-5.x-Solaris/lucene/common-build.xml:1444: The following
error occurred while executing this line:
/export/home/jenkins/workspace/Lucene-Solr-5.x-Solaris/lucene/common-build.xml:1000: There
were test failures: 6 suites, 12 tests, 1 failure [seed: C28D37C4F2A6FEAB]

Total time: 18 minutes 53 seconds
Build step 'Invoke Ant' marked build as failure
Archiving artifacts
[WARNINGS] Skipping publisher since build result is FAILURE
Recording test results
Email was triggered for: Failure - Any
Sending email for trigger: Failure - Any



Mime
View raw message