lucene-dev mailing list archives

Site index · List index
Message view « Date » · « Thread »
Top « Date » · « Thread »
From Policeman Jenkins Server <jenk...@thetaphi.de>
Subject [JENKINS] Lucene-Solr-5.x-MacOSX (64bit/jdk1.8.0) - Build # 2987 - Failure!
Date Wed, 27 Jan 2016 14:36:17 GMT
Build: http://jenkins.thetaphi.de/job/Lucene-Solr-5.x-MacOSX/2987/
Java: 64bit/jdk1.8.0 -XX:-UseCompressedOops -XX:+UseConcMarkSweepGC

1 tests failed.
FAILED:  org.apache.solr.handler.TestReplicationHandler.doTestIndexAndConfigAliasReplication

Error Message:
[/Users/jenkins/workspace/Lucene-Solr-5.x-MacOSX/solr/build/solr-core/test/J1/temp/solr.handler.TestReplicationHandler_C652CF3E55D7FBCD-001/solr-instance-005/./collection1/data/index.20160127201541261, /Users/jenkins/workspace/Lucene-Solr-5.x-MacOSX/solr/build/solr-core/test/J1/temp/solr.handler.TestReplicationHandler_C652CF3E55D7FBCD-001/solr-instance-005/./collection1/data, /Users/jenkins/workspace/Lucene-Solr-5.x-MacOSX/solr/build/solr-core/test/J1/temp/solr.handler.TestReplicationHandler_C652CF3E55D7FBCD-001/solr-instance-005/./collection1/data/index.20160127201541483] expected:<2> but was:<3>

Stack Trace:
java.lang.AssertionError: [/Users/jenkins/workspace/Lucene-Solr-5.x-MacOSX/solr/build/solr-core/test/J1/temp/solr.handler.TestReplicationHandler_C652CF3E55D7FBCD-001/solr-instance-005/./collection1/data/index.20160127201541261, /Users/jenkins/workspace/Lucene-Solr-5.x-MacOSX/solr/build/solr-core/test/J1/temp/solr.handler.TestReplicationHandler_C652CF3E55D7FBCD-001/solr-instance-005/./collection1/data, /Users/jenkins/workspace/Lucene-Solr-5.x-MacOSX/solr/build/solr-core/test/J1/temp/solr.handler.TestReplicationHandler_C652CF3E55D7FBCD-001/solr-instance-005/./collection1/data/index.20160127201541483] expected:<2> but was:<3>
	at __randomizedtesting.SeedInfo.seed([C652CF3E55D7FBCD:31212166933F542B]:0)
	at org.junit.Assert.fail(Assert.java:93)
	at org.junit.Assert.failNotEquals(Assert.java:647)
	at org.junit.Assert.assertEquals(Assert.java:128)
	at org.junit.Assert.assertEquals(Assert.java:472)
	at org.apache.solr.handler.TestReplicationHandler.checkForSingleIndex(TestReplicationHandler.java:815)
	at org.apache.solr.handler.TestReplicationHandler.doTestIndexAndConfigAliasReplication(TestReplicationHandler.java:1245)
	at sun.reflect.NativeMethodAccessorImpl.invoke0(Native Method)
	at sun.reflect.NativeMethodAccessorImpl.invoke(NativeMethodAccessorImpl.java:62)
	at sun.reflect.DelegatingMethodAccessorImpl.invoke(DelegatingMethodAccessorImpl.java:43)
	at java.lang.reflect.Method.invoke(Method.java:497)
	at com.carrotsearch.randomizedtesting.RandomizedRunner.invoke(RandomizedRunner.java:1764)
	at com.carrotsearch.randomizedtesting.RandomizedRunner$8.evaluate(RandomizedRunner.java:871)
	at com.carrotsearch.randomizedtesting.RandomizedRunner$9.evaluate(RandomizedRunner.java:907)
	at com.carrotsearch.randomizedtesting.RandomizedRunner$10.evaluate(RandomizedRunner.java:921)
	at com.carrotsearch.randomizedtesting.rules.SystemPropertiesRestoreRule$1.evaluate(SystemPropertiesRestoreRule.java:57)
	at org.apache.lucene.util.TestRuleSetupTeardownChained$1.evaluate(TestRuleSetupTeardownChained.java:50)
	at org.apache.lucene.util.AbstractBeforeAfterRule$1.evaluate(AbstractBeforeAfterRule.java:46)
	at org.apache.lucene.util.TestRuleThreadAndTestName$1.evaluate(TestRuleThreadAndTestName.java:49)
	at org.apache.lucene.util.TestRuleIgnoreAfterMaxFailures$1.evaluate(TestRuleIgnoreAfterMaxFailures.java:65)
	at org.apache.lucene.util.TestRuleMarkFailure$1.evaluate(TestRuleMarkFailure.java:48)
	at com.carrotsearch.randomizedtesting.rules.StatementAdapter.evaluate(StatementAdapter.java:36)
	at com.carrotsearch.randomizedtesting.ThreadLeakControl$StatementRunner.run(ThreadLeakControl.java:367)
	at com.carrotsearch.randomizedtesting.ThreadLeakControl.forkTimeoutingTask(ThreadLeakControl.java:809)
	at com.carrotsearch.randomizedtesting.ThreadLeakControl$3.evaluate(ThreadLeakControl.java:460)
	at com.carrotsearch.randomizedtesting.RandomizedRunner.runSingleTest(RandomizedRunner.java:880)
	at com.carrotsearch.randomizedtesting.RandomizedRunner$5.evaluate(RandomizedRunner.java:781)
	at com.carrotsearch.randomizedtesting.RandomizedRunner$6.evaluate(RandomizedRunner.java:816)
	at com.carrotsearch.randomizedtesting.RandomizedRunner$7.evaluate(RandomizedRunner.java:827)
	at com.carrotsearch.randomizedtesting.rules.StatementAdapter.evaluate(StatementAdapter.java:36)
	at com.carrotsearch.randomizedtesting.rules.SystemPropertiesRestoreRule$1.evaluate(SystemPropertiesRestoreRule.java:57)
	at org.apache.lucene.util.AbstractBeforeAfterRule$1.evaluate(AbstractBeforeAfterRule.java:46)
	at com.carrotsearch.randomizedtesting.rules.StatementAdapter.evaluate(StatementAdapter.java:36)
	at org.apache.lucene.util.TestRuleStoreClassName$1.evaluate(TestRuleStoreClassName.java:42)
	at com.carrotsearch.randomizedtesting.rules.NoShadowingOrOverridesOnMethodsRule$1.evaluate(NoShadowingOrOverridesOnMethodsRule.java:40)
	at com.carrotsearch.randomizedtesting.rules.NoShadowingOrOverridesOnMethodsRule$1.evaluate(NoShadowingOrOverridesOnMethodsRule.java:40)
	at com.carrotsearch.randomizedtesting.rules.StatementAdapter.evaluate(StatementAdapter.java:36)
	at com.carrotsearch.randomizedtesting.rules.StatementAdapter.evaluate(StatementAdapter.java:36)
	at com.carrotsearch.randomizedtesting.rules.StatementAdapter.evaluate(StatementAdapter.java:36)
	at org.apache.lucene.util.TestRuleAssertionsRequired$1.evaluate(TestRuleAssertionsRequired.java:54)
	at org.apache.lucene.util.TestRuleMarkFailure$1.evaluate(TestRuleMarkFailure.java:48)
	at org.apache.lucene.util.TestRuleIgnoreAfterMaxFailures$1.evaluate(TestRuleIgnoreAfterMaxFailures.java:65)
	at org.apache.lucene.util.TestRuleIgnoreTestSuites$1.evaluate(TestRuleIgnoreTestSuites.java:55)
	at com.carrotsearch.randomizedtesting.rules.StatementAdapter.evaluate(StatementAdapter.java:36)
	at com.carrotsearch.randomizedtesting.ThreadLeakControl$StatementRunner.run(ThreadLeakControl.java:367)
	at java.lang.Thread.run(Thread.java:745)




Build Log:
[...truncated 11340 lines...]
   [junit4] Suite: org.apache.solr.handler.TestReplicationHandler
   [junit4]   2> Creating dataDir: /Users/jenkins/workspace/Lucene-Solr-5.x-MacOSX/solr/build/solr-core/test/J1/temp/solr.handler.TestReplicationHandler_C652CF3E55D7FBCD-001/init-core-data-001
   [junit4]   2> 1803091 INFO  (TEST-TestReplicationHandler.doTestDetails-seed#[C652CF3E55D7FBCD]) [    ] o.a.s.SolrTestCaseJ4 ###Starting doTestDetails
   [junit4]   2> 1803092 INFO  (TEST-TestReplicationHandler.doTestDetails-seed#[C652CF3E55D7FBCD]) [    ] o.a.s.SolrTestCaseJ4 Writing core.properties file to /Users/jenkins/workspace/Lucene-Solr-5.x-MacOSX/solr/build/solr-core/test/J1/temp/solr.handler.TestReplicationHandler_C652CF3E55D7FBCD-001/solr-instance-001/collection1
   [junit4]   2> 1803108 INFO  (TEST-TestReplicationHandler.doTestDetails-seed#[C652CF3E55D7FBCD]) [    ] o.e.j.s.Server jetty-9.2.13.v20150730
   [junit4]   2> 1803111 INFO  (TEST-TestReplicationHandler.doTestDetails-seed#[C652CF3E55D7FBCD]) [    ] o.e.j.s.h.ContextHandler Started o.e.j.s.ServletContextHandler@34fa7e5c{/solr,null,AVAILABLE}
   [junit4]   2> 1803112 INFO  (TEST-TestReplicationHandler.doTestDetails-seed#[C652CF3E55D7FBCD]) [    ] o.e.j.s.ServerConnector Started ServerConnector@741e68c7{HTTP/1.1}{127.0.0.1:61791}
   [junit4]   2> 1803112 INFO  (TEST-TestReplicationHandler.doTestDetails-seed#[C652CF3E55D7FBCD]) [    ] o.e.j.s.Server Started @1808275ms
   [junit4]   2> 1803112 INFO  (TEST-TestReplicationHandler.doTestDetails-seed#[C652CF3E55D7FBCD]) [    ] o.a.s.c.s.e.JettySolrRunner Jetty properties: {solr.data.dir=/Users/jenkins/workspace/Lucene-Solr-5.x-MacOSX/solr/build/solr-core/test/J1/temp/solr.handler.TestReplicationHandler_C652CF3E55D7FBCD-001/solr-instance-001/collection1/data, hostContext=/solr, hostPort=61791}
   [junit4]   2> 1803113 INFO  (TEST-TestReplicationHandler.doTestDetails-seed#[C652CF3E55D7FBCD]) [    ] o.a.s.s.SolrDispatchFilter SolrDispatchFilter.init(): sun.misc.Launcher$AppClassLoader@74a14482
   [junit4]   2> 1803113 INFO  (TEST-TestReplicationHandler.doTestDetails-seed#[C652CF3E55D7FBCD]) [    ] o.a.s.c.SolrResourceLoader new SolrResourceLoader for directory: '/Users/jenkins/workspace/Lucene-Solr-5.x-MacOSX/solr/build/solr-core/test/J1/temp/solr.handler.TestReplicationHandler_C652CF3E55D7FBCD-001/solr-instance-001'
   [junit4]   2> 1803113 INFO  (TEST-TestReplicationHandler.doTestDetails-seed#[C652CF3E55D7FBCD]) [    ] o.a.s.c.SolrResourceLoader JNDI not configured for solr (NoInitialContextEx)
   [junit4]   2> 1803113 INFO  (TEST-TestReplicationHandler.doTestDetails-seed#[C652CF3E55D7FBCD]) [    ] o.a.s.c.SolrResourceLoader solr home defaulted to 'solr/' (could not find system property or JNDI)
   [junit4]   2> 1803117 INFO  (TEST-TestReplicationHandler.doTestDetails-seed#[C652CF3E55D7FBCD]) [    ] o.a.s.c.SolrXmlConfig Loading container configuration from /Users/jenkins/workspace/Lucene-Solr-5.x-MacOSX/solr/build/solr-core/test/J1/temp/solr.handler.TestReplicationHandler_C652CF3E55D7FBCD-001/solr-instance-001/solr.xml
   [junit4]   2> 1803135 INFO  (TEST-TestReplicationHandler.doTestDetails-seed#[C652CF3E55D7FBCD]) [    ] o.a.s.c.CorePropertiesLocator Config-defined core root directory: /Users/jenkins/workspace/Lucene-Solr-5.x-MacOSX/solr/build/solr-core/test/J1/temp/solr.handler.TestReplicationHandler_C652CF3E55D7FBCD-001/solr-instance-001/.
   [junit4]   2> 1803135 INFO  (TEST-TestReplicationHandler.doTestDetails-seed#[C652CF3E55D7FBCD]) [    ] o.a.s.c.CoreContainer New CoreContainer 1621213271
   [junit4]   2> 1803135 INFO  (TEST-TestReplicationHandler.doTestDetails-seed#[C652CF3E55D7FBCD]) [    ] o.a.s.c.CoreContainer Loading cores into CoreContainer [instanceDir=/Users/jenkins/workspace/Lucene-Solr-5.x-MacOSX/solr/build/solr-core/test/J1/temp/solr.handler.TestReplicationHandler_C652CF3E55D7FBCD-001/solr-instance-001]
   [junit4]   2> 1803135 WARN  (TEST-TestReplicationHandler.doTestDetails-seed#[C652CF3E55D7FBCD]) [    ] o.a.s.c.CoreContainer Couldn't add files from /Users/jenkins/workspace/Lucene-Solr-5.x-MacOSX/solr/build/solr-core/test/J1/temp/solr.handler.TestReplicationHandler_C652CF3E55D7FBCD-001/solr-instance-001/lib to classpath: /Users/jenkins/workspace/Lucene-Solr-5.x-MacOSX/solr/build/solr-core/test/J1/temp/solr.handler.TestReplicationHandler_C652CF3E55D7FBCD-001/solr-instance-001/lib
   [junit4]   2> 1803136 INFO  (TEST-TestReplicationHandler.doTestDetails-seed#[C652CF3E55D7FBCD]) [    ] o.a.s.h.c.HttpShardHandlerFactory created with socketTimeout : 90000,urlScheme : ,connTimeout : 15000,maxConnectionsPerHost : 20,maxConnections : 10000,corePoolSize : 0,maximumPoolSize : 2147483647,maxThreadIdleTime : 5,sizeOfQueue : -1,fairnessPolicy : false,useRetries : false,
   [junit4]   2> 1803140 INFO  (TEST-TestReplicationHandler.doTestDetails-seed#[C652CF3E55D7FBCD]) [    ] o.a.s.u.UpdateShardHandler Creating UpdateShardHandler HTTP client with params: socketTimeout=340000&connTimeout=45000&retry=true
   [junit4]   2> 1803140 INFO  (TEST-TestReplicationHandler.doTestDetails-seed#[C652CF3E55D7FBCD]) [    ] o.a.s.l.LogWatcher SLF4J impl is org.slf4j.impl.Log4jLoggerFactory
   [junit4]   2> 1803141 INFO  (TEST-TestReplicationHandler.doTestDetails-seed#[C652CF3E55D7FBCD]) [    ] o.a.s.l.LogWatcher Registering Log Listener [Log4j (org.slf4j.impl.Log4jLoggerFactory)]
   [junit4]   2> 1803141 INFO  (TEST-TestReplicationHandler.doTestDetails-seed#[C652CF3E55D7FBCD]) [    ] o.a.s.c.CoreContainer Security conf doesn't exist. Skipping setup for authorization module.
   [junit4]   2> 1803141 INFO  (TEST-TestReplicationHandler.doTestDetails-seed#[C652CF3E55D7FBCD]) [    ] o.a.s.c.CoreContainer No authentication plugin used.
   [junit4]   2> 1803142 INFO  (TEST-TestReplicationHandler.doTestDetails-seed#[C652CF3E55D7FBCD]) [    ] o.a.s.c.CorePropertiesLocator Looking for core definitions underneath /Users/jenkins/workspace/Lucene-Solr-5.x-MacOSX/solr/build/solr-core/test/J1/temp/solr.handler.TestReplicationHandler_C652CF3E55D7FBCD-001/solr-instance-001/.
   [junit4]   2> 1803144 INFO  (TEST-TestReplicationHandler.doTestDetails-seed#[C652CF3E55D7FBCD]) [    ] o.a.s.c.CoreDescriptor Created CoreDescriptor: {name=collection1, config=solrconfig.xml, loadOnStartup=true, schema=schema.xml, configSetProperties=configsetprops.json, transient=false, dataDir=data/}
   [junit4]   2> 1803144 INFO  (TEST-TestReplicationHandler.doTestDetails-seed#[C652CF3E55D7FBCD]) [    ] o.a.s.c.CorePropertiesLocator Found core collection1 in /Users/jenkins/workspace/Lucene-Solr-5.x-MacOSX/solr/build/solr-core/test/J1/temp/solr.handler.TestReplicationHandler_C652CF3E55D7FBCD-001/solr-instance-001/./collection1
   [junit4]   2> 1803145 INFO  (TEST-TestReplicationHandler.doTestDetails-seed#[C652CF3E55D7FBCD]) [    ] o.a.s.c.CorePropertiesLocator Found 1 core definitions
   [junit4]   2> 1803145 INFO  (coreLoadExecutor-5535-thread-1) [    ] o.a.s.c.SolrResourceLoader new SolrResourceLoader for directory: '/Users/jenkins/workspace/Lucene-Solr-5.x-MacOSX/solr/build/solr-core/test/J1/temp/solr.handler.TestReplicationHandler_C652CF3E55D7FBCD-001/solr-instance-001/collection1'
   [junit4]   2> 1803146 INFO  (coreLoadExecutor-5535-thread-1) [    ] o.a.s.c.SolrResourceLoader JNDI not configured for solr (NoInitialContextEx)
   [junit4]   2> 1803147 INFO  (coreLoadExecutor-5535-thread-1) [    ] o.a.s.c.SolrResourceLoader solr home defaulted to 'solr/' (could not find system property or JNDI)
   [junit4]   2> 1803150 INFO  (TEST-TestReplicationHandler.doTestDetails-seed#[C652CF3E55D7FBCD]) [    ] o.a.s.s.SolrDispatchFilter user.dir=/Users/jenkins/workspace/Lucene-Solr-5.x-MacOSX/solr/build/solr-core/test/J1
   [junit4]   2> 1803150 INFO  (TEST-TestReplicationHandler.doTestDetails-seed#[C652CF3E55D7FBCD]) [    ] o.a.s.s.SolrDispatchFilter SolrDispatchFilter.init() done
   [junit4]   2> 1803161 INFO  (coreLoadExecutor-5535-thread-1) [    ] o.a.s.c.SolrConfig current version of requestparams : -1
   [junit4]   2> 1803165 INFO  (coreLoadExecutor-5535-thread-1) [    ] o.a.s.c.SolrConfig Using Lucene MatchVersion: 5.5.0
   [junit4]   2> 1803180 INFO  (coreLoadExecutor-5535-thread-1) [    ] o.a.s.c.SolrConfig Loaded SolrConfig: solrconfig.xml
   [junit4]   2> 1803184 INFO  (coreLoadExecutor-5535-thread-1) [    ] o.a.s.s.IndexSchema [collection1] Schema name=test
   [junit4]   2> 1803198 INFO  (coreLoadExecutor-5535-thread-1) [    ] o.a.s.s.IndexSchema unique key field: id
   [junit4]   2> 1803204 INFO  (coreLoadExecutor-5535-thread-1) [    ] o.a.s.c.ConfigSetProperties Did not find ConfigSet properties, assuming default properties: Can't find resource 'configsetprops.json' in classpath or '/Users/jenkins/workspace/Lucene-Solr-5.x-MacOSX/solr/build/solr-core/test/J1/temp/solr.handler.TestReplicationHandler_C652CF3E55D7FBCD-001/solr-instance-001/collection1'
   [junit4]   2> 1803204 INFO  (coreLoadExecutor-5535-thread-1) [    ] o.a.s.c.CoreContainer Creating SolrCore 'collection1' using configuration from instancedir /Users/jenkins/workspace/Lucene-Solr-5.x-MacOSX/solr/build/solr-core/test/J1/temp/solr.handler.TestReplicationHandler_C652CF3E55D7FBCD-001/solr-instance-001/./collection1
   [junit4]   2> 1803204 INFO  (coreLoadExecutor-5535-thread-1) [    x:collection1] o.a.s.c.SolrCore org.apache.solr.core.MockDirectoryFactory
   [junit4]   2> 1803204 INFO  (coreLoadExecutor-5535-thread-1) [    x:collection1] o.a.s.c.SolrCore [[collection1] ] Opening new SolrCore at [/Users/jenkins/workspace/Lucene-Solr-5.x-MacOSX/solr/build/solr-core/test/J1/temp/solr.handler.TestReplicationHandler_C652CF3E55D7FBCD-001/solr-instance-001/collection1], dataDir=[/Users/jenkins/workspace/Lucene-Solr-5.x-MacOSX/solr/build/solr-core/test/J1/temp/solr.handler.TestReplicationHandler_C652CF3E55D7FBCD-001/solr-instance-001/./collection1/data/]
   [junit4]   2> 1803204 INFO  (coreLoadExecutor-5535-thread-1) [    x:collection1] o.a.s.c.SolrCore JMX monitoring not detected for core: collection1
   [junit4]   2> 1803205 INFO  (coreLoadExecutor-5535-thread-1) [    x:collection1] o.a.s.c.CachingDirectoryFactory return new directory for /Users/jenkins/workspace/Lucene-Solr-5.x-MacOSX/solr/build/solr-core/test/J1/temp/solr.handler.TestReplicationHandler_C652CF3E55D7FBCD-001/solr-instance-001/./collection1/data
   [junit4]   2> 1803205 INFO  (coreLoadExecutor-5535-thread-1) [    x:collection1] o.a.s.c.SolrCore New index directory detected: old=null new=/Users/jenkins/workspace/Lucene-Solr-5.x-MacOSX/solr/build/solr-core/test/J1/temp/solr.handler.TestReplicationHandler_C652CF3E55D7FBCD-001/solr-instance-001/./collection1/data/index/
   [junit4]   2> 1803205 WARN  (coreLoadExecutor-5535-thread-1) [    x:collection1] o.a.s.c.SolrCore [collection1] Solr index directory '/Users/jenkins/workspace/Lucene-Solr-5.x-MacOSX/solr/build/solr-core/test/J1/temp/solr.handler.TestReplicationHandler_C652CF3E55D7FBCD-001/solr-instance-001/./collection1/data/index' doesn't exist. Creating new index...
   [junit4]   2> 1803205 INFO  (coreLoadExecutor-5535-thread-1) [    x:collection1] o.a.s.c.CachingDirectoryFactory return new directory for /Users/jenkins/workspace/Lucene-Solr-5.x-MacOSX/solr/build/solr-core/test/J1/temp/solr.handler.TestReplicationHandler_C652CF3E55D7FBCD-001/solr-instance-001/./collection1/data/index
   [junit4]   2> 1803206 INFO  (coreLoadExecutor-5535-thread-1) [    x:collection1] o.a.s.u.RandomMergePolicy RandomMergePolicy wrapping class org.apache.lucene.index.TieredMergePolicy: [TieredMergePolicy: maxMergeAtOnce=21, maxMergeAtOnceExplicit=47, maxMergedSegmentMB=59.6533203125, floorSegmentMB=1.572265625, forceMergeDeletesPctAllowed=6.902875907152948, segmentsPerTier=25.0, maxCFSSegmentSizeMB=8.796093022207999E12, noCFSRatio=0.12960865392903137
   [junit4]   2> 1803206 INFO  (coreLoadExecutor-5535-thread-1) [    x:collection1] o.a.s.c.SolrDeletionPolicy SolrDeletionPolicy.onCommit: commits: num=1
   [junit4]   2> 	commit{dir=MockDirectoryWrapper(RAMDirectory@40de1fcb lockFactory=org.apache.lucene.store.SingleInstanceLockFactory@6333aff3),segFN=segments_1,generation=1}
   [junit4]   2> 1803206 INFO  (coreLoadExecutor-5535-thread-1) [    x:collection1] o.a.s.c.SolrDeletionPolicy newest commit generation = 1
   [junit4]   2> 1803207 INFO  (OldIndexDirectoryCleanupThreadForCore-collection1) [    x:collection1] o.a.s.c.SolrCore Looking for old index directories to cleanup for core collection1 in /Users/jenkins/workspace/Lucene-Solr-5.x-MacOSX/solr/build/solr-core/test/J1/temp/solr.handler.TestReplicationHandler_C652CF3E55D7FBCD-001/solr-instance-001/./collection1/data/
   [junit4]   2> 1803211 INFO  (coreLoadExecutor-5535-thread-1) [    x:collection1] o.a.s.c.SolrCore no updateRequestProcessorChain defined as default, creating implicit default
   [junit4]   2> 1803218 INFO  (coreLoadExecutor-5535-thread-1) [    x:collection1] o.a.s.h.l.XMLLoader xsltCacheLifetimeSeconds=60
   [junit4]   2> 1803219 INFO  (coreLoadExecutor-5535-thread-1) [    x:collection1] o.a.s.h.l.XMLLoader xsltCacheLifetimeSeconds=60
   [junit4]   2> 1803220 INFO  (coreLoadExecutor-5535-thread-1) [    x:collection1] o.a.s.h.l.XMLLoader xsltCacheLifetimeSeconds=60
   [junit4]   2> 1803221 INFO  (coreLoadExecutor-5535-thread-1) [    x:collection1] o.a.s.h.l.XMLLoader xsltCacheLifetimeSeconds=60
   [junit4]   2> 1803243 INFO  (coreLoadExecutor-5535-thread-1) [    x:collection1] o.a.s.c.PluginBag requestHandler : 'lazy' created with startup=lazy 
   [junit4]   2> 1803244 INFO  (coreLoadExecutor-5535-thread-1) [    x:collection1] o.a.s.c.RequestHandlers Registered paths: /admin/mbeans,standard,lazy,/update/csv,/update/json/docs,/admin/luke,/admin/segments,/get,/admin/system,/replication,/admin/properties,defaults,/config,/schema,/admin/plugins,/admin/logging,/update/json,/admin/threads,/admin/ping,/update,/admin/file
   [junit4]   2> 1803244 INFO  (coreLoadExecutor-5535-thread-1) [    x:collection1] o.a.s.c.SolrCore Using default statsCache cache: org.apache.solr.search.stats.LocalStatsCache
   [junit4]   2> 1803244 INFO  (coreLoadExecutor-5535-thread-1) [    x:collection1] o.a.s.u.CommitTracker Hard AutoCommit: disabled
   [junit4]   2> 1803245 INFO  (coreLoadExecutor-5535-thread-1) [    x:collection1] o.a.s.u.CommitTracker Soft AutoCommit: disabled
   [junit4]   2> 1803245 INFO  (coreLoadExecutor-5535-thread-1) [    x:collection1] o.a.s.u.RandomMergePolicy RandomMergePolicy wrapping class org.apache.lucene.index.TieredMergePolicy: [TieredMergePolicy: maxMergeAtOnce=30, maxMergeAtOnceExplicit=14, maxMergedSegmentMB=82.08984375, floorSegmentMB=2.171875, forceMergeDeletesPctAllowed=9.555182898710028, segmentsPerTier=26.0, maxCFSSegmentSizeMB=8.796093022207999E12, noCFSRatio=0.4878414406680589
   [junit4]   2> 1803245 INFO  (coreLoadExecutor-5535-thread-1) [    x:collection1] o.a.s.c.SolrDeletionPolicy SolrDeletionPolicy.onInit: commits: num=1
   [junit4]   2> 	commit{dir=MockDirectoryWrapper(RAMDirectory@40de1fcb lockFactory=org.apache.lucene.store.SingleInstanceLockFactory@6333aff3),segFN=segments_1,generation=1}
   [junit4]   2> 1803245 INFO  (coreLoadExecutor-5535-thread-1) [    x:collection1] o.a.s.c.SolrDeletionPolicy newest commit generation = 1
   [junit4]   2> 1803245 INFO  (coreLoadExecutor-5535-thread-1) [    x:collection1] o.a.s.s.SolrIndexSearcher Opening Searcher@f754114[collection1] main
   [junit4]   2> 1803245 INFO  (coreLoadExecutor-5535-thread-1) [    x:collection1] o.a.s.r.ManagedResourceStorage File-based storage initialized to use dir: /Users/jenkins/workspace/Lucene-Solr-5.x-MacOSX/solr/build/solr-core/test/J1/temp/solr.handler.TestReplicationHandler_C652CF3E55D7FBCD-001/solr-instance-001/collection1/conf
   [junit4]   2> 1803245 INFO  (coreLoadExecutor-5535-thread-1) [    x:collection1] o.a.s.r.RestManager Initializing RestManager with initArgs: {storageDir=/Users/jenkins/workspace/Lucene-Solr-5.x-MacOSX/solr/build/solr-core/test/J1/temp/solr.handler.TestReplicationHandler_C652CF3E55D7FBCD-001/solr-instance-001/collection1/conf}
   [junit4]   2> 1803246 INFO  (coreLoadExecutor-5535-thread-1) [    x:collection1] o.a.s.r.ManagedResourceStorage Reading _rest_managed.json using file:dir=/Users/jenkins/workspace/Lucene-Solr-5.x-MacOSX/solr/build/solr-core/test/J1/temp/solr.handler.TestReplicationHandler_C652CF3E55D7FBCD-001/solr-instance-001/collection1/conf
   [junit4]   2> 1803247 INFO  (coreLoadExecutor-5535-thread-1) [    x:collection1] o.a.s.r.RestManager Initializing 0 registered ManagedResources
   [junit4]   2> 1803247 INFO  (coreLoadExecutor-5535-thread-1) [    x:collection1] o.a.s.h.ReplicationHandler Replication enabled for following config files: schema.xml,xslt/dummy.xsl
   [junit4]   2> 1803247 INFO  (coreLoadExecutor-5535-thread-1) [    x:collection1] o.a.s.h.ReplicationHandler Commits will be reserved for  10000
   [junit4]   2> 1803247 INFO  (searcherExecutor-5536-thread-1-processing-x:collection1) [    x:collection1] o.a.s.c.SolrCore [collection1] Registered new searcher Searcher@f754114[collection1] main{ExitableDirectoryReader(UninvertingDirectoryReader())}
   [junit4]   2> 1803248 INFO  (coreLoadExecutor-5535-thread-1) [    x:collection1] o.a.s.c.CoreContainer registering core: collection1
   [junit4]   2> 1803653 INFO  (TEST-TestReplicationHandler.doTestDetails-seed#[C652CF3E55D7FBCD]) [    ] o.a.s.SolrTestCaseJ4 Writing core.properties file to /Users/jenkins/workspace/Lucene-Solr-5.x-MacOSX/solr/build/solr-core/test/J1/temp/solr.handler.TestReplicationHandler_C652CF3E55D7FBCD-001/solr-instance-002/collection1
   [junit4]   2> 1803658 INFO  (TEST-TestReplicationHandler.doTestDetails-seed#[C652CF3E55D7FBCD]) [    ] o.e.j.s.Server jetty-9.2.13.v20150730
   [junit4]   2> 1803661 INFO  (TEST-TestReplicationHandler.doTestDetails-seed#[C652CF3E55D7FBCD]) [    ] o.e.j.s.h.ContextHandler Started o.e.j.s.ServletContextHandler@4396190f{/solr,null,AVAILABLE}
   [junit4]   2> 1803661 INFO  (TEST-TestReplicationHandler.doTestDetails-seed#[C652CF3E55D7FBCD]) [    ] o.e.j.s.ServerConnector Started ServerConnector@849943{HTTP/1.1}{127.0.0.1:61796}
   [junit4]   2> 1803661 INFO  (TEST-TestReplicationHandler.doTestDetails-seed#[C652CF3E55D7FBCD]) [    ] o.e.j.s.Server Started @1808823ms
   [junit4]   2> 1803661 INFO  (TEST-TestReplicationHandler.doTestDetails-seed#[C652CF3E55D7FBCD]) [    ] o.a.s.c.s.e.JettySolrRunner Jetty properties: {solr.data.dir=/Users/jenkins/workspace/Lucene-Solr-5.x-MacOSX/solr/build/solr-core/test/J1/temp/solr.handler.TestReplicationHandler_C652CF3E55D7FBCD-001/solr-instance-002/collection1/data, hostContext=/solr, hostPort=61796}
   [junit4]   2> 1803661 INFO  (TEST-TestReplicationHandler.doTestDetails-seed#[C652CF3E55D7FBCD]) [    ] o.a.s.s.SolrDispatchFilter SolrDispatchFilter.init(): sun.misc.Launcher$AppClassLoader@74a14482
   [junit4]   2> 1803661 INFO  (TEST-TestReplicationHandler.doTestDetails-seed#[C652CF3E55D7FBCD]) [    ] o.a.s.c.SolrResourceLoader new SolrResourceLoader for directory: '/Users/jenkins/workspace/Lucene-Solr-5.x-MacOSX/solr/build/solr-core/test/J1/temp/solr.handler.TestReplicationHandler_C652CF3E55D7FBCD-001/solr-instance-002'
   [junit4]   2> 1803661 INFO  (TEST-TestReplicationHandler.doTestDetails-seed#[C652CF3E55D7FBCD]) [    ] o.a.s.c.SolrResourceLoader JNDI not configured for solr (NoInitialContextEx)
   [junit4]   2> 1803661 INFO  (TEST-TestReplicationHandler.doTestDetails-seed#[C652CF3E55D7FBCD]) [    ] o.a.s.c.SolrResourceLoader solr home defaulted to 'solr/' (could not find system property or JNDI)
   [junit4]   2> 1803662 INFO  (TEST-TestReplicationHandler.doTestDetails-seed#[C652CF3E55D7FBCD]) [    ] o.a.s.c.SolrXmlConfig Loading container configuration from /Users/jenkins/workspace/Lucene-Solr-5.x-MacOSX/solr/build/solr-core/test/J1/temp/solr.handler.TestReplicationHandler_C652CF3E55D7FBCD-001/solr-instance-002/solr.xml
   [junit4]   2> 1803666 INFO  (TEST-TestReplicationHandler.doTestDetails-seed#[C652CF3E55D7FBCD]) [    ] o.a.s.c.CorePropertiesLocator Config-defined core root directory: /Users/jenkins/workspace/Lucene-Solr-5.x-MacOSX/solr/build/solr-core/test/J1/temp/solr.handler.TestReplicationHandler_C652CF3E55D7FBCD-001/solr-instance-002/.
   [junit4]   2> 1803666 INFO  (TEST-TestReplicationHandler.doTestDetails-seed#[C652CF3E55D7FBCD]) [    ] o.a.s.c.CoreContainer New CoreContainer 188971376
   [junit4]   2> 1803666 INFO  (TEST-TestReplicationHandler.doTestDetails-seed#[C652CF3E55D7FBCD]) [    ] o.a.s.c.CoreContainer Loading cores into CoreContainer [instanceDir=/Users/jenkins/workspace/Lucene-Solr-5.x-MacOSX/solr/build/solr-core/test/J1/temp/solr.handler.TestReplicationHandler_C652CF3E55D7FBCD-001/solr-instance-002]
   [junit4]   2> 1803666 WARN  (TEST-TestReplicationHandler.doTestDetails-seed#[C652CF3E55D7FBCD]) [    ] o.a.s.c.CoreContainer Couldn't add files from /Users/jenkins/workspace/Lucene-Solr-5.x-MacOSX/solr/build/solr-core/test/J1/temp/solr.handler.TestReplicationHandler_C652CF3E55D7FBCD-001/solr-instance-002/lib to classpath: /Users/jenkins/workspace/Lucene-Solr-5.x-MacOSX/solr/build/solr-core/test/J1/temp/solr.handler.TestReplicationHandler_C652CF3E55D7FBCD-001/solr-instance-002/lib
   [junit4]   2> 1803667 INFO  (TEST-TestReplicationHandler.doTestDetails-seed#[C652CF3E55D7FBCD]) [    ] o.a.s.h.c.HttpShardHandlerFactory created with socketTimeout : 90000,urlScheme : ,connTimeout : 15000,maxConnectionsPerHost : 20,maxConnections : 10000,corePoolSize : 0,maximumPoolSize : 2147483647,maxThreadIdleTime : 5,sizeOfQueue : -1,fairnessPolicy : false,useRetries : false,
   [junit4]   2> 1803668 INFO  (TEST-TestReplicationHandler.doTestDetails-seed#[C652CF3E55D7FBCD]) [    ] o.a.s.u.UpdateShardHandler Creating UpdateShardHandler HTTP client with params: socketTimeout=340000&connTimeout=45000&retry=true
   [junit4]   2> 1803668 INFO  (TEST-TestReplicationHandler.doTestDetails-seed#[C652CF3E55D7FBCD]) [    ] o.a.s.l.LogWatcher SLF4J impl is org.slf4j.impl.Log4jLoggerFactory
   [junit4]   2> 1803668 INFO  (TEST-TestReplicationHandler.doTestDetails-seed#[C652CF3E55D7FBCD]) [    ] o.a.s.l.LogWatcher Registering Log Listener [Log4j (org.slf4j.impl.Log4jLoggerFactory)]
   [junit4]   2> 1803668 INFO  (TEST-TestReplicationHandler.doTestDetails-seed#[C652CF3E55D7FBCD]) [    ] o.a.s.c.CoreContainer Security conf doesn't exist. Skipping setup for authorization module.
   [junit4]   2> 1803668 INFO  (TEST-TestReplicationHandler.doTestDetails-seed#[C652CF3E55D7FBCD]) [    ] o.a.s.c.CoreContainer No authentication plugin used.
   [junit4]   2> 1803669 INFO  (TEST-TestReplicationHandler.doTestDetails-seed#[C652CF3E55D7FBCD]) [    ] o.a.s.c.CorePropertiesLocator Looking for core definitions underneath /Users/jenkins/workspace/Lucene-Solr-5.x-MacOSX/solr/build/solr-core/test/J1/temp/solr.handler.TestReplicationHandler_C652CF3E55D7FBCD-001/solr-instance-002/.
   [junit4]   2> 1803670 INFO  (TEST-TestReplicationHandler.doTestDetails-seed#[C652CF3E55D7FBCD]) [    ] o.a.s.c.CoreDescriptor Created CoreDescriptor: {name=collection1, config=solrconfig.xml, loadOnStartup=true, schema=schema.xml, configSetProperties=configsetprops.json, transient=false, dataDir=data/}
   [junit4]   2> 1803671 INFO  (TEST-TestReplicationHandler.doTestDetails-seed#[C652CF3E55D7FBCD]) [    ] o.a.s.c.CorePropertiesLocator Found core collection1 in /Users/jenkins/workspace/Lucene-Solr-5.x-MacOSX/solr/build/solr-core/test/J1/temp/solr.handler.TestReplicationHandler_C652CF3E55D7FBCD-001/solr-instance-002/./collection1
   [junit4]   2> 1803671 INFO  (TEST-TestReplicationHandler.doTestDetails-seed#[C652CF3E55D7FBCD]) [    ] o.a.s.c.CorePropertiesLocator Found 1 core definitions
   [junit4]   2> 1803671 INFO  (coreLoadExecutor-5545-thread-1) [    ] o.a.s.c.SolrResourceLoader new SolrResourceLoader for directory: '/Users/jenkins/workspace/Lucene-Solr-5.x-MacOSX/solr/build/solr-core/test/J1/temp/solr.handler.TestReplicationHandler_C652CF3E55D7FBCD-001/solr-instance-002/collection1'
   [junit4]   2> 1803672 INFO  (TEST-TestReplicationHandler.doTestDetails-seed#[C652CF3E55D7FBCD]) [    ] o.a.s.s.SolrDispatchFilter user.dir=/Users/jenkins/workspace/Lucene-Solr-5.x-MacOSX/solr/build/solr-core/test/J1
   [junit4]   2> 1803672 INFO  (TEST-TestReplicationHandler.doTestDetails-seed#[C652CF3E55D7FBCD]) [    ] o.a.s.s.SolrDispatchFilter SolrDispatchFilter.init() done
   [junit4]   2> 1803672 INFO  (coreLoadExecutor-5545-thread-1) [    ] o.a.s.c.SolrResourceLoader JNDI not configured for solr (NoInitialContextEx)
   [junit4]   2> 1803672 INFO  (coreLoadExecutor-5545-thread-1) [    ] o.a.s.c.SolrResourceLoader solr home defaulted to 'solr/' (could not find system property or JNDI)
   [junit4]   2> 1803679 INFO  (coreLoadExecutor-5545-thread-1) [    ] o.a.s.c.SolrConfig current version of requestparams : -1
   [junit4]   2> 1803680 INFO  (coreLoadExecutor-5545-thread-1) [    ] o.a.s.c.SolrConfig Using Lucene MatchVersion: 5.5.0
   [junit4]   2> 1803684 INFO  (coreLoadExecutor-5545-thread-1) [    ] o.a.s.c.SolrConfig Loaded SolrConfig: solrconfig.xml
   [junit4]   2> 1803690 INFO  (coreLoadExecutor-5545-thread-1) [    ] o.a.s.s.IndexSchema [collection1] Schema name=test
   [junit4]   2> 1803698 INFO  (coreLoadExecutor-5545-thread-1) [    ] o.a.s.s.IndexSchema unique key field: id
   [junit4]   2> 1803700 INFO  (coreLoadExecutor-5545-thread-1) [    ] o.a.s.c.ConfigSetProperties Did not find ConfigSet properties, assuming default properties: Can't find resource 'configsetprops.json' in classpath or '/Users/jenkins/workspace/Lucene-Solr-5.x-MacOSX/solr/build/solr-core/test/J1/temp/solr.handler.TestReplicationHandler_C652CF3E55D7FBCD-001/solr-instance-002/collection1'
   [junit4]   2> 1803700 INFO  (coreLoadExecutor-5545-thread-1) [    ] o.a.s.c.CoreContainer Creating SolrCore 'collection1' using configuration from instancedir /Users/jenkins/workspace/Lucene-Solr-5.x-MacOSX/solr/build/solr-core/test/J1/temp/solr.handler.TestReplicationHandler_C652CF3E55D7FBCD-001/solr-instance-002/./collection1
   [junit4]   2> 1803700 INFO  (coreLoadExecutor-5545-thread-1) [    x:collection1] o.a.s.c.SolrCore org.apache.solr.core.MockDirectoryFactory
   [junit4]   2> 1803700 INFO  (coreLoadExecutor-5545-thread-1) [    x:collection1] o.a.s.c.SolrCore [[collection1] ] Opening new SolrCore at [/Users/jenkins/workspace/Lucene-Solr-5.x-MacOSX/solr/build/solr-core/test/J1/temp/solr.handler.TestReplicationHandler_C652CF3E55D7FBCD-001/solr-instance-002/collection1], dataDir=[/Users/jenkins/workspace/Lucene-Solr-5.x-MacOSX/solr/build/solr-core/test/J1/temp/solr.handler.TestReplicationHandler_C652CF3E55D7FBCD-001/solr-instance-002/./collection1/data/]
   [junit4]   2> 1803700 INFO  (coreLoadExecutor-5545-thread-1) [    x:collection1] o.a.s.c.SolrCore JMX monitoring not detected for core: collection1
   [junit4]   2> 1803700 INFO  (coreLoadExecutor-5545-thread-1) [    x:collection1] o.a.s.c.CachingDirectoryFactory return new directory for /Users/jenkins/workspace/Lucene-Solr-5.x-MacOSX/solr/build/solr-core/test/J1/temp/solr.handler.TestReplicationHandler_C652CF3E55D7FBCD-001/solr-instance-002/./collection1/data
   [junit4]   2> 1803700 INFO  (coreLoadExecutor-5545-thread-1) [    x:collection1] o.a.s.c.SolrCore New index directory detected: old=null new=/Users/jenkins/workspace/Lucene-Solr-5.x-MacOSX/solr/build/solr-core/test/J1/temp/solr.handler.TestReplicationHandler_C652CF3E55D7FBCD-001/solr-instance-002/./collection1/data/index/
   [junit4]   2> 1803701 WARN  (coreLoadExecutor-5545-thread-1) [    x:collection1] o.a.s.c.SolrCore [collection1] Solr index directory '/Users/jenkins/workspace/Lucene-Solr-5.x-MacOSX/solr/build/solr-core/test/J1/temp/solr.handler.TestReplicationHandler_C652CF3E55D7FBCD-001/solr-instance-002/./collection1/data/index' doesn't exist. Creating new index...
   [junit4]   2> 1803701 INFO  (coreLoadExecutor-5545-thread-1) [    x:collection1] o.a.s.c.CachingDirectoryFactory return new directory for /Users/jenkins/workspace/Lucene-Solr-5.x-MacOSX/solr/build/solr-core/test/J1/temp/solr.handler.TestReplicationHandler_C652CF3E55D7FBCD-001/solr-instance-002/./collection1/data/index
   [junit4]   2> 1803701 INFO  (coreLoadExecutor-5545-thread-1) [    x:collection1] o.a.s.u.RandomMergePolicy RandomMergePolicy wrapping class org.apache.lucene.index.TieredMergePolicy: [TieredMergePolicy: maxMergeAtOnce=21, maxMergeAtOnceExplicit=47, maxMergedSegmentMB=59.6533203125, floorSegmentMB=1.572265625, forceMergeDeletesPctAllowed=6.902875907152948, segmentsPerTier=25.0, maxCFSSegmentSizeMB=8.796093022207999E12, noCFSRatio=0.12960865392903137
   [junit4]   2> 1803701 INFO  (coreLoadExecutor-5545-thread-1) [    x:collection1] o.a.s.c.SolrDeletionPolicy SolrDeletionPolicy.onCommit: commits: num=1
   [junit4]   2> 	commit{dir=MockDirectoryWrapper(RAMDirectory@3a4b16aa lockFactory=org.apache.lucene.store.SingleInstanceLockFactory@60f0b011),segFN=segments_1,generation=1}
   [junit4]   2> 1803701 INFO  (coreLoadExecutor-5545-thread-1) [    x:collection1] o.a.s.c.SolrDeletionPolicy newest commit generation = 1
   [junit4]   2> 1803702 INFO  (OldIndexDirectoryCleanupThreadForCore-collection1) [    x:collection1] o.a.s.c.SolrCore Looking for old index directories to cleanup for core collection1 in /Users/jenkins/workspace/Lucene-Solr-5.x-MacOSX/solr/build/solr-core/test/J1/temp/solr.handler.TestReplicationHandler_C652CF3E55D7FBCD-001/solr-instance-002/./collection1/data/
   [junit4]   2> 1803704 INFO  (coreLoadExecutor-5545-thread-1) [    x:collection1] o.a.s.c.SolrCore no updateRequestProcessorChain defined as default, creating implicit default
   [junit4]   2> 1803705 INFO  (coreLoadExecutor-5545-thread-1) [    x:collection1] o.a.s.h.l.XMLLoader xsltCacheLifetimeSeconds=60
   [junit4]   2> 1803706 INFO  (coreLoadExecutor-5545-thread-1) [    x:collection1] o.a.s.h.l.XMLLoader xsltCacheLifetimeSeconds=60
   [junit4]   2> 1803706 INFO  (coreLoadExecutor-5545-thread-1) [    x:collection1] o.a.s.h.l.XMLLoader xsltCacheLifetimeSeconds=60
   [junit4]   2> 1803707 INFO  (coreLoadExecutor-5545-thread-1) [    x:collection1] o.a.s.h.l.XMLLoader xsltCacheLifetimeSeconds=60
   [junit4]   2> 1803708 INFO  (coreLoadExecutor-5545-thread-1) [    x:collection1] o.a.s.c.PluginBag requestHandler : 'lazy' created with startup=lazy 
   [junit4]   2> 1803708 INFO  (coreLoadExecutor-5545-thread-1) [    x:collection1] o.a.s.c.RequestHandlers Registered paths: /admin/mbeans,standard,lazy,/update/csv,/update/json/docs,/admin/luke,/admin/segments,/get,/admin/system,/replication,/admin/properties,defaults,/config,/schema,/admin/plugins,/admin/logging,/update/json,/admin/threads,/admin/ping,/update,/admin/file
   [junit4]   2> 1803709 INFO  (coreLoadExecutor-5545-thread-1) [    x:collection1] o.a.s.c.SolrCore Using default statsCache cache: org.apache.solr.search.stats.LocalStatsCache
   [junit4]   2> 1803709 INFO  (coreLoadExecutor-5545-thread-1) [    x:collection1] o.a.s.u.CommitTracker Hard AutoCommit: disabled
   [junit4]   2> 1803709 INFO  (coreLoadExecutor-5545-thread-1) [    x:collection1] o.a.s.u.CommitTracker Soft AutoCommit: disabled
   [junit4]   2> 1803709 INFO  (coreLoadExecutor-5545-thread-1) [    x:collection1] o.a.s.u.RandomMergePolicy RandomMergePolicy wrapping class org.apache.lucene.index.TieredMergePolicy: [TieredMergePolicy: maxMergeAtOnce=30, maxMergeAtOnceExplicit=14, maxMergedSegmentMB=82.08984375, floorSegmentMB=2.171875, forceMergeDeletesPctAllowed=9.555182898710028, segmentsPerTier=26.0, maxCFSSegmentSizeMB=8.796093022207999E12, noCFSRatio=0.4878414406680589
   [junit4]   2> 1803710 INFO  (coreLoadExecutor-5545-thread-1) [    x:collection1] o.a.s.c.SolrDeletionPolicy SolrDeletionPolicy.onInit: commits: num=1
   [junit4]   2> 	commit{dir=MockDirectoryWrapper(RAMDirectory@3a4b16aa lockFactory=org.apache.lucene.store.SingleInstanceLockFactory@60f0b011),segFN=segments_1,generation=1}
   [junit4]   2> 1803710 INFO  (coreLoadExecutor-5545-thread-1) [    x:collection1] o.a.s.c.SolrDeletionPolicy newest commit generation = 1
   [junit4]   2> 1803710 INFO  (coreLoadExecutor-5545-thread-1) [    x:collection1] o.a.s.s.SolrIndexSearcher Opening Searcher@3742181b[collection1] main
   [junit4]   2> 1803710 INFO  (coreLoadExecutor-5545-thread-1) [    x:collection1] o.a.s.r.ManagedResourceStorage File-based storage initialized to use dir: /Users/jenkins/workspace/Lucene-Solr-5.x-MacOSX/solr/build/solr-core/test/J1/temp/solr.handler.TestReplicationHandler_C652CF3E55D7FBCD-001/solr-instance-002/collection1/conf
   [junit4]   2> 1803711 INFO  (coreLoadExecutor-5545-thread-1) [    x:collection1] o.a.s.r.RestManager Initializing RestManager with initArgs: {storageDir=/Users/jenkins/workspace/Lucene-Solr-5.x-MacOSX/solr/build/solr-core/test/J1/temp/solr.handler.TestReplicationHandler_C652CF3E55D7FBCD-001/solr-instance-002/collection1/conf}
   [junit4]   2> 1803711 INFO  (coreLoadExecutor-5545-thread-1) [    x:collection1] o.a.s.r.ManagedResourceStorage Reading _rest_managed.json using file:dir=/Users/jenkins/workspace/Lucene-Solr-5.x-MacOSX/solr/build/solr-core/test/J1/temp/solr.handler.TestReplicationHandler_C652CF3E55D7FBCD-001/solr-instance-002/collection1/conf
   [junit4]   2> 1803711 INFO  (coreLoadExecutor-5545-thread-1) [    x:collection1] o.a.s.r.RestManager Initializing 0 registered ManagedResources
   [junit4]   2> 1803716 INFO  (coreLoadExecutor-5545-thread-1) [    x:collection1] o.a.s.h.ReplicationHandler Poll scheduled at an interval of 1000ms
   [junit4]   2> 1803716 INFO  (coreLoadExecutor-5545-thread-1) [    x:collection1] o.a.s.c.CoreContainer registering core: collection1
   [junit4]   2> 1803717 INFO  (searcherExecutor-5546-thread-1-processing-x:collection1) [    x:collection1] o.a.s.c.SolrCore [collection1] Registered new searcher Searcher@3742181b[collection1] main{ExitableDirectoryReader(UninvertingDirectoryReader())}
   [junit4]   2> 1803720 INFO  (qtp238019867-14390) [    x:collection1] o.a.s.c.S.Request [collection1]  webapp=/solr path=/replication params={qt=/replication&wt=javabin&version=2&command=indexversion} status=0 QTime=0
   [junit4]   2> 1804176 INFO  (qtp238019867-14391) [    x:collection1] o.a.s.c.S.Request [collection1]  webapp=/solr path=/select params={q=*:*&sort=id+desc&wt=javabin&version=2} hits=0 status=0 QTime=0
   [junit4]   2> 1804179 INFO  (qtp238019867-14392) [    x:collection1] o.a.s.c.S.Request [collection1]  webapp=/solr path=/replication params={_trace=getDetails&qt=/replication&wt=javabin&version=2&command=details} status=0 QTime=0
   [junit4]   2> 1804186 INFO  (qtp238019867-14393) [    x:collection1] o.a.s.c.S.Request [collection1]  webapp=/solr path=/replication params={slave=false&qt=/replication&wt=javabin&version=2&command=details} status=0 QTime=0
   [junit4]   2> 1804186 INFO  (qtp1502929738-14408) [    x:collection1] o.a.s.c.S.Request [collection1]  webapp=/solr path=/replication params={_trace=getDetails&qt=/replication&wt=javabin&version=2&command=details} status=0 QTime=5
   [junit4]   2> 1804190 INFO  (qtp238019867-14394) [    x:collection1] o.a.s.u.p.LogUpdateProcessorFactory [collection1]  webapp=/solr path=/update params={wt=javabin&version=2}{add=[0]} 0 1
   [junit4]   2> 1804195 INFO  (qtp238019867-14395) [    x:collection1] o.a.s.u.DirectUpdateHandler2 start commit{,optimize=false,openSearcher=true,waitSearcher=true,expungeDeletes=false,softCommit=false,prepareCommit=false}
   [junit4]   2> 1804196 INFO  (qtp238019867-14395) [    x:collection1] o.a.s.c.SolrDeletionPolicy SolrDeletionPolicy.onCommit: commits: num=2
   [junit4]   2> 	commit{dir=MockDirectoryWrapper(RAMDirectory@40de1fcb lockFactory=org.apache.lucene.store.SingleInstanceLockFactory@6333aff3),segFN=segments_1,generation=1}
   [junit4]   2> 	commit{dir=MockDirectoryWrapper(RAMDirectory@40de1fcb lockFactory=org.apache.lucene.store.SingleInstanceLockFactory@6333aff3),segFN=segments_2,generation=2}
   [junit4]   2> 1804196 INFO  (qtp238019867-14395) [    x:collection1] o.a.s.c.SolrDeletionPolicy newest commit generation = 2
   [junit4]   2> 1804197 INFO  (qtp238019867-14395) [    x:collection1] o.a.s.s.SolrIndexSearcher Opening Searcher@586a989a[collection1] main
   [junit4]   2> 1804198 INFO  (qtp238019867-14395) [    x:collection1] o.a.s.u.DirectUpdateHandler2 end_commit_flush
   [junit4]   2> 1804198 INFO  (searcherExecutor-5536-thread-1-processing-x:collection1) [    x:collection1] o.a.s.c.SolrCore [collection1] Registered new searcher Searcher@586a989a[collection1] main{ExitableDirectoryReader(UninvertingDirectoryReader(Uninverting(_0(5.5.0):C1)))}
   [junit4]   2> 1804198 INFO  (qtp238019867-14395) [    x:collection1] o.a.s.u.p.LogUpdateProcessorFactory [collection1]  webapp=/solr path=/update params={waitSearcher=true&commit=true&softCommit=false&wt=javabin&version=2}{commit=} 0 3
   [junit4]   2> 1804239 WARN  (explicit-fetchindex-cmd) [    x:collection1] o.a.s.h.IndexFetcher 'masterUrl' must be specified without the /replication suffix
   [junit4]   2> 1804242 INFO  (qtp238019867-14390) [    x:collection1] o.a.s.c.S.Request [collection1]  webapp=/solr path=/replication params={qt=/replication&wt=javabin&version=2&command=indexversion} status=0 QTime=0
   [junit4]   2> 1804243 INFO  (explicit-fetchindex-cmd) [    x:collection1] o.a.s.h.IndexFetcher Master's generation: 2
   [junit4]   2> 1804243 INFO  (explicit-fetchindex-cmd) [    x:collection1] o.a.s.h.IndexFetcher Slave's generation: 1
   [junit4]   2> 1804243 INFO  (explicit-fetchindex-cmd) [    x:collection1] o.a.s.h.IndexFetcher Starting replication process
   [junit4]   2> 1804249 INFO  (qtp238019867-14391) [    x:collection1] o.a.s.c.S.Request [collection1]  webapp=/solr path=/replication params={generation=2&qt=/replication&wt=javabin&version=2&command=filelist} status=0 QTime=4
   [junit4]   2> 1804249 INFO  (explicit-fetchindex-cmd) [    x:collection1] o.a.s.h.IndexFetcher Number of files in latest index in master: 10
   [junit4]   2> 1804250 INFO  (explicit-fetchindex-cmd) [    x:collection1] o.a.s.c.CachingDirectoryFactory return new directory for /Users/jenkins/workspace/Lucene-Solr-5.x-MacOSX/solr/build/solr-core/test/J1/temp/solr.handler.TestReplicationHandler_C652CF3E55D7FBCD-001/solr-instance-002/./collection1/data/index.20160127201536453
   [junit4]   2> 1804251 INFO  (explicit-fetchindex-cmd) [    x:collection1] o.a.s.u.DefaultSolrCoreState Rollback old IndexWriter... core=collection1
   [junit4]   2> 1804251 INFO  (explicit-fetchindex-cmd) [    x:collection1] o.a.s.u.RandomMergePolicy RandomMergePolicy wrapping class org.apache.lucene.index.LogByteSizeMergePolicy: [LogByteSizeMergePolicy: minMergeSize=1677721, mergeFactor=43, maxMergeSize=2147483648, maxMergeSizeForForcedMerge=9223372036854775807, calibrateSizeByDeletes=false, maxMergeDocs=2147483647, maxCFSSegmentSizeMB=8.796093022207999E12, noCFSRatio=0.24345491059331997]
   [junit4]   2> 1804251 INFO  (explicit-fetchindex-cmd) [    x:collection1] o.a.s.c.SolrDeletionPolicy SolrDeletionPolicy.onInit: commits: num=1
   [junit4]   2> 	commit{dir=MockDirectoryWrapper(RAMDirectory@3a4b16aa lockFactory=org.apache.lucene.store.SingleInstanceLockFactory@60f0b011),segFN=segments_1,generation=1}
   [junit4]   2> 1804252 INFO  (explicit-fetchindex-cmd) [    x:collection1] o.a.s.c.SolrDeletionPolicy newest commit generation = 1
   [junit4]   2> 1804252 INFO  (explicit-fetchindex-cmd) [    x:collection1] o.a.s.u.DefaultSolrCoreState New IndexWriter is ready to be used.
   [junit4]   2> 1804252 INFO  (explicit-fetchindex-cmd) [    x:collection1] o.a.s.c.SolrDeletionPolicy SolrDeletionPolicy.onCommit: commits: num=1
   [junit4]   2> 	commit{dir=MockDirectoryWrapper(RAMDirectory@3a4b16aa lockFactory=org.apache.lucene.store.SingleInstanceLockFactory@60f0b011),segFN=segments_1,generation=1}
   [junit4]   2> 1804252 INFO  (explicit-fetchindex-cmd) [    x:collection1] o.a.s.c.SolrDeletionPolicy newest commit generation = 1
   [junit4]   2> 1804252 INFO  (explicit-fetchindex-cmd) [    x:collection1] o.a.s.u.DefaultSolrCoreState Rollback old IndexWriter... core=collection1
   [junit4]   2> 1804252 INFO  (explicit-fetchindex-cmd) [    x:collection1] o.a.s.h.IndexFetcher Starting download (fullCopy=false) to MockDirectoryWrapper(RAMDirectory@39c6f182 lockFactory=org.apache.lucene.store.SingleInstanceLockFactory@16394a2d)
   [junit4]   2> 1804254 INFO  (qtp238019867-14392) [    x:collection1] o.a.s.c.S.Request [collection1]  webapp=/solr path=/replication params={generation=2&qt=/replication&file=_0.si&checksum=true&wt=filestream&command=filecontent} status=0 QTime=0
   [junit4]   2> 1804257 INFO  (qtp238019867-14393) [    x:collection1] o.a.s.c.S.Request [collection1]  webapp=/solr path=/replication params={generation=2&qt=/replication&file=_0_FSTOrd50_0.doc&checksum=true&wt=filestream&command=filecontent} status=0 QTime=0
   [junit4]   2> 1804260 INFO  (qtp238019867-14394) [    x:collection1] o.a.s.c.S.Request [collection1]  webapp=/solr path=/replication params={generation=2&qt=/replication&file=_0_FSTOrd50_0.tix&checksum=true&wt=filestream&command=filecontent} status=0 QTime=0
   [junit4]   2> 1804262 INFO  (qtp238019867-14395) [    x:collection1] o.a.s.c.S.Request [collection1]  webapp=/solr path=/replication params={generation=2&qt=/replication&file=_0.nvd&checksum=true&wt=filestream&command=filecontent} status=0 QTime=0
   [junit4]   2> 1804265 INFO  (qtp238019867-14390) [    x:collection1] o.a.s.c.S.Request [collection1]  webapp=/solr path=/replication params={generation=2&qt=/replication&file=_0.fdx&checksum=true&wt=filestream&command=filecontent} status=0 QTime=0
   [junit4]   2> 1804268 INFO  (qtp238019867-14391) [    x:collection1] o.a.s.c.S.Request [collection1]  webapp=/solr path=/replication params={generation=2&qt=/replication&file=_0.fdt&checksum=true&wt=filestream&command=filecontent} status=0 QTime=0
   [junit4]   2> 1804271 INFO  (qtp238019867-14392) [    x:collection1] o.a.s.c.S.Request [collection1]  webapp=/solr path=/replication params={generation=2&qt=/replication&file=_0_FSTOrd50_0.tbk&checksum=true&wt=filestream&command=filecontent} status=0 QTime=0
   [junit4]   2> 1804273 INFO  (qtp238019867-14393) [    x:collection1] o.a.s.c.S.Request [collection1]  webapp=/solr path=/replication params={generation=2&qt=/replication&file=_0.fnm&checksum=true&wt=filestream&command=filecontent} status=0 QTime=0
   [junit4]   2> 1804276 INFO  (qtp238019867-14394) [    x:collection1] o.a.s.c.S.Request [collection1]  webapp=/solr path=/replication params={generation=2&qt=/replication&file=_0.nvm&checksum=true&wt=filestream&command=filecontent} status=0 QTime=0
   [junit4]   2> 1804279 INFO  (qtp238019867-14395) [    x:collection1] o.a.s.c.S.Request [collection1]  webapp=/solr path=/replication params={generation=2&qt=/replication&file=segments_2&checksum=true&wt=filestream&command=filecontent} status=0 QTime=0
   [junit4]   2> 1804279 INFO  (explicit-fetchindex-cmd) [    x:collection1] o.a.s.h.IndexFetcher Total time taken for download (fullCopy=false,bytesDownloaded=1559) : 0 secs (null bytes/sec) to MockDirectoryWrapper(RAMDirectory@39c6f182 lockFactory=org.apache.lucene.store.SingleInstanceLockFactory@16394a2d)
   [junit4]   2> 1804282 INFO  (explicit-fetchindex-cmd) [    x:collection1] o.a.s.u.RandomMergePolicy RandomMergePolicy wrapping class org.apache.lucene.index.TieredMergePolicy: [TieredMergePolicy: maxMergeAtOnce=34, maxMergeAtOnceExplicit=39, maxMergedSegmentMB=34.7900390625, floorSegmentMB=0.2734375, forceMergeDeletesPctAllowed=12.528484150752808, segmentsPerTier=47.0, maxCFSSegmentSizeMB=8.796093022207999E12, noCFSRatio=0.24026507931608343
   [junit4]   2> 1804283 INFO  (explicit-fetchindex-cmd) [    x:collection1] o.a.s.c.SolrDeletionPolicy SolrDeletionPolicy.onInit: commits: num=2
   [junit4]   2> 	commit{dir=MockDirectoryWrapper(RAMDirectory@3a4b16aa lockFactory=org.apache.lucene.store.SingleInstanceLockFactory@60f0b011),segFN=segments_1,generation=1}
   [junit4]   2> 	commit{dir=MockDirectoryWrapper(RAMDirectory@3a4b16aa lockFactory=org.apache.lucene.store.SingleInstanceLockFactory@60f0b011),segFN=segments_2,generation=2}
   [junit4]   2> 1804283 INFO  (explicit-fetchindex-cmd) [    x:collection1] o.a.s.c.SolrDeletionPolicy newest commit generation = 2
   [junit4]   2> 1804283 INFO  (explicit-fetchindex-cmd) [    x:collection1] o.a.s.u.DefaultSolrCoreState New IndexWriter is ready to be used.
   [junit4]   2> 1804283 INFO  (explicit-fetchindex-cmd) [    x:collection1] o.a.s.s.SolrIndexSearcher Opening Searcher@1c6fcac6[collection1] main
   [junit4]   2> 1804284 INFO  (searcherExecutor-5546-thread-1-processing-x:collection1) [    x:collection1] o.a.s.c.SolrCore [collection1] Registered new searcher Searcher@1c6fcac6[collection1] main{ExitableDirectoryReader(UninvertingDirectoryReader(Uninverting(_0(5.5.0):C1)))}
   [junit4]   2> 1804284 INFO  (explicit-fetchindex-cmd) [    x:collection1] o.a.s.c.CachingDirectoryFactory looking to close /Users/jenkins/workspace/Lucene-Solr-5.x-MacOSX/solr/build/solr-core/test/J1/temp/solr.handler.TestReplicationHandler_C652CF3E55D7FBCD-001/solr-instance-002/./collection1/data/index.20160127201536453 [CachedDir<<refCount=0;path=/Users/jenkins/workspace/Lucene-Solr-5.x-MacOSX/solr/build/solr-core/test/J1/temp/solr.handler.TestReplicationHandler_C652CF3E55D7FBCD-001/solr-instance-002/./collection1/data/index.20160127201536453;done=true>>]
   [junit4]   2> 1804284 INFO  (explicit-fetchindex-cmd) [    x:collection1] o.a.s.c.CachingDirectoryFactory Closing directory: /Users/jenkins/workspace/Lucene-Solr-5.x-MacOSX/solr/build/solr-core/test/J1/temp/solr.handler.TestReplicationHandler_C652CF3E55D7FBCD-001/solr-instance-002/./collection1/data/index.20160127201536453
   [junit4]   2> 1804284 INFO  (qtp1502929738-14409) [    x:collection1] o.a.s.c.S.Request [collection1]  webapp=/solr path=/replication params={wait=true&masterUrl=http://127.0.0.1:61791/solr/collection1/replication&command=fetchindex} status=0 QTime=46
   [junit4]   2> 1804298 INFO  (qtp238019867-14390) [    x:collection1] o.a.s.c.S.Request [collection1]  webapp=/solr path=/replication params={slave=false&qt=/replication&wt=javabin&version=2&command=details} status=0 QTime=0
   [junit4]   2> 1804298 INFO  (qtp1502929738-14410) [    x:collection1] o.a.s.c.S.Request [collection1]  webapp=/solr path=/replication params={_trace=getDetails&qt=/replication&wt=javabin&version=2&command=details} status=0 QTime=3
   [junit4]   2> 1804302 INFO  (qtp238019867-14391) [    x:collection1] o.a.s.u.p.LogUpdateProcessorFactory [collection1]  webapp=/solr path=/update params={wt=javabin&version=2}{add=[1]} 0 1
   [junit4]   2> 1804304 INFO  (qtp238019867-14392) [    x:collection1] o.a.s.u.DirectUpdateHandler2 start commit{,optimize=false,openSearcher=true,waitSearcher=true,expungeDeletes=false,softCommit=false,prepareCommit=false}
   [junit4]   2> 1804307 INFO  (qtp238019867-14392) [    x:collection1] o.a.s.c.SolrDeletionPolicy SolrDeletionPolicy.onCommit: commits: num=3
   [junit4]   2> 	commit{dir=MockDirectoryWrapper(RAMDirectory@40de1fcb lockFactory=org.apache.lucene.store.SingleInstanceLockFactory@6333aff3),segFN=segments_1,generation=1}
   [junit4]   2> 	commit{dir=MockDirectoryWrapper(RAMDirectory@40de1fcb lockFactory=org.apache.lucene.store.SingleInstanceLockFactory@6333aff3),segFN=segments_2,generation=2}
   [junit4]   2> 	commit{dir=MockDirectoryWrapper(RAMDirectory@40de1fcb lockFactory=org.apache.lucene.store.SingleInstanceLockFactory@6333aff3),segFN=segments_3,generation=3}
   [junit4]   2> 1804307 INFO  (qtp238019867-14392) [    x:collection1] o.a.s.c.SolrDeletionPolicy newest commit generation = 3
   [junit4]   2> 1804308 INFO  (qtp238019867-14392) [    x:collection1] o.a.s.s.SolrIndexSearcher Opening Searcher@4efd406[collection1] main
   [junit4]   2> 1804308 INFO  (qtp238019867-14392) [    x:collection1] o.a.s.u.DirectUpdateHandler2 end_commit_flush
   [junit4]   2> 1804308 INFO  (searcherExecutor-5536-thread-1-processing-x:collection1) [    x:collection1] o.a.s.c.SolrCore [collection1] Registered new searcher Searcher@4efd406[collection1] main{ExitableDirectoryReader(UninvertingDirectoryReader(Uninverting(_0(5.5.0):C1) Uninverting(_1(5.5.0):C1)))}
   [junit4]   2> 1804308 INFO  (qtp238019867-14392) [    x:collection1] o.a.s.u.p.LogUpdateProcessorFactory [collection1]  webapp=/solr path=/update params={waitSearcher=true&commit=true&softCommit=false&wt=javabin&version=2}{commit=} 0 4
   [junit4]   2> 1804311 WARN  (explicit-fetchindex-cmd) [    x:collection1] o.a.s.h.IndexFetcher 'masterUrl' must be specified without the /replication suffix
   [junit4]   2> 1804314 INFO  (qtp238019867-14393) [    x:collection1] o.a.s.c.S.Request [collection1]  webapp=/solr path=/replication params={qt=/replication&wt=javabin&version=2&command=indexversion} status=0 QTime=0
   [junit4]   2> 1804314 INFO  (explicit-fetchindex-cmd) [    x:collection1] o.a.s.h.IndexFetcher Master's generation: 3
   [junit4]   2> 1804314 INFO  (explicit-fetchindex-cmd) [    x:collection1] o.a.s.h.IndexFetcher Slave's generation: 2
   [junit4]   2> 1804314 INFO  (explicit-fetchindex-cmd) [    x:collection1] o.a.s.h.IndexFetcher Starting replication process
   [junit4]   2> 1804317 INFO  (qtp238019867-14394) [    x:collection1] o.a.s.c.S.Request [collection1]  webapp=/solr path=/replication params={generation=3&qt=/replication&wt=javabin&version=2&command=filelist} status=0 QTime=1
   [junit4]   2> 1804318 INFO  (explicit-fetchindex-cmd) [    x:collection1] o.a.s.h.IndexFetcher Number of files in latest index in master: 19
   [junit4]   2> 1804318 INFO  (explicit-fetchindex-cmd) [    x:collection1] o.a.s.c.CachingDirectoryFactory return new directory for /Users/jenkins/workspace/Lucene-Solr-5.x-MacOSX/solr/build/solr-core/test/J1/temp/solr.handler.TestReplicationHandler_C652CF3E55D7FBCD-001/solr-instance-002/./collection1/data/index.20160127201536522
   [junit4]   2> 1804318 INFO  (explicit-fetchindex-cmd) [    x:collection1] o.a.s.u.DefaultSolrCoreState Rollback old IndexWriter... core=collection1
   [junit4]   2> 1804319 INFO  (explicit-fetchindex-cmd) [    x:collection1] o.a.s.u.RandomMergePolicy RandomMergePolicy wrapping class org.apache.lucene.index.LogByteSizeMergePolicy: [LogByteSizeMergePolicy: minMergeSize=1677721, mergeFactor=43, maxMergeSize=2147483648, maxMergeSizeForForcedMerge=9223372036854775807, calibrateSizeByDeletes=false, maxMergeDocs=2147483647, maxCFSSegmentSizeMB=8.796093022207999E12, noCFSRatio=0.24345491059331997]
   [junit4]   2> 1804319 INFO  (explicit-fetchindex-cmd) [    x:collection1] o.a.s.c.SolrDeletionPolicy SolrDeletionPolicy.onInit: commits: num=1
   [junit4]   2> 	commit{dir=MockDirectoryWrapper(RAMDirectory@3a4b16aa lockFactory=org.apache.lucene.store.SingleInstanceLockFactory@60f0b011),segFN=segments_2,generation=2}
   [junit4]   2> 1804319 INFO  (explicit-fetchindex-cmd) [    x:collection1] o.a.s.c.SolrDeletionPolicy newest commit generation = 2
   [junit4]   2> 1804319 INFO  (explicit-fetchindex-cmd) [    x:collection1] o.a.s.u.DefaultSolrCoreState New IndexWriter is ready to be used.
   [junit4]   2> 1804319 INFO  (explicit-fetchindex-cmd) [    x:collection1] o.a.s.c.SolrDeletionPolicy SolrDeletionPolicy.onCommit: commits: num=1
   [junit4]   2> 	commit{dir=MockDirectoryWrapper(RAMDirectory@3a4b16aa lockFactory=org.apache.lucene.store.SingleInstanceLockFactory@60f0b011),segFN=segments_2,generation=2}
   [junit4]   2> 1804319 INFO  (explicit-fetchindex-cmd) [    x:collection1] o.a.s.c.SolrDeletionPolicy newest commit generation = 2
   [junit4]   2> 1804320 INFO  (explicit-fetchindex-cmd) [    x:collection1] o.a.s.u.DefaultSolrCoreState Rollback old IndexWriter... core=collection1
   [junit4]   2> 1804320 INFO  (explicit-fetchindex-cmd) [    x:collection1] o.a.s.h.IndexFetcher Starting download (fullCopy=false) to MockDirectoryWrapper(RAMDirectory@5e73292d lockFactory=org.apache.lucene.store.SingleInstanceLockFactory@6962bcf9)
   [junit4]   2> 1804320 INFO  (explicit-fetchindex-cmd) [    x:collection1] o.a.s.h.IndexFetcher Skipping download for _0.si because it already exists
   [junit4]   2> 1804320 INFO  (explicit-fetchindex-cmd) [    x:collection1] o.a.s.h.IndexFetcher Skipping download for _0_FSTOrd50_0.doc because it already exists
   [junit4]   2> 1804320 INFO  (explicit-fetchindex-cmd) [    x:collection1] o.a.s.h.IndexFetcher Skipping download for _0_FSTOrd50_0.tix because it already exists
   [junit4]   2> 1804320 INFO  (explicit-fetchindex-cmd) [    x:collection1] o.a.s.h.IndexFetcher Skipping download for _0.nvd because it already exists
   [junit4]   2> 1804320 INFO  (explicit-fetchindex-cmd) [    x:collection1] o.a.s.h.IndexFetcher Skipping download for _0.fdx because it already exists
   [junit4]   2> 1804320 INFO  (explicit-fetchindex-cmd) [    x:collection1] o.a.s.h.IndexFetcher Skipping download for _0.fdt because it already exists
   [junit4]   2> 1804320 INFO  (explicit-fetchindex-cmd) [    x:collection1] o.a.s.h.IndexFetcher Skipping download for _0_FSTOrd50_0.tbk because it already exists
   [junit4]   2> 1804320 INFO  (explicit-fetchindex-cmd) [    x:collection1] o.a.s.h.IndexFetcher Skipping download for _0.fnm because it already exists
   [junit4]   2> 1804320 INFO  (explicit-fetchindex-cmd) [    x:collection1] o.a.s.h.IndexFetcher Skipping download for _0.nvm because it already exists
   [junit4]   2> 1804323 INFO  (qtp238019867-14395) [    x:collection1] o.a.s.c.S.Request [collection1]  webapp=/solr path=/replication params={generation=3&qt=/replication&file=_1_FSTOrd50_0.doc&checksum=true&wt=filestream&command=filecontent} status=0 QTime=0
   [junit4]   2> 1804326 INFO  (qtp238019867-14390) [    x:collection1] o.a.s.c.S.Request [collection1]  webapp=/solr path=/replication params={generation=3&qt=/replication&file=_1.si&checksum=true&wt=filestream&command=filecontent} status=0 QTime=0
   [junit4]   2> 1804329 INFO  (qtp238019867-14391) [    x:collection1] o.a.s.c.S.Request [collection1]  webapp=/solr path=/replication params={generation=3&qt=/replication&file=_1.nvd&checksum=true&wt=filestream&command=filecontent} status=0 QTime=0
   [junit4]   2> 1804331 INFO  (qtp238019867-14392) [    x:collection1] o.a.s.c.S.Request [collection1]  webapp=/solr path=/replication params={generation=3&qt=/replication&file=_1_FSTOrd50_0.tix&checksum=true&wt=filestream&command=filecontent} status=0 QTime=0
   [junit4]   2> 1804333 INFO  (qtp238019867-14393) [    x:collection1] o.a.s.c.S.Request [collection1]  webapp=/solr path=/replication params={generation=3&qt=/replication&file=_1.fdx&checksum=true&wt=filestream&command=filecontent} status=0 QTime=0
   [junit4]   2> 1804336 INFO  (qtp238019867-14394) [    x:collection1] o.a.s.c.S.Request [collection1]  webapp=/solr path=/replication params={generation=3&qt=/replication&file=_1.fnm&checksum=true&wt=filestream&command=filecontent} status=0 QTime=0
   [junit4]   2> 1804339 INFO  (qtp238019867-14395) [    x:collection1] o.a.s.c.S.Request [collection1]  webapp=/solr path=/replication params={generation=3&qt=/replication&file=_1.nvm&checksum=true&wt=filestream&command=filecontent} status=0 QTime=0
   [junit4]   2> 1804341 INFO  (qtp238019867-14390) [    x:collection1] o.a.s.c.S.Request [collection1]  webapp=/solr path=/replication params={generation=3&qt=/replication&file=_1_FSTOrd50_0.tbk&checksum=true&wt=filestream&command=filecontent} status=0 QTime=0
   [junit4]   2> 1804343 INFO  (qtp238019867-14391) [    x:collection1] o.a.s.c.S.Request [collection1]  webapp=/solr path=/replication params={generation=3&qt=/replication&file=_1.fdt&checksum=true&wt=filestream&command=filecontent} status=0 QTime=0
   [junit4]   2> 1804346 INFO  (qtp238019867-14392) [    x:collection1] o.a.s.c.S.Request [collection1]  webapp=/solr path=/replication params={generation=3&qt=/replication&file=segments_3&checksum=true&wt=filestream&command=filecontent} status=0 QTime=0
   [junit4]   2> 1804347 INFO  (explicit-fetchindex-cmd) [    x:collection1] o.a.s.h.IndexFetcher Total time taken for download (fullCopy=false,bytesDownloaded=1622) : 0 secs (null bytes/sec) to MockDirectoryWrapper(RAMDirectory@5e73292d lockFactory=org.apache.lucene.store.SingleInstanceLockFactory@6962bcf9)
   [junit4]   2> 1804348 INFO  (explicit-fetchindex-cmd) [    x:collection1] o.a.s.u.RandomMergePolicy RandomMergePolicy wrapping class org.apache.lucene.index.TieredMergePolicy: [TieredMergePolicy: maxMergeAtOnce=34, maxMergeAtOnceExplicit=39, maxMergedSegmentMB=34.7900390625, floorSegmentMB=0.2734375, forceMergeDeletesPctAllowed=12.528484150752808, segmentsPerTier=47.0, maxCFSSegmentSizeMB=8.796093022207999E12, noCFSRatio=0.24026507931608343
   [junit4]   2> 1804348 INFO  (explicit-fetchindex-cmd) [    x:collection1] o.a.s.c.SolrDeletionPolicy SolrDeletionPolicy.onInit: commits: num=2
   [junit4]   2> 	commit{dir=MockDirectoryWrapper(RAMDirectory@3a4b16aa lockFactory=org.apache.lucene.store.SingleInstanceLockFactory@60f0b011),segFN=segments_2,generation=2}
   [junit4]   2> 	commit{dir=MockDirectoryWrapper(RAMDirectory@3a4b16aa lockFactory=org.apache.lucene.store.SingleInstanceLockFactory@60f0b011),segFN=segments_3,generation=3}
   [junit4]   2> 1804348 INFO  (explicit-fetchindex-cmd) [    x:collection1] o.a.s.c.SolrDeletionPolicy newest commit generation = 3
   [junit4]   2> 1804349 INFO  (explicit-fetchindex-cmd) [    x:collection1] o.a.s.u.DefaultSolrCoreState New IndexWriter is ready to be used.
   [junit4]   2> 1804349 INFO  (explicit-fetchindex-cmd) [    x:collection1] o.a.s.s.SolrIndexSearcher Opening Searcher@2dd0c01a[collection1] main
   [junit4]   2> 1804349 INFO  (searcherExecutor-5546-thread-1-processing-x:collection1) [    x:collection1] o.a.s.c.SolrCore [collection1] Registered new searcher Searcher@2dd0c01a[collection1] main{ExitableDirectoryReader(UninvertingDirectoryReader(Uninverting(_0(5.5.0):C1) Uninverting(_1(5.5.0):C1)))}
   [junit4]   2> 1804350 INFO  (explicit-fetchindex-cmd) [    x:collection1] o.a.s.c.CachingDirectoryFactory looking to close /Users/jenkins/workspace/Lucene-Solr-5.x-MacOSX/solr/build/solr-core/test/J1/temp/solr.handler.TestReplicationHandler_C652CF3E55D7FBCD-001/solr-instance-002/./collection1/data/index.20160127201536522 [CachedDir<<refCount=0;path=/Users/jenkins/workspace/Lucene-Solr-5.x-MacOSX/solr/build/solr-core/test/J1/temp/solr.handler.TestReplicationHandler_C652CF3E55D7FBCD-001/solr-instance-002/./collection1/data/index.20160127201536522;done=true>>]
   [junit4]   2> 1804350 INFO  (explicit-fetchindex-cmd) [    x:collection1] o.a.s.c.CachingDirectoryFactory Closing directory: /Users/jenkins/workspace/Lucene-Solr-5.x-MacOSX/solr/build/solr-core/test/J1/temp/solr.handler.TestReplicationHandler_C652CF3E55D7FBCD-001/solr-instance-002/./collection1/data/index.20160127201536522
   [junit4]   2> 1804350 INFO  (qtp1502929738-14411) [    x:collection1] o.a.s.c.S.Request [collection1]  webapp=/solr path=/replication params={wait=true&masterUrl=http://127.0.0.1:61791/solr/collection1/replication&command=fetchindex} status=0 QTime=40
   [junit4]   2> 1804355 INFO  (qtp238019867-14393) [    x:collection1] o.a.s.c.S.Request [collection1]  webapp=/solr path=/replication params={slave=false&qt=/replication&wt=javabin&version=2&command=details} status=0 QTime=0
   [junit4]   2> 1804355 INFO  (qtp1502929738-14412) [    x:collection1] o.a.s.c.S.Request [collection1]  webapp=/solr path=/replication params={_trace=getDetails&qt=/replication&wt=javabin&version=2&command=details} status=0 QTime=2
   [junit4]   2> 1804359 INFO  (qtp238019867-14394) [    x:collection1] o.a.s.u.p.LogUpdateProcessorFactory [collection1]  webapp=/solr path=/update params={wt=javabin&version=2}{add=[2]} 0 0
   [junit4]   2> 1804361 INFO  (qtp238019867-14395) [    x:collection1] o.a.s.u.DirectUpdateHandler2 start commit{,optimize=false,openSearcher=true,waitSearcher=true,expungeDeletes=false,softCommit=false,prepareCommit=false}
   [junit4]   2> 1804363 INFO  (qtp238019867-14395) [    x:collection1] o.a.s.c.SolrDeletionPolicy SolrDeletionPolicy.onCommit: commits: num=4
   [junit4]   2> 	commit{dir=MockDirectoryWrapper(RAMDirectory@40de1fcb lockFactory=org.apache.lucene.store.SingleInstanceLockFactory@6333aff3),segFN=segments_1,generation=1}
   [junit4]   2> 	commit{dir=MockDirectoryWrapper(RAMDirectory@40de1fcb lockFactory=org.apache.lucene.store.SingleInstanceLockFactory@6333aff3),segFN=segments_2,generation=2}
   [junit4]   2> 	commit{dir=MockDirectoryWrapper(RAMDirectory@40de1fcb lockFactory=org.apache.lucene.store.SingleInstanceLockFactory@6333aff3),segFN=segments_3,generation=3}
   [junit4]   2> 	commit{dir=MockDirectoryWrapper(RAMDirectory@40de1fcb lockFactory=org.apache.lucene.store.SingleInstanceLockFactory@6333aff3),segFN=segments_4,generation=4}
   [junit4]   2> 1804363 INFO  (qtp238019867-14395) [    x:collection1] o.a.s.c.SolrDeletionPolicy newest commit generation = 4
   [junit4]   2> 1804363 INFO  (qtp238019867-14395) [    x:collection1] o.a.s.s.SolrIndexSearcher Opening Searcher@3d182952[collection1] main
   [junit4]   2> 1804363 INFO  (qtp238019867-14395) [    x:collection1] o.a.s.u.DirectUpdateHandler2 end_commit_flush
   [junit4]   2> 1804363 INFO  (searcherExecutor-5536-thread-1-processing-x:collection1) [    x:collection1] o.a.s.c.SolrCore [collection1] Registered new searcher Searcher@3d182952[collection1] main{ExitableDirectoryReader(UninvertingDirectoryReader(Uninverting(_0(5.5.0):C1) Uninverting(_1(5.5.0):C1) Uninverting(_2(5.5.0):C1)))}
   [junit4]   2> 1804363 INFO  (qtp238019867-14395) [    x:collection1] o.a.s.u.p.LogUpdateProcessorFactory [collection1]  webapp=/solr path=/update params={waitSearcher=true&commit=true&softCommit=false&wt=javabin&version=2}{commit=} 0 2
   [junit4]   2> 1804365 WARN  (explicit-fetchindex-cmd) [    x:collection1] o.a.s.h.IndexFetcher 'masterUrl' must be specified without the /replication suffix
   [junit4]   2> 1804368 INFO  (qtp238019867-14390) [    x:collection1] o.a.s.c.S.Request [collection1]  webapp=/solr path=/replication params={qt=/replication&wt=javabin&version=2&command=indexversion} status=0 QTime=0
   [junit4]   2> 1804368 INFO  (explicit-fetchindex-cmd) [    x:collection1] o.a.s.h.IndexFetcher Master's generation: 4
   [junit4]   2> 1804368 INFO  (explicit-fetchindex-cmd) [    x:collection1] o.a.s.h.IndexFetcher Slave's generation: 3
   [junit4]   2> 1804368 INFO  (explicit-fetchindex-cmd) [    x:collection1] o.a.s.h.IndexFetcher Starting replication process
   [junit4]   2> 1804371 INFO  (qtp238019867-14391) [    x:collection1] o.a.s.c.S.Request [collection1]  webapp=/solr path=/replication params={generation=4&qt=/replication&wt=javabin&version=2&command=filelist} status=0 QTime=0
   [junit4]   2> 1804371 INFO  (explicit-fetchindex-cmd) [    x:collection1] o.a.s.h.IndexFetcher Number of files in latest index in master: 28
   [junit4]   2> 1804371 INFO  (explicit-fetchindex-cmd) [    x:collection1] o.a.s.c.CachingDirectoryFactory return new directory for /Users/jenkins/workspace/Lucene-Solr-5.x-MacOSX/solr/build/solr-core/test/J1/temp/solr.handler.TestReplicationHandler_C652CF3E55D7FBCD-001/solr-instance-002/./collection1/data/index.20160127201536575
   [junit4]   2> 1804372 INFO  (explicit-fetchindex-cmd) [    x:collection1] o.a.s.u.DefaultSolrCoreState Rollback old IndexWriter... core=collection1
   [junit4]   2> 1804373 INFO  (explicit-fetchindex-cmd) [    x:collection1] o.a.s.u.RandomMergePolicy RandomMergePolicy wrapping class org.apache.lucene.index.LogByteSizeMergePolicy: [LogByteSizeMergePolicy: minMergeSize=1677721, mergeFactor=43, maxMergeSize=2147483648, maxMergeSizeForForcedMerge=9223372036854775807, calibrateSizeByDeletes=false, maxMergeDocs=2147483647, maxCFSSegmentSizeMB=8.796093022207999E12, noCFSRatio=0.24345491059331997]
   [junit4]   2> 1804373 INFO  (explicit-fetchindex-cmd) [    x:collection1] o.a.s.c.SolrDeletionPolicy SolrDeletionPolicy.onInit: commits: num=1
   [junit4]   2> 	commit{dir=MockDirectoryWrapper(RAMDirectory@3a4b16aa lockFactory=org.apache.lucene.store.SingleInstanceLockFactory@60f0b011),segFN=segments_3,generation=3}
   [junit4]   2> 1804373 INFO  (explicit-fetchindex-cmd) [    x:collection1] o.a.s.c.SolrDeletionPolicy newest commit generation = 3
   [junit4]   2> 1804374 INFO  (explicit-fetchindex-cmd) [    x:collection1] o.a.s.u.DefaultSolrCoreState New IndexWriter is ready to be used.
   [junit4]   2> 1804374 INFO  (explicit-fetchindex-cmd) [    x:collection1] o.a.s.c.SolrDeletionPolicy SolrDeletionPolicy.onCommit: commits: num=1
   [junit4]   2> 	commit{dir=MockDirectoryWrapper(RAMDirectory@3a4b16aa lockFactory=org.apache.lucene.store.SingleInstanceLockFactory@60f0b011),segFN=segments_3,generation=3}
   [junit4]   2> 1804374 INFO  (explicit-fetchindex-cmd) [    x:collection1] o.a.s.c.SolrDeletionPolicy newest commit generation = 3
   [junit4]   2> 1804374 INFO  (explicit-fetchindex-cmd) [    x:collection1] o.a.s.u.DefaultSolrCoreState Rollback old IndexWriter... core=collection1
   [junit4]   2> 1804374 INFO  (explicit-fetchindex-cmd) [    x:collection1] o.a.s.h.IndexFetcher Starting download (fullCopy=false) to MockDirectoryWrapper(RAMDirectory@6ca82859 lockFactory=org.apache.lucene.store.SingleInstanceLockFactory@6839a904)
   [junit4]   2> 1804374 INFO  (explicit-fetchindex-cmd) [    x:collection1] o.a.s.h.IndexFetcher Skipping download for _0.si because it already exists
   [junit4]   2> 1804375 INFO  (explicit-fetchindex-cmd) [    x:collection1] o.a.s.h.IndexFetcher Skipping download for _0_FSTOrd50_0.doc because it already exists
   [junit4]   2> 1804375 INFO  (explicit-fetchindex-cmd) [    x:collection1] o.a.s.h.IndexFetcher Skipping download for _0_FSTOrd50_0.tix because it already exists
   [junit4]   2> 1804375 INFO  (explicit-fetchindex-cmd) [    x:collection1] o.a.s.h.IndexFetcher Skipping download for _0.nvd because it already exists
   [junit4]   2> 1804375 INFO  (explicit-fetchindex-cmd) [    x:collection1] o.a.s.h.IndexFetcher Skipping download for _0.fdx because it already exists
   [junit4]   2> 1804375 INFO  (explicit-fetchindex-cmd) [    x:collection1] o.a.s.h.IndexFetcher Skipping download for _0.fdt because it already exists
   [junit4]   2> 1804375 INFO  (explicit-fetchindex-cmd) [    x:collection1] o.a.s.h.IndexFetcher Skipping download for _0_FSTOrd50_0.tbk because it already exists
   [junit4]   2> 1804375 INFO  (explicit-fetchindex-cmd) [    x:collection1] o.a.s.h.IndexFetcher Skipping download for _0.fnm because it already exists
   [junit4]   2> 1804375 INFO  (explicit-fetchindex-cmd) [    x:collection1] o.a.s.h.IndexFetcher Skipping download for _0.nvm because it already exists
   [junit4]   2> 1804375 INFO  (explicit-fetchindex-cmd) [    x:collection1] o.a.s.h.IndexFetcher Skipping download for _1_FSTOrd50_0.doc because it already exists
   [junit4]   2> 1804375 INFO  (explicit-fetchindex-cmd) [    x:collection1] o.a.s.h.IndexFetcher Skipping download for _1.si because it already exists
   [junit4]   2> 1804375 INFO  (explicit-fetchindex-cmd) [    x:collection1] o.a.s.h.IndexFetcher Skipping download for _1.nvd because it already exists
   [junit4]   2> 1804375 INFO  (explicit-fetchindex-cmd) [    x:collection1] o.a.s.h.IndexFetcher Skipping download for _1_FSTOrd50_0.tix because it already exists
   [junit4]   2> 1804375 INFO  (explicit-fetchindex-cmd) [    x:collection1] o.a.s.h.IndexFetcher Skipping download for _1.fdx because it already exists
   [junit4]   2> 1804375 INFO  (explicit-fetchindex-cmd) [    x:collection1] o.a.s.h.IndexFetcher Skipping download for _1.fnm because it already exists
   [junit4]   2> 1804375 INFO  (explicit-fetchindex-cmd) [    x:collection1] o.a.s.h.IndexFetcher Skipping download for _1.nvm because it already exists
   [junit4]   2> 1804375 INFO  (explicit-fetchindex-cmd) [    x:collection1] o.a.s.h.IndexFetcher Skipping download for _1_FSTOrd50_0.tbk because it already exists
   [junit4]   2> 1804375 INFO  (explicit-fetchindex-cmd) [    x:collection1] o.a.s.h.IndexFetcher Skipping download for _1.fdt because it already exists
   [junit4]   2> 1804377 INFO  (qtp238019867-14392) [    x:collection1] o.a.s.c.S.Request [collection1]  webapp=/solr path=/replication params={generation=4&qt=/replication&file=_2_FSTOrd50_0.tbk&checksum=true&wt=filestream&command=filecontent} status=0 QTime=0
   [junit4]   2> 1804380 INFO  (qtp238019867-14393) [    x:collection1] o.a.s.c.S.Request [collection1]  webapp=/solr path=/replication params={generation=4&qt=/replication&file=_2.nvd&checksum=true&wt=filestream&command=filecontent} status=0 QTime=0
   [junit4]   2> 1804386 INFO  (qtp238019867-14394) [    x:collection1] o.a.s.c.S.Request [collection1]  webapp=/solr path=/replication params={generation=4&qt=/replication&file=_2.si&checksum=true&wt=filestream&command=filecontent} status=0 QTime=0
   [junit4]   2> 1804388 INFO  (qtp238019867-14395) [    x:collection1] o.a.s.c.S.Request [collection1]  webapp=/solr path=/replication params={generation=4&qt=/replication&file=_2_FSTOrd50_0.tix&checksum=true&wt=filestream&command=filecontent} status=0 QTime=0
   [junit4]   2> 1804391 INFO  (qtp238019867-14390) [    x:collection1] o.a.s.c.S.Request [collection1]  webapp=/solr path=/replication params={generation=4&qt=/replication&file=_2.fdt&checksum=true&wt=filestream&command=filecontent} status=0 QTime=0
   [junit4]   2> 1804394 INFO  (qtp238019867-14391) [    x:collection1] o.a.s.c.S.Request [collection1]  webapp=/solr path=/replication params={generation=4&qt=/replication&file=_2.fnm&checksum=true&wt=filestream&command=filecontent} status=0 QTime=0
   [junit4]   2> 1804398 INFO  (qtp238019867-14392) [    x:collection1] o.a.s.c.S.Request [collection1]  webapp=/solr path=/replication params={generation=4&qt=/replication&file=_2.nvm&checksum=true&wt=filestream&command=filecontent} status=0 QTime=0
   [junit4]   2> 1804400 INFO  (qtp238019867-14393) [    x:collection1] o.a.s.c.S.Request [collection1]  webapp=/solr path=/replication params={generation=4&qt=/replication&file=_2.fdx&checksum=true&wt=filestream&command=filecontent} status=0 QTime=0
   [junit4]   2> 1804403 INFO  (qtp238019867-14394) [    x:collection1] o.a.s.c.S.Request [collection1]  webapp=/solr path=/replication params={generation=4&qt=/replication&file=_2_FSTOrd50_0.doc&checksum=true&wt=filestream&command=filecontent} status=0 QTime=0
   [junit4]   2> 1804405 INFO  (qtp238019867-14395) [    x:collection1] o.a.s.c.S.Request [collection1]  webapp=/solr path=/replication params={generation=4&qt=/replication&file=segments_4&checksum=true&wt=filestream&command=filecontent} status=0 QTime=0
   [junit4]   2> 1804406 INFO  (explicit-fetchindex-cmd) [    x:collection1] o.a.s.h.IndexFetcher Total time taken for download (fullCopy=false,bytesDownloaded=1685) : 0 secs (null bytes/sec) to MockDirectoryWrapper(RAMDirectory@6ca82859 lockFactory=org.apache.lucene.store.SingleInstanceLockFactory@6839a904)
   [junit4]   2> 1804408 INFO  (explicit-fetchindex-cmd) [    x:collection1] o.a.s.u.RandomMergePolicy RandomMergePolicy wrapping class org.apache.lucene.index.TieredMergePolicy: [TieredMergePolicy: maxMergeAtOnce=34, maxMergeAtOnceExplicit=39, maxMergedSegmentMB=34.7900390625, floorSegmentMB=0.2734375, forceMergeDeletesPctAllowed=12.528484150752808, segmentsPerTier=47.0, maxCFSSegmentSizeMB=8.796093022207999E12, noCFSRatio=0.24026507931608343
   [junit4]   2> 1804408 INFO  (explicit-fetchindex-cmd) [    x:collection1] o.a.s.c.SolrDeletionPolicy SolrDeletionPolicy.onInit: commits: num=2
   [junit4]   2> 	commit{dir=MockDirectoryWrapper(RAMDirectory@3a4b16aa lockFactory=org.apache.lucene.store.SingleInstanceLockFactory@60f0b011),segFN=segments_3,generation=3}
   [junit4]   2> 	commit{dir=MockDirectoryWrapper(RAMDirectory@3a4b16aa lockFactory=org.apache.lucene.store.SingleInstanceLockFactory@60f0b011),segFN=segments_4,generation=4}
   [junit4]   2> 1804408 INFO  (explicit-fetchindex-cmd) [    x:collection1] o.a.s.c.SolrDeletionPolicy newest commit generation = 4
   [junit4]   2> 1804409 INFO  (explicit-fetchindex-cmd) [    x:collection1] o.a.s.u.DefaultSolrCoreState New IndexWriter is ready to be used.
   [junit4]   2> 1804409 INFO  (explicit-fetchindex-cmd) [    x:collection1] o.a.s.s.SolrIndexSearcher Opening Searcher@60979e84[collection1] main
   [junit4]   2> 1804409 INFO  (searcherExecutor-5546-thread-1-processing-x:collection1) [    x:collection1] o.a.s.c.SolrCore [collection1] Registered new searcher Searcher@60979e84[collection1] main{ExitableDirectoryReader(UninvertingDirectoryReader(Uninverting(_0(5.5.0):C1) Uninverting(_1(5.5.0):C1) Uninverting(_2(5.5.0):C1)))}
   [junit4]   2> 1804410 INFO  (explicit-fetchindex-cmd) [    x:collection1] o.a.s.c.CachingDirectoryFactory looking to close /Users/jenkins/workspace/Lucene-Solr-5.x-MacOSX/solr/build/solr-core/test/J1/temp/solr.handler.TestReplicationHandler_C652CF3E55D7FBCD-001/solr-instance-002/./collection1/data/index.20160127201536575 [CachedDir<<refCount=0;path=/Users/jenkins/workspace/Lucene-Solr-5.x-MacOSX/solr/build/solr-core/test/J1/temp/solr.handler.TestReplicationHandler_C652CF3E55D7FBCD-001/solr-instance-002/./collection1/data/index.20160127201536575;done=true>>]
   [junit4]   2> 1804410 INFO  (explicit-fetchindex-cmd) [    x:collection1] o.a.s.c.CachingDirectoryFactory Closing directory: /Users/jenkins/workspace/Lucene-Solr-5.x-MacOSX/solr/build/solr-core/test/J1/temp/solr.handler.TestReplicationHandler_C652CF3E55D7FBCD-001/solr-instance-002/./collection1/data/index.20160127201536575
   [junit4]   2> 1804410 INFO  (qtp1502929738-14413) [    x:collection1] o.a.s.c.S.Request [collection1]  webapp=/solr path=/replication params={wait=true&masterUrl=http://127.0.0.1:61791/solr/collection1/replication&command=fetchindex} status=0 QTime=45
   [junit4]   2> 1804412 INFO  (TEST-TestReplicationHandler.doTestDetails-seed#[C652CF3E55D7FBCD]) [    ] o.a.s.SolrTestCaseJ4 Writing core.properties file to /Users/jenkins/workspace/Lucene-Solr-5.x-MacOSX/solr/build/solr-core/test/J1/temp/solr.handler.TestReplicationHandler_C652CF3E55D7FBCD-001/solr-instance-003/collection1
   [junit4]   2> 1804419 INFO  (TEST-TestReplicationHandler.doTestDetails-seed#[C652CF3E55D7FBCD]) [    ] o.e.j.s.Server jetty-9.2.13.v20150730
   [junit4]   2> 1804421 INFO  (TEST-TestReplicationHandler.doTestDetails-seed#[C652CF3E55D7FBCD]) [    ] o.e.j.s.h.ContextHandler Started o.e.j.s.ServletContextHandler@4c9a5a08{/solr,null,AVAILABLE}
   [junit4]   2> 1804423 INFO  (TEST-TestReplicationHandler.doTestDetails-seed#[C652CF3E55D7FBCD]) [    ] o.e.j.s.ServerConnector Started ServerConnector@363e7791{HTTP/1.1}{127.0.0.1:61801}
   [junit4]   2> 1804423 INFO  (TEST-TestReplicationHandler.doTestDetails-seed#[C652CF3E55D7FBCD]) [    ] o.e.j.s.Server Started @1809585ms
   [junit4]   2> 1804423 INFO  (TEST-TestReplicationHandler.doTestDetails-seed#[C652CF3E55D7FBCD]) [    ] o.a.s.c.s.e.JettySolrRunner Jetty properties: {solr.data.dir=/Users/jenkins/workspace/Lucene-Solr-5.x-MacOSX/solr/build/solr-core/test/J1/temp/solr.handler.TestReplicationHandler_C652CF3E55D7FBCD-001/solr-instance-003/collection1/data, hostContext=/solr, hostPort=61801}
   [junit4]   2> 1804423 INFO  (TEST-TestReplicationHandler.doTestDetails-seed#[C652CF3E55D7FBCD]) [    ] o.a.s.s.SolrDispatchFilter SolrDispatchFilter.init(): sun.misc.Launcher$AppClassLoader@74a14482
   [junit4]   2> 1804423 INFO  (TEST-TestReplicationHandler.doTestDetails-seed#[C652CF3E55D7FBCD]) [    ] o.a.s.c.SolrResourceLoader new SolrResourceLoader for directory: '/Users/jenkins/workspace/Lucene-Solr-5.x-MacOSX/solr/build/solr-core/test/J1/temp/solr.handler.TestReplicationHandler_C652CF3E55D7FBCD-001/solr-instance-003'
   [junit4]   2> 1804423 INFO  (TEST-TestReplicationHandler.doTestDetails-seed#[C652CF3E55D7FBCD]) [    ] o.a.s.c.SolrResourceLoader JNDI not configured for solr (NoInitialContextEx)
   [junit4]   2> 1804423 INFO  (TEST-TestReplicationHandler.doTestDetails-seed#[C652CF3E55D7FBCD]) [    ] o.a.s.c.SolrResourceLoader solr home defaulted to 'solr/' (could not find system property or JNDI)
   [junit4]   2> 1804423 INFO  (TEST-TestReplicationHandler.doTestDetails-seed#[C652CF3E55D7FBCD]) [    ] o.a.s.c.SolrXmlConfig Loading container configuration from /Users/jenkins/workspace/Lucene-Solr-5.x-MacOSX/solr/build/solr-core/test/J1/temp/solr.handler.TestReplicationHandler_C652CF3E55D7FBCD-001/solr-instance-003/solr.xml
   [junit4]   2> 1804427 INFO  (TEST-TestReplicationHandler.doTestDetails-seed#[C652CF3E55D7FBCD]) [    ] o.a.s.c.CorePropertiesLocator Config-defined core root directory: /Users/jenkins/workspace/Lucene-Solr-5.x-MacOSX/solr/build/solr-core/test/J1/temp/solr.handler.TestReplicationHandler_C652CF3E55D7FBCD-001/solr-instance-003/.
   [junit4]   2> 1804427 INFO  (TEST-TestReplicationHandler.doTestDetails-seed#[C652CF3E55D7FBCD]) [    ] o.a.s.c.CoreContainer New CoreContainer 1285224016
   [junit4]   2> 1804427 INFO  (TEST-TestReplicationHandler.doTestDetails-seed#[C652CF3E55D7FBCD]) [    ] o.a.s.c.CoreContainer Loading cores into CoreContainer [instanceDir=/Users/jenkins/workspace/Lucene-Solr-5.x-MacOSX/solr/build/solr-core/test/J1/temp/solr.handler.TestReplicationHandler_C652CF3E55D7FBCD-001/solr-instance-003]
   [junit4]   2> 1804427 WARN  (TEST-TestReplicationHandler.doTestDetails-seed#[C652CF3E55D7FBCD]) [    ] o.a.s.c.CoreContainer Couldn't add files from /Users/jenkins/workspace/Lucene-Solr-5.x-MacOSX/solr/build/solr-core/test/J1/temp/solr.handler.TestReplicationHandler_C652CF3E55D7FBCD-001/solr-instance-003/lib to classpath: /Users/jenkins/workspace/Lucene-Solr-5.x-MacOSX/solr/build/solr-core/test/J1/temp/solr.handler.TestReplicationHandler_C652CF3E55D7FBCD-001/solr-instance-003/lib
   [junit4]   2> 1804428 INFO  (TEST-TestReplicationHandler.doTestDetails-seed#[C652CF3E55D7FBCD]) [    ] o.a.s.h.c.HttpShardHandlerFactory created with socketTimeout : 90000,urlScheme : ,connTimeout : 15000,maxConnectionsPerHost : 20,maxConnections : 10000,corePoolSize : 0,maximumPoolSize : 2147483647,maxThreadIdleTime : 5,sizeOfQueue : -1,fairnessPolicy : false,useRetries : false,
   [junit4]   2> 1804428 INFO  (TEST-TestReplicationHandler.doTestDetails-seed#[C652CF3E55D7FBCD]) [    ] o.a.s.u.UpdateShardHandler Creating UpdateShardHandler HTTP client with params: socketTimeout=340000&connTimeout=45000&retry=true
   [junit4]   2> 1804429 INFO  (TEST-TestReplicationHandler.doTestDetails-seed#[C652CF3E55D7FBCD]) [    ] o.a.s.l.LogWatcher SLF4J impl is org.slf4j.impl.Log4jLoggerFactory
   [junit4]   2> 1804429 INFO  (TEST-TestReplicationHandler.doTestDetails-seed#[C652CF3E55D7FBCD]) [    ] o.a.s.l.LogWatcher Registering Log Listener [Log4j (org.slf4j.impl.Log4jLoggerFactory)]
   [junit4]   2> 1804429 INFO  (TEST-TestReplicationHandler.doTestDetails-seed#[C652CF3E55D7FBCD]) [    ] o.a.s.c.CoreContainer Security conf doesn't exist. Skipping setup for authorization module.
   [junit4]   2> 1804429 INFO  (TEST-TestReplicationHandler.doTestDetails-seed#[C652CF3E55D7FBCD]) [    ] o.a.s.c.CoreContainer No authentication plugin used.
   [junit4]   2> 1804430 INFO  (TEST-TestReplicationHandler.doTestDetails-seed#[C652CF3E55D7FBCD]) [    ] o.a.s.c.CorePropertiesLocator Looking for core definitions underneath /Users/jenkins/workspace/Lucene-Solr-5.x-MacOSX/solr/build/solr-core/test/J1/temp/solr.handler.TestReplicationHandler_C652CF3E55D7FBCD-001/solr-instance-003/.
   [junit4]   2> 1804432 INFO  (TEST-TestReplicationHandler.doTestDetails-seed#[C652CF3E55D7FBCD]) [    ] o.a.s.c.CoreDescriptor Created CoreDescriptor: {name=collection1, config=solrconfig.xml, loadOnStartup=true, schema=schema.xml, configSetProperties=configsetprops.json, transient=false, dataDir=data/}
   [junit4]   2> 1804432 INFO  (TEST-TestReplicationHandler.doTestDetails-seed#[C652CF3E55D7FBCD]) [    ] o.a.s.c.CorePropertiesLocator Found core collection1 in /Users/jenkins/workspace/Lucene-Solr-5.x-MacOSX/solr/build/solr-core/test/J1/temp/solr.handler.TestReplicationHandler_C652CF3E55D7FBCD-001/solr-instance-003/./collection1
   [junit4]   2> 1804432 INFO  (TEST-TestReplicationHandler.doTestDetails-seed#[C652CF3E55D7FBCD]) [    ] o.a.s.c.CorePropertiesLocator Found 1 core definitions
   [junit4]   2> 1804433 INFO  (coreLoadExecutor-5559-thread-1) [    ] o.a.s.c.SolrResourceLoader new SolrResourceLoader for directory: '/Users/jenkins/workspace/Lucene-Solr-5.x-MacOSX/solr/build/solr-core/test/J1/temp/solr.handler.TestReplicationHandler_C652CF3E55D7FBCD-001/solr-instance-003/collection1'
   [junit4]   2> 1804433 INFO  (TEST-TestReplicationHandler.doTestDetails-seed#[C652CF3E55D7FBCD]) [    ] o.a.s.s.SolrDispatchFilter user.dir=/Users/jenkins/workspace/Lucene-Solr-5.x-MacOSX/solr/build/solr-core/test/J1
   [junit4]   2> 1804434 INFO  (TEST-TestReplicationHandler.doTestDetails-seed#[C652CF3E55D7FBCD]) [    ] o.a.s.s.SolrDispatchFilter SolrDispatchFilter.init() done
   [junit4]   2> 1804434 INFO  (coreLoadExecutor-5559-thread-1) [    ] o.a.s.c.SolrResourceLoader JNDI not configured for solr (NoInitialContextEx)
   [junit4]   2> 1804434 INFO  (coreLoadExecutor-5559-thread-1) [    ] o.a.s.c.SolrResourceLoader solr home defaulted to 'solr/' (could not find system property or JNDI)
   [junit4]   2> 1804446 INFO  (coreLoadExecutor-5559-thread-1) [    ] o.a.s.c.SolrConfig current version of requestparams : -1
   [junit4]   2> 1804448 INFO  (coreLoadExecutor-5559-thread-1) [    ] o.a.s.c.SolrConfig Using Lucene MatchVersion: 5.5.0
   [junit4]   2> 1804462 INFO  (coreLoadExecutor-5559-thread-1) [    ] o.a.s.c.SolrConfig Loaded SolrConfig: solrconfig.xml
   [junit4]   2> 1804464 INFO  (coreLoadExecutor-5559-thread-1) [    ] o.a.s.s.IndexSchema [collection1] Schema name=test
   [junit4]   2> 1804475 INFO  (coreLoadExecutor-5559-thread-1) [    ] o.a.s.s.IndexSchema unique key field: id
   [junit4]   2> 1804480 INFO  (coreLoadExecutor-5559-thread-1) [    ] o.a.s.c.ConfigSetProperties Did not find ConfigSet properties, assuming default properties: Can't find resource 'configsetprops.json' in classpath or '/Users/jenkins/workspace/Lucene-Solr-5.x-MacOSX/solr/build/solr-core/test/J1/temp/solr.handler.TestReplicationHandler_C652CF3E55D7FBCD-001/solr-instance-003/collection1'
   [junit4]   2> 1804480 INFO  (coreLoadExecutor-5559-thread-1) [    ] o.a.s.c.CoreContainer Creating SolrCore 'collection1' using configuration from instancedir /Users/jenkins/workspace/Lucene-Solr-5.x-MacOSX/solr/build/solr-core/test/J1/temp/solr.handler.TestReplicationHandler_C652CF3E55D7FBCD-001/solr-instance-003/./collection1
   [junit4]   2> 1804480 INFO  (coreLoadExecutor-5559-thread-1) [    x:collection1] o.a.s.c.SolrCore org.apache.solr.core.MockDirectoryFactory
   [junit4]   2> 1804480 INFO  (coreLoadExecutor-5559-thread-1) [    x:collection1] o.a.s.c.SolrCore [[collection1] ] Opening new SolrCore at [/Users/jenkins/workspace/Lucene-Solr-5.x-MacOSX/solr/build/solr-core/test/J1/temp/solr.handler.TestReplicationHandler_C652CF3E55D7FBCD-001/solr-instance-003/collection1], dataDir=[/Users/jenkins/workspace/Lucene-Solr-5.x-MacOSX/solr/build/solr-core/test/J1/temp/solr.handler.TestReplicationHandler_C652CF3E55D7FBCD-001/solr-instance-003/./collection1/data/]
   [junit4]   2> 1804480 INFO  (coreLoadExecutor-5559-thread-1) [    x:collection1] o.a.s.c.SolrCore JMX monitoring not detected for core: collection1
   [junit4]   2> 1804480 INFO  (coreLoadExecutor-5559-thread-1) [    x:collection1] o.a.s.c.CachingDirectoryFactory return new directory for /Users/jenkins/workspace/Lucene-Solr-5.x-MacOSX/solr/build/solr-core/test/J1/temp/solr.handler.TestReplicationHandler_C652CF3E55D7FBCD-001/solr-instance-003/./collection1/data
   [junit4]   2> 1804481 INFO  (coreLoadExecutor-5559-thread-1) [    x:collection1] o.a.s.c.SolrCore New index directory detected: old=null new=/Users/jenkins/workspace/Lucene-Solr-5.x-MacOSX/solr/build/solr-core/test/J1/temp/solr.handler.TestReplicationHandler_C652CF3E55D7FBCD-001/solr-instance-003/./collection1/data/index/
   [junit4]   2> 1804481 WARN  (coreLoadExecutor-5559-thread-1) [    x:collection1] o.a.s.c.SolrCore [collection1] Solr index directory '/Users/jenkins/workspace/Lucene-Solr-5.x-MacOSX/solr/build/solr-core/test/J1/temp/solr.handler.TestReplicationHandler_C652CF3E55D7FBCD-001/solr-insta

[...truncated too long message...]

ater-seed#[C652CF3E55D7FBCD]) [    x:collection1] o.a.s.c.CachingDirectoryFactory Closing directory: /Users/jenkins/workspace/Lucene-Solr-5.x-MacOSX/solr/build/solr-core/test/J1/temp/solr.handler.TestReplicationHandler_C652CF3E55D7FBCD-001/solr-instance-026/./collection1/data
   [junit4]   2> 1867395 INFO  (TEST-TestReplicationHandler.doTestRepeater-seed#[C652CF3E55D7FBCD]) [    x:collection1] o.e.j.s.h.ContextHandler Stopped o.e.j.s.ServletContextHandler@777693b0{/solr,null,UNAVAILABLE}
   [junit4]   2> 1867397 INFO  (TEST-TestReplicationHandler.doTestRepeater-seed#[C652CF3E55D7FBCD]) [    ] o.e.j.s.ServerConnector Stopped ServerConnector@72c39763{HTTP/1.1}{127.0.0.1:0}
   [junit4]   2> 1867397 INFO  (TEST-TestReplicationHandler.doTestRepeater-seed#[C652CF3E55D7FBCD]) [    ] o.a.s.c.CoreContainer Shutting down CoreContainer instance=1310389790
   [junit4]   2> 1867397 INFO  (TEST-TestReplicationHandler.doTestRepeater-seed#[C652CF3E55D7FBCD]) [    x:collection1] o.a.s.c.SolrCore [collection1]  CLOSING SolrCore org.apache.solr.core.SolrCore@3ea829a4
   [junit4]   2> 1867397 INFO  (TEST-TestReplicationHandler.doTestRepeater-seed#[C652CF3E55D7FBCD]) [    x:collection1] o.a.s.u.DirectUpdateHandler2 closing DirectUpdateHandler2{commits=0,autocommits=0,soft autocommits=0,optimizes=0,rollbacks=0,expungeDeletes=0,docsPending=0,adds=0,deletesById=0,deletesByQuery=0,errors=0,cumulative_adds=0,cumulative_deletesById=0,cumulative_deletesByQuery=0,cumulative_errors=0}
   [junit4]   2> 1867397 INFO  (TEST-TestReplicationHandler.doTestRepeater-seed#[C652CF3E55D7FBCD]) [    x:collection1] o.a.s.u.SolrCoreState Closing SolrCoreState
   [junit4]   2> 1867397 INFO  (TEST-TestReplicationHandler.doTestRepeater-seed#[C652CF3E55D7FBCD]) [    x:collection1] o.a.s.u.DefaultSolrCoreState SolrCoreState ref count has reached 0 - closing IndexWriter
   [junit4]   2> 1867397 INFO  (TEST-TestReplicationHandler.doTestRepeater-seed#[C652CF3E55D7FBCD]) [    x:collection1] o.a.s.u.DefaultSolrCoreState closing IndexWriter with IndexWriterCloser
   [junit4]   2> 1867399 INFO  (TEST-TestReplicationHandler.doTestRepeater-seed#[C652CF3E55D7FBCD]) [    x:collection1] o.a.s.c.SolrCore [collection1] Closing main searcher on request.
   [junit4]   2> 1867399 INFO  (TEST-TestReplicationHandler.doTestRepeater-seed#[C652CF3E55D7FBCD]) [    x:collection1] o.a.s.c.CachingDirectoryFactory Closing MockDirectoryFactory - 2 directories currently being tracked
   [junit4]   2> 1867399 INFO  (TEST-TestReplicationHandler.doTestRepeater-seed#[C652CF3E55D7FBCD]) [    x:collection1] o.a.s.c.CachingDirectoryFactory looking to close /Users/jenkins/workspace/Lucene-Solr-5.x-MacOSX/solr/build/solr-core/test/J1/temp/solr.handler.TestReplicationHandler_C652CF3E55D7FBCD-001/solr-instance-027/./collection1/data/index [CachedDir<<refCount=0;path=/Users/jenkins/workspace/Lucene-Solr-5.x-MacOSX/solr/build/solr-core/test/J1/temp/solr.handler.TestReplicationHandler_C652CF3E55D7FBCD-001/solr-instance-027/./collection1/data/index;done=false>>]
   [junit4]   2> 1867399 INFO  (TEST-TestReplicationHandler.doTestRepeater-seed#[C652CF3E55D7FBCD]) [    x:collection1] o.a.s.c.CachingDirectoryFactory Closing directory: /Users/jenkins/workspace/Lucene-Solr-5.x-MacOSX/solr/build/solr-core/test/J1/temp/solr.handler.TestReplicationHandler_C652CF3E55D7FBCD-001/solr-instance-027/./collection1/data/index
   [junit4]   2> 1867399 INFO  (TEST-TestReplicationHandler.doTestRepeater-seed#[C652CF3E55D7FBCD]) [    x:collection1] o.a.s.c.CachingDirectoryFactory looking to close /Users/jenkins/workspace/Lucene-Solr-5.x-MacOSX/solr/build/solr-core/test/J1/temp/solr.handler.TestReplicationHandler_C652CF3E55D7FBCD-001/solr-instance-027/./collection1/data [CachedDir<<refCount=0;path=/Users/jenkins/workspace/Lucene-Solr-5.x-MacOSX/solr/build/solr-core/test/J1/temp/solr.handler.TestReplicationHandler_C652CF3E55D7FBCD-001/solr-instance-027/./collection1/data;done=false>>]
   [junit4]   2> 1867399 INFO  (TEST-TestReplicationHandler.doTestRepeater-seed#[C652CF3E55D7FBCD]) [    x:collection1] o.a.s.c.CachingDirectoryFactory Closing directory: /Users/jenkins/workspace/Lucene-Solr-5.x-MacOSX/solr/build/solr-core/test/J1/temp/solr.handler.TestReplicationHandler_C652CF3E55D7FBCD-001/solr-instance-027/./collection1/data
   [junit4]   2> 1867401 INFO  (TEST-TestReplicationHandler.doTestRepeater-seed#[C652CF3E55D7FBCD]) [    x:collection1] o.e.j.s.h.ContextHandler Stopped o.e.j.s.ServletContextHandler@33564465{/solr,null,UNAVAILABLE}
   [junit4]   2> 1867402 INFO  (SUITE-TestReplicationHandler-seed#[C652CF3E55D7FBCD]-worker) [    ] o.a.s.SolrTestCaseJ4 ###deleteCore
   [junit4]   2> NOTE: leaving temporary files on disk at: /Users/jenkins/workspace/Lucene-Solr-5.x-MacOSX/solr/build/solr-core/test/J1/temp/solr.handler.TestReplicationHandler_C652CF3E55D7FBCD-001
   [junit4]   2> NOTE: test params are: codec=Asserting(Lucene54): {name=FSTOrd50, id=FSTOrd50, newname=FSTOrd50}, docValues:{}, sim=DefaultSimilarity, locale=en-US, timezone=Asia/Urumqi
   [junit4]   2> NOTE: Mac OS X 10.8.5 x86_64/Oracle Corporation 1.8.0_66 (64-bit)/cpus=3,threads=1,free=113244024,total=518979584
   [junit4]   2> NOTE: All tests run in this JVM: [RequestHandlersTest, HdfsDirectoryFactoryTest, ZkStateWriterTest, BlockJoinFacetRandomTest, CollectionsAPIDistributedZkTest, TestCustomDocTransformer, TestCSVResponseWriter, TestBinaryResponseWriter, IgnoreCommitOptimizeUpdateProcessorFactoryTest, TestObjectReleaseTracker, TestCharFilters, TestRangeQuery, TestSimpleTrackingShardHandler, DebugComponentTest, WordBreakSolrSpellCheckerTest, OpenExchangeRatesOrgProviderTest, TestStressRecovery, SpellCheckComponentTest, TestConfigSetsAPI, TermVectorComponentDistributedTest, CopyFieldTest, MergeStrategyTest, TestFoldingMultitermQuery, BadIndexSchemaTest, TestValueSourceCache, TestExclusionRuleCollectionAccess, TestMiniSolrCloudClusterSSL, NotRequiredUniqueKeyTest, TestLeaderInitiatedRecoveryThread, ResponseLogComponentTest, BitVectorTest, ConnectionReuseTest, DistributedFacetPivotWhiteBoxTest, TestDistributedMissingSort, SuggesterWFSTTest, FacetPivotSmallTest, CloudExitableDirectoryReaderTest, TestTrie, ChaosMonkeySafeLeaderTest, TestManagedStopFilterFactory, TestZkChroot, TestDistributedStatsComponentCardinality, SearchHandlerTest, TestFieldTypeCollectionResource, TestJsonRequest, PreAnalyzedUpdateProcessorTest, SpellCheckCollatorTest, FieldMutatingUpdateProcessorTest, TestIndexSearcher, TestCloudManagedSchemaConcurrent, TestSolrDynamicMBean, TestCoreDiscovery, OutputWriterTest, DeleteLastCustomShardedReplicaTest, CollectionsAPIAsyncDistributedZkTest, TestLRUStatsCache, TestUseDocValuesAsStored2, TestAuthenticationFramework, AliasIntegrationTest, TestSolrConfigHandlerCloud, TestDFISimilarityFactory, TestConfigReload, AddSchemaFieldsUpdateProcessorFactoryTest, NoCacheHeaderTest, TestQueryTypes, TestSchemaSimilarityResource, DistributedFacetPivotLargeTest, DistribDocExpirationUpdateProcessorTest, SpellingQueryConverterTest, TestPKIAuthenticationPlugin, TestSolr4Spatial, ConjunctionSolrSpellCheckerTest, CoreAdminCreateDiscoverTest, ConfigSetsAPITest, TestSolrQueryParserResource, TestManagedResourceStorage, SignatureUpdateProcessorFactoryTest, TestOmitPositions, TestComplexPhraseQParserPlugin, BasicDistributedZk2Test, TestUtils, CoreMergeIndexesAdminHandlerTest, TestFuzzyAnalyzedSuggestions, SortByFunctionTest, HdfsWriteToMultipleCollectionsTest, DistributedDebugComponentTest, HdfsBasicDistributedZk2Test, DirectSolrConnectionTest, ShardSplitTest, ShardRoutingCustomTest, ConvertedLegacyTest, TestCloudPivotFacet, DefaultValueUpdateProcessorTest, RulesTest, TestOverriddenPrefixQueryForCustomFieldType, TestSystemIdResolver, SuggesterTest, DateFieldTest, TestRandomForceMergePolicy, EnumFieldTest, TestInfoStreamLogging, TestRealTimeGet, FullHLLTest, FullSolrCloudDistribCmdsTest, DistanceFunctionTest, TestOrdValues, TestConfigOverlay, TestAtomicUpdateErrorCases, TestSolrDeletionPolicy2, TestStandardQParsers, TestJsonFacets, TestSolrJ, TestJettySolrRunner, PluginInfoTest, MinimalSchemaTest, TestPivotHelperCode, HLLUtilTest, HdfsLockFactoryTest, TestCollationFieldDocValues, HdfsThreadLeakTest, SolrPluginUtilsTest, TestManagedSchemaFieldTypeResource, NumericFieldsTest, IndexSchemaRuntimeFieldTest, TestSha256AuthenticationProvider, TestSchemaNameResource, UniqFieldsUpdateProcessorFactoryTest, FileUtilsTest, DateRangeFieldTest, TestHdfsUpdateLog, TestRebalanceLeaders, TestDistributedGrouping, TestBulkSchemaAPI, LeaderFailoverAfterPartitionTest, TestBlendedInfixSuggestions, BasicZkTest, TestSolrCLIRunExample, TestScoreJoinQPNoScore, TestReplicationHandler]
   [junit4] Completed [292/566 (1!)] on J1 in 64.34s, 13 tests, 1 failure <<< FAILURES!

[...truncated 865 lines...]
BUILD FAILED
/Users/jenkins/workspace/Lucene-Solr-5.x-MacOSX/build.xml:750: The following error occurred while executing this line:
/Users/jenkins/workspace/Lucene-Solr-5.x-MacOSX/build.xml:694: The following error occurred while executing this line:
/Users/jenkins/workspace/Lucene-Solr-5.x-MacOSX/build.xml:59: The following error occurred while executing this line:
/Users/jenkins/workspace/Lucene-Solr-5.x-MacOSX/solr/build.xml:233: The following error occurred while executing this line:
/Users/jenkins/workspace/Lucene-Solr-5.x-MacOSX/solr/common-build.xml:534: The following error occurred while executing this line:
/Users/jenkins/workspace/Lucene-Solr-5.x-MacOSX/lucene/common-build.xml:1477: The following error occurred while executing this line:
/Users/jenkins/workspace/Lucene-Solr-5.x-MacOSX/lucene/common-build.xml:1033: There were test failures: 566 suites (7 ignored), 2266 tests, 1 failure, 88 ignored (38 assumptions) [seed: C652CF3E55D7FBCD]

Total time: 73 minutes 37 seconds
Build step 'Invoke Ant' marked build as failure
Archiving artifacts
[WARNINGS] Skipping publisher since build result is FAILURE
Recording test results
Email was triggered for: Failure - Any
Sending email for trigger: Failure - Any



Mime
View raw message