lucene-dev mailing list archives

Site index · List index
Message view « Date » · « Thread »
Top « Date » · « Thread »
From Policeman Jenkins Server <jenk...@thetaphi.de>
Subject [JENKINS-EA] Lucene-Solr-5.4-Linux (32bit/jdk-9-ea+95) - Build # 421 - Failure!
Date Wed, 20 Jan 2016 12:31:29 GMT
Build: http://jenkins.thetaphi.de/job/Lucene-Solr-5.4-Linux/421/
Java: 32bit/jdk-9-ea+95 -server -XX:+UseParallelGC -XX:-CompactStrings

3 tests failed.
FAILED:  org.apache.solr.handler.dataimport.TestTikaEntityProcessor.testEmbeddedDocsLegacy

Error Message:


Stack Trace:
java.lang.ExceptionInInitializerError
	at __randomizedtesting.SeedInfo.seed([27CD6AAC15842238:2A691B55B350653D]:0)
	at org.apache.tika.parser.pdf.PDFParser.parse(PDFParser.java:146)
	at org.apache.tika.parser.CompositeParser.parse(CompositeParser.java:256)
	at org.apache.tika.parser.CompositeParser.parse(CompositeParser.java:256)
	at org.apache.tika.parser.AutoDetectParser.parse(AutoDetectParser.java:120)
	at org.apache.solr.handler.dataimport.TikaEntityProcessor.nextRow(TikaEntityProcessor.java:159)
	at org.apache.solr.handler.dataimport.EntityProcessorWrapper.nextRow(EntityProcessorWrapper.java:244)
	at org.apache.solr.handler.dataimport.DocBuilder.buildDocument(DocBuilder.java:476)
	at org.apache.solr.handler.dataimport.DocBuilder.buildDocument(DocBuilder.java:415)
	at org.apache.solr.handler.dataimport.DocBuilder.doFullDump(DocBuilder.java:330)
	at org.apache.solr.handler.dataimport.DocBuilder.execute(DocBuilder.java:233)
	at org.apache.solr.handler.dataimport.DataImporter.doFullImport(DataImporter.java:417)
	at org.apache.solr.handler.dataimport.DataImporter.runCmd(DataImporter.java:481)
	at org.apache.solr.handler.dataimport.DataImportHandler.handleRequestBody(DataImportHandler.java:186)
	at org.apache.solr.handler.RequestHandlerBase.handleRequest(RequestHandlerBase.java:156)
	at org.apache.solr.core.SolrCore.execute(SolrCore.java:2073)
	at org.apache.solr.util.TestHarness.query(TestHarness.java:311)
	at org.apache.solr.handler.dataimport.AbstractDataImportHandlerTestCase.runFullImport(AbstractDataImportHandlerTestCase.java:87)
	at org.apache.solr.handler.dataimport.TestTikaEntityProcessor.testEmbeddedDocsLegacy(TestTikaEntityProcessor.java:168)
	at sun.reflect.NativeMethodAccessorImpl.invoke0(Native Method)
	at sun.reflect.NativeMethodAccessorImpl.invoke(NativeMethodAccessorImpl.java:62)
	at sun.reflect.DelegatingMethodAccessorImpl.invoke(DelegatingMethodAccessorImpl.java:43)
	at java.lang.reflect.Method.invoke(Method.java:520)
	at com.carrotsearch.randomizedtesting.RandomizedRunner.invoke(RandomizedRunner.java:1764)
	at com.carrotsearch.randomizedtesting.RandomizedRunner$8.evaluate(RandomizedRunner.java:871)
	at com.carrotsearch.randomizedtesting.RandomizedRunner$9.evaluate(RandomizedRunner.java:907)
	at com.carrotsearch.randomizedtesting.RandomizedRunner$10.evaluate(RandomizedRunner.java:921)
	at com.carrotsearch.randomizedtesting.rules.SystemPropertiesRestoreRule$1.evaluate(SystemPropertiesRestoreRule.java:57)
	at org.apache.lucene.util.TestRuleSetupTeardownChained$1.evaluate(TestRuleSetupTeardownChained.java:50)
	at org.apache.lucene.util.AbstractBeforeAfterRule$1.evaluate(AbstractBeforeAfterRule.java:46)
	at org.apache.lucene.util.TestRuleThreadAndTestName$1.evaluate(TestRuleThreadAndTestName.java:49)
	at org.apache.lucene.util.TestRuleIgnoreAfterMaxFailures$1.evaluate(TestRuleIgnoreAfterMaxFailures.java:65)
	at org.apache.lucene.util.TestRuleMarkFailure$1.evaluate(TestRuleMarkFailure.java:48)
	at com.carrotsearch.randomizedtesting.rules.StatementAdapter.evaluate(StatementAdapter.java:36)
	at com.carrotsearch.randomizedtesting.ThreadLeakControl$StatementRunner.run(ThreadLeakControl.java:367)
	at com.carrotsearch.randomizedtesting.ThreadLeakControl.forkTimeoutingTask(ThreadLeakControl.java:809)
	at com.carrotsearch.randomizedtesting.ThreadLeakControl$3.evaluate(ThreadLeakControl.java:460)
	at com.carrotsearch.randomizedtesting.RandomizedRunner.runSingleTest(RandomizedRunner.java:880)
	at com.carrotsearch.randomizedtesting.RandomizedRunner$5.evaluate(RandomizedRunner.java:781)
	at com.carrotsearch.randomizedtesting.RandomizedRunner$6.evaluate(RandomizedRunner.java:816)
	at com.carrotsearch.randomizedtesting.RandomizedRunner$7.evaluate(RandomizedRunner.java:827)
	at com.carrotsearch.randomizedtesting.rules.StatementAdapter.evaluate(StatementAdapter.java:36)
	at com.carrotsearch.randomizedtesting.rules.SystemPropertiesRestoreRule$1.evaluate(SystemPropertiesRestoreRule.java:57)
	at org.apache.lucene.util.AbstractBeforeAfterRule$1.evaluate(AbstractBeforeAfterRule.java:46)
	at com.carrotsearch.randomizedtesting.rules.StatementAdapter.evaluate(StatementAdapter.java:36)
	at org.apache.lucene.util.TestRuleStoreClassName$1.evaluate(TestRuleStoreClassName.java:42)
	at com.carrotsearch.randomizedtesting.rules.NoShadowingOrOverridesOnMethodsRule$1.evaluate(NoShadowingOrOverridesOnMethodsRule.java:40)
	at com.carrotsearch.randomizedtesting.rules.NoShadowingOrOverridesOnMethodsRule$1.evaluate(NoShadowingOrOverridesOnMethodsRule.java:40)
	at com.carrotsearch.randomizedtesting.rules.StatementAdapter.evaluate(StatementAdapter.java:36)
	at com.carrotsearch.randomizedtesting.rules.StatementAdapter.evaluate(StatementAdapter.java:36)
	at com.carrotsearch.randomizedtesting.rules.StatementAdapter.evaluate(StatementAdapter.java:36)
	at org.apache.lucene.util.TestRuleAssertionsRequired$1.evaluate(TestRuleAssertionsRequired.java:54)
	at org.apache.lucene.util.TestRuleMarkFailure$1.evaluate(TestRuleMarkFailure.java:48)
	at org.apache.lucene.util.TestRuleIgnoreAfterMaxFailures$1.evaluate(TestRuleIgnoreAfterMaxFailures.java:65)
	at org.apache.lucene.util.TestRuleIgnoreTestSuites$1.evaluate(TestRuleIgnoreTestSuites.java:55)
	at com.carrotsearch.randomizedtesting.rules.StatementAdapter.evaluate(StatementAdapter.java:36)
	at com.carrotsearch.randomizedtesting.ThreadLeakControl$StatementRunner.run(ThreadLeakControl.java:367)
	at java.lang.Thread.run(Thread.java:747)
Caused by: java.lang.NumberFormatException: For input string: "9-ea"
	at java.lang.NumberFormatException.forInputString(NumberFormatException.java:65)
	at java.lang.Integer.parseInt(Integer.java:675)
	at java.lang.Integer.parseInt(Integer.java:793)
	at org.apache.pdfbox.util.PDFTextStripper.<clinit>(PDFTextStripper.java:122)
	... 57 more


FAILED:  org.apache.solr.handler.dataimport.TestTikaEntityProcessor.testSkip

Error Message:
Could not initialize class org.apache.tika.parser.pdf.PDF2XHTML

Stack Trace:
java.lang.NoClassDefFoundError: Could not initialize class org.apache.tika.parser.pdf.PDF2XHTML
	at __randomizedtesting.SeedInfo.seed([27CD6AAC15842238:E1A2C23F25CE183F]:0)
	at org.apache.tika.parser.pdf.PDFParser.parse(PDFParser.java:146)
	at org.apache.tika.parser.CompositeParser.parse(CompositeParser.java:256)
	at org.apache.tika.parser.CompositeParser.parse(CompositeParser.java:256)
	at org.apache.tika.parser.AutoDetectParser.parse(AutoDetectParser.java:120)
	at org.apache.solr.handler.dataimport.TikaEntityProcessor.nextRow(TikaEntityProcessor.java:159)
	at org.apache.solr.handler.dataimport.EntityProcessorWrapper.nextRow(EntityProcessorWrapper.java:244)
	at org.apache.solr.handler.dataimport.DocBuilder.buildDocument(DocBuilder.java:476)
	at org.apache.solr.handler.dataimport.DocBuilder.buildDocument(DocBuilder.java:415)
	at org.apache.solr.handler.dataimport.DocBuilder.doFullDump(DocBuilder.java:330)
	at org.apache.solr.handler.dataimport.DocBuilder.execute(DocBuilder.java:233)
	at org.apache.solr.handler.dataimport.DataImporter.doFullImport(DataImporter.java:417)
	at org.apache.solr.handler.dataimport.DataImporter.runCmd(DataImporter.java:481)
	at org.apache.solr.handler.dataimport.DataImportHandler.handleRequestBody(DataImportHandler.java:186)
	at org.apache.solr.handler.RequestHandlerBase.handleRequest(RequestHandlerBase.java:156)
	at org.apache.solr.core.SolrCore.execute(SolrCore.java:2073)
	at org.apache.solr.util.TestHarness.query(TestHarness.java:311)
	at org.apache.solr.handler.dataimport.AbstractDataImportHandlerTestCase.runFullImport(AbstractDataImportHandlerTestCase.java:87)
	at org.apache.solr.handler.dataimport.TestTikaEntityProcessor.testSkip(TestTikaEntityProcessor.java:118)
	at sun.reflect.NativeMethodAccessorImpl.invoke0(Native Method)
	at sun.reflect.NativeMethodAccessorImpl.invoke(NativeMethodAccessorImpl.java:62)
	at sun.reflect.DelegatingMethodAccessorImpl.invoke(DelegatingMethodAccessorImpl.java:43)
	at java.lang.reflect.Method.invoke(Method.java:520)
	at com.carrotsearch.randomizedtesting.RandomizedRunner.invoke(RandomizedRunner.java:1764)
	at com.carrotsearch.randomizedtesting.RandomizedRunner$8.evaluate(RandomizedRunner.java:871)
	at com.carrotsearch.randomizedtesting.RandomizedRunner$9.evaluate(RandomizedRunner.java:907)
	at com.carrotsearch.randomizedtesting.RandomizedRunner$10.evaluate(RandomizedRunner.java:921)
	at com.carrotsearch.randomizedtesting.rules.SystemPropertiesRestoreRule$1.evaluate(SystemPropertiesRestoreRule.java:57)
	at org.apache.lucene.util.TestRuleSetupTeardownChained$1.evaluate(TestRuleSetupTeardownChained.java:50)
	at org.apache.lucene.util.AbstractBeforeAfterRule$1.evaluate(AbstractBeforeAfterRule.java:46)
	at org.apache.lucene.util.TestRuleThreadAndTestName$1.evaluate(TestRuleThreadAndTestName.java:49)
	at org.apache.lucene.util.TestRuleIgnoreAfterMaxFailures$1.evaluate(TestRuleIgnoreAfterMaxFailures.java:65)
	at org.apache.lucene.util.TestRuleMarkFailure$1.evaluate(TestRuleMarkFailure.java:48)
	at com.carrotsearch.randomizedtesting.rules.StatementAdapter.evaluate(StatementAdapter.java:36)
	at com.carrotsearch.randomizedtesting.ThreadLeakControl$StatementRunner.run(ThreadLeakControl.java:367)
	at com.carrotsearch.randomizedtesting.ThreadLeakControl.forkTimeoutingTask(ThreadLeakControl.java:809)
	at com.carrotsearch.randomizedtesting.ThreadLeakControl$3.evaluate(ThreadLeakControl.java:460)
	at com.carrotsearch.randomizedtesting.RandomizedRunner.runSingleTest(RandomizedRunner.java:880)
	at com.carrotsearch.randomizedtesting.RandomizedRunner$5.evaluate(RandomizedRunner.java:781)
	at com.carrotsearch.randomizedtesting.RandomizedRunner$6.evaluate(RandomizedRunner.java:816)
	at com.carrotsearch.randomizedtesting.RandomizedRunner$7.evaluate(RandomizedRunner.java:827)
	at com.carrotsearch.randomizedtesting.rules.StatementAdapter.evaluate(StatementAdapter.java:36)
	at com.carrotsearch.randomizedtesting.rules.SystemPropertiesRestoreRule$1.evaluate(SystemPropertiesRestoreRule.java:57)
	at org.apache.lucene.util.AbstractBeforeAfterRule$1.evaluate(AbstractBeforeAfterRule.java:46)
	at com.carrotsearch.randomizedtesting.rules.StatementAdapter.evaluate(StatementAdapter.java:36)
	at org.apache.lucene.util.TestRuleStoreClassName$1.evaluate(TestRuleStoreClassName.java:42)
	at com.carrotsearch.randomizedtesting.rules.NoShadowingOrOverridesOnMethodsRule$1.evaluate(NoShadowingOrOverridesOnMethodsRule.java:40)
	at com.carrotsearch.randomizedtesting.rules.NoShadowingOrOverridesOnMethodsRule$1.evaluate(NoShadowingOrOverridesOnMethodsRule.java:40)
	at com.carrotsearch.randomizedtesting.rules.StatementAdapter.evaluate(StatementAdapter.java:36)
	at com.carrotsearch.randomizedtesting.rules.StatementAdapter.evaluate(StatementAdapter.java:36)
	at com.carrotsearch.randomizedtesting.rules.StatementAdapter.evaluate(StatementAdapter.java:36)
	at org.apache.lucene.util.TestRuleAssertionsRequired$1.evaluate(TestRuleAssertionsRequired.java:54)
	at org.apache.lucene.util.TestRuleMarkFailure$1.evaluate(TestRuleMarkFailure.java:48)
	at org.apache.lucene.util.TestRuleIgnoreAfterMaxFailures$1.evaluate(TestRuleIgnoreAfterMaxFailures.java:65)
	at org.apache.lucene.util.TestRuleIgnoreTestSuites$1.evaluate(TestRuleIgnoreTestSuites.java:55)
	at com.carrotsearch.randomizedtesting.rules.StatementAdapter.evaluate(StatementAdapter.java:36)
	at com.carrotsearch.randomizedtesting.ThreadLeakControl$StatementRunner.run(ThreadLeakControl.java:367)
	at java.lang.Thread.run(Thread.java:747)


FAILED:  org.apache.solr.handler.dataimport.TestTikaEntityProcessor.testIndexingWithTikaEntityProcessor

Error Message:
Could not initialize class org.apache.tika.parser.pdf.PDF2XHTML

Stack Trace:
java.lang.NoClassDefFoundError: Could not initialize class org.apache.tika.parser.pdf.PDF2XHTML
	at __randomizedtesting.SeedInfo.seed([27CD6AAC15842238:7A116B393579AC8A]:0)
	at org.apache.tika.parser.pdf.PDFParser.parse(PDFParser.java:146)
	at org.apache.tika.parser.CompositeParser.parse(CompositeParser.java:256)
	at org.apache.tika.parser.CompositeParser.parse(CompositeParser.java:256)
	at org.apache.tika.parser.AutoDetectParser.parse(AutoDetectParser.java:120)
	at org.apache.solr.handler.dataimport.TikaEntityProcessor.nextRow(TikaEntityProcessor.java:159)
	at org.apache.solr.handler.dataimport.EntityProcessorWrapper.nextRow(EntityProcessorWrapper.java:244)
	at org.apache.solr.handler.dataimport.DocBuilder.buildDocument(DocBuilder.java:476)
	at org.apache.solr.handler.dataimport.DocBuilder.buildDocument(DocBuilder.java:415)
	at org.apache.solr.handler.dataimport.DocBuilder.doFullDump(DocBuilder.java:330)
	at org.apache.solr.handler.dataimport.DocBuilder.execute(DocBuilder.java:233)
	at org.apache.solr.handler.dataimport.DataImporter.doFullImport(DataImporter.java:417)
	at org.apache.solr.handler.dataimport.DataImporter.runCmd(DataImporter.java:481)
	at org.apache.solr.handler.dataimport.DataImportHandler.handleRequestBody(DataImportHandler.java:186)
	at org.apache.solr.handler.RequestHandlerBase.handleRequest(RequestHandlerBase.java:156)
	at org.apache.solr.core.SolrCore.execute(SolrCore.java:2073)
	at org.apache.solr.util.TestHarness.query(TestHarness.java:311)
	at org.apache.solr.handler.dataimport.AbstractDataImportHandlerTestCase.runFullImport(AbstractDataImportHandlerTestCase.java:87)
	at org.apache.solr.handler.dataimport.TestTikaEntityProcessor.testIndexingWithTikaEntityProcessor(TestTikaEntityProcessor.java:112)
	at sun.reflect.NativeMethodAccessorImpl.invoke0(Native Method)
	at sun.reflect.NativeMethodAccessorImpl.invoke(NativeMethodAccessorImpl.java:62)
	at sun.reflect.DelegatingMethodAccessorImpl.invoke(DelegatingMethodAccessorImpl.java:43)
	at java.lang.reflect.Method.invoke(Method.java:520)
	at com.carrotsearch.randomizedtesting.RandomizedRunner.invoke(RandomizedRunner.java:1764)
	at com.carrotsearch.randomizedtesting.RandomizedRunner$8.evaluate(RandomizedRunner.java:871)
	at com.carrotsearch.randomizedtesting.RandomizedRunner$9.evaluate(RandomizedRunner.java:907)
	at com.carrotsearch.randomizedtesting.RandomizedRunner$10.evaluate(RandomizedRunner.java:921)
	at com.carrotsearch.randomizedtesting.rules.SystemPropertiesRestoreRule$1.evaluate(SystemPropertiesRestoreRule.java:57)
	at org.apache.lucene.util.TestRuleSetupTeardownChained$1.evaluate(TestRuleSetupTeardownChained.java:50)
	at org.apache.lucene.util.AbstractBeforeAfterRule$1.evaluate(AbstractBeforeAfterRule.java:46)
	at org.apache.lucene.util.TestRuleThreadAndTestName$1.evaluate(TestRuleThreadAndTestName.java:49)
	at org.apache.lucene.util.TestRuleIgnoreAfterMaxFailures$1.evaluate(TestRuleIgnoreAfterMaxFailures.java:65)
	at org.apache.lucene.util.TestRuleMarkFailure$1.evaluate(TestRuleMarkFailure.java:48)
	at com.carrotsearch.randomizedtesting.rules.StatementAdapter.evaluate(StatementAdapter.java:36)
	at com.carrotsearch.randomizedtesting.ThreadLeakControl$StatementRunner.run(ThreadLeakControl.java:367)
	at com.carrotsearch.randomizedtesting.ThreadLeakControl.forkTimeoutingTask(ThreadLeakControl.java:809)
	at com.carrotsearch.randomizedtesting.ThreadLeakControl$3.evaluate(ThreadLeakControl.java:460)
	at com.carrotsearch.randomizedtesting.RandomizedRunner.runSingleTest(RandomizedRunner.java:880)
	at com.carrotsearch.randomizedtesting.RandomizedRunner$5.evaluate(RandomizedRunner.java:781)
	at com.carrotsearch.randomizedtesting.RandomizedRunner$6.evaluate(RandomizedRunner.java:816)
	at com.carrotsearch.randomizedtesting.RandomizedRunner$7.evaluate(RandomizedRunner.java:827)
	at com.carrotsearch.randomizedtesting.rules.StatementAdapter.evaluate(StatementAdapter.java:36)
	at com.carrotsearch.randomizedtesting.rules.SystemPropertiesRestoreRule$1.evaluate(SystemPropertiesRestoreRule.java:57)
	at org.apache.lucene.util.AbstractBeforeAfterRule$1.evaluate(AbstractBeforeAfterRule.java:46)
	at com.carrotsearch.randomizedtesting.rules.StatementAdapter.evaluate(StatementAdapter.java:36)
	at org.apache.lucene.util.TestRuleStoreClassName$1.evaluate(TestRuleStoreClassName.java:42)
	at com.carrotsearch.randomizedtesting.rules.NoShadowingOrOverridesOnMethodsRule$1.evaluate(NoShadowingOrOverridesOnMethodsRule.java:40)
	at com.carrotsearch.randomizedtesting.rules.NoShadowingOrOverridesOnMethodsRule$1.evaluate(NoShadowingOrOverridesOnMethodsRule.java:40)
	at com.carrotsearch.randomizedtesting.rules.StatementAdapter.evaluate(StatementAdapter.java:36)
	at com.carrotsearch.randomizedtesting.rules.StatementAdapter.evaluate(StatementAdapter.java:36)
	at com.carrotsearch.randomizedtesting.rules.StatementAdapter.evaluate(StatementAdapter.java:36)
	at org.apache.lucene.util.TestRuleAssertionsRequired$1.evaluate(TestRuleAssertionsRequired.java:54)
	at org.apache.lucene.util.TestRuleMarkFailure$1.evaluate(TestRuleMarkFailure.java:48)
	at org.apache.lucene.util.TestRuleIgnoreAfterMaxFailures$1.evaluate(TestRuleIgnoreAfterMaxFailures.java:65)
	at org.apache.lucene.util.TestRuleIgnoreTestSuites$1.evaluate(TestRuleIgnoreTestSuites.java:55)
	at com.carrotsearch.randomizedtesting.rules.StatementAdapter.evaluate(StatementAdapter.java:36)
	at com.carrotsearch.randomizedtesting.ThreadLeakControl$StatementRunner.run(ThreadLeakControl.java:367)
	at java.lang.Thread.run(Thread.java:747)




Build Log:
[...truncated 14450 lines...]
   [junit4] Suite: org.apache.solr.handler.dataimport.TestTikaEntityProcessor
   [junit4]   2> Creating dataDir: /home/jenkins/workspace/Lucene-Solr-5.4-Linux/solr/build/contrib/solr-dataimporthandler-extras/test/J0/temp/solr.handler.dataimport.TestTikaEntityProcessor_27CD6AAC15842238-001/init-core-data-001
   [junit4]   2> log4j:WARN No appenders could be found for logger (org.apache.solr.SolrTestCaseJ4).
   [junit4]   2> log4j:WARN Please initialize the log4j system properly.
   [junit4]   2> log4j:WARN See http://logging.apache.org/log4j/1.2/faq.html#noconfig for
more info.
   [junit4]   2> NOTE: reproduce with: ant test  -Dtestcase=TestTikaEntityProcessor -Dtests.method=testEmbeddedDocsLegacy
-Dtests.seed=27CD6AAC15842238 -Dtests.multiplier=3 -Dtests.slow=true -Dtests.locale=uk_UA
-Dtests.timezone=Etc/GMT+9 -Dtests.asserts=true -Dtests.file.encoding=US-ASCII
   [junit4] ERROR   0.45s J0 | TestTikaEntityProcessor.testEmbeddedDocsLegacy <<<
   [junit4]    > Throwable #1: java.lang.ExceptionInInitializerError
   [junit4]    > 	at __randomizedtesting.SeedInfo.seed([27CD6AAC15842238:2A691B55B350653D]:0)
   [junit4]    > 	at org.apache.tika.parser.pdf.PDFParser.parse(PDFParser.java:146)
   [junit4]    > 	at org.apache.tika.parser.CompositeParser.parse(CompositeParser.java:256)
   [junit4]    > 	at org.apache.tika.parser.CompositeParser.parse(CompositeParser.java:256)
   [junit4]    > 	at org.apache.tika.parser.AutoDetectParser.parse(AutoDetectParser.java:120)
   [junit4]    > 	at org.apache.solr.handler.dataimport.TikaEntityProcessor.nextRow(TikaEntityProcessor.java:159)
   [junit4]    > 	at org.apache.solr.handler.dataimport.EntityProcessorWrapper.nextRow(EntityProcessorWrapper.java:244)
   [junit4]    > 	at org.apache.solr.handler.dataimport.DocBuilder.buildDocument(DocBuilder.java:476)
   [junit4]    > 	at org.apache.solr.handler.dataimport.DocBuilder.buildDocument(DocBuilder.java:415)
   [junit4]    > 	at org.apache.solr.handler.dataimport.DocBuilder.doFullDump(DocBuilder.java:330)
   [junit4]    > 	at org.apache.solr.handler.dataimport.DocBuilder.execute(DocBuilder.java:233)
   [junit4]    > 	at org.apache.solr.handler.dataimport.DataImporter.doFullImport(DataImporter.java:417)
   [junit4]    > 	at org.apache.solr.handler.dataimport.DataImporter.runCmd(DataImporter.java:481)
   [junit4]    > 	at org.apache.solr.handler.dataimport.DataImportHandler.handleRequestBody(DataImportHandler.java:186)
   [junit4]    > 	at org.apache.solr.handler.RequestHandlerBase.handleRequest(RequestHandlerBase.java:156)
   [junit4]    > 	at org.apache.solr.core.SolrCore.execute(SolrCore.java:2073)
   [junit4]    > 	at org.apache.solr.util.TestHarness.query(TestHarness.java:311)
   [junit4]    > 	at org.apache.solr.handler.dataimport.AbstractDataImportHandlerTestCase.runFullImport(AbstractDataImportHandlerTestCase.java:87)
   [junit4]    > 	at org.apache.solr.handler.dataimport.TestTikaEntityProcessor.testEmbeddedDocsLegacy(TestTikaEntityProcessor.java:168)
   [junit4]    > 	at java.lang.Thread.run(Thread.java:747)
   [junit4]    > Caused by: java.lang.NumberFormatException: For input string: "9-ea"
   [junit4]    > 	at java.lang.NumberFormatException.forInputString(NumberFormatException.java:65)
   [junit4]    > 	at java.lang.Integer.parseInt(Integer.java:675)
   [junit4]    > 	at java.lang.Integer.parseInt(Integer.java:793)
   [junit4]    > 	at org.apache.pdfbox.util.PDFTextStripper.<clinit>(PDFTextStripper.java:122)
   [junit4]    > 	... 57 more
   [junit4]   2> NOTE: reproduce with: ant test  -Dtestcase=TestTikaEntityProcessor -Dtests.method=testSkip
-Dtests.seed=27CD6AAC15842238 -Dtests.multiplier=3 -Dtests.slow=true -Dtests.locale=uk_UA
-Dtests.timezone=Etc/GMT+9 -Dtests.asserts=true -Dtests.file.encoding=US-ASCII
   [junit4] ERROR   0.03s J0 | TestTikaEntityProcessor.testSkip <<<
   [junit4]    > Throwable #1: java.lang.NoClassDefFoundError: Could not initialize class
org.apache.tika.parser.pdf.PDF2XHTML
   [junit4]    > 	at __randomizedtesting.SeedInfo.seed([27CD6AAC15842238:E1A2C23F25CE183F]:0)
   [junit4]    > 	at org.apache.tika.parser.pdf.PDFParser.parse(PDFParser.java:146)
   [junit4]    > 	at org.apache.tika.parser.CompositeParser.parse(CompositeParser.java:256)
   [junit4]    > 	at org.apache.tika.parser.CompositeParser.parse(CompositeParser.java:256)
   [junit4]    > 	at org.apache.tika.parser.AutoDetectParser.parse(AutoDetectParser.java:120)
   [junit4]    > 	at org.apache.solr.handler.dataimport.TikaEntityProcessor.nextRow(TikaEntityProcessor.java:159)
   [junit4]    > 	at org.apache.solr.handler.dataimport.EntityProcessorWrapper.nextRow(EntityProcessorWrapper.java:244)
   [junit4]    > 	at org.apache.solr.handler.dataimport.DocBuilder.buildDocument(DocBuilder.java:476)
   [junit4]    > 	at org.apache.solr.handler.dataimport.DocBuilder.buildDocument(DocBuilder.java:415)
   [junit4]    > 	at org.apache.solr.handler.dataimport.DocBuilder.doFullDump(DocBuilder.java:330)
   [junit4]    > 	at org.apache.solr.handler.dataimport.DocBuilder.execute(DocBuilder.java:233)
   [junit4]    > 	at org.apache.solr.handler.dataimport.DataImporter.doFullImport(DataImporter.java:417)
   [junit4]    > 	at org.apache.solr.handler.dataimport.DataImporter.runCmd(DataImporter.java:481)
   [junit4]    > 	at org.apache.solr.handler.dataimport.DataImportHandler.handleRequestBody(DataImportHandler.java:186)
   [junit4]    > 	at org.apache.solr.handler.RequestHandlerBase.handleRequest(RequestHandlerBase.java:156)
   [junit4]    > 	at org.apache.solr.core.SolrCore.execute(SolrCore.java:2073)
   [junit4]    > 	at org.apache.solr.util.TestHarness.query(TestHarness.java:311)
   [junit4]    > 	at org.apache.solr.handler.dataimport.AbstractDataImportHandlerTestCase.runFullImport(AbstractDataImportHandlerTestCase.java:87)
   [junit4]    > 	at org.apache.solr.handler.dataimport.TestTikaEntityProcessor.testSkip(TestTikaEntityProcessor.java:118)
   [junit4]    > 	at java.lang.Thread.run(Thread.java:747)
   [junit4]   2> NOTE: reproduce with: ant test  -Dtestcase=TestTikaEntityProcessor -Dtests.method=testIndexingWithTikaEntityProcessor
-Dtests.seed=27CD6AAC15842238 -Dtests.multiplier=3 -Dtests.slow=true -Dtests.locale=uk_UA
-Dtests.timezone=Etc/GMT+9 -Dtests.asserts=true -Dtests.file.encoding=US-ASCII
   [junit4] ERROR   0.01s J0 | TestTikaEntityProcessor.testIndexingWithTikaEntityProcessor
<<<
   [junit4]    > Throwable #1: java.lang.NoClassDefFoundError: Could not initialize class
org.apache.tika.parser.pdf.PDF2XHTML
   [junit4]    > 	at __randomizedtesting.SeedInfo.seed([27CD6AAC15842238:7A116B393579AC8A]:0)
   [junit4]    > 	at org.apache.tika.parser.pdf.PDFParser.parse(PDFParser.java:146)
   [junit4]    > 	at org.apache.tika.parser.CompositeParser.parse(CompositeParser.java:256)
   [junit4]    > 	at org.apache.tika.parser.CompositeParser.parse(CompositeParser.java:256)
   [junit4]    > 	at org.apache.tika.parser.AutoDetectParser.parse(AutoDetectParser.java:120)
   [junit4]    > 	at org.apache.solr.handler.dataimport.TikaEntityProcessor.nextRow(TikaEntityProcessor.java:159)
   [junit4]    > 	at org.apache.solr.handler.dataimport.EntityProcessorWrapper.nextRow(EntityProcessorWrapper.java:244)
   [junit4]    > 	at org.apache.solr.handler.dataimport.DocBuilder.buildDocument(DocBuilder.java:476)
   [junit4]    > 	at org.apache.solr.handler.dataimport.DocBuilder.buildDocument(DocBuilder.java:415)
   [junit4]    > 	at org.apache.solr.handler.dataimport.DocBuilder.doFullDump(DocBuilder.java:330)
   [junit4]    > 	at org.apache.solr.handler.dataimport.DocBuilder.execute(DocBuilder.java:233)
   [junit4]    > 	at org.apache.solr.handler.dataimport.DataImporter.doFullImport(DataImporter.java:417)
   [junit4]    > 	at org.apache.solr.handler.dataimport.DataImporter.runCmd(DataImporter.java:481)
   [junit4]    > 	at org.apache.solr.handler.dataimport.DataImportHandler.handleRequestBody(DataImportHandler.java:186)
   [junit4]    > 	at org.apache.solr.handler.RequestHandlerBase.handleRequest(RequestHandlerBase.java:156)
   [junit4]    > 	at org.apache.solr.core.SolrCore.execute(SolrCore.java:2073)
   [junit4]    > 	at org.apache.solr.util.TestHarness.query(TestHarness.java:311)
   [junit4]    > 	at org.apache.solr.handler.dataimport.AbstractDataImportHandlerTestCase.runFullImport(AbstractDataImportHandlerTestCase.java:87)
   [junit4]    > 	at org.apache.solr.handler.dataimport.TestTikaEntityProcessor.testIndexingWithTikaEntityProcessor(TestTikaEntityProcessor.java:112)
   [junit4]    > 	at java.lang.Thread.run(Thread.java:747)
   [junit4]   2> NOTE: leaving temporary files on disk at: /home/jenkins/workspace/Lucene-Solr-5.4-Linux/solr/build/contrib/solr-dataimporthandler-extras/test/J0/temp/solr.handler.dataimport.TestTikaEntityProcessor_27CD6AAC15842238-001
   [junit4]   2> NOTE: test params are: codec=Asserting(Lucene54): {home_1___double=PostingsFormat(name=LuceneVarGapDocFreqInterval),
text=PostingsFormat(name=Memory doPackFST= true), home_0___double=PostingsFormat(name=Memory
doPackFST= false)}, docValues:{}, sim=DefaultSimilarity, locale=uk_UA, timezone=Etc/GMT+9
   [junit4]   2> NOTE: Linux 3.19.0-42-generic i386/Oracle Corporation 9-ea (32-bit)/cpus=12,threads=1,free=34856904,total=181665792
   [junit4]   2> NOTE: All tests run in this JVM: [TestTikaEntityProcessor]
   [junit4] Completed [2/2] on J0 in 4.55s, 9 tests, 3 errors <<< FAILURES!

[...truncated 12 lines...]
BUILD FAILED
/home/jenkins/workspace/Lucene-Solr-5.4-Linux/build.xml:792: The following error occurred
while executing this line:
/home/jenkins/workspace/Lucene-Solr-5.4-Linux/build.xml:736: The following error occurred
while executing this line:
/home/jenkins/workspace/Lucene-Solr-5.4-Linux/build.xml:59: The following error occurred while
executing this line:
/home/jenkins/workspace/Lucene-Solr-5.4-Linux/solr/build.xml:253: The following error occurred
while executing this line:
/home/jenkins/workspace/Lucene-Solr-5.4-Linux/solr/common-build.xml:467: The following error
occurred while executing this line:
/home/jenkins/workspace/Lucene-Solr-5.4-Linux/solr/common-build.xml:526: The following error
occurred while executing this line:
/home/jenkins/workspace/Lucene-Solr-5.4-Linux/lucene/common-build.xml:1452: The following
error occurred while executing this line:
/home/jenkins/workspace/Lucene-Solr-5.4-Linux/lucene/common-build.xml:1006: There were test
failures: 2 suites, 15 tests, 3 errors, 6 ignored [seed: 27CD6AAC15842238]

Total time: 52 minutes 27 seconds
Build step 'Invoke Ant' marked build as failure
Archiving artifacts
[WARNINGS] Skipping publisher since build result is FAILURE
Recording test results
Email was triggered for: Failure - Any
Sending email for trigger: Failure - Any



Mime
View raw message