lucene-dev mailing list archives

Site index · List index
Message view « Date » · « Thread »
Top « Date » · « Thread »
From Policeman Jenkins Server <jenk...@thetaphi.de>
Subject [JENKINS] Lucene-Solr-trunk-Windows (64bit/jdk1.8.0_72) - Build # 5578 - Failure!
Date Thu, 28 Jan 2016 21:07:13 GMT
Build: http://jenkins.thetaphi.de/job/Lucene-Solr-trunk-Windows/5578/
Java: 64bit/jdk1.8.0_72 -XX:-UseCompressedOops -XX:+UseConcMarkSweepGC

1 tests failed.
FAILED:  org.apache.solr.handler.dataimport.TestContentStreamDataSource.testCommitWithin

Error Message:
expected:<0> but was:<2>

Stack Trace:
java.lang.AssertionError: expected:<0> but was:<2>
	at __randomizedtesting.SeedInfo.seed([708AC2BA5BDD5917:CA58ADC2D8F3B702]:0)
	at org.junit.Assert.fail(Assert.java:93)
	at org.junit.Assert.failNotEquals(Assert.java:647)
	at org.junit.Assert.assertEquals(Assert.java:128)
	at org.junit.Assert.assertEquals(Assert.java:472)
	at org.junit.Assert.assertEquals(Assert.java:456)
	at org.apache.solr.handler.dataimport.TestContentStreamDataSource.testCommitWithin(TestContentStreamDataSource.java:97)
	at sun.reflect.NativeMethodAccessorImpl.invoke0(Native Method)
	at sun.reflect.NativeMethodAccessorImpl.invoke(NativeMethodAccessorImpl.java:62)
	at sun.reflect.DelegatingMethodAccessorImpl.invoke(DelegatingMethodAccessorImpl.java:43)
	at java.lang.reflect.Method.invoke(Method.java:498)
	at com.carrotsearch.randomizedtesting.RandomizedRunner.invoke(RandomizedRunner.java:1764)
	at com.carrotsearch.randomizedtesting.RandomizedRunner$8.evaluate(RandomizedRunner.java:871)
	at com.carrotsearch.randomizedtesting.RandomizedRunner$9.evaluate(RandomizedRunner.java:907)
	at com.carrotsearch.randomizedtesting.RandomizedRunner$10.evaluate(RandomizedRunner.java:921)
	at com.carrotsearch.randomizedtesting.rules.SystemPropertiesRestoreRule$1.evaluate(SystemPropertiesRestoreRule.java:57)
	at org.apache.lucene.util.TestRuleSetupTeardownChained$1.evaluate(TestRuleSetupTeardownChained.java:50)
	at org.apache.lucene.util.AbstractBeforeAfterRule$1.evaluate(AbstractBeforeAfterRule.java:46)
	at org.apache.lucene.util.TestRuleThreadAndTestName$1.evaluate(TestRuleThreadAndTestName.java:49)
	at org.apache.lucene.util.TestRuleIgnoreAfterMaxFailures$1.evaluate(TestRuleIgnoreAfterMaxFailures.java:65)
	at org.apache.lucene.util.TestRuleMarkFailure$1.evaluate(TestRuleMarkFailure.java:48)
	at com.carrotsearch.randomizedtesting.rules.StatementAdapter.evaluate(StatementAdapter.java:36)
	at com.carrotsearch.randomizedtesting.ThreadLeakControl$StatementRunner.run(ThreadLeakControl.java:367)
	at com.carrotsearch.randomizedtesting.ThreadLeakControl.forkTimeoutingTask(ThreadLeakControl.java:809)
	at com.carrotsearch.randomizedtesting.ThreadLeakControl$3.evaluate(ThreadLeakControl.java:460)
	at com.carrotsearch.randomizedtesting.RandomizedRunner.runSingleTest(RandomizedRunner.java:880)
	at com.carrotsearch.randomizedtesting.RandomizedRunner$5.evaluate(RandomizedRunner.java:781)
	at com.carrotsearch.randomizedtesting.RandomizedRunner$6.evaluate(RandomizedRunner.java:816)
	at com.carrotsearch.randomizedtesting.RandomizedRunner$7.evaluate(RandomizedRunner.java:827)
	at com.carrotsearch.randomizedtesting.rules.StatementAdapter.evaluate(StatementAdapter.java:36)
	at com.carrotsearch.randomizedtesting.rules.SystemPropertiesRestoreRule$1.evaluate(SystemPropertiesRestoreRule.java:57)
	at org.apache.lucene.util.AbstractBeforeAfterRule$1.evaluate(AbstractBeforeAfterRule.java:46)
	at com.carrotsearch.randomizedtesting.rules.StatementAdapter.evaluate(StatementAdapter.java:36)
	at org.apache.lucene.util.TestRuleStoreClassName$1.evaluate(TestRuleStoreClassName.java:42)
	at com.carrotsearch.randomizedtesting.rules.NoShadowingOrOverridesOnMethodsRule$1.evaluate(NoShadowingOrOverridesOnMethodsRule.java:40)
	at com.carrotsearch.randomizedtesting.rules.NoShadowingOrOverridesOnMethodsRule$1.evaluate(NoShadowingOrOverridesOnMethodsRule.java:40)
	at com.carrotsearch.randomizedtesting.rules.StatementAdapter.evaluate(StatementAdapter.java:36)
	at com.carrotsearch.randomizedtesting.rules.StatementAdapter.evaluate(StatementAdapter.java:36)
	at com.carrotsearch.randomizedtesting.rules.StatementAdapter.evaluate(StatementAdapter.java:36)
	at org.apache.lucene.util.TestRuleAssertionsRequired$1.evaluate(TestRuleAssertionsRequired.java:54)
	at org.apache.lucene.util.TestRuleMarkFailure$1.evaluate(TestRuleMarkFailure.java:48)
	at org.apache.lucene.util.TestRuleIgnoreAfterMaxFailures$1.evaluate(TestRuleIgnoreAfterMaxFailures.java:65)
	at org.apache.lucene.util.TestRuleIgnoreTestSuites$1.evaluate(TestRuleIgnoreTestSuites.java:55)
	at com.carrotsearch.randomizedtesting.rules.StatementAdapter.evaluate(StatementAdapter.java:36)
	at com.carrotsearch.randomizedtesting.ThreadLeakControl$StatementRunner.run(ThreadLeakControl.java:367)
	at java.lang.Thread.run(Thread.java:745)




Build Log:
[...truncated 15814 lines...]
   [junit4] Suite: org.apache.solr.handler.dataimport.TestContentStreamDataSource
   [junit4]   2> Creating dataDir: C:\Users\JenkinsSlave\workspace\Lucene-Solr-trunk-Windows\solr\build\contrib\solr-dataimporthandler\test\J0\temp\solr.handler.dataimport.TestContentStreamDataSource_708AC2BA5BDD5917-001\init-core-data-001
   [junit4]   2> 17317 T59 oas.SolrTestCaseJ4.buildSSLConfig Randomized ssl (false) and clientAuth (false)
   [junit4]   2> 17324 T59 oas.SolrTestCaseJ4.setUp ###Starting testCommitWithin
   [junit4]   2> 17742 T59 oejs.Server.doStart jetty-9.2.13.v20150730
   [junit4]   2> 17880 T59 oejsh.ContextHandler.doStart Started o.e.j.s.ServletContextHandler@7e14ff42{/solr,null,AVAILABLE}
   [junit4]   2> 17901 T59 oejs.AbstractConnector.doStart Started ServerConnector@34095afc{HTTP/1.1}{127.0.0.1:57517}
   [junit4]   2> 17902 T59 oejs.Server.doStart Started @20267ms
   [junit4]   2> 17902 T59 oascse.JettySolrRunner$1.lifeCycleStarted Jetty properties: {hostContext=/solr, hostPort=57517}
   [junit4]   2> 17913 T59 oass.SolrDispatchFilter.init SolrDispatchFilter.init(): sun.misc.Launcher$AppClassLoader@73d16e93
   [junit4]   2> 17915 T59 oasc.SolrResourceLoader.<init> new SolrResourceLoader for directory: 'C:\Users\JenkinsSlave\workspace\Lucene-Solr-trunk-Windows\solr\build\contrib\solr-dataimporthandler\test\J0\temp\solr.handler.dataimport.TestContentStreamDataSource_708AC2BA5BDD5917-001\inst-001'
   [junit4]   2> 17915 T59 oasc.SolrResourceLoader.locateSolrHome JNDI not configured for solr (NoInitialContextEx)
   [junit4]   2> 17915 T59 oasc.SolrResourceLoader.locateSolrHome using system property solr.solr.home: C:\Users\JenkinsSlave\workspace\Lucene-Solr-trunk-Windows\solr\build\contrib\solr-dataimporthandler\test\J0\temp\solr.handler.dataimport.TestContentStreamDataSource_708AC2BA5BDD5917-001\dih-properties-001
   [junit4]   2> 17919 T59 oasc.SolrXmlConfig.fromFile Loading container configuration from C:\Users\JenkinsSlave\workspace\Lucene-Solr-trunk-Windows\solr\build\contrib\solr-dataimporthandler\test\J0\temp\solr.handler.dataimport.TestContentStreamDataSource_708AC2BA5BDD5917-001\inst-001\solr.xml
   [junit4]   2> 17938 T59 oasc.CorePropertiesLocator.<init> Config-defined core root directory: C:\Users\JenkinsSlave\workspace\Lucene-Solr-trunk-Windows\solr\build\contrib\solr-dataimporthandler\test\J0\temp\solr.handler.dataimport.TestContentStreamDataSource_708AC2BA5BDD5917-001\inst-001
   [junit4]   2> 17938 T59 oasc.CoreContainer.<init> New CoreContainer 1231039761
   [junit4]   2> 17938 T59 oasc.CoreContainer.load Loading cores into CoreContainer [instanceDir=C:\Users\JenkinsSlave\workspace\Lucene-Solr-trunk-Windows\solr\build\contrib\solr-dataimporthandler\test\J0\temp\solr.handler.dataimport.TestContentStreamDataSource_708AC2BA5BDD5917-001\inst-001]
   [junit4]   2> 17940 T59 oasc.CoreContainer.load WARN Couldn't add files from C:\Users\JenkinsSlave\workspace\Lucene-Solr-trunk-Windows\solr\build\contrib\solr-dataimporthandler\test\J0\temp\solr.handler.dataimport.TestContentStreamDataSource_708AC2BA5BDD5917-001\inst-001\lib to classpath: C:\Users\JenkinsSlave\workspace\Lucene-Solr-trunk-Windows\solr\build\contrib\solr-dataimporthandler\test\J0\temp\solr.handler.dataimport.TestContentStreamDataSource_708AC2BA5BDD5917-001\inst-001\lib
   [junit4]   2> 17972 T59 oashc.HttpShardHandlerFactory.init created with socketTimeout : 600000,urlScheme : ,connTimeout : 60000,maxConnectionsPerHost : 20,maxConnections : 10000,corePoolSize : 0,maximumPoolSize : 2147483647,maxThreadIdleTime : 5,sizeOfQueue : -1,fairnessPolicy : false,useRetries : false,
   [junit4]   2> 17974 T59 oasu.UpdateShardHandler.<init> Creating UpdateShardHandler HTTP client with params: socketTimeout=600000&connTimeout=60000&retry=true
   [junit4]   2> 17975 T59 oasl.LogWatcher.createWatcher SLF4J impl is org.slf4j.impl.Log4jLoggerFactory
   [junit4]   2> 17975 T59 oasl.LogWatcher.newRegisteredLogWatcher Registering Log Listener [Log4j (org.slf4j.impl.Log4jLoggerFactory)]
   [junit4]   2> 17975 T59 oasc.CoreContainer.initializeAuthorizationPlugin Security conf doesn't exist. Skipping setup for authorization module.
   [junit4]   2> 17976 T59 oasc.CoreContainer.initializeAuthenticationPlugin No authentication plugin used.
   [junit4]   2> 17977 T59 oasc.CorePropertiesLocator.discover Looking for core definitions underneath C:\Users\JenkinsSlave\workspace\Lucene-Solr-trunk-Windows\solr\build\contrib\solr-dataimporthandler\test\J0\temp\solr.handler.dataimport.TestContentStreamDataSource_708AC2BA5BDD5917-001\inst-001
   [junit4]   2> 17984 T59 oasc.CoreDescriptor.<init> Created CoreDescriptor: {name=collection1, config=solrconfig.xml, loadOnStartup=true, schema=schema.xml, configSetProperties=configsetprops.json, transient=false, dataDir=data\}
   [junit4]   2> 17984 T59 oasc.CorePropertiesLocator$1.visitFile Found core collection1 in C:\Users\JenkinsSlave\workspace\Lucene-Solr-trunk-Windows\solr\build\contrib\solr-dataimporthandler\test\J0\temp\solr.handler.dataimport.TestContentStreamDataSource_708AC2BA5BDD5917-001\inst-001\collection1
   [junit4]   2> 17985 T59 oasc.CorePropertiesLocator.discover Found 1 core definitions
   [junit4]   2> 17987 T72 oasc.SolrResourceLoader.<init> new SolrResourceLoader for directory: 'C:\Users\JenkinsSlave\workspace\Lucene-Solr-trunk-Windows\solr\build\contrib\solr-dataimporthandler\test\J0\temp\solr.handler.dataimport.TestContentStreamDataSource_708AC2BA5BDD5917-001\inst-001\collection1'
   [junit4]   2> 17988 T72 oasc.SolrResourceLoader.locateSolrHome JNDI not configured for solr (NoInitialContextEx)
   [junit4]   2> 17989 T72 oasc.SolrResourceLoader.locateSolrHome using system property solr.solr.home: C:\Users\JenkinsSlave\workspace\Lucene-Solr-trunk-Windows\solr\build\contrib\solr-dataimporthandler\test\J0\temp\solr.handler.dataimport.TestContentStreamDataSource_708AC2BA5BDD5917-001\dih-properties-001
   [junit4]   2> 17990 T59 oass.SolrDispatchFilter.init user.dir=C:\Users\JenkinsSlave\workspace\Lucene-Solr-trunk-Windows\solr\build\contrib\solr-dataimporthandler\test\J0
   [junit4]   2> 17990 T59 oass.SolrDispatchFilter.init SolrDispatchFilter.init() done
   [junit4]   2> 18010 T72 oasc.SolrConfig.refreshRequestParams current version of requestparams : -1
   [junit4]   2> 18025 T72 oasc.SolrConfig.<init> Using Lucene MatchVersion: 6.0.0
   [junit4]   2> 18042 T72 oasc.SolrConfig.<init> Loaded SolrConfig: solrconfig.xml
   [junit4]   2> 18057 T72 oass.IndexSchema.readSchema [collection1] Schema name=dih_test
   [junit4]   2> 18074 T72 oass.IndexSchema.readSchema default search field in schema is desc
   [junit4]   2> 18074 T72 oass.IndexSchema.readSchema query parser default operator is OR
   [junit4]   2> 18074 T72 oass.IndexSchema.readSchema unique key field: id
   [junit4]   2> 18080 T72 oasc.ConfigSetProperties.readFromResourceLoader Did not find ConfigSet properties, assuming default properties: Can't find resource 'configsetprops.json' in classpath or 'C:\Users\JenkinsSlave\workspace\Lucene-Solr-trunk-Windows\solr\build\contrib\solr-dataimporthandler\test\J0\temp\solr.handler.dataimport.TestContentStreamDataSource_708AC2BA5BDD5917-001\inst-001\collection1'
   [junit4]   2> 18081 T72 oasc.CoreContainer.create Creating SolrCore 'collection1' using configuration from instancedir C:\Users\JenkinsSlave\workspace\Lucene-Solr-trunk-Windows\solr\build\contrib\solr-dataimporthandler\test\J0\temp\solr.handler.dataimport.TestContentStreamDataSource_708AC2BA5BDD5917-001\inst-001\collection1
   [junit4]   2> 18081 T72 x:x:collection1 oasc.SolrCore.initDirectoryFactory org.apache.solr.core.MockDirectoryFactory
   [junit4]   2> 18081 T72 x:x:collection1 oasc.SolrCore.<init> [[collection1] ] Opening new SolrCore at [C:\Users\JenkinsSlave\workspace\Lucene-Solr-trunk-Windows\solr\build\contrib\solr-dataimporthandler\test\J0\temp\solr.handler.dataimport.TestContentStreamDataSource_708AC2BA5BDD5917-001\inst-001\collection1], dataDir=[C:\Users\JenkinsSlave\workspace\Lucene-Solr-trunk-Windows\solr\build\contrib\solr-dataimporthandler\test\J0\temp\solr.handler.dataimport.TestContentStreamDataSource_708AC2BA5BDD5917-001\inst-001\collection1\data\]
   [junit4]   2> 18081 T72 x:x:collection1 oasc.SolrCore.initInfoRegistry JMX monitoring not detected for core: collection1
   [junit4]   2> 18081 T72 x:x:collection1 oasc.SolrCore.initListeners [[collection1] ] Added SolrEventListener for newSearcher: [org.apache.solr.core.QuerySenderListener{queries=[{q=solr,start=0,rows=10}, {q=rocks,start=0,rows=10}, {q=static newSearcher warming query from solrconfig.xml}]}]
   [junit4]   2> 18082 T72 x:x:collection1 oasc.SolrCore.initListeners [[collection1] ] Added SolrEventListener for firstSearcher: [org.apache.solr.core.QuerySenderListener{queries=[]}]
   [junit4]   2> 18082 T72 x:x:collection1 oasc.CachingDirectoryFactory.get return new directory for C:\Users\JenkinsSlave\workspace\Lucene-Solr-trunk-Windows\solr\build\contrib\solr-dataimporthandler\test\J0\temp\solr.handler.dataimport.TestContentStreamDataSource_708AC2BA5BDD5917-001\inst-001\collection1\data\
   [junit4]   2> 18082 T72 x:x:collection1 oasc.SolrCore.getNewIndexDir New index directory detected: old=null new=C:\Users\JenkinsSlave\workspace\Lucene-Solr-trunk-Windows\solr\build\contrib\solr-dataimporthandler\test\J0\temp\solr.handler.dataimport.TestContentStreamDataSource_708AC2BA5BDD5917-001\inst-001\collection1\data\index/
   [junit4]   2> 18082 T72 x:x:collection1 oasc.SolrCore.initIndex WARN [collection1] Solr index directory 'C:\Users\JenkinsSlave\workspace\Lucene-Solr-trunk-Windows\solr\build\contrib\solr-dataimporthandler\test\J0\temp\solr.handler.dataimport.TestContentStreamDataSource_708AC2BA5BDD5917-001\inst-001\collection1\data\index' doesn't exist. Creating new index...
   [junit4]   2> 18083 T72 x:x:collection1 oasc.CachingDirectoryFactory.get return new directory for C:\Users\JenkinsSlave\workspace\Lucene-Solr-trunk-Windows\solr\build\contrib\solr-dataimporthandler\test\J0\temp\solr.handler.dataimport.TestContentStreamDataSource_708AC2BA5BDD5917-001\inst-001\collection1\data\index
   [junit4]   2> 18084 T72 x:x:collection1 oasc.SolrDeletionPolicy.onCommit SolrDeletionPolicy.onCommit: commits: num=1
   [junit4]   2> 		commit{dir=MockDirectoryWrapper(RAMDirectory@5804035a lockFactory=org.apache.lucene.store.SingleInstanceLockFactory@2516f5ec),segFN=segments_1,generation=1}
   [junit4]   2> 18084 T72 x:x:collection1 oasc.SolrDeletionPolicy.updateCommits newest commit generation = 1
   [junit4]   2> 18084 T76 x:x:collection1 oasc.SolrCore$12.run Looking for old index directories to cleanup for core collection1 in C:\Users\JenkinsSlave\workspace\Lucene-Solr-trunk-Windows\solr\build\contrib\solr-dataimporthandler\test\J0\temp\solr.handler.dataimport.TestContentStreamDataSource_708AC2BA5BDD5917-001\inst-001\collection1\data\
   [junit4]   2> 18086 T72 x:x:collection1 oasup.UpdateRequestProcessorChain.init creating updateRequestProcessorChain "" (default)
   [junit4]   2> 18087 T72 x:x:collection1 oasup.UpdateRequestProcessorChain.init inserting DistributedUpdateProcessorFactory into updateRequestProcessorChain "" (default)
   [junit4]   2> 18093 T72 x:x:collection1 oashl.XMLLoader.init xsltCacheLifetimeSeconds=60
   [junit4]   2> 18094 T72 x:x:collection1 oashl.XMLLoader.init xsltCacheLifetimeSeconds=60
   [junit4]   2> 18096 T72 x:x:collection1 oashl.XMLLoader.init xsltCacheLifetimeSeconds=60
   [junit4]   2> 18097 T72 x:x:collection1 oashl.XMLLoader.init xsltCacheLifetimeSeconds=60
   [junit4]   2> 18100 T72 x:x:collection1 oasc.RequestHandlers.initHandlersFromConfig Registered paths: /admin/mbeans,standard,,/update/json/docs,/admin/luke,/export,/get,/admin/properties,/update/json,/admin/threads,/update/csv,/sql,/search,/admin/segments,/admin/system,/replication,/config,/stream,/schema,/admin/plugins,/admin/logging,/admin/ping,/update,/admin/file,/dataimport
   [junit4]   2> 18101 T72 x:x:collection1 oasc.SolrCore.initStatsCache Using default statsCache cache: org.apache.solr.search.stats.LocalStatsCache
   [junit4]   2> 18101 T72 x:x:collection1 oasu.CommitTracker.<init> Hard AutoCommit: disabled
   [junit4]   2> 18102 T72 x:x:collection1 oasu.CommitTracker.<init> Soft AutoCommit: disabled
   [junit4]   2> 18102 T72 x:x:collection1 oasc.SolrDeletionPolicy.onInit SolrDeletionPolicy.onInit: commits: num=1
   [junit4]   2> 		commit{dir=MockDirectoryWrapper(RAMDirectory@5804035a lockFactory=org.apache.lucene.store.SingleInstanceLockFactory@2516f5ec),segFN=segments_1,generation=1}
   [junit4]   2> 18102 T72 x:x:collection1 oasc.SolrDeletionPolicy.updateCommits newest commit generation = 1
   [junit4]   2> 18103 T72 x:x:collection1 oass.SolrIndexSearcher.<init> Opening [Searcher@31d69897[collection1] main]
   [junit4]   2> 18103 T72 x:x:collection1 oasr.ManagedResourceStorage$FileStorageIO.configure File-based storage initialized to use dir: C:\Users\JenkinsSlave\workspace\Lucene-Solr-trunk-Windows\solr\build\contrib\solr-dataimporthandler\test\J0\temp\solr.handler.dataimport.TestContentStreamDataSource_708AC2BA5BDD5917-001\inst-001\collection1\conf
   [junit4]   2> 18103 T72 x:x:collection1 oasr.RestManager.init Initializing RestManager with initArgs: {storageDir=C:\Users\JenkinsSlave\workspace\Lucene-Solr-trunk-Windows\solr\build\contrib\solr-dataimporthandler\test\J0\temp\solr.handler.dataimport.TestContentStreamDataSource_708AC2BA5BDD5917-001\inst-001\collection1\conf}
   [junit4]   2> 18104 T72 x:x:collection1 oasr.ManagedResourceStorage.load Reading _rest_managed.json using file:dir=C:\Users\JenkinsSlave\workspace\Lucene-Solr-trunk-Windows\solr\build\contrib\solr-dataimporthandler\test\J0\temp\solr.handler.dataimport.TestContentStreamDataSource_708AC2BA5BDD5917-001\inst-001\collection1\conf
   [junit4]   2> 18104 T72 x:x:collection1 oasr.RestManager.init Initializing 0 registered ManagedResources
   [junit4]   2> 18104 T72 x:x:collection1 oash.ReplicationHandler.inform Commits will be reserved for  10000
   [junit4]   2> 18104 T77 x:x:collection1 oasc.QuerySenderListener.newSearcher QuerySenderListener sending requests to Searcher@31d69897[collection1] main{ExitableDirectoryReader(UninvertingDirectoryReader())}
   [junit4]   2> 18104 T77 x:x:collection1 oasc.QuerySenderListener.newSearcher QuerySenderListener done.
   [junit4]   2> 18104 T77 x:x:collection1 oasc.SolrCore.registerSearcher [collection1] Registered new searcher Searcher@31d69897[collection1] main{ExitableDirectoryReader(UninvertingDirectoryReader())}
   [junit4]   2> 18105 T72 x:x:collection1 oasc.CoreContainer.registerCore registering core: collection1
   [junit4]   2> ASYNC  NEW_CORE C9 name=collection1 org.apache.solr.core.SolrCore@6819b4a7
   [junit4]   2> 19446 T64 x:x:collection1 C9 oashd.DataImporter.maybeReloadConfiguration Loading DIH Configuration: data-config.xml
   [junit4]   2> 19451 T64 x:x:collection1 C9 oashd.DataImporter.loadDataConfig Data Configuration loaded successfully
   [junit4]   2> 19451 T64 x:x:collection1 C9 oashd.DataImporter.doFullImport Starting Full Import
   [junit4]   2> 19452 T64 x:x:collection1 C9 oashd.SimplePropertiesWriter.readIndexerProperties WARN Unable to read: dataimport.properties
   [junit4]   2> 19557 T64 x:x:collection1 C9 oashd.DocBuilder.finish Import completed successfully
   [junit4]   2> 19558 T64 x:x:collection1 C9 oashd.SimplePropertiesWriter.readIndexerProperties WARN Unable to read: dataimport.properties
   [junit4]   2> 20654 T80 x:x:collection1 oasu.DirectUpdateHandler2.commit start commit{,optimize=false,openSearcher=true,waitSearcher=true,expungeDeletes=false,softCommit=true,prepareCommit=false}
   [junit4]   2> 20716 T80 x:x:collection1 oass.SolrIndexSearcher.<init> Opening [Searcher@64f180b6[collection1] main]
   [junit4]   2> 20716 T80 x:x:collection1 oasu.DirectUpdateHandler2.commit end_commit_flush
   [junit4]   2> 20716 T77 x:x:collection1 oasc.QuerySenderListener.newSearcher QuerySenderListener sending requests to Searcher@64f180b6[collection1] main{ExitableDirectoryReader(UninvertingDirectoryReader(Uninverting(_0(6.0.0):C2)))}
   [junit4]   2> 20719 T77 x:x:collection1 C9 oasc.SolrCore.execute [collection1]  webapp=null path=null params={q=solr&distrib=false&start=0&rows=10&event=newSearcher} hits=0 status=0 QTime=2
   [junit4]   2> 20719 T77 x:x:collection1 C9 oasc.SolrCore.execute [collection1]  webapp=null path=null params={q=rocks&distrib=false&start=0&rows=10&event=newSearcher} hits=0 status=0 QTime=0
   [junit4]   2> 20720 T77 x:x:collection1 C9 oasc.SolrCore.execute [collection1]  webapp=null path=null params={q=static+newSearcher+warming+query+from+solrconfig.xml&distrib=false&event=newSearcher} hits=0 status=0 QTime=0
   [junit4]   2> 20720 T77 x:x:collection1 oasc.QuerySenderListener.newSearcher QuerySenderListener done.
   [junit4]   2> 20721 T77 x:x:collection1 oasc.SolrCore.registerSearcher [collection1] Registered new searcher Searcher@64f180b6[collection1] main{ExitableDirectoryReader(UninvertingDirectoryReader(Uninverting(_0(6.0.0):C2)))}
   [junit4]   2> 22894 T64 x:x:collection1 C9 oashd.SimplePropertiesWriter.persist Wrote last indexed time to dataimport.properties
   [junit4]   2> 22894 T64 x:x:collection1 C9 oashd.DocBuilder.execute Time taken = 0:0:3.146
   [junit4]   2> 22895 T64 x:x:collection1 C9 oasup.LogUpdateProcessorFactory$LogUpdateProcessor.finish [collection1]  webapp=/solr path=/dataimport params={commitWithin=1000&commit=false&clean=false&wt=javabin&version=2&command=full-import}{add=[1, 2]} 0 3186
   [junit4]   2> ASYNC  NEW_CORE C10 name=collection1 org.apache.solr.core.SolrCore@6819b4a7
   [junit4]   2> 23119 T65 x:x:collection1 C10 oasc.SolrCore.execute [collection1]  webapp=/solr path=/select params={q=*&wt=javabin&version=2} hits=2 status=0 QTime=0
   [junit4]   2> 23140 T59 oejs.AbstractConnector.doStop Stopped ServerConnector@34095afc{HTTP/1.1}{127.0.0.1:0}
   [junit4]   2> 23140 T59 oasc.CoreContainer.shutdown Shutting down CoreContainer instance=1231039761
   [junit4]   2> 23141 T59 x:x:collection1 oasc.SolrCore.close [collection1]  CLOSING SolrCore org.apache.solr.core.SolrCore@6819b4a7
   [junit4]   2> 23143 T59 x:x:collection1 oasu.DirectUpdateHandler2.close closing DirectUpdateHandler2{commits=1,autocommits=0,soft autocommits=1,optimizes=0,rollbacks=0,expungeDeletes=0,docsPending=2,adds=0,deletesById=0,deletesByQuery=0,errors=0,cumulative_adds=2,cumulative_deletesById=0,cumulative_deletesByQuery=0,cumulative_errors=0}
   [junit4]   2> 23143 T59 x:x:collection1 oasu.SolrCoreState.decrefSolrCoreState Closing SolrCoreState
   [junit4]   2> 23143 T59 x:x:collection1 oasu.DefaultSolrCoreState.closeIndexWriter SolrCoreState ref count has reached 0 - closing IndexWriter
   [junit4]   2> 23143 T59 x:x:collection1 oasu.DefaultSolrCoreState.closeIndexWriter closing IndexWriter with IndexWriterCloser
   [junit4]   2> 23153 T59 x:x:collection1 C10 oasc.SolrDeletionPolicy.onCommit SolrDeletionPolicy.onCommit: commits: num=2
   [junit4]   2> 		commit{dir=MockDirectoryWrapper(RAMDirectory@5804035a lockFactory=org.apache.lucene.store.SingleInstanceLockFactory@2516f5ec),segFN=segments_1,generation=1}
   [junit4]   2> 		commit{dir=MockDirectoryWrapper(RAMDirectory@5804035a lockFactory=org.apache.lucene.store.SingleInstanceLockFactory@2516f5ec),segFN=segments_2,generation=2}
   [junit4]   2> 23153 T59 x:x:collection1 C10 oasc.SolrDeletionPolicy.updateCommits newest commit generation = 2
   [junit4]   2> 23154 T59 x:x:collection1 oasc.SolrCore.closeSearcher [collection1] Closing main searcher on request.
   [junit4]   2> 23155 T59 x:x:collection1 oasc.CachingDirectoryFactory.close Closing MockDirectoryFactory - 2 directories currently being tracked
   [junit4]   2> 23155 T59 x:x:collection1 oasc.CachingDirectoryFactory.closeCacheValue looking to close C:\Users\JenkinsSlave\workspace\Lucene-Solr-trunk-Windows\solr\build\contrib\solr-dataimporthandler\test\J0\temp\solr.handler.dataimport.TestContentStreamDataSource_708AC2BA5BDD5917-001\inst-001\collection1\data\index [CachedDir<<refCount=0;path=C:\Users\JenkinsSlave\workspace\Lucene-Solr-trunk-Windows\solr\build\contrib\solr-dataimporthandler\test\J0\temp\solr.handler.dataimport.TestContentStreamDataSource_708AC2BA5BDD5917-001\inst-001\collection1\data\index;done=false>>]
   [junit4]   2> 23155 T59 x:x:collection1 oasc.CachingDirectoryFactory.close Closing directory: C:\Users\JenkinsSlave\workspace\Lucene-Solr-trunk-Windows\solr\build\contrib\solr-dataimporthandler\test\J0\temp\solr.handler.dataimport.TestContentStreamDataSource_708AC2BA5BDD5917-001\inst-001\collection1\data\index
   [junit4]   2> 23155 T59 x:x:collection1 oasc.CachingDirectoryFactory.closeCacheValue looking to close C:\Users\JenkinsSlave\workspace\Lucene-Solr-trunk-Windows\solr\build\contrib\solr-dataimporthandler\test\J0\temp\solr.handler.dataimport.TestContentStreamDataSource_708AC2BA5BDD5917-001\inst-001\collection1\data\ [CachedDir<<refCount=0;path=C:\Users\JenkinsSlave\workspace\Lucene-Solr-trunk-Windows\solr\build\contrib\solr-dataimporthandler\test\J0\temp\solr.handler.dataimport.TestContentStreamDataSource_708AC2BA5BDD5917-001\inst-001\collection1\data\;done=false>>]
   [junit4]   2> 23156 T59 x:x:collection1 oasc.CachingDirectoryFactory.close Closing directory: C:\Users\JenkinsSlave\workspace\Lucene-Solr-trunk-Windows\solr\build\contrib\solr-dataimporthandler\test\J0\temp\solr.handler.dataimport.TestContentStreamDataSource_708AC2BA5BDD5917-001\inst-001\collection1\data\
   [junit4]   2> 23161 T59 x:x:collection1 oejsh.ContextHandler.doStop Stopped o.e.j.s.ServletContextHandler@7e14ff42{/solr,null,UNAVAILABLE}
   [junit4]   2> 23165 T59 oas.SolrTestCaseJ4.tearDown ###Ending testCommitWithin
   [junit4]   2> NOTE: reproduce with: ant test  -Dtestcase=TestContentStreamDataSource -Dtests.method=testCommitWithin -Dtests.seed=708AC2BA5BDD5917 -Dtests.slow=true -Dtests.locale=ro-RO -Dtests.timezone=Europe/Athens -Dtests.asserts=true -Dtests.file.encoding=Cp1252
   [junit4] FAILURE 5.86s J0 | TestContentStreamDataSource.testCommitWithin <<<
   [junit4]    > Throwable #1: java.lang.AssertionError: expected:<0> but was:<2>
   [junit4]    > 	at __randomizedtesting.SeedInfo.seed([708AC2BA5BDD5917:CA58ADC2D8F3B702]:0)
   [junit4]    > 	at org.apache.solr.handler.dataimport.TestContentStreamDataSource.testCommitWithin(TestContentStreamDataSource.java:97)
   [junit4]    > 	at java.lang.Thread.run(Thread.java:745)
   [junit4]   2> 23175 T59 oas.SolrTestCaseJ4.setUp ###Starting testSimple
   [junit4]   2> 23226 T59 oejs.Server.doStart jetty-9.2.13.v20150730
   [junit4]   2> 23230 T59 oejsh.ContextHandler.doStart Started o.e.j.s.ServletContextHandler@5726e3af{/solr,null,AVAILABLE}
   [junit4]   2> 23231 T59 oejs.AbstractConnector.doStart Started ServerConnector@7d4aa40a{HTTP/1.1}{127.0.0.1:57521}
   [junit4]   2> 23231 T59 oejs.Server.doStart Started @25143ms
   [junit4]   2> 23231 T59 oascse.JettySolrRunner$1.lifeCycleStarted Jetty properties: {hostContext=/solr, hostPort=57521}
   [junit4]   2> 23232 T59 oass.SolrDispatchFilter.init SolrDispatchFilter.init(): sun.misc.Launcher$AppClassLoader@73d16e93
   [junit4]   2> 23232 T59 oasc.SolrResourceLoader.<init> new SolrResourceLoader for directory: 'C:\Users\JenkinsSlave\workspace\Lucene-Solr-trunk-Windows\solr\build\contrib\solr-dataimporthandler\test\J0\temp\solr.handler.dataimport.TestContentStreamDataSource_708AC2BA5BDD5917-001\inst-002'
   [junit4]   2> 23232 T59 oasc.SolrResourceLoader.locateSolrHome JNDI not configured for solr (NoInitialContextEx)
   [junit4]   2> 23232 T59 oasc.SolrResourceLoader.locateSolrHome using system property solr.solr.home: C:\Users\JenkinsSlave\workspace\Lucene-Solr-trunk-Windows\solr\build\contrib\solr-dataimporthandler\test\J0\temp\solr.handler.dataimport.TestContentStreamDataSource_708AC2BA5BDD5917-001\dih-properties-002
   [junit4]   2> 23233 T59 oasc.SolrXmlConfig.fromFile Loading container configuration from C:\Users\JenkinsSlave\workspace\Lucene-Solr-trunk-Windows\solr\build\contrib\solr-dataimporthandler\test\J0\temp\solr.handler.dataimport.TestContentStreamDataSource_708AC2BA5BDD5917-001\inst-002\solr.xml
   [junit4]   2> 23246 T59 oasc.CorePropertiesLocator.<init> Config-defined core root directory: C:\Users\JenkinsSlave\workspace\Lucene-Solr-trunk-Windows\solr\build\contrib\solr-dataimporthandler\test\J0\temp\solr.handler.dataimport.TestContentStreamDataSource_708AC2BA5BDD5917-001\inst-002
   [junit4]   2> 23247 T59 oasc.CoreContainer.<init> New CoreContainer 486545210
   [junit4]   2> 23247 T59 oasc.CoreContainer.load Loading cores into CoreContainer [instanceDir=C:\Users\JenkinsSlave\workspace\Lucene-Solr-trunk-Windows\solr\build\contrib\solr-dataimporthandler\test\J0\temp\solr.handler.dataimport.TestContentStreamDataSource_708AC2BA5BDD5917-001\inst-002]
   [junit4]   2> 23247 T59 oasc.CoreContainer.load WARN Couldn't add files from C:\Users\JenkinsSlave\workspace\Lucene-Solr-trunk-Windows\solr\build\contrib\solr-dataimporthandler\test\J0\temp\solr.handler.dataimport.TestContentStreamDataSource_708AC2BA5BDD5917-001\inst-002\lib to classpath: C:\Users\JenkinsSlave\workspace\Lucene-Solr-trunk-Windows\solr\build\contrib\solr-dataimporthandler\test\J0\temp\solr.handler.dataimport.TestContentStreamDataSource_708AC2BA5BDD5917-001\inst-002\lib
   [junit4]   2> 23247 T59 oashc.HttpShardHandlerFactory.init created with socketTimeout : 600000,urlScheme : ,connTimeout : 60000,maxConnectionsPerHost : 20,maxConnections : 10000,corePoolSize : 0,maximumPoolSize : 2147483647,maxThreadIdleTime : 5,sizeOfQueue : -1,fairnessPolicy : false,useRetries : false,
   [junit4]   2> 23252 T59 oasu.UpdateShardHandler.<init> Creating UpdateShardHandler HTTP client with params: socketTimeout=600000&connTimeout=60000&retry=true
   [junit4]   2> 23252 T59 oasl.LogWatcher.createWatcher SLF4J impl is org.slf4j.impl.Log4jLoggerFactory
   [junit4]   2> 23253 T59 oasl.LogWatcher.newRegisteredLogWatcher Registering Log Listener [Log4j (org.slf4j.impl.Log4jLoggerFactory)]
   [junit4]   2> 23253 T59 oasc.CoreContainer.initializeAuthorizationPlugin Security conf doesn't exist. Skipping setup for authorization module.
   [junit4]   2> 23253 T59 oasc.CoreContainer.initializeAuthenticationPlugin No authentication plugin used.
   [junit4]   2> 23258 T59 oasc.CorePropertiesLocator.discover Looking for core definitions underneath C:\Users\JenkinsSlave\workspace\Lucene-Solr-trunk-Windows\solr\build\contrib\solr-dataimporthandler\test\J0\temp\solr.handler.dataimport.TestContentStreamDataSource_708AC2BA5BDD5917-001\inst-002
   [junit4]   2> 23261 T59 oasc.CoreDescriptor.<init> Created CoreDescriptor: {name=collection1, config=solrconfig.xml, loadOnStartup=true, schema=schema.xml, configSetProperties=configsetprops.json, transient=false, dataDir=data\}
   [junit4]   2> 23261 T59 oasc.CorePropertiesLocator$1.visitFile Found core collection1 in C:\Users\JenkinsSlave\workspace\Lucene-Solr-trunk-Windows\solr\build\contrib\solr-dataimporthandler\test\J0\temp\solr.handler.dataimport.TestContentStreamDataSource_708AC2BA5BDD5917-001\inst-002\collection1
   [junit4]   2> 23262 T59 oasc.CorePropertiesLocator.discover Found 1 core definitions
   [junit4]   2> 23263 T59 oass.SolrDispatchFilter.init user.dir=C:\Users\JenkinsSlave\workspace\Lucene-Solr-trunk-Windows\solr\build\contrib\solr-dataimporthandler\test\J0
   [junit4]   2> 23263 T59 oass.SolrDispatchFilter.init SolrDispatchFilter.init() done
   [junit4]   2> 23264 T92 oasc.SolrResourceLoader.<init> new SolrResourceLoader for directory: 'C:\Users\JenkinsSlave\workspace\Lucene-Solr-trunk-Windows\solr\build\contrib\solr-dataimporthandler\test\J0\temp\solr.handler.dataimport.TestContentStreamDataSource_708AC2BA5BDD5917-001\inst-002\collection1'
   [junit4]   2> 23267 T92 oasc.SolrResourceLoader.locateSolrHome JNDI not configured for solr (NoInitialContextEx)
   [junit4]   2> 23267 T92 oasc.SolrResourceLoader.locateSolrHome using system property solr.solr.home: C:\Users\JenkinsSlave\workspace\Lucene-Solr-trunk-Windows\solr\build\contrib\solr-dataimporthandler\test\J0\temp\solr.handler.dataimport.TestContentStreamDataSource_708AC2BA5BDD5917-001\dih-properties-002
   [junit4]   2> 23293 T92 oasc.SolrConfig.refreshRequestParams current version of requestparams : -1
   [junit4]   2> 23301 T92 oasc.SolrConfig.<init> Using Lucene MatchVersion: 6.0.0
   [junit4]   2> 23316 T92 oasc.SolrConfig.<init> Loaded SolrConfig: solrconfig.xml
   [junit4]   2> 23322 T92 oass.IndexSchema.readSchema [collection1] Schema name=dih_test
   [junit4]   2> 23345 T92 oass.IndexSchema.readSchema default search field in schema is desc
   [junit4]   2> 23345 T92 oass.IndexSchema.readSchema query parser default operator is OR
   [junit4]   2> 23345 T92 oass.IndexSchema.readSchema unique key field: id
   [junit4]   2> 23353 T92 oasc.ConfigSetProperties.readFromResourceLoader Did not find ConfigSet properties, assuming default properties: Can't find resource 'configsetprops.json' in classpath or 'C:\Users\JenkinsSlave\workspace\Lucene-Solr-trunk-Windows\solr\build\contrib\solr-dataimporthandler\test\J0\temp\solr.handler.dataimport.TestContentStreamDataSource_708AC2BA5BDD5917-001\inst-002\collection1'
   [junit4]   2> 23353 T92 oasc.CoreContainer.create Creating SolrCore 'collection1' using configuration from instancedir C:\Users\JenkinsSlave\workspace\Lucene-Solr-trunk-Windows\solr\build\contrib\solr-dataimporthandler\test\J0\temp\solr.handler.dataimport.TestContentStreamDataSource_708AC2BA5BDD5917-001\inst-002\collection1
   [junit4]   2> 23354 T92 x:x:collection1 oasc.SolrCore.initDirectoryFactory org.apache.solr.core.MockDirectoryFactory
   [junit4]   2> 23354 T92 x:x:collection1 oasc.SolrCore.<init> [[collection1] ] Opening new SolrCore at [C:\Users\JenkinsSlave\workspace\Lucene-Solr-trunk-Windows\solr\build\contrib\solr-dataimporthandler\test\J0\temp\solr.handler.dataimport.TestContentStreamDataSource_708AC2BA5BDD5917-001\inst-002\collection1], dataDir=[C:\Users\JenkinsSlave\workspace\Lucene-Solr-trunk-Windows\solr\build\contrib\solr-dataimporthandler\test\J0\temp\solr.handler.dataimport.TestContentStreamDataSource_708AC2BA5BDD5917-001\inst-002\collection1\data\]
   [junit4]   2> 23354 T92 x:x:collection1 oasc.SolrCore.initInfoRegistry JMX monitoring not detected for core: collection1
   [junit4]   2> 23354 T92 x:x:collection1 oasc.SolrCore.initListeners [[collection1] ] Added SolrEventListener for newSearcher: [org.apache.solr.core.QuerySenderListener{queries=[{q=solr,start=0,rows=10}, {q=rocks,start=0,rows=10}, {q=static newSearcher warming query from solrconfig.xml}]}]
   [junit4]   2> 23354 T92 x:x:collection1 oasc.SolrCore.initListeners [[collection1] ] Added SolrEventListener for firstSearcher: [org.apache.solr.core.QuerySenderListener{queries=[]}]
   [junit4]   2> 23380 T92 x:x:collection1 oasc.CachingDirectoryFactory.get return new directory for C:\Users\JenkinsSlave\workspace\Lucene-Solr-trunk-Windows\solr\build\contrib\solr-dataimporthandler\test\J0\temp\solr.handler.dataimport.TestContentStreamDataSource_708AC2BA5BDD5917-001\inst-002\collection1\data\
   [junit4]   2> 23380 T92 x:x:collection1 oasc.SolrCore.getNewIndexDir New index directory detected: old=null new=C:\Users\JenkinsSlave\workspace\Lucene-Solr-trunk-Windows\solr\build\contrib\solr-dataimporthandler\test\J0\temp\solr.handler.dataimport.TestContentStreamDataSource_708AC2BA5BDD5917-001\inst-002\collection1\data\index/
   [junit4]   2> 23380 T92 x:x:collection1 oasc.SolrCore.initIndex WARN [collection1] Solr index directory 'C:\Users\JenkinsSlave\workspace\Lucene-Solr-trunk-Windows\solr\build\contrib\solr-dataimporthandler\test\J0\temp\solr.handler.dataimport.TestContentStreamDataSource_708AC2BA5BDD5917-001\inst-002\collection1\data\index' doesn't exist. Creating new index...
   [junit4]   2> 23380 T92 x:x:collection1 oasc.CachingDirectoryFactory.get return new directory for C:\Users\JenkinsSlave\workspace\Lucene-Solr-trunk-Windows\solr\build\contrib\solr-dataimporthandler\test\J0\temp\solr.handler.dataimport.TestContentStreamDataSource_708AC2BA5BDD5917-001\inst-002\collection1\data\index
   [junit4]   2> 23381 T92 x:x:collection1 oasc.SolrDeletionPolicy.onCommit SolrDeletionPolicy.onCommit: commits: num=1
   [junit4]   2> 		commit{dir=MockDirectoryWrapper(RAMDirectory@129625ca lockFactory=org.apache.lucene.store.SingleInstanceLockFactory@6122d5),segFN=segments_1,generation=1}
   [junit4]   2> 23381 T92 x:x:collection1 oasc.SolrDeletionPolicy.updateCommits newest commit generation = 1
   [junit4]   2> 23387 T92 x:x:collection1 oasup.UpdateRequestProcessorChain.init creating updateRequestProcessorChain "" (default)
   [junit4]   2> 23387 T92 x:x:collection1 oasup.UpdateRequestProcessorChain.init inserting DistributedUpdateProcessorFactory into updateRequestProcessorChain "" (default)
   [junit4]   2> 23392 T92 x:x:collection1 oashl.XMLLoader.init xsltCacheLifetimeSeconds=60
   [junit4]   2> 23396 T92 x:x:collection1 oashl.XMLLoader.init xsltCacheLifetimeSeconds=60
   [junit4]   2> 23397 T92 x:x:collection1 oashl.XMLLoader.init xsltCacheLifetimeSeconds=60
   [junit4]   2> 23399 T92 x:x:collection1 oashl.XMLLoader.init xsltCacheLifetimeSeconds=60
   [junit4]   2> 23401 T92 x:x:collection1 oasc.RequestHandlers.initHandlersFromConfig Registered paths: /admin/mbeans,standard,,/update/json/docs,/admin/luke,/export,/get,/admin/properties,/update/json,/admin/threads,/update/csv,/sql,/search,/admin/segments,/admin/system,/replication,/config,/stream,/schema,/admin/plugins,/admin/logging,/admin/ping,/update,/admin/file,/dataimport
   [junit4]   2> 23402 T92 x:x:collection1 oasc.SolrCore.initStatsCache Using default statsCache cache: org.apache.solr.search.stats.LocalStatsCache
   [junit4]   2> 23402 T92 x:x:collection1 oasu.CommitTracker.<init> Hard AutoCommit: disabled
   [junit4]   2> 23402 T92 x:x:collection1 oasu.CommitTracker.<init> Soft AutoCommit: disabled
   [junit4]   2> 23403 T92 x:x:collection1 oasc.SolrDeletionPolicy.onInit SolrDeletionPolicy.onInit: commits: num=1
   [junit4]   2> 		commit{dir=MockDirectoryWrapper(RAMDirectory@129625ca lockFactory=org.apache.lucene.store.SingleInstanceLockFactory@6122d5),segFN=segments_1,generation=1}
   [junit4]   2> 23403 T92 x:x:collection1 oasc.SolrDeletionPolicy.updateCommits newest commit generation = 1
   [junit4]   2> 23403 T92 x:x:collection1 oass.SolrIndexSearcher.<init> Opening [Searcher@73f96856[collection1] main]
   [junit4]   2> 23404 T92 x:x:collection1 oasr.ManagedResourceStorage$FileStorageIO.configure File-based storage initialized to use dir: C:\Users\JenkinsSlave\workspace\Lucene-Solr-trunk-Windows\solr\build\contrib\solr-dataimporthandler\test\J0\temp\solr.handler.dataimport.TestContentStreamDataSource_708AC2BA5BDD5917-001\inst-002\collection1\conf
   [junit4]   2> 23404 T92 x:x:collection1 oasr.RestManager.init Initializing RestManager with initArgs: {storageDir=C:\Users\JenkinsSlave\workspace\Lucene-Solr-trunk-Windows\solr\build\contrib\solr-dataimporthandler\test\J0\temp\solr.handler.dataimport.TestContentStreamDataSource_708AC2BA5BDD5917-001\inst-002\collection1\conf}
   [junit4]   2> 23404 T92 x:x:collection1 oasr.ManagedResourceStorage.load Reading _rest_managed.json using file:dir=C:\Users\JenkinsSlave\workspace\Lucene-Solr-trunk-Windows\solr\build\contrib\solr-dataimporthandler\test\J0\temp\solr.handler.dataimport.TestContentStreamDataSource_708AC2BA5BDD5917-001\inst-002\collection1\conf
   [junit4]   2> 23405 T92 x:x:collection1 oasr.RestManager.init Initializing 0 registered ManagedResources
   [junit4]   2> 23413 T92 x:x:collection1 oash.ReplicationHandler.inform Commits will be reserved for  10000
   [junit4]   2> 23413 T92 x:x:collection1 oasc.CoreContainer.registerCore registering core: collection1
   [junit4]   2> 23417 T97 x:x:collection1 oasc.QuerySenderListener.newSearcher QuerySenderListener sending requests to Searcher@73f96856[collection1] main{ExitableDirectoryReader(UninvertingDirectoryReader())}
   [junit4]   2> 23417 T97 x:x:collection1 oasc.QuerySenderListener.newSearcher QuerySenderListener done.
   [junit4]   2> 23417 T97 x:x:collection1 oasc.SolrCore.registerSearcher [collection1] Registered new searcher Searcher@73f96856[collection1] main{ExitableDirectoryReader(UninvertingDirectoryReader())}
   [junit4]   2> 23420 T96 x:x:collection1 oasc.SolrCore$12.run Looking for old index directories to cleanup for core collection1 in C:\Users\JenkinsSlave\workspace\Lucene-Solr-trunk-Windows\solr\build\contrib\solr-dataimporthandler\test\J0\temp\solr.handler.dataimport.TestContentStreamDataSource_708AC2BA5BDD5917-001\inst-002\collection1\data\
   [junit4]   2> ASYNC  NEW_CORE C11 name=collection1 org.apache.solr.core.SolrCore@c4e414f
   [junit4]   2> 23828 T83 x:x:collection1 C11 oashd.DataImporter.maybeReloadConfiguration Loading DIH Configuration: data-config.xml
   [junit4]   2> 23834 T83 x:x:collection1 C11 oashd.DataImporter.loadDataConfig Data Configuration loaded successfully
   [junit4]   2> 23834 T83 x:x:collection1 C11 oashd.DataImporter.doFullImport Starting Full Import
   [junit4]   2> 23835 T83 x:x:collection1 C11 oashd.SimplePropertiesWriter.readIndexerProperties WARN Unable to read: dataimport.properties
   [junit4]   2> 23842 T83 x:x:collection1 C11 oashd.DocBuilder.finish Import completed successfully
   [junit4]   2> 23842 T83 x:x:collection1 C11 oasu.DirectUpdateHandler2.commit start commit{,optimize=false,openSearcher=true,waitSearcher=true,expungeDeletes=false,softCommit=false,prepareCommit=false}
   [junit4]   2> 23855 T83 x:x:collection1 C11 oasc.SolrDeletionPolicy.onCommit SolrDeletionPolicy.onCommit: commits: num=2
   [junit4]   2> 		commit{dir=MockDirectoryWrapper(RAMDirectory@129625ca lockFactory=org.apache.lucene.store.SingleInstanceLockFactory@6122d5),segFN=segments_1,generation=1}
   [junit4]   2> 		commit{dir=MockDirectoryWrapper(RAMDirectory@129625ca lockFactory=org.apache.lucene.store.SingleInstanceLockFactory@6122d5),segFN=segments_2,generation=2}
   [junit4]   2> 23859 T83 x:x:collection1 C11 oasc.SolrDeletionPolicy.updateCommits newest commit generation = 2
   [junit4]   2> 23861 T83 x:x:collection1 C11 oass.SolrIndexSearcher.<init> Opening [Searcher@6883f54c[collection1] main]
   [junit4]   2> 23863 T83 x:x:collection1 C11 oasu.DirectUpdateHandler2.commit end_commit_flush
   [junit4]   2> 23863 T97 x:x:collection1 C11 oasc.QuerySenderListener.newSearcher QuerySenderListener sending requests to Searcher@6883f54c[collection1] main{ExitableDirectoryReader(UninvertingDirectoryReader(Uninverting(_0(6.0.0):C2)))}
   [junit4]   2> 23864 T97 x:x:collection1 C11 oasr.SolrRequestInfo.setRequestInfo ERROR Previous SolrRequestInfo was not closed!  req=clean=false&wt=javabin&version=2&command=full-import
   [junit4]   2> 23864 T97 x:x:collection1 C11 oasr.SolrRequestInfo.setRequestInfo ERROR prev == info : false
   [junit4]   2> 23864 T97 x:x:collection1 oasc.SolrException.log ERROR null:java.lang.AssertionError
   [junit4]   2> 		at org.apache.solr.request.SolrRequestInfo.setRequestInfo(SolrRequestInfo.java:62)
   [junit4]   2> 		at org.apache.solr.core.QuerySenderListener.newSearcher(QuerySenderListener.java:68)
   [junit4]   2> 		at org.apache.solr.core.SolrCore$6.call(SolrCore.java:1869)
   [junit4]   2> 		at java.util.concurrent.FutureTask.run(FutureTask.java:266)
   [junit4]   2> 		at org.apache.solr.common.util.ExecutorUtil$MDCAwareThreadPoolExecutor$1.run(ExecutorUtil.java:232)
   [junit4]   2> 		at java.util.concurrent.ThreadPoolExecutor.runWorker(ThreadPoolExecutor.java:1142)
   [junit4]   2> 		at java.util.concurrent.ThreadPoolExecutor$Worker.run(ThreadPoolExecutor.java:617)
   [junit4]   2> 		at java.lang.Thread.run(Thread.java:745)
   [junit4]   2> 	
   [junit4]   2> 23864 T97 x:x:collection1 C11 oasc.SolrCore.registerSearcher [collection1] Registered new searcher Searcher@6883f54c[collection1] main{ExitableDirectoryReader(UninvertingDirectoryReader(Uninverting(_0(6.0.0):C2)))}
   [junit4]   2> 23864 T83 x:x:collection1 C11 oashd.SimplePropertiesWriter.readIndexerProperties WARN Unable to read: dataimport.properties
   [junit4]   2> 23890 T83 x:x:collection1 C11 oashd.SimplePropertiesWriter.persist Wrote last indexed time to dataimport.properties
   [junit4]   2> 23891 T83 x:x:collection1 C11 oashd.DocBuilder.execute Time taken = 0:0:0.50
   [junit4]   2> 23891 T83 x:x:collection1 C11 oasup.LogUpdateProcessorFactory$LogUpdateProcessor.finish [collection1]  webapp=/solr path=/dataimport params={clean=false&wt=javabin&version=2&command=full-import}{add=[1, 2],commit=} 0 58
   [junit4]   2> 23901 T85 x:x:collection1 C11 oasc.SolrCore.execute [collection1]  webapp=/solr path=/select params={q=*:*&wt=javabin&version=2} hits=2 status=0 QTime=0
   [junit4]   2> 23923 T59 oejs.AbstractConnector.doStop Stopped ServerConnector@7d4aa40a{HTTP/1.1}{127.0.0.1:0}
   [junit4]   2> 23923 T59 oasc.CoreContainer.shutdown Shutting down CoreContainer instance=486545210
   [junit4]   2> 23926 T59 x:x:collection1 oasc.SolrCore.close [collection1]  CLOSING SolrCore org.apache.solr.core.SolrCore@c4e414f
   [junit4]   2> 23927 T59 x:x:collection1 oasu.DirectUpdateHandler2.close closing DirectUpdateHandler2{commits=1,autocommits=0,soft autocommits=0,optimizes=0,rollbacks=0,expungeDeletes=0,docsPending=0,adds=0,deletesById=0,deletesByQuery=0,errors=0,cumulative_adds=2,cumulative_deletesById=0,cumulative_deletesByQuery=0,cumulative_errors=0}
   [junit4]   2> 23928 T59 x:x:collection1 oasu.SolrCoreState.decrefSolrCoreState Closing SolrCoreState
   [junit4]   2> 23928 T59 x:x:collection1 oasu.DefaultSolrCoreState.closeIndexWriter SolrCoreState ref count has reached 0 - closing IndexWriter
   [junit4]   2> 23928 T59 x:x:collection1 oasu.DefaultSolrCoreState.closeIndexWriter closing IndexWriter with IndexWriterCloser
   [junit4]   2> 23929 T59 x:x:collection1 oasc.SolrCore.closeSearcher [collection1] Closing main searcher on request.
   [junit4]   2> 23930 T59 x:x:collection1 oasc.CachingDirectoryFactory.close Closing MockDirectoryFactory - 2 directories currently being tracked
   [junit4]   2> 23930 T59 x:x:collection1 oasc.CachingDirectoryFactory.closeCacheValue looking to close C:\Users\JenkinsSlave\workspace\Lucene-Solr-trunk-Windows\solr\build\contrib\solr-dataimporthandler\test\J0\temp\solr.handler.dataimport.TestContentStreamDataSource_708AC2BA5BDD5917-001\inst-002\collection1\data\ [CachedDir<<refCount=0;path=C:\Users\JenkinsSlave\workspace\Lucene-Solr-trunk-Windows\solr\build\contrib\solr-dataimporthandler\test\J0\temp\solr.handler.dataimport.TestContentStreamDataSource_708AC2BA5BDD5917-001\inst-002\collection1\data\;done=false>>]
   [junit4]   2> 23930 T59 x:x:collection1 oasc.CachingDirectoryFactory.close Closing directory: C:\Users\JenkinsSlave\workspace\Lucene-Solr-trunk-Windows\solr\build\contrib\solr-dataimporthandler\test\J0\temp\solr.handler.dataimport.TestContentStreamDataSource_708AC2BA5BDD5917-001\inst-002\collection1\data\
   [junit4]   2> 23930 T59 x:x:collection1 oasc.CachingDirectoryFactory.closeCacheValue looking to close C:\Users\JenkinsSlave\workspace\Lucene-Solr-trunk-Windows\solr\build\contrib\solr-dataimporthandler\test\J0\temp\solr.handler.dataimport.TestContentStreamDataSource_708AC2BA5BDD5917-001\inst-002\collection1\data\index [CachedDir<<refCount=0;path=C:\Users\JenkinsSlave\workspace\Lucene-Solr-trunk-Windows\solr\build\contrib\solr-dataimporthandler\test\J0\temp\solr.handler.dataimport.TestContentStreamDataSource_708AC2BA5BDD5917-001\inst-002\collection1\data\index;done=false>>]
   [junit4]   2> 23931 T59 x:x:collection1 oasc.CachingDirectoryFactory.close Closing directory: C:\Users\JenkinsSlave\workspace\Lucene-Solr-trunk-Windows\solr\build\contrib\solr-dataimporthandler\test\J0\temp\solr.handler.dataimport.TestContentStreamDataSource_708AC2BA5BDD5917-001\inst-002\collection1\data\index
   [junit4]   2> 23931 T59 x:x:collection1 oejsh.ContextHandler.doStop Stopped o.e.j.s.ServletContextHandler@5726e3af{/solr,null,UNAVAILABLE}
   [junit4]   2> 23935 T59 oas.SolrTestCaseJ4.tearDown ###Ending testSimple
   [junit4]   2> 23937 T59 oas.SolrTestCaseJ4.deleteCore ###deleteCore
   [junit4]   2> NOTE: leaving temporary files on disk at: C:\Users\JenkinsSlave\workspace\Lucene-Solr-trunk-Windows\solr\build\contrib\solr-dataimporthandler\test\J0\temp\solr.handler.dataimport.TestContentStreamDataSource_708AC2BA5BDD5917-001
   [junit4]   2> NOTE: test params are: codec=Asserting(Lucene60): {id=PostingsFormat(name=LuceneVarGapFixedInterval), desc=PostingsFormat(name=LuceneFixedGap), timestamp=PostingsFormat(name=Memory doPackFST= true)}, docValues:{}, sim=ClassicSimilarity, locale=ro-RO, timezone=Europe/Athens
   [junit4]   2> NOTE: Windows 7 6.1 amd64/Oracle Corporation 1.8.0_72 (64-bit)/cpus=3,threads=1,free=36990800,total=64880640
   [junit4]   2> NOTE: All tests run in this JVM: [TestWriterImpl, TestZKPropertiesWriter, TestNestedChildren, TestContentStreamDataSource]
   [junit4] Completed [12/38 (1!)] on J0 in 6.66s, 2 tests, 1 failure <<< FAILURES!

[...truncated 88 lines...]
BUILD FAILED
C:\Users\JenkinsSlave\workspace\Lucene-Solr-trunk-Windows\build.xml:740: The following error occurred while executing this line:
C:\Users\JenkinsSlave\workspace\Lucene-Solr-trunk-Windows\build.xml:684: The following error occurred while executing this line:
C:\Users\JenkinsSlave\workspace\Lucene-Solr-trunk-Windows\build.xml:59: The following error occurred while executing this line:
C:\Users\JenkinsSlave\workspace\Lucene-Solr-trunk-Windows\solr\build.xml:253: The following error occurred while executing this line:
C:\Users\JenkinsSlave\workspace\Lucene-Solr-trunk-Windows\solr\common-build.xml:459: The following error occurred while executing this line:
C:\Users\JenkinsSlave\workspace\Lucene-Solr-trunk-Windows\solr\common-build.xml:524: The following error occurred while executing this line:
C:\Users\JenkinsSlave\workspace\Lucene-Solr-trunk-Windows\lucene\common-build.xml:1457: The following error occurred while executing this line:
C:\Users\JenkinsSlave\workspace\Lucene-Solr-trunk-Windows\lucene\common-build.xml:1014: There were test failures: 38 suites, 157 tests, 1 failure, 4 ignored (1 assumption) [seed: 708AC2BA5BDD5917]

Total time: 85 minutes 47 seconds
Build step 'Invoke Ant' marked build as failure
Archiving artifacts
[WARNINGS] Skipping publisher since build result is FAILURE
Recording test results
Email was triggered for: Failure - Any
Sending email for trigger: Failure - Any



Mime
View raw message