lucene-dev mailing list archives

Site index · List index
Message view « Date » · « Thread »
Top « Date » · « Thread »
From Policeman Jenkins Server <jenk...@thetaphi.de>
Subject [JENKINS-EA] Lucene-Solr-5.x-Linux (64bit/jdk-9-ea+95) - Build # 15296 - Still Failing!
Date Tue, 19 Jan 2016 19:07:09 GMT
Build: http://jenkins.thetaphi.de/job/Lucene-Solr-5.x-Linux/15296/
Java: 64bit/jdk-9-ea+95 -XX:-UseCompressedOops -XX:+UseParallelGC -XX:-CompactStrings

1 tests failed.
FAILED:  org.apache.lucene.TestSearch.testNegativeQueryBoost

Error Message:
score is not negative: 0.0

Stack Trace:
java.lang.AssertionError: score is not negative: 0.0
	at __randomizedtesting.SeedInfo.seed([471FDA61F24DAE7B:1B69D1E9CDF5DAF3]:0)
	at org.junit.Assert.fail(Assert.java:93)
	at org.junit.Assert.assertTrue(Assert.java:43)
	at org.apache.lucene.TestSearch.testNegativeQueryBoost(TestSearch.java:60)
	at sun.reflect.NativeMethodAccessorImpl.invoke0(Native Method)
	at sun.reflect.NativeMethodAccessorImpl.invoke(NativeMethodAccessorImpl.java:62)
	at sun.reflect.DelegatingMethodAccessorImpl.invoke(DelegatingMethodAccessorImpl.java:43)
	at java.lang.reflect.Method.invoke(Method.java:520)
	at com.carrotsearch.randomizedtesting.RandomizedRunner.invoke(RandomizedRunner.java:1764)
	at com.carrotsearch.randomizedtesting.RandomizedRunner$8.evaluate(RandomizedRunner.java:871)
	at com.carrotsearch.randomizedtesting.RandomizedRunner$9.evaluate(RandomizedRunner.java:907)
	at com.carrotsearch.randomizedtesting.RandomizedRunner$10.evaluate(RandomizedRunner.java:921)
	at org.apache.lucene.util.TestRuleSetupTeardownChained$1.evaluate(TestRuleSetupTeardownChained.java:50)
	at org.apache.lucene.util.AbstractBeforeAfterRule$1.evaluate(AbstractBeforeAfterRule.java:46)
	at org.apache.lucene.util.TestRuleThreadAndTestName$1.evaluate(TestRuleThreadAndTestName.java:49)
	at org.apache.lucene.util.TestRuleIgnoreAfterMaxFailures$1.evaluate(TestRuleIgnoreAfterMaxFailures.java:65)
	at org.apache.lucene.util.TestRuleMarkFailure$1.evaluate(TestRuleMarkFailure.java:48)
	at com.carrotsearch.randomizedtesting.rules.StatementAdapter.evaluate(StatementAdapter.java:36)
	at com.carrotsearch.randomizedtesting.ThreadLeakControl$StatementRunner.run(ThreadLeakControl.java:367)
	at com.carrotsearch.randomizedtesting.ThreadLeakControl.forkTimeoutingTask(ThreadLeakControl.java:809)
	at com.carrotsearch.randomizedtesting.ThreadLeakControl$3.evaluate(ThreadLeakControl.java:460)
	at com.carrotsearch.randomizedtesting.RandomizedRunner.runSingleTest(RandomizedRunner.java:880)
	at com.carrotsearch.randomizedtesting.RandomizedRunner$5.evaluate(RandomizedRunner.java:781)
	at com.carrotsearch.randomizedtesting.RandomizedRunner$6.evaluate(RandomizedRunner.java:816)
	at com.carrotsearch.randomizedtesting.RandomizedRunner$7.evaluate(RandomizedRunner.java:827)
	at org.apache.lucene.util.AbstractBeforeAfterRule$1.evaluate(AbstractBeforeAfterRule.java:46)
	at com.carrotsearch.randomizedtesting.rules.StatementAdapter.evaluate(StatementAdapter.java:36)
	at org.apache.lucene.util.TestRuleStoreClassName$1.evaluate(TestRuleStoreClassName.java:42)
	at com.carrotsearch.randomizedtesting.rules.NoShadowingOrOverridesOnMethodsRule$1.evaluate(NoShadowingOrOverridesOnMethodsRule.java:40)
	at com.carrotsearch.randomizedtesting.rules.NoShadowingOrOverridesOnMethodsRule$1.evaluate(NoShadowingOrOverridesOnMethodsRule.java:40)
	at com.carrotsearch.randomizedtesting.rules.StatementAdapter.evaluate(StatementAdapter.java:36)
	at com.carrotsearch.randomizedtesting.rules.StatementAdapter.evaluate(StatementAdapter.java:36)
	at com.carrotsearch.randomizedtesting.rules.StatementAdapter.evaluate(StatementAdapter.java:36)
	at org.apache.lucene.util.TestRuleAssertionsRequired$1.evaluate(TestRuleAssertionsRequired.java:54)
	at org.apache.lucene.util.TestRuleMarkFailure$1.evaluate(TestRuleMarkFailure.java:48)
	at org.apache.lucene.util.TestRuleIgnoreAfterMaxFailures$1.evaluate(TestRuleIgnoreAfterMaxFailures.java:65)
	at org.apache.lucene.util.TestRuleIgnoreTestSuites$1.evaluate(TestRuleIgnoreTestSuites.java:55)
	at com.carrotsearch.randomizedtesting.rules.StatementAdapter.evaluate(StatementAdapter.java:36)
	at com.carrotsearch.randomizedtesting.ThreadLeakControl$StatementRunner.run(ThreadLeakControl.java:367)
	at java.lang.Thread.run(Thread.java:747)




Build Log:
[...truncated 1299 lines...]
   [junit4] Suite: org.apache.lucene.TestSearch
   [junit4]   2> NOTE: reproduce with: ant test  -Dtestcase=TestSearch -Dtests.method=testNegativeQueryBoost
-Dtests.seed=471FDA61F24DAE7B -Dtests.multiplier=3 -Dtests.slow=true -Dtests.locale=fr-DJ
-Dtests.timezone=America/Argentina/La_Rioja -Dtests.asserts=true -Dtests.file.encoding=UTF-8
   [junit4] FAILURE 0.01s J0 | TestSearch.testNegativeQueryBoost <<<
   [junit4]    > Throwable #1: java.lang.AssertionError: score is not negative: 0.0
   [junit4]    > 	at __randomizedtesting.SeedInfo.seed([471FDA61F24DAE7B:1B69D1E9CDF5DAF3]:0)
   [junit4]    > 	at org.apache.lucene.TestSearch.testNegativeQueryBoost(TestSearch.java:60)
   [junit4]    > 	at java.lang.Thread.run(Thread.java:747)
   [junit4]   2> NOTE: test params are: codec=Asserting(Lucene54): {contents=PostingsFormat(name=Asserting),
foo=FST50, id=PostingsFormat(name=Direct)}, docValues:{id=DocValuesFormat(name=Memory)}, sim=RandomSimilarity(queryNorm=false,coord=no):
{contents=IB SPL-D3(800.0), foo=DFI}, locale=fr-DJ, timezone=America/Argentina/La_Rioja
   [junit4]   2> NOTE: Linux 3.19.0-42-generic amd64/Oracle Corporation 9-ea (64-bit)/cpus=12,threads=1,free=130485064,total=381157376
   [junit4]   2> NOTE: All tests run in this JVM: [TestDirectoryReader, TestHugeRamFile,
TestIndexWriterExceptions2, FuzzyTermOnShortTermsTest, TestIndexWriterWithThreads, TestCustomSearcherSort,
TestRegexpQuery, TestSpanMultiTermQueryWrapper, TestTerms, TestMatchAllDocsQuery, TestNGramPhraseQuery,
TestBytesRefHash, TestReaderClosed, TestSpansEnum, TestMultiTermsEnum, TestIndexWriterCommit,
TestDateFilter, TestSpanFirstQuery, TestSpanCollection, TestMixedCodecs, TestPrefixCodedTerms,
TestSortedSetSortField, TestQueryCachingPolicy, TestSizeBoundedForceMerge, Test2BPagedBytes,
TestField, TestElevationComparator, TestSortRandom, TestRegexpRandom, TestMinimize, TestOrdinalMap,
TestDeletionPolicy, TestExceedMaxTermLength, TestOperations, TestFilterLeafReader, TestTwoPhaseCommitTool,
TestCustomNorms, TestCharTermAttributeImpl, TestNot, TestMultiThreadTermVectors, TestMatchNoDocsQuery,
TestSumDocFreq, TestSentinelIntSet, TestMultiTermConstantScore, TestMultiFields, TestSimilarityProvider,
TestQueryBuilder, TestShardSearching, TestPerSegmentDeletes, TestIndexWriterNRTIsCurrent,
TestSubScorerFreqs, TestUTF32ToUTF8, TestRateLimiter, TestCachingWrapperQuery, TestLSBRadixSorter,
TestDoc, TestDocumentsWriterDeleteQueue, TestNumericRangeQuery64, Test2BSortedDocValuesFixedSorted,
TestPriorityQueue, TestTieredMergePolicy, TestNoDeletionPolicy, TestDocInverterPerFieldErrorInfo,
TestToken, TestRegexpRandom2, TestBlockPostingsFormat2, TestDirectMonotonic, TestAttributeSource,
TestFilterDirectoryReader, TestIndexWriter, TestPerFieldDocValuesFormat, TestIndexWriterMerging,
TestAddIndexes, TestSearcherManager, TestIndexWriterMergePolicy, TestBoolean2, TestTimeLimitingCollector,
TestHighCompressionMode, TestTopDocsMerge, TestSnapshotDeletionPolicy, TestIndexWriterForceMerge,
TestArrayUtil, TestLevenshteinAutomata, TestByteSlices, TestWeakIdentityMap, TestSegmentMerger,
TestCollectionUtil, TestBagOfPositions, TestFixedBitSet, TestComplexExplanations, TestSegmentReader,
TestFastDecompressionMode, TestTransactions, TestPerFieldPostingsFormat2, TestSort, TestMultiDocValues,
TestFieldsReader, TestSimpleSearchEquivalence, TestNumericUtils, TestSpans, TestTransactionRollback,
TestSpanExplanations, TestRAMDirectory, TestMultiPhraseQuery, TestDeterminism, TestDocsAndPositions,
TestMergeSchedulerExternal, TestBagOfPostings, TestParallelLeafReader, TestThreadedForceMerge,
TestStressNRT, TestOmitTf, TestNearSpansOrdered, TestSameScoresWithThreads, TestLiveFieldValues,
TestForTooMuchCloning, TestPayloads, TestSimilarity2, TestTermRangeFilter, TestFieldMaskingSpanQuery,
TestExternalCodecs, TestTermVectorsReader, TestPrefixInBooleanQuery, TestSegmentTermEnum,
TestUniqueTermCount, TestBooleanQuery, TestComplexExplanationsOfNonMatches, TestAllFilesHaveCodecHeader,
TestParallelReaderEmptyIndex, TestDocument, TestTermScorer, TestTopFieldCollector, TestFileSwitchDirectory,
TestIndexableField, TestDocValuesScoring, TestWindowsMMap, TestMultiLevelSkipList, TestSearchForDuplicates,
TestConstantScoreQuery, TestBinaryTerms, TestMultiTermQueryRewrites, TestSimilarity, TestVirtualMethod,
TestSmallFloat, TestSearch]
   [junit4] Completed [305/417 (1!)] on J0 in 0.02s, 2 tests, 1 failure <<< FAILURES!

[...truncated 395 lines...]
BUILD FAILED
/home/jenkins/workspace/Lucene-Solr-5.x-Linux/build.xml:794: The following error occurred
while executing this line:
/home/jenkins/workspace/Lucene-Solr-5.x-Linux/build.xml:738: The following error occurred
while executing this line:
/home/jenkins/workspace/Lucene-Solr-5.x-Linux/build.xml:59: The following error occurred while
executing this line:
/home/jenkins/workspace/Lucene-Solr-5.x-Linux/lucene/build.xml:50: The following error occurred
while executing this line:
/home/jenkins/workspace/Lucene-Solr-5.x-Linux/lucene/common-build.xml:1444: The following
error occurred while executing this line:
/home/jenkins/workspace/Lucene-Solr-5.x-Linux/lucene/common-build.xml:1000: There were test
failures: 417 suites (1 ignored), 3359 tests, 1 failure, 48 ignored (44 assumptions) [seed:
471FDA61F24DAE7B]

Total time: 6 minutes 4 seconds
Build step 'Invoke Ant' marked build as failure
Archiving artifacts
[WARNINGS] Skipping publisher since build result is FAILURE
Recording test results
Email was triggered for: Failure - Any
Sending email for trigger: Failure - Any



Mime
View raw message