lucene-dev mailing list archives

Site index · List index
Message view « Date » · « Thread »
Top « Date » · « Thread »
From Policeman Jenkins Server <jenk...@thetaphi.de>
Subject [JENKINS-EA] Lucene-Solr-trunk-Linux (32bit/jdk-9-ea+95) - Build # 15216 - Still Failing!
Date Wed, 16 Dec 2015 07:22:35 GMT
Build: http://jenkins.thetaphi.de/job/Lucene-Solr-trunk-Linux/15216/
Java: 32bit/jdk-9-ea+95 -server -XX:+UseParallelGC -XX:-CompactStrings

1 tests failed.
FAILED:  org.apache.solr.cloud.CollectionsAPIDistributedZkTest.test

Error Message:
Error from server at http://127.0.0.1:58927/p_ew/c/awholynewcollection_0: non ok status: 500, message:Server Error

Stack Trace:
org.apache.solr.client.solrj.impl.HttpSolrClient$RemoteSolrException: Error from server at http://127.0.0.1:58927/p_ew/c/awholynewcollection_0: non ok status: 500, message:Server Error
	at __randomizedtesting.SeedInfo.seed([CA4F90A4381D77E8:421BAF7E96E11A10]:0)
	at org.apache.solr.client.solrj.impl.HttpSolrClient.executeMethod(HttpSolrClient.java:509)
	at org.apache.solr.client.solrj.impl.HttpSolrClient.request(HttpSolrClient.java:241)
	at org.apache.solr.client.solrj.impl.HttpSolrClient.request(HttpSolrClient.java:230)
	at org.apache.solr.client.solrj.SolrRequest.process(SolrRequest.java:150)
	at org.apache.solr.client.solrj.SolrClient.query(SolrClient.java:943)
	at org.apache.solr.client.solrj.SolrClient.query(SolrClient.java:958)
	at org.apache.solr.cloud.AbstractFullDistribZkTestBase.waitForNon403or404or503(AbstractFullDistribZkTestBase.java:1754)
	at org.apache.solr.cloud.CollectionsAPIDistributedZkTest.testCollectionsAPI(CollectionsAPIDistributedZkTest.java:638)
	at org.apache.solr.cloud.CollectionsAPIDistributedZkTest.test(CollectionsAPIDistributedZkTest.java:160)
	at sun.reflect.NativeMethodAccessorImpl.invoke0(Native Method)
	at sun.reflect.NativeMethodAccessorImpl.invoke(NativeMethodAccessorImpl.java:62)
	at sun.reflect.DelegatingMethodAccessorImpl.invoke(DelegatingMethodAccessorImpl.java:43)
	at java.lang.reflect.Method.invoke(Method.java:520)
	at com.carrotsearch.randomizedtesting.RandomizedRunner.invoke(RandomizedRunner.java:1764)
	at com.carrotsearch.randomizedtesting.RandomizedRunner$8.evaluate(RandomizedRunner.java:871)
	at com.carrotsearch.randomizedtesting.RandomizedRunner$9.evaluate(RandomizedRunner.java:907)
	at com.carrotsearch.randomizedtesting.RandomizedRunner$10.evaluate(RandomizedRunner.java:921)
	at org.apache.solr.BaseDistributedSearchTestCase$ShardsRepeatRule$ShardsFixedStatement.callStatement(BaseDistributedSearchTestCase.java:965)
	at org.apache.solr.BaseDistributedSearchTestCase$ShardsRepeatRule$ShardsStatement.evaluate(BaseDistributedSearchTestCase.java:940)
	at com.carrotsearch.randomizedtesting.rules.SystemPropertiesRestoreRule$1.evaluate(SystemPropertiesRestoreRule.java:57)
	at org.apache.lucene.util.TestRuleSetupTeardownChained$1.evaluate(TestRuleSetupTeardownChained.java:50)
	at org.apache.lucene.util.AbstractBeforeAfterRule$1.evaluate(AbstractBeforeAfterRule.java:46)
	at org.apache.lucene.util.TestRuleThreadAndTestName$1.evaluate(TestRuleThreadAndTestName.java:49)
	at org.apache.lucene.util.TestRuleIgnoreAfterMaxFailures$1.evaluate(TestRuleIgnoreAfterMaxFailures.java:65)
	at org.apache.lucene.util.TestRuleMarkFailure$1.evaluate(TestRuleMarkFailure.java:48)
	at com.carrotsearch.randomizedtesting.rules.StatementAdapter.evaluate(StatementAdapter.java:36)
	at com.carrotsearch.randomizedtesting.ThreadLeakControl$StatementRunner.run(ThreadLeakControl.java:367)
	at com.carrotsearch.randomizedtesting.ThreadLeakControl.forkTimeoutingTask(ThreadLeakControl.java:809)
	at com.carrotsearch.randomizedtesting.ThreadLeakControl$3.evaluate(ThreadLeakControl.java:460)
	at com.carrotsearch.randomizedtesting.RandomizedRunner.runSingleTest(RandomizedRunner.java:880)
	at com.carrotsearch.randomizedtesting.RandomizedRunner$5.evaluate(RandomizedRunner.java:781)
	at com.carrotsearch.randomizedtesting.RandomizedRunner$6.evaluate(RandomizedRunner.java:816)
	at com.carrotsearch.randomizedtesting.RandomizedRunner$7.evaluate(RandomizedRunner.java:827)
	at com.carrotsearch.randomizedtesting.rules.StatementAdapter.evaluate(StatementAdapter.java:36)
	at com.carrotsearch.randomizedtesting.rules.SystemPropertiesRestoreRule$1.evaluate(SystemPropertiesRestoreRule.java:57)
	at org.apache.lucene.util.AbstractBeforeAfterRule$1.evaluate(AbstractBeforeAfterRule.java:46)
	at com.carrotsearch.randomizedtesting.rules.StatementAdapter.evaluate(StatementAdapter.java:36)
	at org.apache.lucene.util.TestRuleStoreClassName$1.evaluate(TestRuleStoreClassName.java:42)
	at com.carrotsearch.randomizedtesting.rules.NoShadowingOrOverridesOnMethodsRule$1.evaluate(NoShadowingOrOverridesOnMethodsRule.java:40)
	at com.carrotsearch.randomizedtesting.rules.NoShadowingOrOverridesOnMethodsRule$1.evaluate(NoShadowingOrOverridesOnMethodsRule.java:40)
	at com.carrotsearch.randomizedtesting.rules.StatementAdapter.evaluate(StatementAdapter.java:36)
	at com.carrotsearch.randomizedtesting.rules.StatementAdapter.evaluate(StatementAdapter.java:36)
	at com.carrotsearch.randomizedtesting.rules.StatementAdapter.evaluate(StatementAdapter.java:36)
	at org.apache.lucene.util.TestRuleAssertionsRequired$1.evaluate(TestRuleAssertionsRequired.java:54)
	at org.apache.lucene.util.TestRuleMarkFailure$1.evaluate(TestRuleMarkFailure.java:48)
	at org.apache.lucene.util.TestRuleIgnoreAfterMaxFailures$1.evaluate(TestRuleIgnoreAfterMaxFailures.java:65)
	at org.apache.lucene.util.TestRuleIgnoreTestSuites$1.evaluate(TestRuleIgnoreTestSuites.java:55)
	at com.carrotsearch.randomizedtesting.rules.StatementAdapter.evaluate(StatementAdapter.java:36)
	at com.carrotsearch.randomizedtesting.ThreadLeakControl$StatementRunner.run(ThreadLeakControl.java:367)
	at java.lang.Thread.run(Thread.java:747)




Build Log:
[...truncated 10120 lines...]
   [junit4] Suite: org.apache.solr.cloud.CollectionsAPIDistributedZkTest
   [junit4]   2> Creating dataDir: /home/jenkins/workspace/Lucene-Solr-trunk-Linux/solr/build/solr-core/test/J1/temp/solr.cloud.CollectionsAPIDistributedZkTest_CA4F90A4381D77E8-001/init-core-data-001
   [junit4]   2> 1001718 INFO  (SUITE-CollectionsAPIDistributedZkTest-seed#[CA4F90A4381D77E8]-worker) [    ] o.a.s.SolrTestCaseJ4 Randomized ssl (false) and clientAuth (false)
   [junit4]   2> 1001718 INFO  (SUITE-CollectionsAPIDistributedZkTest-seed#[CA4F90A4381D77E8]-worker) [    ] o.a.s.BaseDistributedSearchTestCase Setting hostContext system property: /p_ew/c
   [junit4]   2> 1001720 INFO  (TEST-CollectionsAPIDistributedZkTest.test-seed#[CA4F90A4381D77E8]) [    ] o.a.s.c.ZkTestServer STARTING ZK TEST SERVER
   [junit4]   2> 1001720 INFO  (Thread-2590) [    ] o.a.s.c.ZkTestServer client port:0.0.0.0/0.0.0.0:0
   [junit4]   2> 1001720 INFO  (Thread-2590) [    ] o.a.s.c.ZkTestServer Starting server
   [junit4]   2> 1001820 INFO  (TEST-CollectionsAPIDistributedZkTest.test-seed#[CA4F90A4381D77E8]) [    ] o.a.s.c.ZkTestServer start zk server on port:51158
   [junit4]   2> 1001820 INFO  (TEST-CollectionsAPIDistributedZkTest.test-seed#[CA4F90A4381D77E8]) [    ] o.a.s.c.c.SolrZkClient Using default ZkCredentialsProvider
   [junit4]   2> 1001820 INFO  (TEST-CollectionsAPIDistributedZkTest.test-seed#[CA4F90A4381D77E8]) [    ] o.a.s.c.c.ConnectionManager Waiting for client to connect to ZooKeeper
   [junit4]   2> 1001822 INFO  (zkCallback-797-thread-1) [    ] o.a.s.c.c.ConnectionManager Watcher org.apache.solr.common.cloud.ConnectionManager@144d1a2 name:ZooKeeperConnection Watcher:127.0.0.1:51158 got event WatchedEvent state:SyncConnected type:None path:null path:null type:None
   [junit4]   2> 1001822 INFO  (TEST-CollectionsAPIDistributedZkTest.test-seed#[CA4F90A4381D77E8]) [    ] o.a.s.c.c.ConnectionManager Client is connected to ZooKeeper
   [junit4]   2> 1001822 INFO  (TEST-CollectionsAPIDistributedZkTest.test-seed#[CA4F90A4381D77E8]) [    ] o.a.s.c.c.SolrZkClient Using default ZkACLProvider
   [junit4]   2> 1001822 INFO  (TEST-CollectionsAPIDistributedZkTest.test-seed#[CA4F90A4381D77E8]) [    ] o.a.s.c.c.SolrZkClient makePath: /solr
   [junit4]   2> 1001824 INFO  (TEST-CollectionsAPIDistributedZkTest.test-seed#[CA4F90A4381D77E8]) [    ] o.a.s.c.c.SolrZkClient Using default ZkCredentialsProvider
   [junit4]   2> 1001824 INFO  (TEST-CollectionsAPIDistributedZkTest.test-seed#[CA4F90A4381D77E8]) [    ] o.a.s.c.c.ConnectionManager Waiting for client to connect to ZooKeeper
   [junit4]   2> 1001824 INFO  (zkCallback-798-thread-1) [    ] o.a.s.c.c.ConnectionManager Watcher org.apache.solr.common.cloud.ConnectionManager@65e9c6 name:ZooKeeperConnection Watcher:127.0.0.1:51158/solr got event WatchedEvent state:SyncConnected type:None path:null path:null type:None
   [junit4]   2> 1001824 INFO  (TEST-CollectionsAPIDistributedZkTest.test-seed#[CA4F90A4381D77E8]) [    ] o.a.s.c.c.ConnectionManager Client is connected to ZooKeeper
   [junit4]   2> 1001825 INFO  (TEST-CollectionsAPIDistributedZkTest.test-seed#[CA4F90A4381D77E8]) [    ] o.a.s.c.c.SolrZkClient Using default ZkACLProvider
   [junit4]   2> 1001825 INFO  (TEST-CollectionsAPIDistributedZkTest.test-seed#[CA4F90A4381D77E8]) [    ] o.a.s.c.c.SolrZkClient makePath: /collections/collection1
   [junit4]   2> 1001825 INFO  (TEST-CollectionsAPIDistributedZkTest.test-seed#[CA4F90A4381D77E8]) [    ] o.a.s.c.c.SolrZkClient makePath: /collections/collection1/shards
   [junit4]   2> 1001826 INFO  (TEST-CollectionsAPIDistributedZkTest.test-seed#[CA4F90A4381D77E8]) [    ] o.a.s.c.c.SolrZkClient makePath: /collections/control_collection
   [junit4]   2> 1001826 INFO  (TEST-CollectionsAPIDistributedZkTest.test-seed#[CA4F90A4381D77E8]) [    ] o.a.s.c.c.SolrZkClient makePath: /collections/control_collection/shards
   [junit4]   2> 1001827 INFO  (TEST-CollectionsAPIDistributedZkTest.test-seed#[CA4F90A4381D77E8]) [    ] o.a.s.c.AbstractZkTestCase put /home/jenkins/workspace/Lucene-Solr-trunk-Linux/solr/core/src/test-files/solr/collection1/conf/solrconfig-tlog.xml to /configs/conf1/solrconfig.xml
   [junit4]   2> 1001827 INFO  (TEST-CollectionsAPIDistributedZkTest.test-seed#[CA4F90A4381D77E8]) [    ] o.a.s.c.c.SolrZkClient makePath: /configs/conf1/solrconfig.xml
   [junit4]   2> 1001828 INFO  (TEST-CollectionsAPIDistributedZkTest.test-seed#[CA4F90A4381D77E8]) [    ] o.a.s.c.AbstractZkTestCase put /home/jenkins/workspace/Lucene-Solr-trunk-Linux/solr/core/src/test-files/solr/collection1/conf/schema.xml to /configs/conf1/schema.xml
   [junit4]   2> 1001828 INFO  (TEST-CollectionsAPIDistributedZkTest.test-seed#[CA4F90A4381D77E8]) [    ] o.a.s.c.c.SolrZkClient makePath: /configs/conf1/schema.xml
   [junit4]   2> 1001828 INFO  (TEST-CollectionsAPIDistributedZkTest.test-seed#[CA4F90A4381D77E8]) [    ] o.a.s.c.AbstractZkTestCase put /home/jenkins/workspace/Lucene-Solr-trunk-Linux/solr/core/src/test-files/solr/collection1/conf/solrconfig.snippet.randomindexconfig.xml to /configs/conf1/solrconfig.snippet.randomindexconfig.xml
   [junit4]   2> 1001829 INFO  (TEST-CollectionsAPIDistributedZkTest.test-seed#[CA4F90A4381D77E8]) [    ] o.a.s.c.c.SolrZkClient makePath: /configs/conf1/solrconfig.snippet.randomindexconfig.xml
   [junit4]   2> 1001829 INFO  (TEST-CollectionsAPIDistributedZkTest.test-seed#[CA4F90A4381D77E8]) [    ] o.a.s.c.AbstractZkTestCase put /home/jenkins/workspace/Lucene-Solr-trunk-Linux/solr/core/src/test-files/solr/collection1/conf/stopwords.txt to /configs/conf1/stopwords.txt
   [junit4]   2> 1001829 INFO  (TEST-CollectionsAPIDistributedZkTest.test-seed#[CA4F90A4381D77E8]) [    ] o.a.s.c.c.SolrZkClient makePath: /configs/conf1/stopwords.txt
   [junit4]   2> 1001830 INFO  (TEST-CollectionsAPIDistributedZkTest.test-seed#[CA4F90A4381D77E8]) [    ] o.a.s.c.AbstractZkTestCase put /home/jenkins/workspace/Lucene-Solr-trunk-Linux/solr/core/src/test-files/solr/collection1/conf/protwords.txt to /configs/conf1/protwords.txt
   [junit4]   2> 1001830 INFO  (TEST-CollectionsAPIDistributedZkTest.test-seed#[CA4F90A4381D77E8]) [    ] o.a.s.c.c.SolrZkClient makePath: /configs/conf1/protwords.txt
   [junit4]   2> 1001830 INFO  (TEST-CollectionsAPIDistributedZkTest.test-seed#[CA4F90A4381D77E8]) [    ] o.a.s.c.AbstractZkTestCase put /home/jenkins/workspace/Lucene-Solr-trunk-Linux/solr/core/src/test-files/solr/collection1/conf/currency.xml to /configs/conf1/currency.xml
   [junit4]   2> 1001831 INFO  (TEST-CollectionsAPIDistributedZkTest.test-seed#[CA4F90A4381D77E8]) [    ] o.a.s.c.c.SolrZkClient makePath: /configs/conf1/currency.xml
   [junit4]   2> 1001831 INFO  (TEST-CollectionsAPIDistributedZkTest.test-seed#[CA4F90A4381D77E8]) [    ] o.a.s.c.AbstractZkTestCase put /home/jenkins/workspace/Lucene-Solr-trunk-Linux/solr/core/src/test-files/solr/collection1/conf/enumsConfig.xml to /configs/conf1/enumsConfig.xml
   [junit4]   2> 1001831 INFO  (TEST-CollectionsAPIDistributedZkTest.test-seed#[CA4F90A4381D77E8]) [    ] o.a.s.c.c.SolrZkClient makePath: /configs/conf1/enumsConfig.xml
   [junit4]   2> 1001832 INFO  (TEST-CollectionsAPIDistributedZkTest.test-seed#[CA4F90A4381D77E8]) [    ] o.a.s.c.AbstractZkTestCase put /home/jenkins/workspace/Lucene-Solr-trunk-Linux/solr/core/src/test-files/solr/collection1/conf/open-exchange-rates.json to /configs/conf1/open-exchange-rates.json
   [junit4]   2> 1001832 INFO  (TEST-CollectionsAPIDistributedZkTest.test-seed#[CA4F90A4381D77E8]) [    ] o.a.s.c.c.SolrZkClient makePath: /configs/conf1/open-exchange-rates.json
   [junit4]   2> 1001832 INFO  (TEST-CollectionsAPIDistributedZkTest.test-seed#[CA4F90A4381D77E8]) [    ] o.a.s.c.AbstractZkTestCase put /home/jenkins/workspace/Lucene-Solr-trunk-Linux/solr/core/src/test-files/solr/collection1/conf/mapping-ISOLatin1Accent.txt to /configs/conf1/mapping-ISOLatin1Accent.txt
   [junit4]   2> 1001832 INFO  (TEST-CollectionsAPIDistributedZkTest.test-seed#[CA4F90A4381D77E8]) [    ] o.a.s.c.c.SolrZkClient makePath: /configs/conf1/mapping-ISOLatin1Accent.txt
   [junit4]   2> 1001833 INFO  (TEST-CollectionsAPIDistributedZkTest.test-seed#[CA4F90A4381D77E8]) [    ] o.a.s.c.AbstractZkTestCase put /home/jenkins/workspace/Lucene-Solr-trunk-Linux/solr/core/src/test-files/solr/collection1/conf/old_synonyms.txt to /configs/conf1/old_synonyms.txt
   [junit4]   2> 1001833 INFO  (TEST-CollectionsAPIDistributedZkTest.test-seed#[CA4F90A4381D77E8]) [    ] o.a.s.c.c.SolrZkClient makePath: /configs/conf1/old_synonyms.txt
   [junit4]   2> 1001833 INFO  (TEST-CollectionsAPIDistributedZkTest.test-seed#[CA4F90A4381D77E8]) [    ] o.a.s.c.AbstractZkTestCase put /home/jenkins/workspace/Lucene-Solr-trunk-Linux/solr/core/src/test-files/solr/collection1/conf/synonyms.txt to /configs/conf1/synonyms.txt
   [junit4]   2> 1001833 INFO  (TEST-CollectionsAPIDistributedZkTest.test-seed#[CA4F90A4381D77E8]) [    ] o.a.s.c.c.SolrZkClient makePath: /configs/conf1/synonyms.txt
   [junit4]   2> 1001887 INFO  (TEST-CollectionsAPIDistributedZkTest.test-seed#[CA4F90A4381D77E8]) [    ] o.a.s.SolrTestCaseJ4 Writing core.properties file to /home/jenkins/workspace/Lucene-Solr-trunk-Linux/solr/build/solr-core/test/J1/temp/solr.cloud.CollectionsAPIDistributedZkTest_CA4F90A4381D77E8-001/control-001/cores/collection1
   [junit4]   2> 1001888 INFO  (TEST-CollectionsAPIDistributedZkTest.test-seed#[CA4F90A4381D77E8]) [    ] o.e.j.s.Server jetty-9.3.6.v20151106
   [junit4]   2> 1001894 INFO  (TEST-CollectionsAPIDistributedZkTest.test-seed#[CA4F90A4381D77E8]) [    ] o.e.j.s.h.ContextHandler Started o.e.j.s.ServletContextHandler@1e527e9{/p_ew/c,null,AVAILABLE}
   [junit4]   2> 1001895 INFO  (TEST-CollectionsAPIDistributedZkTest.test-seed#[CA4F90A4381D77E8]) [    ] o.e.j.s.ServerConnector Started ServerConnector@1804c95{HTTP/1.1,[http/1.1]}{127.0.0.1:58927}
   [junit4]   2> 1001895 INFO  (TEST-CollectionsAPIDistributedZkTest.test-seed#[CA4F90A4381D77E8]) [    ] o.e.j.s.Server Started @1003816ms
   [junit4]   2> 1001895 INFO  (TEST-CollectionsAPIDistributedZkTest.test-seed#[CA4F90A4381D77E8]) [    ] o.a.s.c.s.e.JettySolrRunner Jetty properties: {solr.data.dir=/home/jenkins/workspace/Lucene-Solr-trunk-Linux/solr/build/solr-core/test/J1/temp/solr.cloud.CollectionsAPIDistributedZkTest_CA4F90A4381D77E8-001/tempDir-001/control/data, hostContext=/p_ew/c, hostPort=58927, coreRootDirectory=/home/jenkins/workspace/Lucene-Solr-trunk-Linux/solr/build/solr-core/test/J1/../../../../../../../../../home/jenkins/workspace/Lucene-Solr-trunk-Linux/solr/build/solr-core/test/J1/temp/solr.cloud.CollectionsAPIDistributedZkTest_CA4F90A4381D77E8-001/control-001/cores}
   [junit4]   2> 1001895 INFO  (TEST-CollectionsAPIDistributedZkTest.test-seed#[CA4F90A4381D77E8]) [    ] o.a.s.s.SolrDispatchFilter SolrDispatchFilter.init(): sun.misc.Launcher$AppClassLoader@1eb6432
   [junit4]   2> 1001895 INFO  (TEST-CollectionsAPIDistributedZkTest.test-seed#[CA4F90A4381D77E8]) [    ] o.a.s.c.SolrResourceLoader new SolrResourceLoader for directory: '/home/jenkins/workspace/Lucene-Solr-trunk-Linux/solr/build/solr-core/test/J1/temp/solr.cloud.CollectionsAPIDistributedZkTest_CA4F90A4381D77E8-001/control-001'
   [junit4]   2> 1001895 INFO  (TEST-CollectionsAPIDistributedZkTest.test-seed#[CA4F90A4381D77E8]) [    ] o.a.s.c.SolrResourceLoader JNDI not configured for solr (NoInitialContextEx)
   [junit4]   2> 1001895 INFO  (TEST-CollectionsAPIDistributedZkTest.test-seed#[CA4F90A4381D77E8]) [    ] o.a.s.c.SolrResourceLoader solr home defaulted to 'solr/' (could not find system property or JNDI)
   [junit4]   2> 1001895 INFO  (TEST-CollectionsAPIDistributedZkTest.test-seed#[CA4F90A4381D77E8]) [    ] o.a.s.c.c.SolrZkClient Using default ZkCredentialsProvider
   [junit4]   2> 1001895 INFO  (TEST-CollectionsAPIDistributedZkTest.test-seed#[CA4F90A4381D77E8]) [    ] o.a.s.c.c.ConnectionManager Waiting for client to connect to ZooKeeper
   [junit4]   2> 1001896 INFO  (zkCallback-799-thread-1) [    ] o.a.s.c.c.ConnectionManager Watcher org.apache.solr.common.cloud.ConnectionManager@435e8 name:ZooKeeperConnection Watcher:127.0.0.1:51158/solr got event WatchedEvent state:SyncConnected type:None path:null path:null type:None
   [junit4]   2> 1001896 INFO  (TEST-CollectionsAPIDistributedZkTest.test-seed#[CA4F90A4381D77E8]) [    ] o.a.s.c.c.ConnectionManager Client is connected to ZooKeeper
   [junit4]   2> 1001896 INFO  (TEST-CollectionsAPIDistributedZkTest.test-seed#[CA4F90A4381D77E8]) [    ] o.a.s.c.c.SolrZkClient Using default ZkACLProvider
   [junit4]   2> 1001897 INFO  (TEST-CollectionsAPIDistributedZkTest.test-seed#[CA4F90A4381D77E8]) [    ] o.a.s.s.SolrDispatchFilter Loading solr.xml from SolrHome (not found in ZooKeeper)
   [junit4]   2> 1001897 INFO  (TEST-CollectionsAPIDistributedZkTest.test-seed#[CA4F90A4381D77E8]) [    ] o.a.s.c.SolrXmlConfig Loading container configuration from /home/jenkins/workspace/Lucene-Solr-trunk-Linux/solr/build/solr-core/test/J1/temp/solr.cloud.CollectionsAPIDistributedZkTest_CA4F90A4381D77E8-001/control-001/solr.xml
   [junit4]   2> 1001900 INFO  (TEST-CollectionsAPIDistributedZkTest.test-seed#[CA4F90A4381D77E8]) [    ] o.a.s.c.CorePropertiesLocator Config-defined core root directory: /home/jenkins/workspace/Lucene-Solr-trunk-Linux/solr/build/solr-core/test/J1/../../../../../../../../../home/jenkins/workspace/Lucene-Solr-trunk-Linux/solr/build/solr-core/test/J1/temp/solr.cloud.CollectionsAPIDistributedZkTest_CA4F90A4381D77E8-001/control-001/cores
   [junit4]   2> 1001900 INFO  (TEST-CollectionsAPIDistributedZkTest.test-seed#[CA4F90A4381D77E8]) [    ] o.a.s.c.CoreContainer New CoreContainer 32169139
   [junit4]   2> 1001900 INFO  (TEST-CollectionsAPIDistributedZkTest.test-seed#[CA4F90A4381D77E8]) [    ] o.a.s.c.CoreContainer Loading cores into CoreContainer [instanceDir=/home/jenkins/workspace/Lucene-Solr-trunk-Linux/solr/build/solr-core/test/J1/temp/solr.cloud.CollectionsAPIDistributedZkTest_CA4F90A4381D77E8-001/control-001]
   [junit4]   2> 1001900 WARN  (TEST-CollectionsAPIDistributedZkTest.test-seed#[CA4F90A4381D77E8]) [    ] o.a.s.c.CoreContainer Couldn't add files from /home/jenkins/workspace/Lucene-Solr-trunk-Linux/solr/build/solr-core/test/J1/temp/solr.cloud.CollectionsAPIDistributedZkTest_CA4F90A4381D77E8-001/control-001/lib to classpath: /home/jenkins/workspace/Lucene-Solr-trunk-Linux/solr/build/solr-core/test/J1/temp/solr.cloud.CollectionsAPIDistributedZkTest_CA4F90A4381D77E8-001/control-001/lib
   [junit4]   2> 1001900 INFO  (TEST-CollectionsAPIDistributedZkTest.test-seed#[CA4F90A4381D77E8]) [    ] o.a.s.h.c.HttpShardHandlerFactory created with socketTimeout : 90000,urlScheme : ,connTimeout : 15000,maxConnectionsPerHost : 20,maxConnections : 10000,corePoolSize : 0,maximumPoolSize : 2147483647,maxThreadIdleTime : 5,sizeOfQueue : -1,fairnessPolicy : false,useRetries : false,
   [junit4]   2> 1001901 INFO  (TEST-CollectionsAPIDistributedZkTest.test-seed#[CA4F90A4381D77E8]) [    ] o.a.s.u.UpdateShardHandler Creating UpdateShardHandler HTTP client with params: socketTimeout=340000&connTimeout=45000&retry=true
   [junit4]   2> 1001901 INFO  (TEST-CollectionsAPIDistributedZkTest.test-seed#[CA4F90A4381D77E8]) [    ] o.a.s.l.LogWatcher SLF4J impl is org.slf4j.impl.Log4jLoggerFactory
   [junit4]   2> 1001901 INFO  (TEST-CollectionsAPIDistributedZkTest.test-seed#[CA4F90A4381D77E8]) [    ] o.a.s.l.LogWatcher Registering Log Listener [Log4j (org.slf4j.impl.Log4jLoggerFactory)]
   [junit4]   2> 1001901 INFO  (TEST-CollectionsAPIDistributedZkTest.test-seed#[CA4F90A4381D77E8]) [    ] o.a.s.c.ZkContainer Zookeeper client=127.0.0.1:51158/solr
   [junit4]   2> 1001901 INFO  (TEST-CollectionsAPIDistributedZkTest.test-seed#[CA4F90A4381D77E8]) [    ] o.a.s.c.ZkController zkHost includes chroot
   [junit4]   2> 1001901 INFO  (TEST-CollectionsAPIDistributedZkTest.test-seed#[CA4F90A4381D77E8]) [    ] o.a.s.c.c.SolrZkClient Using default ZkCredentialsProvider
   [junit4]   2> 1001903 INFO  (TEST-CollectionsAPIDistributedZkTest.test-seed#[CA4F90A4381D77E8]) [    ] o.a.s.c.c.ConnectionManager Waiting for client to connect to ZooKeeper
   [junit4]   2> 1001903 INFO  (zkCallback-801-thread-1) [    ] o.a.s.c.c.ConnectionManager Watcher org.apache.solr.common.cloud.ConnectionManager@a66a2b name:ZooKeeperConnection Watcher:127.0.0.1:51158 got event WatchedEvent state:SyncConnected type:None path:null path:null type:None
   [junit4]   2> 1001903 INFO  (TEST-CollectionsAPIDistributedZkTest.test-seed#[CA4F90A4381D77E8]) [    ] o.a.s.c.c.ConnectionManager Client is connected to ZooKeeper
   [junit4]   2> 1001904 INFO  (TEST-CollectionsAPIDistributedZkTest.test-seed#[CA4F90A4381D77E8]) [    ] o.a.s.c.c.SolrZkClient Using default ZkACLProvider
   [junit4]   2> 1001904 INFO  (TEST-CollectionsAPIDistributedZkTest.test-seed#[CA4F90A4381D77E8]) [    ] o.a.s.c.c.ConnectionManager Waiting for client to connect to ZooKeeper
   [junit4]   2> 1001905 INFO  (zkCallback-802-thread-1) [    ] o.a.s.c.c.ConnectionManager Watcher org.apache.solr.common.cloud.ConnectionManager@1956ec9 name:ZooKeeperConnection Watcher:127.0.0.1:51158/solr got event WatchedEvent state:SyncConnected type:None path:null path:null type:None
   [junit4]   2> 1001905 INFO  (TEST-CollectionsAPIDistributedZkTest.test-seed#[CA4F90A4381D77E8]) [    ] o.a.s.c.c.ConnectionManager Client is connected to ZooKeeper
   [junit4]   2> 1001905 INFO  (TEST-CollectionsAPIDistributedZkTest.test-seed#[CA4F90A4381D77E8]) [    ] o.a.s.c.c.SolrZkClient makePath: /overseer/queue
   [junit4]   2> 1001906 INFO  (TEST-CollectionsAPIDistributedZkTest.test-seed#[CA4F90A4381D77E8]) [    ] o.a.s.c.c.SolrZkClient makePath: /overseer/collection-queue-work
   [junit4]   2> 1001907 INFO  (TEST-CollectionsAPIDistributedZkTest.test-seed#[CA4F90A4381D77E8]) [    ] o.a.s.c.c.SolrZkClient makePath: /overseer/collection-map-running
   [junit4]   2> 1001908 INFO  (TEST-CollectionsAPIDistributedZkTest.test-seed#[CA4F90A4381D77E8]) [    ] o.a.s.c.c.SolrZkClient makePath: /overseer/collection-map-completed
   [junit4]   2> 1001908 INFO  (TEST-CollectionsAPIDistributedZkTest.test-seed#[CA4F90A4381D77E8]) [    ] o.a.s.c.c.SolrZkClient makePath: /overseer/collection-map-failure
   [junit4]   2> 1001909 INFO  (TEST-CollectionsAPIDistributedZkTest.test-seed#[CA4F90A4381D77E8]) [    ] o.a.s.c.c.SolrZkClient makePath: /live_nodes
   [junit4]   2> 1001909 INFO  (TEST-CollectionsAPIDistributedZkTest.test-seed#[CA4F90A4381D77E8]) [    ] o.a.s.c.c.SolrZkClient makePath: /aliases.json
   [junit4]   2> 1001909 INFO  (TEST-CollectionsAPIDistributedZkTest.test-seed#[CA4F90A4381D77E8]) [    ] o.a.s.c.c.SolrZkClient makePath: /clusterstate.json
   [junit4]   2> 1001910 INFO  (TEST-CollectionsAPIDistributedZkTest.test-seed#[CA4F90A4381D77E8]) [    ] o.a.s.c.c.SolrZkClient makePath: /security.json
   [junit4]   2> 1001910 INFO  (TEST-CollectionsAPIDistributedZkTest.test-seed#[CA4F90A4381D77E8]) [    ] o.a.s.c.ZkController Register node as live in ZooKeeper:/live_nodes/127.0.0.1:58927_p_ew%2Fc
   [junit4]   2> 1001910 INFO  (TEST-CollectionsAPIDistributedZkTest.test-seed#[CA4F90A4381D77E8]) [    ] o.a.s.c.c.SolrZkClient makePath: /live_nodes/127.0.0.1:58927_p_ew%2Fc
   [junit4]   2> 1001911 INFO  (TEST-CollectionsAPIDistributedZkTest.test-seed#[CA4F90A4381D77E8]) [    ] o.a.s.c.c.SolrZkClient makePath: /overseer_elect
   [junit4]   2> 1001911 INFO  (TEST-CollectionsAPIDistributedZkTest.test-seed#[CA4F90A4381D77E8]) [    ] o.a.s.c.c.SolrZkClient makePath: /overseer_elect/election
   [junit4]   2> 1001911 INFO  (TEST-CollectionsAPIDistributedZkTest.test-seed#[CA4F90A4381D77E8]) [    ] o.a.s.c.Overseer Overseer (id=null) closing
   [junit4]   2> 1001912 INFO  (TEST-CollectionsAPIDistributedZkTest.test-seed#[CA4F90A4381D77E8]) [    ] o.a.s.c.LeaderElector Joined leadership election with path: /overseer_elect/election/95043558742163460-127.0.0.1:58927_p_ew%2Fc-n_0000000000
   [junit4]   2> 1001912 INFO  (TEST-CollectionsAPIDistributedZkTest.test-seed#[CA4F90A4381D77E8]) [    ] o.a.s.c.OverseerElectionContext I am going to be the leader 127.0.0.1:58927_p_ew%2Fc
   [junit4]   2> 1001912 INFO  (TEST-CollectionsAPIDistributedZkTest.test-seed#[CA4F90A4381D77E8]) [    ] o.a.s.c.c.SolrZkClient makePath: /overseer_elect/leader
   [junit4]   2> 1001912 INFO  (TEST-CollectionsAPIDistributedZkTest.test-seed#[CA4F90A4381D77E8]) [    ] o.a.s.c.Overseer Overseer (id=95043558742163460-127.0.0.1:58927_p_ew%2Fc-n_0000000000) starting
   [junit4]   2> 1001913 INFO  (TEST-CollectionsAPIDistributedZkTest.test-seed#[CA4F90A4381D77E8]) [    ] o.a.s.c.c.SolrZkClient makePath: /overseer/queue-work
   [junit4]   2> 1001914 INFO  (TEST-CollectionsAPIDistributedZkTest.test-seed#[CA4F90A4381D77E8]) [    ] o.a.s.c.OverseerAutoReplicaFailoverThread Starting OverseerAutoReplicaFailoverThread autoReplicaFailoverWorkLoopDelay=10000 autoReplicaFailoverWaitAfterExpiration=10000 autoReplicaFailoverBadNodeExpiration=60000
   [junit4]   2> 1001915 INFO  (OverseerCollectionConfigSetProcessor-95043558742163460-127.0.0.1:58927_p_ew%2Fc-n_0000000000) [    ] o.a.s.c.OverseerTaskProcessor Process current queue of overseer operations
   [junit4]   2> 1001915 INFO  (TEST-CollectionsAPIDistributedZkTest.test-seed#[CA4F90A4381D77E8]) [    ] o.a.s.c.c.ZkStateReader Updating cluster state from ZooKeeper... 
   [junit4]   2> 1001915 INFO  (OverseerStateUpdate-95043558742163460-127.0.0.1:58927_p_ew%2Fc-n_0000000000) [    ] o.a.s.c.Overseer Starting to work on the main queue
   [junit4]   2> 1001928 INFO  (TEST-CollectionsAPIDistributedZkTest.test-seed#[CA4F90A4381D77E8]) [    ] o.a.s.c.CoreContainer Security conf doesn't exist. Skipping setup for authorization module.
   [junit4]   2> 1001928 INFO  (TEST-CollectionsAPIDistributedZkTest.test-seed#[CA4F90A4381D77E8]) [    ] o.a.s.c.CoreContainer No authentication plugin used.
   [junit4]   2> 1001928 INFO  (TEST-CollectionsAPIDistributedZkTest.test-seed#[CA4F90A4381D77E8]) [    ] o.a.s.c.CorePropertiesLocator Looking for core definitions underneath /home/jenkins/workspace/Lucene-Solr-trunk-Linux/solr/build/solr-core/test/J1/../../../../../../../../../home/jenkins/workspace/Lucene-Solr-trunk-Linux/solr/build/solr-core/test/J1/temp/solr.cloud.CollectionsAPIDistributedZkTest_CA4F90A4381D77E8-001/control-001/cores
   [junit4]   2> 1001929 INFO  (TEST-CollectionsAPIDistributedZkTest.test-seed#[CA4F90A4381D77E8]) [    ] o.a.s.c.CoreDescriptor Created CoreDescriptor: {name=collection1, config=solrconfig.xml, transient=false, schema=schema.xml, loadOnStartup=true, configSetProperties=configsetprops.json, collection=control_collection, coreNodeName=, dataDir=data/, shard=}
   [junit4]   2> 1001929 INFO  (TEST-CollectionsAPIDistributedZkTest.test-seed#[CA4F90A4381D77E8]) [    ] o.a.s.c.CorePropertiesLocator Found core collection1 in /home/jenkins/workspace/Lucene-Solr-trunk-Linux/solr/build/solr-core/test/J1/../../../../../../../../../home/jenkins/workspace/Lucene-Solr-trunk-Linux/solr/build/solr-core/test/J1/temp/solr.cloud.CollectionsAPIDistributedZkTest_CA4F90A4381D77E8-001/control-001/cores/collection1
   [junit4]   2> 1001929 INFO  (TEST-CollectionsAPIDistributedZkTest.test-seed#[CA4F90A4381D77E8]) [    ] o.a.s.c.CorePropertiesLocator Found 1 core definitions
   [junit4]   2> 1001929 INFO  (TEST-CollectionsAPIDistributedZkTest.test-seed#[CA4F90A4381D77E8]) [    ] o.a.s.s.SolrDispatchFilter user.dir=/home/jenkins/workspace/Lucene-Solr-trunk-Linux/solr/build/solr-core/test/J1
   [junit4]   2> 1001929 INFO  (TEST-CollectionsAPIDistributedZkTest.test-seed#[CA4F90A4381D77E8]) [    ] o.a.s.s.SolrDispatchFilter SolrDispatchFilter.init() done
   [junit4]   2> 1001929 INFO  (coreLoadExecutor-2942-thread-1) [    ] o.a.s.c.ZkController publishing state=down
   [junit4]   2> 1001929 INFO  (coreLoadExecutor-2942-thread-1) [    ] o.a.s.c.ZkController numShards not found on descriptor - reading it from system property
   [junit4]   2> 1001930 INFO  (OverseerStateUpdate-95043558742163460-127.0.0.1:58927_p_ew%2Fc-n_0000000000) [    ] o.a.s.c.Overseer processMessage: queueSize: 1, message = {
   [junit4]   2>   "core":"collection1",
   [junit4]   2>   "roles":null,
   [junit4]   2>   "base_url":"http://127.0.0.1:58927/p_ew/c",
   [junit4]   2>   "node_name":"127.0.0.1:58927_p_ew%2Fc",
   [junit4]   2>   "numShards":"1",
   [junit4]   2>   "state":"down",
   [junit4]   2>   "shard":null,
   [junit4]   2>   "collection":"control_collection",
   [junit4]   2>   "operation":"state"} current state version: 0
   [junit4]   2> 1001930 INFO  (coreLoadExecutor-2942-thread-1) [    ] o.a.s.c.ZkController look for our core node name
   [junit4]   2> 1001930 INFO  (OverseerStateUpdate-95043558742163460-127.0.0.1:58927_p_ew%2Fc-n_0000000000) [    ] o.a.s.c.o.ReplicaMutator Update state numShards=1 message={
   [junit4]   2>   "core":"collection1",
   [junit4]   2>   "roles":null,
   [junit4]   2>   "base_url":"http://127.0.0.1:58927/p_ew/c",
   [junit4]   2>   "node_name":"127.0.0.1:58927_p_ew%2Fc",
   [junit4]   2>   "numShards":"1",
   [junit4]   2>   "state":"down",
   [junit4]   2>   "shard":null,
   [junit4]   2>   "collection":"control_collection",
   [junit4]   2>   "operation":"state"}
   [junit4]   2> 1001930 INFO  (OverseerStateUpdate-95043558742163460-127.0.0.1:58927_p_ew%2Fc-n_0000000000) [    ] o.a.s.c.o.ClusterStateMutator building a new cName: control_collection
   [junit4]   2> 1001930 INFO  (OverseerStateUpdate-95043558742163460-127.0.0.1:58927_p_ew%2Fc-n_0000000000) [    ] o.a.s.c.o.ReplicaMutator Assigning new node to shard shard=shard1
   [junit4]   2> 1001931 INFO  (zkCallback-802-thread-1) [    ] o.a.s.c.c.ZkStateReader A cluster state change: WatchedEvent state:SyncConnected type:NodeDataChanged path:/clusterstate.json, has occurred - updating... (live nodes size: 1)
   [junit4]   2> 1002930 INFO  (coreLoadExecutor-2942-thread-1) [    ] o.a.s.c.ZkController waiting to find shard id in clusterstate for collection1
   [junit4]   2> 1002930 INFO  (coreLoadExecutor-2942-thread-1) [    ] o.a.s.c.ZkController Check for collection zkNode:control_collection
   [junit4]   2> 1002931 INFO  (coreLoadExecutor-2942-thread-1) [    ] o.a.s.c.ZkController Collection zkNode exists
   [junit4]   2> 1002931 INFO  (coreLoadExecutor-2942-thread-1) [    ] o.a.s.c.c.ZkStateReader Load collection config from:/collections/control_collection
   [junit4]   2> 1002931 INFO  (coreLoadExecutor-2942-thread-1) [    ] o.a.s.c.c.ZkStateReader path=/collections/control_collection configName=conf1 specified config exists in ZooKeeper
   [junit4]   2> 1002931 INFO  (coreLoadExecutor-2942-thread-1) [    ] o.a.s.c.SolrResourceLoader new SolrResourceLoader for directory: '/home/jenkins/workspace/Lucene-Solr-trunk-Linux/solr/build/solr-core/test/J1/temp/solr.cloud.CollectionsAPIDistributedZkTest_CA4F90A4381D77E8-001/control-001/cores/collection1'
   [junit4]   2> 1002931 INFO  (coreLoadExecutor-2942-thread-1) [    ] o.a.s.c.SolrResourceLoader JNDI not configured for solr (NoInitialContextEx)
   [junit4]   2> 1002931 INFO  (coreLoadExecutor-2942-thread-1) [    ] o.a.s.c.SolrResourceLoader solr home defaulted to 'solr/' (could not find system property or JNDI)
   [junit4]   2> 1002932 INFO  (coreLoadExecutor-2942-thread-1) [    ] o.a.s.c.Config loaded config solrconfig.xml with version 0 
   [junit4]   2> 1002936 INFO  (coreLoadExecutor-2942-thread-1) [    ] o.a.s.c.SolrConfig current version of requestparams : -1
   [junit4]   2> 1002938 INFO  (coreLoadExecutor-2942-thread-1) [    ] o.a.s.c.SolrConfig Using Lucene MatchVersion: 6.0.0
   [junit4]   2> 1002942 INFO  (coreLoadExecutor-2942-thread-1) [    ] o.a.s.c.SolrConfig Loaded SolrConfig: solrconfig.xml
   [junit4]   2> 1002945 INFO  (coreLoadExecutor-2942-thread-1) [    ] o.a.s.s.IndexSchema [collection1] Schema name=test
   [junit4]   2> 1002996 INFO  (coreLoadExecutor-2942-thread-1) [    ] o.a.s.s.OpenExchangeRatesOrgProvider Initialized with rates=open-exchange-rates.json, refreshInterval=1440.
   [junit4]   2> 1003000 INFO  (coreLoadExecutor-2942-thread-1) [    ] o.a.s.s.IndexSchema default search field in schema is text
   [junit4]   2> 1003000 INFO  (coreLoadExecutor-2942-thread-1) [    ] o.a.s.s.IndexSchema unique key field: id
   [junit4]   2> 1003004 INFO  (coreLoadExecutor-2942-thread-1) [    ] o.a.s.s.FileExchangeRateProvider Reloading exchange rates from file currency.xml
   [junit4]   2> 1003005 INFO  (coreLoadExecutor-2942-thread-1) [    ] o.a.s.s.FileExchangeRateProvider Reloading exchange rates from file currency.xml
   [junit4]   2> 1003006 INFO  (coreLoadExecutor-2942-thread-1) [    ] o.a.s.s.OpenExchangeRatesOrgProvider Reloading exchange rates from open-exchange-rates.json
   [junit4]   2> 1003007 WARN  (coreLoadExecutor-2942-thread-1) [    ] o.a.s.s.OpenExchangeRatesOrgProvider Unknown key IMPORTANT NOTE
   [junit4]   2> 1003007 WARN  (coreLoadExecutor-2942-thread-1) [    ] o.a.s.s.OpenExchangeRatesOrgProvider Expected key, got STRING
   [junit4]   2> 1003007 INFO  (coreLoadExecutor-2942-thread-1) [    ] o.a.s.s.OpenExchangeRatesOrgProvider Reloading exchange rates from open-exchange-rates.json
   [junit4]   2> 1003007 WARN  (coreLoadExecutor-2942-thread-1) [    ] o.a.s.s.OpenExchangeRatesOrgProvider Unknown key IMPORTANT NOTE
   [junit4]   2> 1003007 WARN  (coreLoadExecutor-2942-thread-1) [    ] o.a.s.s.OpenExchangeRatesOrgProvider Expected key, got STRING
   [junit4]   2> 1003008 INFO  (coreLoadExecutor-2942-thread-1) [    ] o.a.s.c.ConfigSetProperties Did not find ConfigSet properties, assuming default properties: Can't find resource 'configsetprops.json' in classpath or '/configs/conf1', cwd=/home/jenkins/workspace/Lucene-Solr-trunk-Linux/solr/build/solr-core/test/J1
   [junit4]   2> 1003008 INFO  (coreLoadExecutor-2942-thread-1) [    ] o.a.s.c.CoreContainer Creating SolrCore 'collection1' using configuration from collection control_collection
   [junit4]   2> 1003008 INFO  (coreLoadExecutor-2942-thread-1) [    ] o.a.s.c.SolrCore org.apache.solr.core.MockDirectoryFactory
   [junit4]   2> 1003008 INFO  (coreLoadExecutor-2942-thread-1) [    ] o.a.s.c.SolrCore [[collection1] ] Opening new SolrCore at [/home/jenkins/workspace/Lucene-Solr-trunk-Linux/solr/build/solr-core/test/J1/temp/solr.cloud.CollectionsAPIDistributedZkTest_CA4F90A4381D77E8-001/control-001/cores/collection1], dataDir=[/home/jenkins/workspace/Lucene-Solr-trunk-Linux/solr/build/solr-core/test/J1/../../../../../../../../../home/jenkins/workspace/Lucene-Solr-trunk-Linux/solr/build/solr-core/test/J1/temp/solr.cloud.CollectionsAPIDistributedZkTest_CA4F90A4381D77E8-001/control-001/cores/collection1/data/]
   [junit4]   2> 1003008 INFO  (coreLoadExecutor-2942-thread-1) [    ] o.a.s.c.JmxMonitoredMap JMX monitoring is enabled. Adding Solr mbeans to JMX Server: com.sun.jmx.mbeanserver.JmxMBeanServer@108c575
   [junit4]   2> 1003009 INFO  (coreLoadExecutor-2942-thread-1) [    ] o.a.s.c.CachingDirectoryFactory return new directory for /home/jenkins/workspace/Lucene-Solr-trunk-Linux/solr/build/solr-core/test/J1/../../../../../../../../../home/jenkins/workspace/Lucene-Solr-trunk-Linux/solr/build/solr-core/test/J1/temp/solr.cloud.CollectionsAPIDistributedZkTest_CA4F90A4381D77E8-001/control-001/cores/collection1/data
   [junit4]   2> 1003009 INFO  (coreLoadExecutor-2942-thread-1) [    ] o.a.s.c.SolrCore New index directory detected: old=null new=/home/jenkins/workspace/Lucene-Solr-trunk-Linux/solr/build/solr-core/test/J1/../../../../../../../../../home/jenkins/workspace/Lucene-Solr-trunk-Linux/solr/build/solr-core/test/J1/temp/solr.cloud.CollectionsAPIDistributedZkTest_CA4F90A4381D77E8-001/control-001/cores/collection1/data/index/
   [junit4]   2> 1003009 WARN  (coreLoadExecutor-2942-thread-1) [    ] o.a.s.c.SolrCore [collection1] Solr index directory '/home/jenkins/workspace/Lucene-Solr-trunk-Linux/solr/build/solr-core/test/J1/../../../../../../../../../home/jenkins/workspace/Lucene-Solr-trunk-Linux/solr/build/solr-core/test/J1/temp/solr.cloud.CollectionsAPIDistributedZkTest_CA4F90A4381D77E8-001/control-001/cores/collection1/data/index' doesn't exist. Creating new index...
   [junit4]   2> 1003009 INFO  (coreLoadExecutor-2942-thread-1) [    ] o.a.s.c.CachingDirectoryFactory return new directory for /home/jenkins/workspace/Lucene-Solr-trunk-Linux/solr/build/solr-core/test/J1/../../../../../../../../../home/jenkins/workspace/Lucene-Solr-trunk-Linux/solr/build/solr-core/test/J1/temp/solr.cloud.CollectionsAPIDistributedZkTest_CA4F90A4381D77E8-001/control-001/cores/collection1/data/index
   [junit4]   2> 1003009 INFO  (coreLoadExecutor-2942-thread-1) [    ] o.a.s.u.RandomMergePolicy RandomMergePolicy wrapping class org.apache.lucene.index.LogDocMergePolicy: [LogDocMergePolicy: minMergeSize=1000, mergeFactor=36, maxMergeSize=9223372036854775807, maxMergeSizeForForcedMerge=9223372036854775807, calibrateSizeByDeletes=false, maxMergeDocs=2147483647, maxCFSSegmentSizeMB=8.796093022207999E12, noCFSRatio=0.2991257590938854]
   [junit4]   2> 1003009 INFO  (coreLoadExecutor-2942-thread-1) [    ] o.a.s.c.SolrDeletionPolicy SolrDeletionPolicy.onCommit: commits: num=1
   [junit4]   2> 	commit{dir=MockDirectoryWrapper(RAMDirectory@a93aea lockFactory=org.apache.lucene.store.SingleInstanceLockFactory@e47045),segFN=segments_1,generation=1}
   [junit4]   2> 1003009 INFO  (coreLoadExecutor-2942-thread-1) [    ] o.a.s.c.SolrDeletionPolicy newest commit generation = 1
   [junit4]   2> 1003009 INFO  (OldIndexDirectoryCleanupThreadForCore-collection1) [    ] o.a.s.c.SolrCore Looking for old index directories to cleanup for core collection1 in /home/jenkins/workspace/Lucene-Solr-trunk-Linux/solr/build/solr-core/test/J1/../../../../../../../../../home/jenkins/workspace/Lucene-Solr-trunk-Linux/solr/build/solr-core/test/J1/temp/solr.cloud.CollectionsAPIDistributedZkTest_CA4F90A4381D77E8-001/control-001/cores/collection1/data/
   [junit4]   2> 1003010 WARN  (OldIndexDirectoryCleanupThreadForCore-collection1) [    ] o.a.s.c.DirectoryFactory /home/jenkins/workspace/Lucene-Solr-trunk-Linux/solr/build/solr-core/test/J1/../../../../../../../../../home/jenkins/workspace/Lucene-Solr-trunk-Linux/solr/build/solr-core/test/J1/temp/solr.cloud.CollectionsAPIDistributedZkTest_CA4F90A4381D77E8-001/control-001/cores/collection1/data/ does not point to a valid data directory; skipping clean-up of old index directories.
   [junit4]   2> 1003011 INFO  (coreLoadExecutor-2942-thread-1) [    ] o.a.s.u.p.UpdateRequestProcessorChain creating updateRequestProcessorChain "nodistrib"
   [junit4]   2> 1003012 INFO  (coreLoadExecutor-2942-thread-1) [    ] o.a.s.u.p.UpdateRequestProcessorChain creating updateRequestProcessorChain "dedupe"
   [junit4]   2> 1003012 INFO  (coreLoadExecutor-2942-thread-1) [    ] o.a.s.u.p.UpdateRequestProcessorChain inserting DistributedUpdateProcessorFactory into updateRequestProcessorChain "dedupe"
   [junit4]   2> 1003012 INFO  (coreLoadExecutor-2942-thread-1) [    ] o.a.s.u.p.UpdateRequestProcessorChain creating updateRequestProcessorChain "stored_sig"
   [junit4]   2> 1003012 INFO  (coreLoadExecutor-2942-thread-1) [    ] o.a.s.u.p.UpdateRequestProcessorChain inserting DistributedUpdateProcessorFactory into updateRequestProcessorChain "stored_sig"
   [junit4]   2> 1003012 INFO  (coreLoadExecutor-2942-thread-1) [    ] o.a.s.u.p.UpdateRequestProcessorChain creating updateRequestProcessorChain "distrib-dup-test-chain-explicit"
   [junit4]   2> 1003012 INFO  (coreLoadExecutor-2942-thread-1) [    ] o.a.s.u.p.UpdateRequestProcessorChain creating updateRequestProcessorChain "distrib-dup-test-chain-implicit"
   [junit4]   2> 1003012 INFO  (coreLoadExecutor-2942-thread-1) [    ] o.a.s.u.p.UpdateRequestProcessorChain inserting DistributedUpdateProcessorFactory into updateRequestProcessorChain "distrib-dup-test-chain-implicit"
   [junit4]   2> 1003012 INFO  (coreLoadExecutor-2942-thread-1) [    ] o.a.s.c.SolrCore no updateRequestProcessorChain defined as default, creating implicit default
   [junit4]   2> 1003012 WARN  (coreLoadExecutor-2942-thread-1) [    ] o.a.s.c.RequestHandlers INVALID paramSet a in requestHandler {type = requestHandler,name = /dump,class = DumpRequestHandler,args = {defaults={a=A,b=B}}}
   [junit4]   2> 1003013 INFO  (coreLoadExecutor-2942-thread-1) [    ] o.a.s.h.l.XMLLoader xsltCacheLifetimeSeconds=60
   [junit4]   2> 1003013 INFO  (coreLoadExecutor-2942-thread-1) [    ] o.a.s.h.l.XMLLoader xsltCacheLifetimeSeconds=60
   [junit4]   2> 1003014 INFO  (coreLoadExecutor-2942-thread-1) [    ] o.a.s.h.l.XMLLoader xsltCacheLifetimeSeconds=60
   [junit4]   2> 1003015 INFO  (coreLoadExecutor-2942-thread-1) [    ] o.a.s.h.l.XMLLoader xsltCacheLifetimeSeconds=60
   [junit4]   2> 1003016 INFO  (coreLoadExecutor-2942-thread-1) [    ] o.a.s.c.RequestHandlers Registered paths: /admin/mbeans,standard,/dump,/update/csv,/update/json/docs,/admin/luke,/admin/segments,/get,/admin/system,/replication,/admin/properties,/config,/schema,/admin/plugins,/admin/logging,/update/json,/admin/threads,/admin/ping,/update,/admin/file
   [junit4]   2> 1003016 INFO  (coreLoadExecutor-2942-thread-1) [    ] o.a.s.c.SolrCore Using default statsCache cache: org.apache.solr.search.stats.LocalStatsCache
   [junit4]   2> 1003017 INFO  (coreLoadExecutor-2942-thread-1) [    ] o.a.s.u.UpdateHandler Using UpdateLog implementation: org.apache.solr.update.UpdateLog
   [junit4]   2> 1003017 INFO  (coreLoadExecutor-2942-thread-1) [    ] o.a.s.u.UpdateLog Initializing UpdateLog: dataDir= defaultSyncLevel=FLUSH numRecordsToKeep=100 maxNumLogsToKeep=10 numVersionBuckets=65536
   [junit4]   2> 1003017 INFO  (coreLoadExecutor-2942-thread-1) [    ] o.a.s.u.CommitTracker Hard AutoCommit: disabled
   [junit4]   2> 1003017 INFO  (coreLoadExecutor-2942-thread-1) [    ] o.a.s.u.CommitTracker Soft AutoCommit: disabled
   [junit4]   2> 1003017 INFO  (coreLoadExecutor-2942-thread-1) [    ] o.a.s.u.RandomMergePolicy RandomMergePolicy wrapping class org.apache.lucene.index.TieredMergePolicy: [TieredMergePolicy: maxMergeAtOnce=11, maxMergeAtOnceExplicit=30, maxMergedSegmentMB=44.806640625, floorSegmentMB=2.1513671875, forceMergeDeletesPctAllowed=19.746027534464993, segmentsPerTier=21.0, maxCFSSegmentSizeMB=8.796093022207999E12, noCFSRatio=1.0
   [junit4]   2> 1003018 INFO  (coreLoadExecutor-2942-thread-1) [    ] o.a.s.c.SolrDeletionPolicy SolrDeletionPolicy.onInit: commits: num=1
   [junit4]   2> 	commit{dir=MockDirectoryWrapper(RAMDirectory@a93aea lockFactory=org.apache.lucene.store.SingleInstanceLockFactory@e47045),segFN=segments_1,generation=1}
   [junit4]   2> 1003018 INFO  (coreLoadExecutor-2942-thread-1) [    ] o.a.s.c.SolrDeletionPolicy newest commit generation = 1
   [junit4]   2> 1003018 INFO  (coreLoadExecutor-2942-thread-1) [    ] o.a.s.s.SolrIndexSearcher Opening Searcher@7381b8[collection1] main
   [junit4]   2> 1003018 INFO  (coreLoadExecutor-2942-thread-1) [    ] o.a.s.c.c.ZkStateReader Load collection config from:/collections/control_collection
   [junit4]   2> 1003018 INFO  (coreLoadExecutor-2942-thread-1) [    ] o.a.s.c.c.ZkStateReader path=/collections/control_collection configName=conf1 specified config exists in ZooKeeper
   [junit4]   2> 1003018 INFO  (coreLoadExecutor-2942-thread-1) [    ] o.a.s.r.ManagedResourceStorage Setting up ZooKeeper-based storage for the RestManager with znodeBase: /configs/conf1
   [junit4]   2> 1003019 INFO  (coreLoadExecutor-2942-thread-1) [    ] o.a.s.r.ManagedResourceStorage Configured ZooKeeperStorageIO with znodeBase: /configs/conf1
   [junit4]   2> 1003019 INFO  (coreLoadExecutor-2942-thread-1) [    ] o.a.s.r.RestManager Initializing RestManager with initArgs: {}
   [junit4]   2> 1003019 INFO  (coreLoadExecutor-2942-thread-1) [    ] o.a.s.r.ManagedResourceStorage Reading _rest_managed.json using ZooKeeperStorageIO:path=/configs/conf1
   [junit4]   2> 1003019 INFO  (coreLoadExecutor-2942-thread-1) [    ] o.a.s.r.ManagedResourceStorage No data found for znode /configs/conf1/_rest_managed.json
   [junit4]   2> 1003019 INFO  (coreLoadExecutor-2942-thread-1) [    ] o.a.s.r.ManagedResourceStorage Loaded null at path _rest_managed.json using ZooKeeperStorageIO:path=/configs/conf1
   [junit4]   2> 1003019 INFO  (coreLoadExecutor-2942-thread-1) [    ] o.a.s.r.RestManager Initializing 0 registered ManagedResources
   [junit4]   2> 1003019 INFO  (coreLoadExecutor-2942-thread-1) [    ] o.a.s.h.ReplicationHandler Commits will be reserved for  10000
   [junit4]   2> 1003019 INFO  (searcherExecutor-2943-thread-1) [    ] o.a.s.c.SolrCore [collection1] Registered new searcher Searcher@7381b8[collection1] main{ExitableDirectoryReader(UninvertingDirectoryReader())}
   [junit4]   2> 1003019 INFO  (coreLoadExecutor-2942-thread-1) [    ] o.a.s.u.UpdateLog Looking up max value of version field to seed version buckets
   [junit4]   2> 1003019 INFO  (coreLoadExecutor-2942-thread-1) [    ] o.a.s.u.VersionInfo Refreshing highest value of _version_ for 65536 version buckets from index
   [junit4]   2> 1003019 INFO  (coreLoadExecutor-2942-thread-1) [    ] o.a.s.u.VersionInfo No terms found for _version_, cannot seed version bucket highest value from index
   [junit4]   2> 1003019 INFO  (coreLoadExecutor-2942-thread-1) [    ] o.a.s.u.UpdateLog Could not find max version in index or recent updates, using new clock 1520696941235666944
   [junit4]   2> 1003021 INFO  (coreLoadExecutor-2942-thread-1) [    ] o.a.s.u.UpdateLog Took 1.0ms to seed version buckets with highest version 1520696941235666944
   [junit4]   2> 1003021 INFO  (coreLoadExecutor-2942-thread-1) [    ] o.a.s.c.ZkController watch zkdir /configs/conf1
   [junit4]   2> 1003021 INFO  (coreLoadExecutor-2942-thread-1) [    ] o.a.s.c.CoreContainer registering core: collection1
   [junit4]   2> 1003021 INFO  (coreZkRegister-2936-thread-1) [    ] o.a.s.c.ZkController Register replica - core:collection1 address:http://127.0.0.1:58927/p_ew/c collection:control_collection shard:shard1
   [junit4]   2> 1003021 INFO  (coreZkRegister-2936-thread-1) [    ] o.a.s.c.c.SolrZkClient makePath: /collections/control_collection/leader_elect/shard1/election
   [junit4]   2> 1003023 INFO  (coreZkRegister-2936-thread-1) [    ] o.a.s.c.LeaderElector Joined leadership election with path: /collections/control_collection/leader_elect/shard1/election/95043558742163460-core_node1-n_0000000000
   [junit4]   2> 1003023 INFO  (coreZkRegister-2936-thread-1) [    ] o.a.s.c.ShardLeaderElectionContext Running the leader process for shard=shard1 and weAreReplacement=false and leaderVoteWait=180000
   [junit4]   2> 1003023 INFO  (coreZkRegister-2936-thread-1) [    ] o.a.s.c.ShardLeaderElectionContext Enough replicas found to continue.
   [junit4]   2> 1003023 INFO  (coreZkRegister-2936-thread-1) [    ] o.a.s.c.ShardLeaderElectionContext I may be the new leader - try and sync
   [junit4]   2> 1003023 INFO  (coreZkRegister-2936-thread-1) [    ] o.a.s.c.SyncStrategy Sync replicas to http://127.0.0.1:58927/p_ew/c/collection1/
   [junit4]   2> 1003024 INFO  (OverseerStateUpdate-95043558742163460-127.0.0.1:58927_p_ew%2Fc-n_0000000000) [    ] o.a.s.c.Overseer processMessage: queueSize: 1, message = {
   [junit4]   2>   "operation":"leader",
   [junit4]   2>   "shard":"shard1",
   [junit4]   2>   "collection":"control_collection"} current state version: 1
   [junit4]   2> 1003024 INFO  (coreZkRegister-2936-thread-1) [    ] o.a.s.c.SyncStrategy Sync Success - now sync replicas to me
   [junit4]   2> 1003024 INFO  (coreZkRegister-2936-thread-1) [    ] o.a.s.c.SyncStrategy http://127.0.0.1:58927/p_ew/c/collection1/ has no replicas
   [junit4]   2> 1003024 INFO  (coreZkRegister-2936-thread-1) [    ] o.a.s.c.c.SolrZkClient makePath: /collections/control_collection/leaders/shard1
   [junit4]   2> 1003025 INFO  (coreZkRegister-2936-thread-1) [    ] o.a.s.c.ShardLeaderElectionContextBase Creating leader registration node
   [junit4]   2> 1003025 INFO  (coreZkRegister-2936-thread-1) [    ] o.a.s.c.ShardLeaderElectionContext I am the new leader: http://127.0.0.1:58927/p_ew/c/collection1/ shard1
   [junit4]   2> 1003026 INFO  (OverseerStateUpdate-95043558742163460-127.0.0.1:58927_p_ew%2Fc-n_0000000000) [    ] o.a.s.c.Overseer processMessage: queueSize: 1, message = {
   [junit4]   2>   "operation":"leader",
   [junit4]   2>   "shard":"shard1",
   [junit4]   2>   "collection":"control_collection",
   [junit4]   2>   "base_url":"http://127.0.0.1:58927/p_ew/c",
   [junit4]   2>   "core":"collection1",
   [junit4]   2>   "state":"active"} current state version: 1
   [junit4]   2> 1003127 INFO  (zkCallback-802-thread-1) [    ] o.a.s.c.c.ZkStateReader A cluster state change: WatchedEvent state:SyncConnected type:NodeDataChanged path:/clusterstate.json, has occurred - updating... (live nodes size: 1)
   [junit4]   2> 1003176 INFO  (coreZkRegister-2936-thread-1) [    ] o.a.s.c.ZkController We are http://127.0.0.1:58927/p_ew/c/collection1/ and leader is http://127.0.0.1:58927/p_ew/c/collection1/
   [junit4]   2> 1003176 INFO  (coreZkRegister-2936-thread-1) [    ] o.a.s.c.ZkController No LogReplay needed for core=collection1 baseURL=http://127.0.0.1:58927/p_ew/c
   [junit4]   2> 1003176 INFO  (coreZkRegister-2936-thread-1) [    ] o.a.s.c.ZkController I am the leader, no recovery necessary
   [junit4]   2> 1003176 INFO  (coreZkRegister-2936-thread-1) [    ] o.a.s.c.ZkController publishing state=active
   [junit4]   2> 1003176 INFO  (coreZkRegister-2936-thread-1) [    ] o.a.s.c.ZkController numShards not found on descriptor - reading it from system property
   [junit4]   2> 1003177 INFO  (OverseerStateUpdate-95043558742163460-127.0.0.1:58927_p_ew%2Fc-n_0000000000) [    ] o.a.s.c.Overseer processMessage: queueSize: 1, message = {
   [junit4]   2>   "core":"collection1",
   [junit4]   2>   "core_node_name":"core_node1",
   [junit4]   2>   "roles":null,
   [junit4]   2>   "base_url":"http://127.0.0.1:58927/p_ew/c",
   [junit4]   2>   "node_name":"127.0.0.1:58927_p_ew%2Fc",
   [junit4]   2>   "numShards":"1",
   [junit4]   2>   "state":"active",
   [junit4]   2>   "shard":"shard1",
   [junit4]   2>   "collection":"control_collection",
   [junit4]   2>   "operation":"state"} current state version: 2
   [junit4]   2> 1003177 INFO  (OverseerStateUpdate-95043558742163460-127.0.0.1:58927_p_ew%2Fc-n_0000000000) [    ] o.a.s.c.o.ReplicaMutator Update state numShards=1 message={
   [junit4]   2>   "core":"collection1",
   [junit4]   2>   "core_node_name":"core_node1",
   [junit4]   2>   "roles":null,
   [junit4]   2>   "base_url":"http://127.0.0.1:58927/p_ew/c",
   [junit4]   2>   "node_name":"127.0.0.1:58927_p_ew%2Fc",
   [junit4]   2>   "numShards":"1",
   [junit4]   2>   "state":"active",
   [junit4]   2>   "shard":"shard1",
   [junit4]   2>   "collection":"control_collection",
   [junit4]   2>   "operation":"state"}
   [junit4]   2> 1003278 INFO  (zkCallback-802-thread-1) [    ] o.a.s.c.c.ZkStateReader A cluster state change: WatchedEvent state:SyncConnected type:NodeDataChanged path:/clusterstate.json, has occurred - updating... (live nodes size: 1)
   [junit4]   2> 1003430 INFO  (TEST-CollectionsAPIDistributedZkTest.test-seed#[CA4F90A4381D77E8]) [    ] o.a.s.c.c.SolrZkClient Using default ZkCredentialsProvider
   [junit4]   2> 1003431 INFO  (TEST-CollectionsAPIDistributedZkTest.test-seed#[CA4F90A4381D77E8]) [    ] o.a.s.c.c.ConnectionManager Waiting for client to connect to ZooKeeper
   [junit4]   2> 1003432 INFO  (zkCallback-804-thread-1) [    ] o.a.s.c.c.ConnectionManager Watcher org.apache.solr.common.cloud.ConnectionManager@e23d8d name:ZooKeeperConnection Watcher:127.0.0.1:51158/solr got event WatchedEvent state:SyncConnected type:None path:null path:null type:None
   [junit4]   2> 1003432 INFO  (TEST-CollectionsAPIDistributedZkTest.test-seed#[CA4F90A4381D77E8]) [    ] o.a.s.c.c.ConnectionManager Client is connected to ZooKeeper
   [junit4]   2> 1003432 INFO  (TEST-CollectionsAPIDistributedZkTest.test-seed#[CA4F90A4381D77E8]) [    ] o.a.s.c.c.SolrZkClient Using default ZkACLProvider
   [junit4]   2> 1003432 INFO  (TEST-CollectionsAPIDistributedZkTest.test-seed#[CA4F90A4381D77E8]) [    ] o.a.s.c.c.ZkStateReader Updating cluster state from ZooKeeper... 
   [junit4]   2> 1003433 INFO  (TEST-CollectionsAPIDistributedZkTest.test-seed#[CA4F90A4381D77E8]) [    ] o.a.s.c.ChaosMonkey monkey: init - expire sessions:false cause connection loss:false
   [junit4]   2> 1003433 INFO  (TEST-CollectionsAPIDistributedZkTest.test-seed#[CA4F90A4381D77E8]) [    ] o.a.s.c.AbstractFullDistribZkTestBase Creating collection1 with stateFormat=2
   [junit4]   2> 1003433 INFO  (TEST-CollectionsAPIDistributedZkTest.test-seed#[CA4F90A4381D77E8]) [    ] o.a.s.c.c.SolrZkClient Using default ZkCredentialsProvider
   [junit4]   2> 1003433 INFO  (TEST-CollectionsAPIDistributedZkTest.test-seed#[CA4F90A4381D77E8]) [    ] o.a.s.c.c.ConnectionManager Waiting for client to connect to ZooKeeper
   [junit4]   2> 1003433 INFO  (zkCallback-805-thread-1) [    ] o.a.s.c.c.ConnectionManager Watcher org.apache.solr.common.cloud.ConnectionManager@1fe07b3 name:ZooKeeperConnection Watcher:127.0.0.1:51158/solr got event WatchedEvent state:SyncConnected type:None path:null path:null type:None
   [junit4]   2> 1003433 INFO  (TEST-CollectionsAPIDistributedZkTest.test-seed#[CA4F90A4381D77E8]) [    ] o.a.s.c.c.ConnectionManager Client is connected to ZooKeeper
   [junit4]   2> 1003434 INFO  (TEST-CollectionsAPIDistributedZkTest.test-seed#[CA4F90A4381D77E8]) [    ] o.a.s.c.c.SolrZkClient Using default ZkACLProvider
   [junit4]   2> 1003434 INFO  (OverseerStateUpdate-95043558742163460-127.0.0.1:58927_p_ew%2Fc-n_0000000000) [    ] o.a.s.c.Overseer processMessage: queueSize: 1, message = {
   [junit4]   2>   "operation":"create",
   [junit4]   2>   "name":"collection1",
   [junit4]   2>   "numShards":"2",
   [junit4]   2>   "stateFormat":"2"} current state version: 3
   [junit4]   2> 1003435 INFO  (OverseerStateUpdate-95043558742163460-127.0.0.1:58927_p_ew%2Fc-n_0000000000) [    ] o.a.s.c.o.ClusterStateMutator building a new cName: collection1
   [junit4]   2> 1003491 INFO  (TEST-CollectionsAPIDistributedZkTest.test-seed#[CA4F90A4381D77E8]) [    ] o.a.s.SolrTestCaseJ4 Writing core.properties file to /home/jenkins/workspace/Lucene-Solr-trunk-Linux/solr/build/solr-core/test/J1/temp/solr.cloud.CollectionsAPIDistributedZkTest_CA4F90A4381D77E8-001/shard-1-001/cores/collection1
   [junit4]   2> 1003491 INFO  (TEST-CollectionsAPIDistributedZkTest.test-seed#[CA4F90A4381D77E8]) [    ] o.a.s.c.AbstractFullDistribZkTestBase create jetty 1 in directory /home/jenkins/workspace/Lucene-Solr-trunk-Linux/solr/build/solr-core/test/J1/temp/solr.cloud.CollectionsAPIDistributedZkTest_CA4F90A4381D77E8-001/shard-1-001
   [junit4]   2> 1003492 INFO  (TEST-CollectionsAPIDistributedZkTest.test-seed#[CA4F90A4381D77E8]) [    ] o.e.j.s.Server jetty-9.3.6.v20151106
   [junit4]   2> 1003493 INFO  (TEST-CollectionsAPIDistributedZkTest.test-seed#[CA4F90A4381D77E8]) [    ] o.e.j.s.h.ContextHandler Started o.e.j.s.ServletContextHandler@d9d0b2{/p_ew/c,null,AVAILABLE}
   [junit4]   2> 1003494 INFO  (TEST-CollectionsAPIDistributedZkTest.test-seed#[CA4F90A4381D77E8]) [    ] o.e.j.s.ServerConnector Started ServerConnector@dac547{HTTP/1.1,[http/1.1]}{127.0.0.1:42522}
   [junit4]   2> 1003494 INFO  (TEST-CollectionsAPIDistributedZkTest.test-seed#[CA4F90A4381D77E8]) [    ] o.e.j.s.Server Started @1005416ms
   [junit4]   2> 1003494 INFO  (TEST-CollectionsAPIDistributedZkTest.test-seed#[CA4F90A4381D77E8]) [    ] o.a.s.c.s.e.JettySolrRunner Jetty properties: {solr.data.dir=/home/jenkins/workspace/Lucene-Solr-trunk-Linux/solr/build/solr-core/test/J1/temp/solr.cloud.CollectionsAPIDistributedZkTest_CA4F90A4381D77E8-001/tempDir-001/jetty1, solrconfig=solrconfig.xml, hostContext=/p_ew/c, hostPort=42522, coreRootDirectory=/home/jenkins/workspace/Lucene-Solr-trunk-Linux/solr/build/solr-core/test/J1/temp/solr.cloud.CollectionsAPIDistributedZkTest_CA4F90A4381D77E8-001/shard-1-001/cores}
   [junit4]   2> 1003494 INFO  (TEST-CollectionsAPIDistributedZkTest.test-seed#[CA4F90A4381D77E8]) [    ] o.a.s.s.SolrDispatchFilter SolrDispatchFilter.init(): sun.misc.Launcher$AppClassLoader@1eb6432
   [junit4]   2> 1003494 INFO  (TEST-CollectionsAPIDistributedZkTest.test-seed#[CA4F90A4381D77E8]) [    ] o.a.s.c.SolrResourceLoader new SolrResourceLoader for directory: '/home/jenkins/workspace/Lucene-Solr-trunk-Linux/solr/build/solr-core/test/J1/temp/solr.cloud.CollectionsAPIDistributedZkTest_CA4F90A4381D77E8-001/shard-1-001'
   [junit4]   2> 1003494 INFO  (TEST-CollectionsAPIDistributedZkTest.test-seed#[CA4F90A4381D77E8]) [    ] o.a.s.c.SolrResourceLoader JNDI not configured for solr (NoInitialContextEx)
   [junit4]   2> 1003494 INFO  (TEST-CollectionsAPIDistributedZkTest.test-seed#[CA4F90A4381D77E8]) [    ] o.a.s.c.SolrResourceLoader solr home defaulted to 'solr/' (could not find system property or JNDI)
   [junit4]   2> 1003495 INFO  (TEST-CollectionsAPIDistributedZkTest.test-seed#[CA4F90A4381D77E8]) [    ] o.a.s.c.c.SolrZkClient Using default ZkCredentialsProvider
   [junit4]   2> 1003495 INFO  (TEST-CollectionsAPIDistributedZkTest.test-seed#[CA4F90A4381D77E8]) [    ] o.a.s.c.c.ConnectionManager Waiting for client to connect to ZooKeeper
   [junit4]   2> 1003496 INFO  (zkCallback-806-thread-1) [    ] o.a.s.c.c.ConnectionManager Watcher org.apache.solr.common.cloud.ConnectionManager@2413e4 name:ZooKeeperConnection Watcher:127.0.0.1:51158/solr got event WatchedEvent state:SyncConnected type:None path:null path:null type:None
   [junit4]   2> 1003497 INFO  (TEST-CollectionsAPIDistributedZkTest.test-seed#[CA4F90A4381D77E8]) [    ] o.a.s.c.c.ConnectionManager Client is connected to ZooKeeper
   [junit4]   2> 1003497 INFO  (TEST-CollectionsAPIDistributedZkTest.test-seed#[CA4F90A4381D77E8]) [    ] o.a.s.c.c.SolrZkClient Using default ZkACLProvider
   [junit4]   2> 1003497 INFO  (TEST-CollectionsAPIDistributedZkTest.test-seed#[CA4F90A4381D77E8]) [    ] o.a.s.s.SolrDispatchFilter Loading solr.xml from SolrHome (not found in ZooKeeper)
   [junit4]   2> 1003497 INFO  (TEST-CollectionsAPIDistributedZkTest.test-seed#[CA4F90A4381D77E8]) [    ] o.a.s.c.SolrXmlConfig Loading container configuration from /home/jenkins/workspace/Lucene-Solr-trunk-Linux/solr/build/solr-core/test/J1/temp/solr.cloud.CollectionsAPIDistributedZkTest_CA4F90A4381D77E8-001/shard-1-001/solr.xml
   [junit4]   2> 1003500 INFO  (TEST-CollectionsAPIDistributedZkTest.test-seed#[CA4F90A4381D77E8]) [    ] o.a.s.c.CorePropertiesLocator Config-defined core root directory: /home/jenkins/workspace/Lucene-Solr-trunk-Linux/solr/build/solr-core/test/J1/temp/solr.cloud.CollectionsAPIDistributedZkTest_CA4F90A4381D77E8-001/shard-1-001/cores
   [junit4]   2> 1003500 INFO  (TEST-CollectionsAPIDistributedZkTest.test-seed#[CA4F90A4381D77E8]) [    ] o.a.s.c.CoreContainer New CoreContainer 23597005
   [junit4]   2> 1003500 INFO  (TEST-CollectionsAPIDistributedZkTest.test-seed#[CA4F90A4381D77E8]) [    ] o.a.s.c.CoreContainer Loading cores into CoreContainer [instanceDir=/home/jenkins/workspace/Lucene-Solr-trunk-Linux/solr/build/solr-core/test/J1/temp/solr.cloud.CollectionsAPIDistributedZkTest_CA4F90A4381D77E8-001/shard-1-001]
   [junit4]   2> 1003501 WARN  (TEST-CollectionsAPIDistributedZkTest.test-seed#[CA4F90A4381D77E8]) [    ] o.a.s.c.CoreContainer Couldn't add files from /home/jenkins/workspace/Lucene-Solr-trunk-Linux/solr/build/solr-core/test/J1/temp/solr.cloud.CollectionsAPIDistributedZkTest_CA4F90A4381D77E8-001/shard-1-001/lib to classpath: /home/jenkins/workspace/Lucene-Solr-trunk-Linux/solr/build/solr-core/test/J1/temp/solr.cloud.CollectionsAPIDistributedZkTest_CA4F90A4381D77E8-001/shard-1-001/lib
   [junit4]   2> 1003501 INFO  (TEST-CollectionsAPIDistributedZkTest.test-seed#[CA4F90A4381D77E8]) [    ] o.a.s.h.c.HttpShardHandlerFactory created with socketTimeout : 90000,urlScheme : ,connTimeout : 15000,maxConnectionsPerHost : 20,maxConnections : 10000,corePoolSize : 0,maximumPoolSize : 2147483647,maxThreadIdleTime : 5,sizeOfQueue : -1,fairnessPolicy : false,useRetries : false,
   [junit4]   2> 1003501 INFO  (TEST-CollectionsAPIDistributedZkTest.test-seed#[CA4F90A4381D77E8]) [    ] o.a.s.u.UpdateShardHandler Creating UpdateShardHandler HTTP client with params: socketTimeout=340000&connTimeout=45000&retry=true
   [junit4]   2> 1003502 INFO  (TEST-CollectionsAPIDistributedZkTest.test-seed#[CA4F90A4381D77E8]) [    ] o.a.s.l.LogWatcher SLF4J impl is org.slf4j.impl.Log4jLoggerFactory
   [junit4]   2> 1003502 INFO  (TEST-CollectionsAPIDistributedZkTest.test-seed#[CA4F90A4381D77E8]) [    ] o.a.s.l.LogWatcher Registering Log Listener [Log4j (org.slf4j.impl.Log4jLoggerFactory)]
   [junit4]   2> 1003502 INFO  (TEST-CollectionsAPIDistributedZkTest.test-seed#[CA4F90A4381D77E8]) [    ] o.a.s.c.ZkContainer Zookeeper client=127.0.0.1:51158/solr
   [junit4]   2> 1003502 INFO  (TEST-CollectionsAPIDistributedZkTest.test-seed#[CA4F90A4381D77E8]) [    ] o.a.s.c.ZkController zkHost includes chroot
   [junit4]   2> 1003502 INFO  (TEST-CollectionsAPIDistributedZkTest.test-seed#[CA4F90A4381D77E8]) [    ] o.a.s.c.c.SolrZkClient Using default ZkCredentialsProvider
   [junit4]   2> 1003502 INFO  (TEST-CollectionsAPIDistributedZkTest.test-seed#[CA4F90A4381D77E8]) [    ] o.a.s.c.c.ConnectionManager Waiting for client to connect to ZooKeeper
   [junit4]   2> 1003503 INFO  (zkCallback-808-thread-1) [    ] o.a.s.c.c.ConnectionManager Watcher org.apache.solr.common.cloud.ConnectionManager@12a1aa5 name:ZooKeeperConnection Watcher:127.0.0.1:51158 got event WatchedEvent state:SyncConnected type:None path:null path:null type:None
   [junit4]   2> 1003504 INFO  (TEST-CollectionsAPIDistributedZkTest.test-seed#[CA4F90A4381D77E8]) [    ] o.a.s.c.c.ConnectionManager Client is connected to ZooKeeper
   [junit4]   2> 1003504 INFO  (TEST-CollectionsAPIDistributedZkTest.test-seed#[CA4F90A4381D77E8]) [    ] o.a.s.c.c.SolrZkClient Using default ZkACLProvider
   [junit4]   2> 1003505 INFO  (TEST-CollectionsAPIDistributedZkTest.test-seed#[CA4F90A4381D77E8]) [    ] o.a.s.c.c.ConnectionManager Waiting for client to connect to ZooKeeper
   [junit4]   2> 1003505 INFO  (zkCallback-809-thread-1) [    ] o.a.s.c.c.ConnectionManager Watcher org.apache.solr.common.cloud.ConnectionManager@106f8e5 name:ZooKeeperConnection Watcher:127.0.0.1:51158/solr got event WatchedEvent state:SyncConnected type:None path:null path:null type:None
   [junit4]   2> 1003505 INFO  (TEST-CollectionsAPIDistributedZkTest.test-seed#[CA4F90A4381D77E8]) [    ] o.a.s.c.c.ConnectionManager Client is connected to ZooKeeper
   [junit4]   2> 1003507 INFO  (TEST-CollectionsAPIDistributedZkTest.test-seed#[CA4F90A4381D77E8]) [    ] o.a.s.c.c.ZkStateReader Updating cluster state from ZooKeeper... 
   [junit4]   2> 1003536 INFO  (OverseerStateUpdate-95043558742163460-127.0.0.1:58927_p_ew%2Fc-n_0000000000) [    ] o.a.s.c.o.ZkStateWriter going to create_collection /collections/collection1/state.json
   [junit4]   2> 1004509 INFO  (TEST-CollectionsAPIDistributedZkTest.test-seed#[CA4F90A4381D77E8]) [    ] o.a.s.c.ZkController Register node as live in ZooKeeper:/live_nodes/127.0.0.1:42522_p_ew%2Fc
   [junit4]   2> 1004509 INFO  (TEST-CollectionsAPIDistributedZkTest.test-seed#[CA4F90A4381D77E8]) [    ] o.a.s.c.c.SolrZkClient makePath: /live_nodes/127.0.0.1:42522_p_ew%2Fc
   [junit4]   2> 1004510 INFO  (zkCallback-802-thread-2) [    ] o.a.s.c.c.ZkStateReader A live node change: WatchedEvent state:SyncConnected type:NodeChildrenChanged path:/live_nodes, has occurred - updating... (live nodes size: 1)
   [junit4]   2> 1004510 INFO  (zkCallback-809-thread-1) [    ] o.a.s.c.c.ZkStateReader A live node change: WatchedEvent state:SyncConnected type:NodeChildrenChanged path:/live_nodes, has occurred - updating... (live nodes size: 1)
   [junit4]   2> 1004510 INFO  (zkCallback-804-thread-1) [    ] o.a.s.c.c.ZkStateReader A live node change: WatchedEvent state:SyncConnected type:NodeChildrenChanged path:/live_nodes, has occurred - updating... (live nodes size: 1)
   [junit4]   2> 1004511 INFO  (TEST-CollectionsAPIDistributedZkTest.test-seed#[CA4F90A4381D77E8]) [    ] o.a.s.c.Overseer Overseer (id=null) closing
   [junit4]   2> 1004511 INFO  (TEST-CollectionsAPIDistributedZkTest.test-seed#[CA4F90A4381D77E8]) [    ] o.a.s.c.LeaderElector Joined leadership election with path: /overseer_elect/election/95043558742163465-127.0.0.1:42522_p_ew%2Fc-n_0000000001
   [junit4]   2> 1004511 INFO  (TEST-CollectionsAPIDistributedZkTest.test-seed#[CA4F90A4381D77E8]) [    ] o.a.s.c.LeaderElector Watching path /overseer_elect/election/95043558742163460-127.0.0.1:58927_p_ew%2Fc-n_0000000000 to know if I could be the leader
   [junit4]   2> 1004530 INFO  (TEST-CollectionsAPIDistributedZkTest.test-seed#[CA4F90A4381D77E8]) [    ] o.a.s.c.CoreContainer Security conf doesn't exist. Skipping setup for authorization module.
   [junit4]   2> 1004530 INFO  (TEST-CollectionsAPIDistributedZkTest.test-seed#[CA4F90A4381D77E8]) [    ] o.a.s.c.CoreContainer No authentication plugin used.
   [junit4]   2> 1004531 INFO  (TEST-CollectionsAPIDistributedZkTest.test-seed#[CA4F90A4381D77E8]) [    ] o.a.s.c.CorePropertiesLocator Looking for core definitions underneath /home/jenkins/workspace/Lucene-Solr-trunk-Linux/solr/build/solr-core/test/J1/temp/solr.cloud.CollectionsAPIDistributedZkTest_CA4F90A4381D77E8-001/shard-1-001/cores
   [junit4]   2> 1004532 INFO  (TEST-CollectionsAPIDistributedZkTest.test-seed#[CA4F90A4381D77E8]) [    ] o.a.s.c.CoreDescriptor Created CoreDescriptor: {name=collection1, config=solrconfig.xml, transient=false, schema=schema.xml, loadOnStartup=true, configSetProperties=configsetprops.json, collection=collection1, coreNodeName=, dataDir=data/, shard=}
   [junit4]   2> 1004532 INFO  (TEST-CollectionsAPIDistributedZkTest.test-seed#[CA4F90A4381D77E8]) [    ] o.a.s.c.CorePropertiesLocator Found core collection1 in /home/jenkins/workspace/Lucene-Solr-trunk-Linux/solr/build/solr-core/test/J1/temp/solr.cloud.CollectionsAPIDistributedZkTest_CA4F90A4381D77E8-001/shard-1-001/cores/collection1
   [junit4]   2> 1004532 INFO  (TEST-CollectionsAPIDistributedZkTest.test-seed#[CA4F90A4381D77E8]) [    ] o.a.s.c.CorePropertiesLocator Found 1 core definitions
   [junit4]   2> 1004532 INFO  (TEST-CollectionsAPIDistributedZkTest.test-seed#[CA4F90A4381D77E8]) [    ] o.a.s.s.SolrDispatchFilter user.dir=/home/jenkins/workspace/Lucene-Solr-trunk-Linux/solr/build/solr-core/test/J1
   [junit4]   2> 1004532 INFO  (TEST-CollectionsAPIDistributedZkTest.test-seed#[CA4F90A4381D77E8]) [    ] o.a.s.s.SolrDispatchFilter SolrDispatchFilter.init() done
   [junit4]   2> 1004533 INFO  (coreLoadExecutor-2953-thread-1) [    ] o.a.s.c.ZkController publishing state=down
   [junit4]   2> 1004533 INFO  (coreLoadExecutor-2953-thread-1) [    ] o.a.s.c.ZkController numShards not found on descriptor - reading it from system property
   [junit4]   2> 1004533 INFO  (coreLoadExecutor-2953-thread-1) [    ] o.a.s.c.ZkController Registering watch for collection collection1
   [junit4]   2> 1004533 INFO  (coreLoadExecutor-2953-thread-1) [    ] o.a.s.c.c.ZkStateReader addZkWatch collection1
   [junit4]   2> 1004533 INFO  (OverseerStateUpdate-95043558742163460-127.0.0.1:58927_p_ew%2Fc-n_0000000000) [    ] o.a.s.c.Overseer processMessage: queueSize: 1, message = {
   [junit4]   2>   "core":"collection1",
   [junit4]   2>   "roles":null,
   [junit4]   2>   "base_url":"http://127.0.0.1:42522/p_ew/c",
   [junit4]   2>   "node_name":"127.0.0.1:42522_p_ew%2Fc",
   [junit4]   2>   "numShards":"2",
   [junit4]   2>   "state":"down",
   [junit4]   2>   "shard":null,
   [junit4]   2>   "collection":"collection1",
   [junit4]   2>   "operation":"state"} current state version: 3
   [junit4]   2> 1004533 INFO  (coreLoadExecutor-2953-thread-1) [    ] o.a.s.c.c.ZkStateReader Add data for collection1 ver 0 
   [junit4]   2> 1004533 INFO  (coreLoadExecutor-2953-thread-1) [    ] o.a.s.c.ZkController look for our core node name
   [junit4]   2> 1004533 INFO  (OverseerStateUpdate-95043558742163460-127.0.0.1:58927_p_ew%2Fc-n_0000000000) [    ] o.a.s.c.o.ReplicaMutator Update state numShards=2 message={
   [junit4]   2>   "core":"collection1",
   [junit4]   2>   "roles":null,
   [junit4]   2>   "base_url":"http://127.0.0.1:42522/p_ew/c",
   [junit4]   2>   "node_name":"127.0.0.1:42522_p_ew%2Fc",
   [junit4]   2>   "numShards":"2",
   [junit4]   2>   "state":"down",
   [junit4]   2>   "shard":null,
   [junit4]   2>   "collection":"collection1",
   [junit4]   2>   "operation":"state"}
   [junit4]   2> 1004534 INFO  (OverseerStateUpdate-95043558742163460-127.0.0.1:58927_p_ew%2Fc-n_0000000000) [    ] o.a.s.c.o.ReplicaMutator Collection already exists with numShards=2
   [junit4]   2> 1004534 INFO  (OverseerStateUpdate-95043558742163460-127.0.0.1:58927_p_ew%2Fc-n_0000000000) [    ] o.a.s.c.o.ReplicaMutator Assigning new node to shard shard=shard2
   [junit4]   2> 1004635 INFO  (OverseerStateUpdate-95043558742163460-127.0.0.1:58927_p_ew%2Fc-n_0000000000) [    ] o.a.s.c.o.ZkStateWriter going to update_collection /collections/collection1/state.json version: 0
   [junit4]   2> 1004635 INFO  (zkCallback-809-thread-1) [    ] o.a.s.c.c.ZkStateReader A cluster state change: WatchedEvent state:SyncConnected type:NodeDataChanged path:/collections/collection1/state.json for collection collection1 has occurred - updating... (live nodes size: 2)
   [junit4]   2> 1004635 INFO  (zkCallback-809-thread-1) [    ] o.a.s.c.c.ZkStateReader Updating data for collection1 from 0 to 1 
   [junit4]   2> 1005534 INFO  (coreLoadExecutor-2953-thread-1) [    ] o.a.s.c.ZkController waiting to find shard id in clusterstate for collection1
   [junit4]   2> 1005534 INFO  (coreLoadExecutor-2953-thread-1) [    ] o.a.s.c.ZkController Check for collection zkNode:collection1
   [junit4]   2> 1005534 INFO  (coreLoadExecutor-2953-thread-1) [    ] o.a.s.c.ZkController Collection zkNode exists
   [junit4]   2> 1005534 INFO  (coreLoadExecutor-2953-thread-1) [    ] o.a.s.c.c.ZkStateReader Load collection config from:/collections/collection1
   [junit4]   2> 1005534 INFO  (coreLoadExecutor-2953-thread-1) [    ] o.a.s.c.c.ZkStateReader path=/collections/collection1 configName=conf1 specified config exists in ZooKeeper
   [junit4]   2> 1005534 INFO  (coreLoadExecutor-2953-thread-1) [    ] o.a.s.c.SolrResourceLoader new SolrResourceLoader for directory: '/home/jenkins/workspace/Lucene-Solr-trunk-Linux/solr/build/solr-core/test/J1/temp/solr.cloud.CollectionsAPIDistributedZkTest_CA4F90A4381D77E8-001/shard-1-001/cores/collection1'
   [junit4]   2> 1005534 INFO  (coreLoadExecutor-2953-thread-1) [    ] o.a.s.c.SolrResourceLoader JNDI not configured for solr (NoInitialContextEx)
   [junit4]   2> 1005534 INFO  (coreLoadExecutor-2953-thread-1) [    ] o.a.s.c.SolrResourceLoader solr home defaulted to 'solr/' (could not find system property or JNDI)
   [junit4]   2> 1005535 INFO  (coreLoadExecutor-2953-thread-1) [    ] o.a.s.c.Config loaded config solrconfig.xml with version 0 
   [junit4]   2> 1005539 INFO  (coreLoadExecutor-2953-thread-1) [    ] o.a.s.c.SolrConfig current version of requestparams : -1
   [junit4]   2> 1005540 INFO  (coreLoadExecutor-2953-thread-1) [    ] o.a.s.c.SolrConfig Using Lucene MatchVersion: 6.0.0
   [junit4]   2> 1005545 INFO  (coreLoadExecutor-2953-thread-1) [    ] o.a.s.c.SolrConfig Loaded SolrConfig: solrconfig.xml
   [junit4]   2> 1005548 INFO  (coreLoadExecutor-2953-thread-1) [    ] o.a.s.s.IndexSchema [collection1] Schema name=test
   [junit4]   2> 1005614 INFO  (coreLoadExecutor-2953-thread-1) [    ] o.a.s.s.OpenExchangeRatesOrgProvider Initialized with rates=open-exchange-rates.json, refreshInterval=1440.
   [junit4]   2> 1005617 INFO  (coreLoadExecutor-2953-thread-1) [    ] o.a.s.s.IndexSchema default search field in schema is text
   [junit4]   2> 1005618 INFO  (coreLoadExecutor-2953-thread-1) [    ] o.a.s.s.IndexSchema unique key field: id
   [junit4]   2> 1005621 INFO  (coreLoadExecutor-2953-thread-1) [    ] o.a.s.s.FileExchangeRateProvider Reloading exchange rates from file currency.xml
   [junit4]   2> 1005622 INFO  (coreLoadExecutor-2953-thread-1) [    ] o.a.s.s.FileExchangeRateProvider Reloading exchange rates from file currency.xml
   [junit4]   2> 1005623 INFO  (coreLoadExecutor-2953-thread-1) [    ] o.a.s.s.OpenExchangeRatesOrgProvider Reloading exchange rates from open-exchange-rates.json
   [junit4]   2> 1005624 WARN  (coreLoadExecutor-2953-thread-1) [    ] o.a.s.s.OpenExchangeRatesOrgProvider Unknown key IMPORTANT NOTE
   [junit4]   2> 1005624 WARN  (coreLoadExecutor-2953-thread-1) [    ] o.a.s.s.OpenExchangeRatesOrgProvider Expected key, got STRING
   [junit4]   2> 1005624 INFO  (coreLoadExecutor-2953-thread-1) [    ] o.a.s.s.OpenExchangeRatesOrgProvider Reloading exchange rates from open-exchange-rates.json
   [junit4]   2> 1005624 WARN  (coreLoadExecutor-2953-thread-1) [    ] o.a.s.s.OpenExchangeRatesOrgProvider Unknown key IMPORTANT NOTE
   [junit4]   2> 1005624 WARN  (coreLoadExecutor-2953-thread-1) [    ] o.a.s.s.OpenExchangeRatesOrgProvider Expected key, got STRING
   [junit4]   2> 1005625 INFO  (coreLoadExecutor-2953-thread-1) [    ] o.a.s.c.ConfigSetProperties Did not find ConfigSet properties, assuming default properties: Can't find resource 'configsetprops.json' in classpath or '/configs/conf1', cwd=/home/jenkins/workspace/Lucene-Solr-trunk-Linux/solr/build/solr-core/test/J1
   [junit4]   2> 1005625 INFO  (coreLoadExecutor-2953-thread-1) [    ] o.a.s.c.CoreContainer Creating SolrCore 'collection1' using configuration from collection collection1
   [junit4]   2> 1005625 INFO  (coreLoadExecutor-2953-thread-1) [    ] o.a.s.c.SolrCore org.apache.solr.core.MockDirectoryFactory
   [junit4]   2> 1005625 INFO  (coreLoadExecutor-2953-thread-1) [    ] o.a.s.c.SolrCore [[collection1] ] Opening new SolrCore at [/home/jenkins/workspace/Lucene-Solr-trunk-Linux/solr/build/solr-core/test/J1/temp/solr.cloud.CollectionsAPIDistributedZkTest_CA4F90A4381D77E8-001/shard-1-001/cores/collection1], dataDir=[/home/jenkins/workspace/Lucene-Solr-trunk-Linux/solr/build/solr-core/test/J1/temp/solr.cloud.CollectionsAPIDistributedZkTest_CA4F90A4381D77E8-001/shard-1-001/cores/collection1/data/]
   [junit4]   2> 1005625 INFO  (coreLoadExecutor-2953-thread-1) [    ] o.a.s.c.JmxMonitoredMap JMX monitoring is enabled. Adding Solr mbeans to JMX Server: com.sun.jmx.mbeanserver.JmxMBeanServer@108c575
   [junit4]   2> 1005625 INFO  (coreLoadExecutor-2953-thread-1) [    ] o.a.s.c.CachingDirectoryFactory return new directory for /home/jenkins/workspace/Lucene-Solr-trunk-Linux/solr/build/solr-core/test/J1/temp/solr.cloud.CollectionsAPIDistributedZkTest_CA4F90A4381D77E8-001/shard-1-001/cores/collection1/data
   [junit4]   2> 1005625 INFO  (coreLoadExecutor-2953-thread-1) [    ] o.a.s.c.SolrCore New index directory detected: old=null new=/home/jenkins/workspace/Lucene-Solr-trunk-Linux/solr/build/solr-core/test/J1/temp/solr.cloud.CollectionsAPIDistributedZkTest_CA4F90A4381D77E8-001/shard-1-001/cores/collection1/data/index/
   [junit4]   2> 1005625 WARN  (coreLoadExecutor-2953-thread-1) [    ] o.a.s.c.SolrCore [collection1] Solr index directory '/home/jenkins/workspace/Lucene-Solr-trunk-Linux/solr/build/solr-core/test/J1/temp/solr.cloud.CollectionsAPIDistributedZkTest_CA4F90A4381D77E8-001/shard-1-001/cores/collection1/data/index' doesn't exist. Creating new index...
   [junit4]   2> 1005625 INFO  (coreLoadExecutor-2953-thread-1) [    ] o.a.s.c.CachingDirectoryFactory return new directory for /home/jenkins/workspace/Lucene-Solr-trunk-Linux/solr/build/solr-core/test/J1/temp/solr.cloud.CollectionsAPIDistributedZkTest_CA4F90A4381D77E8-001/shard-1-001/cores/collection1/data/index
   [junit4]   2> 1005626 INFO  (coreLoadExecutor-2953-thread-1) [    ] o.a.s.u.RandomMergePolicy RandomMergePolicy wrapping class org.apache.lucene.index.LogDocMergePolicy: [LogDocMergePolicy: minMergeSize=1000, mergeFactor=36, maxMergeSize=9223372036854775807, maxMergeSizeForForcedMerge=9223372036854775807, calibrateSizeByDeletes=false, maxMergeDocs=2147483647, maxCFSSegmentSizeMB=8.796093022207999E12, noCFSRatio=0.2991257590938854]
   [junit4]   2> 1005626 INFO  (coreLoadExecutor-2953-thread-1) [    ] o.a.s.c.SolrDeletionPolicy SolrDeletionPolicy.onCommit: commits: num=1
   [junit4]   2> 	commit{dir=MockDirectoryWrapper(RAMDirectory@121932 lockFactory=org.apache.lucene.store.SingleInstanceLockFactory@1eca3c6),segFN=segments_1,generation=1}
   [junit4]   2> 1005626 INFO  (coreLoadExecutor-2953-thread-1) [    ] o.a.s.c.SolrDeletionPolicy newest commit generation = 1
   [junit4]   2> 1005626 INFO  (OldIndexDirectoryCleanupThreadForCore-collection1) [    ] o.a.s.c.SolrCore Looking for old index directories to cleanup for core collection1 in /home/jenkins/workspace/Lucene-Solr-trunk-Linux/solr/build/solr-core/test/J1/temp/solr.cloud.CollectionsAPIDistributedZkTest_CA4F90A4381D77E8-001/shard-1-001/cores/collection1/data/
   [junit4]   2> 1005626 WARN  (OldIndexDirectoryCleanupThreadForCore-collection1) [    ] o.a.s.c.DirectoryFactory /home/jenkins/workspace/Lucene-Solr-trunk-Linux/solr/build/solr-core/test/J1/temp/solr.cloud.CollectionsAPIDistributedZkTest_CA4F90A4381D77E8-001/shard-1-001/cores/collection1/data/ does not point to a valid data directory; skipping clean-up of old index directories.
   [junit4]   2> 1005628 INFO  (coreLoadExecutor-2953-thread-1) [    ] o.a.s.u.p.UpdateRequestProcessorChain creating updateRequestProcessorChain "nodistrib"
   [junit4]   2> 1005629 INFO  (coreLoadExecutor-2953-thread-1) [    ] o.a.s.u.p.UpdateRequestProcessorChain creating updateRequestProcessorChain "dedupe"
   [junit4]   2> 1005629 INFO  (coreLoadExecutor-2953-thread-1) [    ] o.a.s.u.p.UpdateRequestProcessorChain inserting DistributedUpdateProcessorFactory into updateRequestProcessorChain "dedupe"
   [junit4]   2> 1005629 INFO  (coreLoadExecutor-2953-thread-1) [    ] o.a.s.u.p.UpdateRequestProcessorChain creating updateRequestProcessorChain "stored_sig"
   [junit4]   2> 1005629 INFO  (coreLoadExecutor-2953-thread-1) [    ] o.a.s.u.p.UpdateRequestProcessorChain inserting DistributedUpdateProcessorFactory into updateRequestProcessorChain "stored_sig"
   [junit4]   2> 1005629 INFO  (coreLoadExecutor-2953-thread-1) [    ] o.a.s.u.p.UpdateRequestProcessorChain creating updateRequestProcessorChain "distrib-dup-test-chain-explicit"
   [junit4]   2> 1005629 INFO  (coreLoadExecutor-2953-thread-1) [    ] o.a.s.u.p.UpdateRequestProcessorChain creating updateRequestProcessorChain "distrib-dup-test-chain-implicit"
   [junit4]   2> 1005629 INFO  (coreLoadExecutor-2953-thread-1) [    ] o.a.s.u.p.UpdateRequestProcessorChain inserting DistributedUpdateProcessorFactory into updateRequestProcessorChain "distrib-dup-test-chain-implicit"
   [junit4]   2> 1005629 INFO  (coreLoadExecutor-2953-thread-1) [    ] o.a.s.c.SolrCore no updateRequestProcessorChain defined as default, creating implicit default
   [junit4]   2> 1005629 WARN  (coreLoadExecutor-2953-thread-1) [    ] o.a.s.c.RequestHandlers INVALID paramSet a in requestHandler {type = requestHandler,name = /dump,class = DumpRequestHandler,args = {defaults={a=A,b=B}}}
   [junit4]   2> 1005630 INFO  (coreLoadExecutor-2953-thread-1) [    ] o.a.s.h.l.XMLLoader xsltCacheLifetimeSeconds=60
   [junit4]   2> 1005631 INFO  (coreLoadExecutor-2953-thread-1) [    ] o.a.s.h.l.XMLLoader xsltCacheLifetimeSeconds=60
   [junit4]   2> 1005631 INFO  (coreLoadExecutor-2953-thread-1) [    ] o.a.s.h.l.XMLLoader xsltCacheLifetimeSeconds=60
   [junit4]   2> 1005632 INFO  (coreLoadExecutor-2953-thread-1) [    ] o.a.s.h.l.XMLLoader xsltCacheLifetimeSeconds=60
   [junit4]   2> 1005634 INFO  (coreLoadExecutor-2953-thread-1) [    ] o.a.s.c.RequestHandlers Registered paths: /admin/mbeans,standard,/dump,/update/csv,/update/json/docs,/admin/luke,/admin/segments,/get,/admin/system,/replication,/admin/properties,/config,/schema,/admin/plugins,/admin/logging,/update/json,/admin/threads,/admin/ping,/update,/admin/file
   [junit4]   2> 1005635 INFO  (coreLoadExecutor-2953-thread-1) [    ] o.a.s.c.SolrCore Using default statsCache cache: org.apache.solr.search.stats.LocalStatsCache
   [junit4]   2> 1005635 INFO  (coreLoadExecutor-2953-thread-1) [    ] o.a.s.u.UpdateHandler Using UpdateLog implementation: org.apache.solr.update.UpdateLog
   [junit4]   2> 1005635 INFO  (coreLoadExecutor-2953-thread-1) [    ] o.a.s.u.UpdateLog Initializing UpdateLog: dataDir= defaultSyncLevel=FLUSH numRecordsToKeep=100 maxNumLogsToKeep=10 numVersionBuckets=65536
   [junit4]   2> 1005635 INFO  (coreLoadExecutor-2953-thread-1) [    ] o.a.s.u.CommitTracker Hard AutoCommit: disabled
   [junit4]   2> 1005635 INFO  (coreLoadExecutor-2953-thread-1) [    ] o.a.s.u.CommitTracker Soft AutoCommit: disabled
   [junit4]   2> 1005636 INFO  (coreLoadExecutor-2953-thread-1) [    ] o.a.s.u.RandomMergePolicy RandomMergePolicy wrapping class org.apache.lucene.index.TieredMergePolicy: [TieredMergePolicy: maxMergeAtOnce=11, maxMergeAtOnceExplicit=30, maxMergedSegmentMB=44.806640625, floorSegmentMB=2.1513671875, forceMergeDeletesPctAllowed=19.746027534464993, segmentsPerTier=21.0, maxCFSSegmentSizeMB=8.796093022207999E12, noCFSRatio=1.0
   [junit4]   2> 1005636 INFO  (coreLoadExecutor-2953-thread-1) [    ] o.a.s.c.SolrDeletionPolicy SolrDeletionPolicy.onInit: commits: num=1
   [junit4]   2> 	commit{dir=MockDirectoryWrapper(RAMDirectory@121932 lockFactory=org.apache.lucene.store.SingleInstanceLockFactory@1eca3c6),segFN=segments_1,generation=1}
   [junit4]   2> 1005636 INFO  (coreLoadExecutor-2953-thread-1) [    ] o.a.s.c.SolrDeletionPolicy newest commit generation = 1
   [junit4]   2> 1005636 INFO  (coreLoadExecutor-2953-thread-1) [    ] o.a.s.s.SolrIndexSearcher Opening Searcher@6cc53d[collection1] main
   [junit4]   2> 1005636 INFO  (coreLoadExecutor-2953-thread-1) [    ] o.a.s.c.c.ZkStateReader Load collection config from:/collections/collection1
   [junit4]   2> 1005636 INFO  (coreLoadExecutor-2953-thread-1) [    ] o.a.s.c.c.ZkStateReader path=/collections/collection1 configName=conf1 specified config exists in ZooKeeper
   [junit4]   2> 1005636 INFO  (coreLoadExecutor-2953-thread-1) [    ] o.a.s.r.ManagedResourceStorage Setting up ZooKeeper-based storage for the RestManager with znodeBase: /configs/conf1
   [junit4]   2> 1005636 INFO  (coreLoadExecutor-2953-thread-1) [    ] o.a.s.r.ManagedResourceStorage Configured ZooKeeperStorageIO with znodeBase: /configs/conf1
   [junit4]   2> 1005637 INFO  (coreLoadExecutor-2953-thread-1) [    ] o.a.s.r.RestManager Initializing RestManager with initArgs: {}
   [junit4]   2> 1005637 INFO  (coreLoadExecutor-2953-thread-1) [    ] o.a.s.r.ManagedResourceStorage Reading _rest_managed.json using ZooKeeperStorageIO:path=/configs/conf1
   [junit4]   2> 1005637 INFO  (coreLoadExecutor-2953-thread-1) [    ] o.a.s.r.ManagedResourceStorage No data found for znode /configs/conf1/_rest_managed.json
   [junit4]   2> 1005637 INFO  (coreLoadExecutor-2953-thread-1) [    ] o.a.s.r.ManagedResourceStorage Loaded null at path _rest_managed.json using ZooKeeperStorageIO:path=/configs/conf1
   [junit4]   2> 1005637 INFO  (coreLoadExecutor-2953-thread-1) [    ] o.a.s.r.RestManager Initializing 0 registered ManagedResources
   [junit4]   2> 1005637 INFO  (coreLoadExecutor-2953-thread-1) [    ] o.a.s.h.ReplicationHandler Commits will be reserved for  10000
   [junit4]   2> 1005637 INFO  (searcherExecutor-2954-thread-1) [    ] o.a.s.c.SolrCore [collection1] Registered new searcher Searcher@6cc53d[collection1] main{ExitableDirectoryReader(UninvertingDirectoryReader())}
   [junit4]   2> 1005637 INFO  (coreLoadExecutor-2953-thread-1) [    ] o.a.s.u.UpdateLog Looking up max value of version field to seed version buckets
   [junit4]   2> 1005637 INFO  (coreLoadExecutor-2953-thread-1) [    ] o.a.s.u.VersionInfo Refreshing highest value of _version_ for 65536 version buckets from index
   [junit4]   2> 1005637 INFO  (coreLoadExecutor-2953-thread-1) [    ] o.a.s.u.VersionInfo No terms found for _version_, cannot seed version bucket highest value from index
   [junit4]   2> 1005637 INFO  (coreLoadExecutor-2953-thread-1) [    ] o.a.s.u.UpdateLog Could not find max version in index or recent updates, using new clock 1520696943980838912
   [junit4]   2> 1005639 INFO  (coreLoadExecutor-2953-thread-1) [    ] o.a.s.u.UpdateLog Took 1.0ms to seed version buckets with highest version 1520696943980838912
   [junit4]   2> 1005639 INFO  (coreLoadExecutor-2953-thread-1) [    ] o.a.s.c.ZkController watch zkdir /configs/conf1
   [junit4]   2> 1005639 INFO  (coreLoadExecutor-2953-thread-1) [    ] o.a.s.c.CoreContainer registering core: collection1
   [junit4]   2> 1005639 INFO  (coreZkRegister-2948-thread-1) [    ] o.a.s.c.ZkController Register replica - core:collection1 address:http://127.0.0.1:42522/p_ew/c collection:collection1 shard:shard2
   [junit4]   2> 1005640 INFO  (coreZkRegister-2948-thread-1) [    ] o.a.s.c.c.SolrZkClient makePath: /collections/collection1/leader_elect/shard2/election
   [junit4]   2> 1005641 INFO  (coreZkRegister-2948-thread-1) [    ] o.a.s.c.LeaderElector Joined leadership election with path: /collections/collection1/leader_elect/shard2/election/95043558742163465-core_node1-n_0000000000
   [junit4]   2> 1005641 INFO  (coreZkRegister-2948-thread-1) [    ] o.a.s.c.ShardLeaderElectionContext Running the leader process for shard=shard2 and weAreReplacement=false and leaderVoteWait=180000
   [junit4]   2> 1005641 INFO  (coreZkRegister-2948-thread-1) [    ] o.a.s.c.ShardLeaderElectionContext Enough replicas found to continue.
   [junit4]   2> 1005641 INFO  (coreZkRegister-2948-thread-1) [    ] o.a.s.c.ShardLeaderElectionContext I may be the new leader - try and sync
   [junit4]   2> 1005642 INFO  (coreZkRegister-2948-thread-1) [    ] o.a.s.c.SyncStrategy Sync replicas to http://127.0.0.1:42522/p_ew/c/collection1/
   [junit4]   2> 1005642 INFO  (coreZkRegister-2948-thread-1) [    ] o.a.s.c.SyncStrategy Sync Success - now sync replicas to me
   [junit4]   2> 1005642 INFO  (OverseerStateUpdate-95043558742163460-127.0.0.1:58927_p_ew%2Fc-n_0000000000) [    ] o.a.s.c.Overseer processMessage: queueSize: 1, message = {
   [junit4]   2>   "operation":"leader",
   [junit4]   2>   "shard":"shard2",
   [junit4]   2>   "collection":"collection1"} current state version: 3
   [junit4]   2> 1005642 INFO  (coreZkRegister-2948-thread-1) [    ] o.a.s.c.SyncStrategy http://127.0.0.1:42522/p_ew/c/collection1/ has no replicas
   [junit4]   2> 1005642 INFO  (coreZkRegister-2948-thread-1) [    ] o.a.s.c.c.SolrZkClient makePath: /collections/collection1/leaders/shard2
   [junit4]   2> 1005643 INFO  (coreZkRegister-2948-thread-1) [    ] o.a.s.c.ShardLeaderElectionContextBase Creating leader registration node
   [junit4]   2> 1005643 INFO  (coreZkRegister-2948-thread-1) [    ] o.a.s.c.ShardLeaderElectionContext I am the new leader: http://127.0.0.1:42522/p_ew/c/collection1/ shard2
   [junit4]   2> 1005643 INFO  (OverseerStateUpdate-95043558742163460-127.0.0.1:58927_p_ew%2Fc-n_0000000000) [    ] o.a.s.c.Overseer processMessage: queueSize: 1, message = {
   [junit4]   2>   "operation":"leader",
   [junit4]   2>   "shard":"shard2",
   [junit4]   2>   "collection":"collection1",
   [junit4]   2>   "base_url":"http://127.0.0.1:42522/p_ew/c",
   [junit4]   2>   "core":"collection1",
   [junit4]   2>   "state":"active"} current state version: 3
   [junit4]   2> 1005744 INFO  (OverseerStateUpdate-95043558742163460-127.0.0.1:58927_p_ew%2Fc-n_0000000000) [    ] o.a.s.c.o.ZkStateWriter going to update_collection /collections/collection1/state.json version: 1
   [junit4]   2> 1005744 INFO  (zkCallback-809-thread-1) [    ] o.a.s.c.c.ZkStateReader A cluster state change: WatchedEvent state:SyncConnected type:NodeDataChanged path:/collections/collection1/state.json for collection collection1 has occurred - updating... (live nodes size: 2)
   [junit4]   2> 1005745 INFO  (zkCallback-809-thread-1) [    ] o.a.s.c.c.ZkStateReader Updating data for collection1 from 1 to 2 
   [junit4]   2> 1005794 INFO  (coreZkRegister-2948-thread-1) [    ] o.a.s.c.ZkController We are http://127.0.0.1:42522/p_ew/c/collection1/ and leader is http://127.0.0.1:42522/p_ew/c/collection1/
   [junit4]   2> 1005794 INFO  (coreZkRegister-2948-thread-1) [    ] o.a.s.c.ZkController No LogReplay needed for core=collection1 baseURL=http://127.0.0.1:42522/p_ew/c
   [junit4]   2> 1005794 INFO  (coreZkRegister-2948-thread-1) [    ] o.a.s.c.ZkController I am the l

[...truncated too long message...]

Task.run(FutureTask.java:266)
   [junit4]   2> 	at org.apache.solr.common.util.ExecutorUtil$MDCAwareThreadPoolExecutor$1.run(ExecutorUtil.java:232)
   [junit4]   2> 	at java.util.concurrent.ThreadPoolExecutor.runWorker(ThreadPoolExecutor.java:1158)
   [junit4]   2> 	at java.util.concurrent.ThreadPoolExecutor$Worker.run(ThreadPoolExecutor.java:632)
   [junit4]   2> 	at java.lang.Thread.run(Thread.java:747)
   [junit4]   2> 1027300 WARN  (OverseerStateUpdate-95043558742163471-127.0.0.1:50977_p_ew%2Fc-n_0000000003) [    ] o.a.s.c.Overseer Solr cannot talk to ZK, exiting Overseer main queue loop
   [junit4]   2> org.apache.zookeeper.KeeperException$SessionExpiredException: KeeperErrorCode = Session expired for /overseer/queue/qn-0000000055
   [junit4]   2> 	at org.apache.zookeeper.KeeperException.create(KeeperException.java:127)
   [junit4]   2> 	at org.apache.zookeeper.KeeperException.create(KeeperException.java:51)
   [junit4]   2> 	at org.apache.zookeeper.ZooKeeper.getData(ZooKeeper.java:1155)
   [junit4]   2> 	at org.apache.solr.common.cloud.SolrZkClient$7.execute(SolrZkClient.java:353)
   [junit4]   2> 	at org.apache.solr.common.cloud.SolrZkClient$7.execute(SolrZkClient.java:350)
   [junit4]   2> 	at org.apache.solr.common.cloud.ZkCmdExecutor.retryOperation(ZkCmdExecutor.java:61)
   [junit4]   2> 	at org.apache.solr.common.cloud.SolrZkClient.getData(SolrZkClient.java:350)
   [junit4]   2> 	at org.apache.solr.cloud.DistributedQueue.removeFirst(DistributedQueue.java:385)
   [junit4]   2> 	at org.apache.solr.cloud.DistributedQueue.poll(DistributedQueue.java:188)
   [junit4]   2> 	at org.apache.solr.cloud.Overseer$ClusterStateUpdater.run(Overseer.java:230)
   [junit4]   2> 	at java.lang.Thread.run(Thread.java:747)
   [junit4]   2> 1027300 INFO  (OverseerStateUpdate-95043558742163471-127.0.0.1:50977_p_ew%2Fc-n_0000000003) [    ] o.a.s.c.Overseer Overseer Loop exiting : 127.0.0.1:50977_p_ew%2Fc
   [junit4]   2> 1028317 WARN  (zkCallback-822-thread-1) [    ] o.a.s.c.c.ZkStateReader ZooKeeper watch triggered, but Solr cannot talk to ZK
   [junit4]   2> 1028318 INFO  (TEST-CollectionsAPIDistributedZkTest.test-seed#[CA4F90A4381D77E8]) [    ] o.e.j.s.ServerConnector Stopped ServerConnector@1ac6224{HTTP/1.1,[http/1.1]}{127.0.0.1:0}
   [junit4]   2> 1028318 INFO  (TEST-CollectionsAPIDistributedZkTest.test-seed#[CA4F90A4381D77E8]) [    ] o.e.j.s.h.ContextHandler Stopped o.e.j.s.ServletContextHandler@1bd1eb5{/p_ew/c,null,UNAVAILABLE}
   [junit4]   2> 1028320 INFO  (TEST-CollectionsAPIDistributedZkTest.test-seed#[CA4F90A4381D77E8]) [    ] o.a.s.c.ZkTestServer connecting to 127.0.0.1:51158 51158
   [junit4]   2> 1028339 INFO  (Thread-2590) [    ] o.a.s.c.ZkTestServer connecting to 127.0.0.1:51158 51158
   [junit4]   2> 1028340 WARN  (Thread-2590) [    ] o.a.s.c.ZkTestServer Watch limit violations: 
   [junit4]   2> Maximum concurrent create/delete watches above limit:
   [junit4]   2> 
   [junit4]   2> 	8	/solr/aliases.json
   [junit4]   2> 	5	/solr/security.json
   [junit4]   2> 	5	/solr/configs/conf1
   [junit4]   2> 
   [junit4]   2> Maximum concurrent data watches above limit:
   [junit4]   2> 
   [junit4]   2> 	8	/solr/clusterstate.json
   [junit4]   2> 	4	/solr/collections/nodes_used_collection/state.json
   [junit4]   2> 	4	/solr/collections/collection1/state.json
   [junit4]   2> 	2	/solr/collections/awholynewcollection_0/state.json
   [junit4]   2> 
   [junit4]   2> Maximum concurrent children watches above limit:
   [junit4]   2> 
   [junit4]   2> 	8	/solr/live_nodes
   [junit4]   2> 	8	/solr/collections
   [junit4]   2> 	5	/solr/overseer/collection-queue-work
   [junit4]   2> 	3	/solr/overseer/queue
   [junit4]   2> 
   [junit4]   2> NOTE: reproduce with: ant test  -Dtestcase=CollectionsAPIDistributedZkTest -Dtests.method=test -Dtests.seed=CA4F90A4381D77E8 -Dtests.multiplier=3 -Dtests.slow=true -Dtests.locale=fr_RW -Dtests.timezone=America/Nassau -Dtests.asserts=true -Dtests.file.encoding=US-ASCII
   [junit4] ERROR   26.6s J1 | CollectionsAPIDistributedZkTest.test <<<
   [junit4]    > Throwable #1: org.apache.solr.client.solrj.impl.HttpSolrClient$RemoteSolrException: Error from server at http://127.0.0.1:58927/p_ew/c/awholynewcollection_0: non ok status: 500, message:Server Error
   [junit4]    > 	at __randomizedtesting.SeedInfo.seed([CA4F90A4381D77E8:421BAF7E96E11A10]:0)
   [junit4]    > 	at org.apache.solr.client.solrj.impl.HttpSolrClient.executeMethod(HttpSolrClient.java:509)
   [junit4]    > 	at org.apache.solr.client.solrj.impl.HttpSolrClient.request(HttpSolrClient.java:241)
   [junit4]    > 	at org.apache.solr.client.solrj.impl.HttpSolrClient.request(HttpSolrClient.java:230)
   [junit4]    > 	at org.apache.solr.client.solrj.SolrRequest.process(SolrRequest.java:150)
   [junit4]    > 	at org.apache.solr.client.solrj.SolrClient.query(SolrClient.java:943)
   [junit4]    > 	at org.apache.solr.client.solrj.SolrClient.query(SolrClient.java:958)
   [junit4]    > 	at org.apache.solr.cloud.AbstractFullDistribZkTestBase.waitForNon403or404or503(AbstractFullDistribZkTestBase.java:1754)
   [junit4]    > 	at org.apache.solr.cloud.CollectionsAPIDistributedZkTest.testCollectionsAPI(CollectionsAPIDistributedZkTest.java:638)
   [junit4]    > 	at org.apache.solr.cloud.CollectionsAPIDistributedZkTest.test(CollectionsAPIDistributedZkTest.java:160)
   [junit4]    > 	at org.apache.solr.BaseDistributedSearchTestCase$ShardsRepeatRule$ShardsFixedStatement.callStatement(BaseDistributedSearchTestCase.java:965)
   [junit4]    > 	at org.apache.solr.BaseDistributedSearchTestCase$ShardsRepeatRule$ShardsStatement.evaluate(BaseDistributedSearchTestCase.java:940)
   [junit4]    > 	at java.lang.Thread.run(Thread.java:747)
   [junit4]   2> 1028343 INFO  (SUITE-CollectionsAPIDistributedZkTest-seed#[CA4F90A4381D77E8]-worker) [    ] o.a.s.SolrTestCaseJ4 ###deleteCore
   [junit4]   2> NOTE: leaving temporary files on disk at: /home/jenkins/workspace/Lucene-Solr-trunk-Linux/solr/build/solr-core/test/J1/temp/solr.cloud.CollectionsAPIDistributedZkTest_CA4F90A4381D77E8-001
   [junit4]   2> Dec 16, 2015 7:07:21 AM com.carrotsearch.randomizedtesting.ThreadLeakControl checkThreadLeaks
   [junit4]   2> WARNING: Will linger awaiting termination of 1 leaked thread(s).
   [junit4]   2> NOTE: test params are: codec=Asserting(Lucene60): {}, docValues:{}, sim=RandomSimilarityProvider(queryNorm=false,coord=crazy): {}, locale=fr_RW, timezone=America/Nassau
   [junit4]   2> NOTE: Linux 3.19.0-37-generic i386/Oracle Corporation 9-ea (32-bit)/cpus=12,threads=1,free=53283792,total=422051840
   [junit4]   2> NOTE: All tests run in this JVM: [TestCloudSchemaless, RemoteQueryErrorTest, TestFieldSortValues, TestBulkSchemaConcurrent, HighlighterMaxOffsetTest, SortByFunctionTest, CollectionStateFormat2Test, SuggesterFSTTest, DocumentBuilderTest, DistributedExpandComponentTest, SecurityConfHandlerTest, TestStandardQParsers, TestPartialUpdateDeduplication, DeleteReplicaTest, SpellCheckCollatorTest, TestSolrCoreProperties, TestRecoveryHdfs, TestLMJelinekMercerSimilarityFactory, ExitableDirectoryReaderTest, TestFieldTypeResource, TestHighFrequencyDictionaryFactory, TestConfigOverlay, TestInfoStreamLogging, ChaosMonkeySafeLeaderTest, DataDrivenBlockJoinTest, DistributedTermsComponentTest, TestScoreJoinQPNoScore, TestNamedUpdateProcessors, TestExactSharedStatsCache, WordBreakSolrSpellCheckerTest, TestBlendedInfixSuggestions, TestConfigSetsAPIZkFailure, TestBinaryResponseWriter, NotRequiredUniqueKeyTest, TestDistributedGrouping, TestReloadAndDeleteDocs, TestNonDefinedSimilarityFactory, BufferStoreTest, TestSchemaManager, TestUpdate, FacetPivotSmallTest, CdcrRequestHandlerTest, SolrPluginUtilsTest, CursorMarkTest, CustomCollectionTest, TestDownShardTolerantSearch, CSVRequestHandlerTest, RollingRestartTest, SpellPossibilityIteratorTest, SparseHLLTest, SimpleCollectionCreateDeleteTest, TestHashPartitioner, ChaosMonkeyNothingIsSafeTest, RuleEngineTest, TestRebalanceLeaders, TestCollectionAPI, IgnoreCommitOptimizeUpdateProcessorFactoryTest, ShardSplitTest, TestQuerySenderNoQuery, HdfsUnloadDistributedZkTest, TestCollapseQParserPlugin, SpellingQueryConverterTest, TestJsonFacets, SolrIndexConfigTest, TestUniqueKeyFieldResource, HdfsBasicDistributedZkTest, TestCoreContainer, ShardRoutingTest, TestSimpleQParserPlugin, TriLevelCompositeIdRoutingTest, ResponseHeaderTest, CoreAdminRequestStatusTest, ZkControllerTest, OverseerStatusTest, TestSurroundQueryParser, TestRequestStatusCollectionAPI, BigEndianAscendingWordSerializerTest, TestManagedResource, SchemaVersionSpecificBehaviorTest, SimplePostToolTest, TimeZoneUtilsTest, SolrIndexSplitterTest, CollectionsAPIDistributedZkTest]
   [junit4] Completed [250/566 (1!)] on J1 in 27.64s, 1 test, 1 error <<< FAILURES!

[...truncated 1044 lines...]
BUILD FAILED
/home/jenkins/workspace/Lucene-Solr-trunk-Linux/build.xml:784: The following error occurred while executing this line:
/home/jenkins/workspace/Lucene-Solr-trunk-Linux/build.xml:728: The following error occurred while executing this line:
/home/jenkins/workspace/Lucene-Solr-trunk-Linux/build.xml:59: The following error occurred while executing this line:
/home/jenkins/workspace/Lucene-Solr-trunk-Linux/solr/build.xml:233: The following error occurred while executing this line:
/home/jenkins/workspace/Lucene-Solr-trunk-Linux/solr/common-build.xml:516: The following error occurred while executing this line:
/home/jenkins/workspace/Lucene-Solr-trunk-Linux/lucene/common-build.xml:1436: The following error occurred while executing this line:
/home/jenkins/workspace/Lucene-Solr-trunk-Linux/lucene/common-build.xml:991: There were test failures: 566 suites (8 ignored), 2254 tests, 1 error, 114 ignored (69 assumptions) [seed: CA4F90A4381D77E8]

Total time: 52 minutes 54 seconds
Build step 'Invoke Ant' marked build as failure
Archiving artifacts
[WARNINGS] Skipping publisher since build result is FAILURE
Recording test results
Email was triggered for: Failure - Any
Sending email for trigger: Failure - Any



Mime
View raw message