lucene-dev mailing list archives

Site index · List index
Message view « Date » · « Thread »
Top « Date » · « Thread »
From Policeman Jenkins Server <jenk...@thetaphi.de>
Subject [JENKINS-EA] Lucene-Solr-trunk-Linux (32bit/jdk-9-ea+95) - Build # 15393 - Failure!
Date Thu, 31 Dec 2015 21:56:02 GMT
Build: http://jenkins.thetaphi.de/job/Lucene-Solr-trunk-Linux/15393/
Java: 32bit/jdk-9-ea+95 -server -XX:+UseConcMarkSweepGC -XX:-CompactStrings

2 tests failed.
FAILED:  junit.framework.TestSuite.org.apache.solr.cloud.ChaosMonkeyNothingIsSafeTest

Error Message:
ObjectTracker found 1 object(s) that were not released!!! [TransactionLog]

Stack Trace:
java.lang.AssertionError: ObjectTracker found 1 object(s) that were not released!!! [TransactionLog]
	at __randomizedtesting.SeedInfo.seed([32A2BE9420DDAF12]:0)
	at org.junit.Assert.fail(Assert.java:93)
	at org.junit.Assert.assertTrue(Assert.java:43)
	at org.junit.Assert.assertNull(Assert.java:551)
	at org.apache.solr.SolrTestCaseJ4.afterClass(SolrTestCaseJ4.java:229)
	at sun.reflect.GeneratedMethodAccessor18.invoke(Unknown Source)
	at sun.reflect.DelegatingMethodAccessorImpl.invoke(DelegatingMethodAccessorImpl.java:43)
	at java.lang.reflect.Method.invoke(Method.java:520)
	at com.carrotsearch.randomizedtesting.RandomizedRunner.invoke(RandomizedRunner.java:1764)
	at com.carrotsearch.randomizedtesting.RandomizedRunner$7.evaluate(RandomizedRunner.java:834)
	at com.carrotsearch.randomizedtesting.rules.StatementAdapter.evaluate(StatementAdapter.java:36)
	at com.carrotsearch.randomizedtesting.rules.SystemPropertiesRestoreRule$1.evaluate(SystemPropertiesRestoreRule.java:57)
	at org.apache.lucene.util.AbstractBeforeAfterRule$1.evaluate(AbstractBeforeAfterRule.java:46)
	at com.carrotsearch.randomizedtesting.rules.StatementAdapter.evaluate(StatementAdapter.java:36)
	at org.apache.lucene.util.TestRuleStoreClassName$1.evaluate(TestRuleStoreClassName.java:42)
	at com.carrotsearch.randomizedtesting.rules.NoShadowingOrOverridesOnMethodsRule$1.evaluate(NoShadowingOrOverridesOnMethodsRule.java:40)
	at com.carrotsearch.randomizedtesting.rules.NoShadowingOrOverridesOnMethodsRule$1.evaluate(NoShadowingOrOverridesOnMethodsRule.java:40)
	at com.carrotsearch.randomizedtesting.rules.StatementAdapter.evaluate(StatementAdapter.java:36)
	at com.carrotsearch.randomizedtesting.rules.StatementAdapter.evaluate(StatementAdapter.java:36)
	at com.carrotsearch.randomizedtesting.rules.StatementAdapter.evaluate(StatementAdapter.java:36)
	at org.apache.lucene.util.TestRuleAssertionsRequired$1.evaluate(TestRuleAssertionsRequired.java:54)
	at org.apache.lucene.util.TestRuleMarkFailure$1.evaluate(TestRuleMarkFailure.java:48)
	at org.apache.lucene.util.TestRuleIgnoreAfterMaxFailures$1.evaluate(TestRuleIgnoreAfterMaxFailures.java:65)
	at org.apache.lucene.util.TestRuleIgnoreTestSuites$1.evaluate(TestRuleIgnoreTestSuites.java:55)
	at com.carrotsearch.randomizedtesting.rules.StatementAdapter.evaluate(StatementAdapter.java:36)
	at com.carrotsearch.randomizedtesting.ThreadLeakControl$StatementRunner.run(ThreadLeakControl.java:367)
	at java.lang.Thread.run(Thread.java:747)


FAILED:  org.apache.solr.cloud.HttpPartitionTest.test

Error Message:
Didn't see all replicas for shard shard1 in c8n_1x2 come up within 30000 ms! ClusterState: {   "collection1":{     "replicationFactor":"1",     "shards":{       "shard1":{         "range":"80000000-ffffffff",         "state":"active",         "replicas":{"core_node2":{             "core":"collection1",             "base_url":"http://127.0.0.1:34875/kh_",             "node_name":"127.0.0.1:34875_kh_",             "state":"active",             "leader":"true"}}},       "shard2":{         "range":"0-7fffffff",         "state":"active",         "replicas":{           "core_node1":{             "core":"collection1",             "base_url":"http://127.0.0.1:42209/kh_",             "node_name":"127.0.0.1:42209_kh_",             "state":"active",             "leader":"true"},           "core_node3":{             "core":"collection1",             "base_url":"http://127.0.0.1:42769/kh_",             "node_name":"127.0.0.1:42769_kh_",             "state":"active"}}}},     "router":{"name":"compositeId"},     "maxShardsPerNode":"1",     "autoAddReplicas":"false",     "autoCreated":"true"},   "control_collection":{     "replicationFactor":"1",     "shards":{"shard1":{         "range":"80000000-7fffffff",         "state":"active",         "replicas":{"core_node1":{             "core":"collection1",             "base_url":"http://127.0.0.1:40132/kh_",             "node_name":"127.0.0.1:40132_kh_",             "state":"active",             "leader":"true"}}}},     "router":{"name":"compositeId"},     "maxShardsPerNode":"1",     "autoAddReplicas":"false",     "autoCreated":"true"},   "c8n_1x2":{     "replicationFactor":"2",     "shards":{"shard1":{         "range":"80000000-7fffffff",         "state":"active",         "replicas":{           "core_node1":{             "core":"c8n_1x2_shard1_replica2",             "base_url":"http://127.0.0.1:42769/kh_",             "node_name":"127.0.0.1:42769_kh_",             "state":"recovering"},           "core_node2":{             "core":"c8n_1x2_shard1_replica1",             "base_url":"http://127.0.0.1:34875/kh_",             "node_name":"127.0.0.1:34875_kh_",             "state":"active",             "leader":"true"}}}},     "router":{"name":"compositeId"},     "maxShardsPerNode":"1",     "autoAddReplicas":"false"},   "collMinRf_1x3":{     "replicationFactor":"3",     "shards":{"shard1":{         "range":"80000000-7fffffff",         "state":"active",         "replicas":{           "core_node1":{             "core":"collMinRf_1x3_shard1_replica1",             "base_url":"http://127.0.0.1:42209/kh_",             "node_name":"127.0.0.1:42209_kh_",             "state":"active"},           "core_node2":{             "core":"collMinRf_1x3_shard1_replica2",             "base_url":"http://127.0.0.1:40132/kh_",             "node_name":"127.0.0.1:40132_kh_",             "state":"active",             "leader":"true"},           "core_node3":{             "core":"collMinRf_1x3_shard1_replica3",             "base_url":"http://127.0.0.1:42769/kh_",             "node_name":"127.0.0.1:42769_kh_",             "state":"active"}}}},     "router":{"name":"compositeId"},     "maxShardsPerNode":"1",     "autoAddReplicas":"false"}}

Stack Trace:
java.lang.AssertionError: Didn't see all replicas for shard shard1 in c8n_1x2 come up within 30000 ms! ClusterState: {
  "collection1":{
    "replicationFactor":"1",
    "shards":{
      "shard1":{
        "range":"80000000-ffffffff",
        "state":"active",
        "replicas":{"core_node2":{
            "core":"collection1",
            "base_url":"http://127.0.0.1:34875/kh_",
            "node_name":"127.0.0.1:34875_kh_",
            "state":"active",
            "leader":"true"}}},
      "shard2":{
        "range":"0-7fffffff",
        "state":"active",
        "replicas":{
          "core_node1":{
            "core":"collection1",
            "base_url":"http://127.0.0.1:42209/kh_",
            "node_name":"127.0.0.1:42209_kh_",
            "state":"active",
            "leader":"true"},
          "core_node3":{
            "core":"collection1",
            "base_url":"http://127.0.0.1:42769/kh_",
            "node_name":"127.0.0.1:42769_kh_",
            "state":"active"}}}},
    "router":{"name":"compositeId"},
    "maxShardsPerNode":"1",
    "autoAddReplicas":"false",
    "autoCreated":"true"},
  "control_collection":{
    "replicationFactor":"1",
    "shards":{"shard1":{
        "range":"80000000-7fffffff",
        "state":"active",
        "replicas":{"core_node1":{
            "core":"collection1",
            "base_url":"http://127.0.0.1:40132/kh_",
            "node_name":"127.0.0.1:40132_kh_",
            "state":"active",
            "leader":"true"}}}},
    "router":{"name":"compositeId"},
    "maxShardsPerNode":"1",
    "autoAddReplicas":"false",
    "autoCreated":"true"},
  "c8n_1x2":{
    "replicationFactor":"2",
    "shards":{"shard1":{
        "range":"80000000-7fffffff",
        "state":"active",
        "replicas":{
          "core_node1":{
            "core":"c8n_1x2_shard1_replica2",
            "base_url":"http://127.0.0.1:42769/kh_",
            "node_name":"127.0.0.1:42769_kh_",
            "state":"recovering"},
          "core_node2":{
            "core":"c8n_1x2_shard1_replica1",
            "base_url":"http://127.0.0.1:34875/kh_",
            "node_name":"127.0.0.1:34875_kh_",
            "state":"active",
            "leader":"true"}}}},
    "router":{"name":"compositeId"},
    "maxShardsPerNode":"1",
    "autoAddReplicas":"false"},
  "collMinRf_1x3":{
    "replicationFactor":"3",
    "shards":{"shard1":{
        "range":"80000000-7fffffff",
        "state":"active",
        "replicas":{
          "core_node1":{
            "core":"collMinRf_1x3_shard1_replica1",
            "base_url":"http://127.0.0.1:42209/kh_",
            "node_name":"127.0.0.1:42209_kh_",
            "state":"active"},
          "core_node2":{
            "core":"collMinRf_1x3_shard1_replica2",
            "base_url":"http://127.0.0.1:40132/kh_",
            "node_name":"127.0.0.1:40132_kh_",
            "state":"active",
            "leader":"true"},
          "core_node3":{
            "core":"collMinRf_1x3_shard1_replica3",
            "base_url":"http://127.0.0.1:42769/kh_",
            "node_name":"127.0.0.1:42769_kh_",
            "state":"active"}}}},
    "router":{"name":"compositeId"},
    "maxShardsPerNode":"1",
    "autoAddReplicas":"false"}}
	at __randomizedtesting.SeedInfo.seed([32A2BE9420DDAF12:BAF6814E8E21C2EA]:0)
	at org.junit.Assert.fail(Assert.java:93)
	at org.apache.solr.cloud.AbstractFullDistribZkTestBase.ensureAllReplicasAreActive(AbstractFullDistribZkTestBase.java:1844)
	at org.apache.solr.cloud.HttpPartitionTest.testRf2(HttpPartitionTest.java:349)
	at org.apache.solr.cloud.HttpPartitionTest.test(HttpPartitionTest.java:109)
	at sun.reflect.NativeMethodAccessorImpl.invoke0(Native Method)
	at sun.reflect.NativeMethodAccessorImpl.invoke(NativeMethodAccessorImpl.java:62)
	at sun.reflect.DelegatingMethodAccessorImpl.invoke(DelegatingMethodAccessorImpl.java:43)
	at java.lang.reflect.Method.invoke(Method.java:520)
	at com.carrotsearch.randomizedtesting.RandomizedRunner.invoke(RandomizedRunner.java:1764)
	at com.carrotsearch.randomizedtesting.RandomizedRunner$8.evaluate(RandomizedRunner.java:871)
	at com.carrotsearch.randomizedtesting.RandomizedRunner$9.evaluate(RandomizedRunner.java:907)
	at com.carrotsearch.randomizedtesting.RandomizedRunner$10.evaluate(RandomizedRunner.java:921)
	at org.apache.solr.BaseDistributedSearchTestCase$ShardsRepeatRule$ShardsFixedStatement.callStatement(BaseDistributedSearchTestCase.java:965)
	at org.apache.solr.BaseDistributedSearchTestCase$ShardsRepeatRule$ShardsStatement.evaluate(BaseDistributedSearchTestCase.java:940)
	at com.carrotsearch.randomizedtesting.rules.SystemPropertiesRestoreRule$1.evaluate(SystemPropertiesRestoreRule.java:57)
	at org.apache.lucene.util.TestRuleSetupTeardownChained$1.evaluate(TestRuleSetupTeardownChained.java:50)
	at org.apache.lucene.util.AbstractBeforeAfterRule$1.evaluate(AbstractBeforeAfterRule.java:46)
	at org.apache.lucene.util.TestRuleThreadAndTestName$1.evaluate(TestRuleThreadAndTestName.java:49)
	at org.apache.lucene.util.TestRuleIgnoreAfterMaxFailures$1.evaluate(TestRuleIgnoreAfterMaxFailures.java:65)
	at org.apache.lucene.util.TestRuleMarkFailure$1.evaluate(TestRuleMarkFailure.java:48)
	at com.carrotsearch.randomizedtesting.rules.StatementAdapter.evaluate(StatementAdapter.java:36)
	at com.carrotsearch.randomizedtesting.ThreadLeakControl$StatementRunner.run(ThreadLeakControl.java:367)
	at com.carrotsearch.randomizedtesting.ThreadLeakControl.forkTimeoutingTask(ThreadLeakControl.java:809)
	at com.carrotsearch.randomizedtesting.ThreadLeakControl$3.evaluate(ThreadLeakControl.java:460)
	at com.carrotsearch.randomizedtesting.RandomizedRunner.runSingleTest(RandomizedRunner.java:880)
	at com.carrotsearch.randomizedtesting.RandomizedRunner$5.evaluate(RandomizedRunner.java:781)
	at com.carrotsearch.randomizedtesting.RandomizedRunner$6.evaluate(RandomizedRunner.java:816)
	at com.carrotsearch.randomizedtesting.RandomizedRunner$7.evaluate(RandomizedRunner.java:827)
	at com.carrotsearch.randomizedtesting.rules.StatementAdapter.evaluate(StatementAdapter.java:36)
	at com.carrotsearch.randomizedtesting.rules.SystemPropertiesRestoreRule$1.evaluate(SystemPropertiesRestoreRule.java:57)
	at org.apache.lucene.util.AbstractBeforeAfterRule$1.evaluate(AbstractBeforeAfterRule.java:46)
	at com.carrotsearch.randomizedtesting.rules.StatementAdapter.evaluate(StatementAdapter.java:36)
	at org.apache.lucene.util.TestRuleStoreClassName$1.evaluate(TestRuleStoreClassName.java:42)
	at com.carrotsearch.randomizedtesting.rules.NoShadowingOrOverridesOnMethodsRule$1.evaluate(NoShadowingOrOverridesOnMethodsRule.java:40)
	at com.carrotsearch.randomizedtesting.rules.NoShadowingOrOverridesOnMethodsRule$1.evaluate(NoShadowingOrOverridesOnMethodsRule.java:40)
	at com.carrotsearch.randomizedtesting.rules.StatementAdapter.evaluate(StatementAdapter.java:36)
	at com.carrotsearch.randomizedtesting.rules.StatementAdapter.evaluate(StatementAdapter.java:36)
	at com.carrotsearch.randomizedtesting.rules.StatementAdapter.evaluate(StatementAdapter.java:36)
	at org.apache.lucene.util.TestRuleAssertionsRequired$1.evaluate(TestRuleAssertionsRequired.java:54)
	at org.apache.lucene.util.TestRuleMarkFailure$1.evaluate(TestRuleMarkFailure.java:48)
	at org.apache.lucene.util.TestRuleIgnoreAfterMaxFailures$1.evaluate(TestRuleIgnoreAfterMaxFailures.java:65)
	at org.apache.lucene.util.TestRuleIgnoreTestSuites$1.evaluate(TestRuleIgnoreTestSuites.java:55)
	at com.carrotsearch.randomizedtesting.rules.StatementAdapter.evaluate(StatementAdapter.java:36)
	at com.carrotsearch.randomizedtesting.ThreadLeakControl$StatementRunner.run(ThreadLeakControl.java:367)
	at java.lang.Thread.run(Thread.java:747)




Build Log:
[...truncated 10769 lines...]
   [junit4] Suite: org.apache.solr.cloud.ChaosMonkeyNothingIsSafeTest
   [junit4]   2> Creating dataDir: /home/jenkins/workspace/Lucene-Solr-trunk-Linux/solr/build/solr-core/test/J0/temp/solr.cloud.ChaosMonkeyNothingIsSafeTest_32A2BE9420DDAF12-001/init-core-data-001
   [junit4]   2> 1161973 INFO  (SUITE-ChaosMonkeyNothingIsSafeTest-seed#[32A2BE9420DDAF12]-worker) [    ] o.a.s.BaseDistributedSearchTestCase Setting hostContext system property: /
   [junit4]   2> 1161974 INFO  (TEST-ChaosMonkeyNothingIsSafeTest.test-seed#[32A2BE9420DDAF12]) [    ] o.a.s.c.ZkTestServer STARTING ZK TEST SERVER
   [junit4]   2> 1161975 INFO  (Thread-3181) [    ] o.a.s.c.ZkTestServer client port:0.0.0.0/0.0.0.0:0
   [junit4]   2> 1161975 INFO  (Thread-3181) [    ] o.a.s.c.ZkTestServer Starting server
   [junit4]   2> 1162075 INFO  (TEST-ChaosMonkeyNothingIsSafeTest.test-seed#[32A2BE9420DDAF12]) [    ] o.a.s.c.ZkTestServer start zk server on port:40110
   [junit4]   2> 1162075 INFO  (TEST-ChaosMonkeyNothingIsSafeTest.test-seed#[32A2BE9420DDAF12]) [    ] o.a.s.c.c.SolrZkClient Using default ZkCredentialsProvider
   [junit4]   2> 1162075 INFO  (TEST-ChaosMonkeyNothingIsSafeTest.test-seed#[32A2BE9420DDAF12]) [    ] o.a.s.c.c.ConnectionManager Waiting for client to connect to ZooKeeper
   [junit4]   2> 1162077 INFO  (zkCallback-1108-thread-1) [    ] o.a.s.c.c.ConnectionManager Watcher org.apache.solr.common.cloud.ConnectionManager@748b43 name:ZooKeeperConnection Watcher:127.0.0.1:40110 got event WatchedEvent state:SyncConnected type:None path:null path:null type:None
   [junit4]   2> 1162077 INFO  (TEST-ChaosMonkeyNothingIsSafeTest.test-seed#[32A2BE9420DDAF12]) [    ] o.a.s.c.c.ConnectionManager Client is connected to ZooKeeper
   [junit4]   2> 1162077 INFO  (TEST-ChaosMonkeyNothingIsSafeTest.test-seed#[32A2BE9420DDAF12]) [    ] o.a.s.c.c.SolrZkClient Using default ZkACLProvider
   [junit4]   2> 1162077 INFO  (TEST-ChaosMonkeyNothingIsSafeTest.test-seed#[32A2BE9420DDAF12]) [    ] o.a.s.c.c.SolrZkClient makePath: /solr
   [junit4]   2> 1162078 INFO  (TEST-ChaosMonkeyNothingIsSafeTest.test-seed#[32A2BE9420DDAF12]) [    ] o.a.s.c.c.SolrZkClient Using default ZkCredentialsProvider
   [junit4]   2> 1162079 INFO  (TEST-ChaosMonkeyNothingIsSafeTest.test-seed#[32A2BE9420DDAF12]) [    ] o.a.s.c.c.ConnectionManager Waiting for client to connect to ZooKeeper
   [junit4]   2> 1162079 INFO  (zkCallback-1109-thread-1) [    ] o.a.s.c.c.ConnectionManager Watcher org.apache.solr.common.cloud.ConnectionManager@1fcfeb0 name:ZooKeeperConnection Watcher:127.0.0.1:40110/solr got event WatchedEvent state:SyncConnected type:None path:null path:null type:None
   [junit4]   2> 1162080 INFO  (TEST-ChaosMonkeyNothingIsSafeTest.test-seed#[32A2BE9420DDAF12]) [    ] o.a.s.c.c.ConnectionManager Client is connected to ZooKeeper
   [junit4]   2> 1162080 INFO  (TEST-ChaosMonkeyNothingIsSafeTest.test-seed#[32A2BE9420DDAF12]) [    ] o.a.s.c.c.SolrZkClient Using default ZkACLProvider
   [junit4]   2> 1162080 INFO  (TEST-ChaosMonkeyNothingIsSafeTest.test-seed#[32A2BE9420DDAF12]) [    ] o.a.s.c.c.SolrZkClient makePath: /collections/collection1
   [junit4]   2> 1162081 INFO  (TEST-ChaosMonkeyNothingIsSafeTest.test-seed#[32A2BE9420DDAF12]) [    ] o.a.s.c.c.SolrZkClient makePath: /collections/collection1/shards
   [junit4]   2> 1162081 INFO  (TEST-ChaosMonkeyNothingIsSafeTest.test-seed#[32A2BE9420DDAF12]) [    ] o.a.s.c.c.SolrZkClient makePath: /collections/control_collection
   [junit4]   2> 1162082 INFO  (TEST-ChaosMonkeyNothingIsSafeTest.test-seed#[32A2BE9420DDAF12]) [    ] o.a.s.c.c.SolrZkClient makePath: /collections/control_collection/shards
   [junit4]   2> 1162082 INFO  (TEST-ChaosMonkeyNothingIsSafeTest.test-seed#[32A2BE9420DDAF12]) [    ] o.a.s.c.AbstractZkTestCase put /home/jenkins/workspace/Lucene-Solr-trunk-Linux/solr/core/src/test-files/solr/collection1/conf/solrconfig-tlog.xml to /configs/conf1/solrconfig.xml
   [junit4]   2> 1162083 INFO  (TEST-ChaosMonkeyNothingIsSafeTest.test-seed#[32A2BE9420DDAF12]) [    ] o.a.s.c.c.SolrZkClient makePath: /configs/conf1/solrconfig.xml
   [junit4]   2> 1162083 INFO  (TEST-ChaosMonkeyNothingIsSafeTest.test-seed#[32A2BE9420DDAF12]) [    ] o.a.s.c.AbstractZkTestCase put /home/jenkins/workspace/Lucene-Solr-trunk-Linux/solr/core/src/test-files/solr/collection1/conf/schema15.xml to /configs/conf1/schema.xml
   [junit4]   2> 1162084 INFO  (TEST-ChaosMonkeyNothingIsSafeTest.test-seed#[32A2BE9420DDAF12]) [    ] o.a.s.c.c.SolrZkClient makePath: /configs/conf1/schema.xml
   [junit4]   2> 1162084 INFO  (TEST-ChaosMonkeyNothingIsSafeTest.test-seed#[32A2BE9420DDAF12]) [    ] o.a.s.c.AbstractZkTestCase put /home/jenkins/workspace/Lucene-Solr-trunk-Linux/solr/core/src/test-files/solr/collection1/conf/solrconfig.snippet.randomindexconfig.xml to /configs/conf1/solrconfig.snippet.randomindexconfig.xml
   [junit4]   2> 1162084 INFO  (TEST-ChaosMonkeyNothingIsSafeTest.test-seed#[32A2BE9420DDAF12]) [    ] o.a.s.c.c.SolrZkClient makePath: /configs/conf1/solrconfig.snippet.randomindexconfig.xml
   [junit4]   2> 1162085 INFO  (TEST-ChaosMonkeyNothingIsSafeTest.test-seed#[32A2BE9420DDAF12]) [    ] o.a.s.c.AbstractZkTestCase put /home/jenkins/workspace/Lucene-Solr-trunk-Linux/solr/core/src/test-files/solr/collection1/conf/stopwords.txt to /configs/conf1/stopwords.txt
   [junit4]   2> 1162086 INFO  (TEST-ChaosMonkeyNothingIsSafeTest.test-seed#[32A2BE9420DDAF12]) [    ] o.a.s.c.c.SolrZkClient makePath: /configs/conf1/stopwords.txt
   [junit4]   2> 1162086 INFO  (TEST-ChaosMonkeyNothingIsSafeTest.test-seed#[32A2BE9420DDAF12]) [    ] o.a.s.c.AbstractZkTestCase put /home/jenkins/workspace/Lucene-Solr-trunk-Linux/solr/core/src/test-files/solr/collection1/conf/protwords.txt to /configs/conf1/protwords.txt
   [junit4]   2> 1162086 INFO  (TEST-ChaosMonkeyNothingIsSafeTest.test-seed#[32A2BE9420DDAF12]) [    ] o.a.s.c.c.SolrZkClient makePath: /configs/conf1/protwords.txt
   [junit4]   2> 1162087 INFO  (TEST-ChaosMonkeyNothingIsSafeTest.test-seed#[32A2BE9420DDAF12]) [    ] o.a.s.c.AbstractZkTestCase put /home/jenkins/workspace/Lucene-Solr-trunk-Linux/solr/core/src/test-files/solr/collection1/conf/currency.xml to /configs/conf1/currency.xml
   [junit4]   2> 1162087 INFO  (TEST-ChaosMonkeyNothingIsSafeTest.test-seed#[32A2BE9420DDAF12]) [    ] o.a.s.c.c.SolrZkClient makePath: /configs/conf1/currency.xml
   [junit4]   2> 1162087 INFO  (TEST-ChaosMonkeyNothingIsSafeTest.test-seed#[32A2BE9420DDAF12]) [    ] o.a.s.c.AbstractZkTestCase put /home/jenkins/workspace/Lucene-Solr-trunk-Linux/solr/core/src/test-files/solr/collection1/conf/enumsConfig.xml to /configs/conf1/enumsConfig.xml
   [junit4]   2> 1162088 INFO  (TEST-ChaosMonkeyNothingIsSafeTest.test-seed#[32A2BE9420DDAF12]) [    ] o.a.s.c.c.SolrZkClient makePath: /configs/conf1/enumsConfig.xml
   [junit4]   2> 1162088 INFO  (TEST-ChaosMonkeyNothingIsSafeTest.test-seed#[32A2BE9420DDAF12]) [    ] o.a.s.c.AbstractZkTestCase put /home/jenkins/workspace/Lucene-Solr-trunk-Linux/solr/core/src/test-files/solr/collection1/conf/open-exchange-rates.json to /configs/conf1/open-exchange-rates.json
   [junit4]   2> 1162088 INFO  (TEST-ChaosMonkeyNothingIsSafeTest.test-seed#[32A2BE9420DDAF12]) [    ] o.a.s.c.c.SolrZkClient makePath: /configs/conf1/open-exchange-rates.json
   [junit4]   2> 1162089 INFO  (TEST-ChaosMonkeyNothingIsSafeTest.test-seed#[32A2BE9420DDAF12]) [    ] o.a.s.c.AbstractZkTestCase put /home/jenkins/workspace/Lucene-Solr-trunk-Linux/solr/core/src/test-files/solr/collection1/conf/mapping-ISOLatin1Accent.txt to /configs/conf1/mapping-ISOLatin1Accent.txt
   [junit4]   2> 1162089 INFO  (TEST-ChaosMonkeyNothingIsSafeTest.test-seed#[32A2BE9420DDAF12]) [    ] o.a.s.c.c.SolrZkClient makePath: /configs/conf1/mapping-ISOLatin1Accent.txt
   [junit4]   2> 1162090 INFO  (TEST-ChaosMonkeyNothingIsSafeTest.test-seed#[32A2BE9420DDAF12]) [    ] o.a.s.c.AbstractZkTestCase put /home/jenkins/workspace/Lucene-Solr-trunk-Linux/solr/core/src/test-files/solr/collection1/conf/old_synonyms.txt to /configs/conf1/old_synonyms.txt
   [junit4]   2> 1162090 INFO  (TEST-ChaosMonkeyNothingIsSafeTest.test-seed#[32A2BE9420DDAF12]) [    ] o.a.s.c.c.SolrZkClient makePath: /configs/conf1/old_synonyms.txt
   [junit4]   2> 1162090 INFO  (TEST-ChaosMonkeyNothingIsSafeTest.test-seed#[32A2BE9420DDAF12]) [    ] o.a.s.c.AbstractZkTestCase put /home/jenkins/workspace/Lucene-Solr-trunk-Linux/solr/core/src/test-files/solr/collection1/conf/synonyms.txt to /configs/conf1/synonyms.txt
   [junit4]   2> 1162090 INFO  (TEST-ChaosMonkeyNothingIsSafeTest.test-seed#[32A2BE9420DDAF12]) [    ] o.a.s.c.c.SolrZkClient makePath: /configs/conf1/synonyms.txt
   [junit4]   2> 1162148 INFO  (TEST-ChaosMonkeyNothingIsSafeTest.test-seed#[32A2BE9420DDAF12]) [    ] o.a.s.SolrTestCaseJ4 Writing core.properties file to /home/jenkins/workspace/Lucene-Solr-trunk-Linux/solr/build/solr-core/test/J0/temp/solr.cloud.ChaosMonkeyNothingIsSafeTest_32A2BE9420DDAF12-001/control-001/cores/collection1
   [junit4]   2> 1162149 INFO  (TEST-ChaosMonkeyNothingIsSafeTest.test-seed#[32A2BE9420DDAF12]) [    ] o.e.j.s.Server jetty-9.3.6.v20151106
   [junit4]   2> 1162150 INFO  (TEST-ChaosMonkeyNothingIsSafeTest.test-seed#[32A2BE9420DDAF12]) [    ] o.e.j.s.h.ContextHandler Started o.e.j.s.ServletContextHandler@1c452d1{/,null,AVAILABLE}
   [junit4]   2> 1162154 INFO  (TEST-ChaosMonkeyNothingIsSafeTest.test-seed#[32A2BE9420DDAF12]) [    ] o.e.j.s.ServerConnector Started ServerConnector@2713f{HTTP/1.1,[http/1.1]}{127.0.0.1:37011}
   [junit4]   2> 1162154 INFO  (TEST-ChaosMonkeyNothingIsSafeTest.test-seed#[32A2BE9420DDAF12]) [    ] o.e.j.s.Server Started @1164025ms
   [junit4]   2> 1162154 INFO  (TEST-ChaosMonkeyNothingIsSafeTest.test-seed#[32A2BE9420DDAF12]) [    ] o.a.s.c.s.e.JettySolrRunner Jetty properties: {solr.data.dir=/home/jenkins/workspace/Lucene-Solr-trunk-Linux/solr/build/solr-core/test/J0/temp/solr.cloud.ChaosMonkeyNothingIsSafeTest_32A2BE9420DDAF12-001/tempDir-001/control/data, hostContext=/, hostPort=37011, coreRootDirectory=/home/jenkins/workspace/Lucene-Solr-trunk-Linux/solr/build/solr-core/test/J0/temp/solr.cloud.ChaosMonkeyNothingIsSafeTest_32A2BE9420DDAF12-001/control-001/cores}
   [junit4]   2> 1162154 INFO  (TEST-ChaosMonkeyNothingIsSafeTest.test-seed#[32A2BE9420DDAF12]) [    ] o.a.s.s.SolrDispatchFilter SolrDispatchFilter.init(): sun.misc.Launcher$AppClassLoader@1521cc1
   [junit4]   2> 1162154 INFO  (TEST-ChaosMonkeyNothingIsSafeTest.test-seed#[32A2BE9420DDAF12]) [    ] o.a.s.c.SolrResourceLoader new SolrResourceLoader for directory: '/home/jenkins/workspace/Lucene-Solr-trunk-Linux/solr/build/solr-core/test/J0/temp/solr.cloud.ChaosMonkeyNothingIsSafeTest_32A2BE9420DDAF12-001/control-001'
   [junit4]   2> 1162154 INFO  (TEST-ChaosMonkeyNothingIsSafeTest.test-seed#[32A2BE9420DDAF12]) [    ] o.a.s.c.SolrResourceLoader JNDI not configured for solr (NoInitialContextEx)
   [junit4]   2> 1162155 INFO  (TEST-ChaosMonkeyNothingIsSafeTest.test-seed#[32A2BE9420DDAF12]) [    ] o.a.s.c.SolrResourceLoader solr home defaulted to 'solr/' (could not find system property or JNDI)
   [junit4]   2> 1162155 INFO  (TEST-ChaosMonkeyNothingIsSafeTest.test-seed#[32A2BE9420DDAF12]) [    ] o.a.s.c.c.SolrZkClient Using default ZkCredentialsProvider
   [junit4]   2> 1162155 INFO  (TEST-ChaosMonkeyNothingIsSafeTest.test-seed#[32A2BE9420DDAF12]) [    ] o.a.s.c.c.ConnectionManager Waiting for client to connect to ZooKeeper
   [junit4]   2> 1162156 INFO  (zkCallback-1110-thread-1) [    ] o.a.s.c.c.ConnectionManager Watcher org.apache.solr.common.cloud.ConnectionManager@1210fcd name:ZooKeeperConnection Watcher:127.0.0.1:40110/solr got event WatchedEvent state:SyncConnected type:None path:null path:null type:None
   [junit4]   2> 1162156 INFO  (TEST-ChaosMonkeyNothingIsSafeTest.test-seed#[32A2BE9420DDAF12]) [    ] o.a.s.c.c.ConnectionManager Client is connected to ZooKeeper
   [junit4]   2> 1162156 INFO  (TEST-ChaosMonkeyNothingIsSafeTest.test-seed#[32A2BE9420DDAF12]) [    ] o.a.s.c.c.SolrZkClient Using default ZkACLProvider
   [junit4]   2> 1162157 INFO  (TEST-ChaosMonkeyNothingIsSafeTest.test-seed#[32A2BE9420DDAF12]) [    ] o.a.s.s.SolrDispatchFilter Loading solr.xml from SolrHome (not found in ZooKeeper)
   [junit4]   2> 1162157 INFO  (TEST-ChaosMonkeyNothingIsSafeTest.test-seed#[32A2BE9420DDAF12]) [    ] o.a.s.c.SolrXmlConfig Loading container configuration from /home/jenkins/workspace/Lucene-Solr-trunk-Linux/solr/build/solr-core/test/J0/temp/solr.cloud.ChaosMonkeyNothingIsSafeTest_32A2BE9420DDAF12-001/control-001/solr.xml
   [junit4]   2> 1162164 INFO  (TEST-ChaosMonkeyNothingIsSafeTest.test-seed#[32A2BE9420DDAF12]) [    ] o.a.s.c.CorePropertiesLocator Config-defined core root directory: /home/jenkins/workspace/Lucene-Solr-trunk-Linux/solr/build/solr-core/test/J0/temp/solr.cloud.ChaosMonkeyNothingIsSafeTest_32A2BE9420DDAF12-001/control-001/cores
   [junit4]   2> 1162164 INFO  (TEST-ChaosMonkeyNothingIsSafeTest.test-seed#[32A2BE9420DDAF12]) [    ] o.a.s.c.CoreContainer New CoreContainer 20699189
   [junit4]   2> 1162164 INFO  (TEST-ChaosMonkeyNothingIsSafeTest.test-seed#[32A2BE9420DDAF12]) [    ] o.a.s.c.CoreContainer Loading cores into CoreContainer [instanceDir=/home/jenkins/workspace/Lucene-Solr-trunk-Linux/solr/build/solr-core/test/J0/temp/solr.cloud.ChaosMonkeyNothingIsSafeTest_32A2BE9420DDAF12-001/control-001]
   [junit4]   2> 1162164 WARN  (TEST-ChaosMonkeyNothingIsSafeTest.test-seed#[32A2BE9420DDAF12]) [    ] o.a.s.c.CoreContainer Couldn't add files from /home/jenkins/workspace/Lucene-Solr-trunk-Linux/solr/build/solr-core/test/J0/temp/solr.cloud.ChaosMonkeyNothingIsSafeTest_32A2BE9420DDAF12-001/control-001/lib to classpath: /home/jenkins/workspace/Lucene-Solr-trunk-Linux/solr/build/solr-core/test/J0/temp/solr.cloud.ChaosMonkeyNothingIsSafeTest_32A2BE9420DDAF12-001/control-001/lib
   [junit4]   2> 1162164 INFO  (TEST-ChaosMonkeyNothingIsSafeTest.test-seed#[32A2BE9420DDAF12]) [    ] o.a.s.h.c.HttpShardHandlerFactory created with socketTimeout : 90000,urlScheme : ,connTimeout : 15000,maxConnectionsPerHost : 20,maxConnections : 10000,corePoolSize : 0,maximumPoolSize : 2147483647,maxThreadIdleTime : 5,sizeOfQueue : -1,fairnessPolicy : false,useRetries : false,
   [junit4]   2> 1162166 INFO  (TEST-ChaosMonkeyNothingIsSafeTest.test-seed#[32A2BE9420DDAF12]) [    ] o.a.s.u.UpdateShardHandler Creating UpdateShardHandler HTTP client with params: socketTimeout=340000&connTimeout=45000&retry=true
   [junit4]   2> 1162166 INFO  (TEST-ChaosMonkeyNothingIsSafeTest.test-seed#[32A2BE9420DDAF12]) [    ] o.a.s.l.LogWatcher SLF4J impl is org.slf4j.impl.Log4jLoggerFactory
   [junit4]   2> 1162166 INFO  (TEST-ChaosMonkeyNothingIsSafeTest.test-seed#[32A2BE9420DDAF12]) [    ] o.a.s.l.LogWatcher Registering Log Listener [Log4j (org.slf4j.impl.Log4jLoggerFactory)]
   [junit4]   2> 1162166 INFO  (TEST-ChaosMonkeyNothingIsSafeTest.test-seed#[32A2BE9420DDAF12]) [    ] o.a.s.c.ZkContainer Zookeeper client=127.0.0.1:40110/solr
   [junit4]   2> 1162167 INFO  (TEST-ChaosMonkeyNothingIsSafeTest.test-seed#[32A2BE9420DDAF12]) [    ] o.a.s.c.ZkController zkHost includes chroot
   [junit4]   2> 1162167 INFO  (TEST-ChaosMonkeyNothingIsSafeTest.test-seed#[32A2BE9420DDAF12]) [    ] o.a.s.c.c.SolrZkClient Using default ZkCredentialsProvider
   [junit4]   2> 1162167 INFO  (TEST-ChaosMonkeyNothingIsSafeTest.test-seed#[32A2BE9420DDAF12]) [    ] o.a.s.c.c.ConnectionManager Waiting for client to connect to ZooKeeper
   [junit4]   2> 1162168 INFO  (zkCallback-1113-thread-1) [    ] o.a.s.c.c.ConnectionManager Watcher org.apache.solr.common.cloud.ConnectionManager@172b461 name:ZooKeeperConnection Watcher:127.0.0.1:40110 got event WatchedEvent state:SyncConnected type:None path:null path:null type:None
   [junit4]   2> 1162168 INFO  (TEST-ChaosMonkeyNothingIsSafeTest.test-seed#[32A2BE9420DDAF12]) [    ] o.a.s.c.c.ConnectionManager Client is connected to ZooKeeper
   [junit4]   2> 1162168 INFO  (TEST-ChaosMonkeyNothingIsSafeTest.test-seed#[32A2BE9420DDAF12]) [    ] o.a.s.c.c.SolrZkClient Using default ZkACLProvider
   [junit4]   2> 1162170 INFO  (TEST-ChaosMonkeyNothingIsSafeTest.test-seed#[32A2BE9420DDAF12]) [    ] o.a.s.c.c.ConnectionManager Waiting for client to connect to ZooKeeper
   [junit4]   2> 1162170 INFO  (zkCallback-1114-thread-1) [    ] o.a.s.c.c.ConnectionManager Watcher org.apache.solr.common.cloud.ConnectionManager@319de2 name:ZooKeeperConnection Watcher:127.0.0.1:40110/solr got event WatchedEvent state:SyncConnected type:None path:null path:null type:None
   [junit4]   2> 1162170 INFO  (TEST-ChaosMonkeyNothingIsSafeTest.test-seed#[32A2BE9420DDAF12]) [    ] o.a.s.c.c.ConnectionManager Client is connected to ZooKeeper
   [junit4]   2> 1162171 INFO  (TEST-ChaosMonkeyNothingIsSafeTest.test-seed#[32A2BE9420DDAF12]) [    ] o.a.s.c.c.SolrZkClient makePath: /overseer/queue
   [junit4]   2> 1162172 INFO  (TEST-ChaosMonkeyNothingIsSafeTest.test-seed#[32A2BE9420DDAF12]) [    ] o.a.s.c.c.SolrZkClient makePath: /overseer/collection-queue-work
   [junit4]   2> 1162173 INFO  (TEST-ChaosMonkeyNothingIsSafeTest.test-seed#[32A2BE9420DDAF12]) [    ] o.a.s.c.c.SolrZkClient makePath: /overseer/collection-map-running
   [junit4]   2> 1162173 INFO  (TEST-ChaosMonkeyNothingIsSafeTest.test-seed#[32A2BE9420DDAF12]) [    ] o.a.s.c.c.SolrZkClient makePath: /overseer/collection-map-completed
   [junit4]   2> 1162174 INFO  (TEST-ChaosMonkeyNothingIsSafeTest.test-seed#[32A2BE9420DDAF12]) [    ] o.a.s.c.c.SolrZkClient makePath: /overseer/collection-map-failure
   [junit4]   2> 1162175 INFO  (TEST-ChaosMonkeyNothingIsSafeTest.test-seed#[32A2BE9420DDAF12]) [    ] o.a.s.c.c.SolrZkClient makePath: /live_nodes
   [junit4]   2> 1162175 INFO  (TEST-ChaosMonkeyNothingIsSafeTest.test-seed#[32A2BE9420DDAF12]) [    ] o.a.s.c.c.SolrZkClient makePath: /aliases.json
   [junit4]   2> 1162176 INFO  (TEST-ChaosMonkeyNothingIsSafeTest.test-seed#[32A2BE9420DDAF12]) [    ] o.a.s.c.c.SolrZkClient makePath: /clusterstate.json
   [junit4]   2> 1162176 INFO  (TEST-ChaosMonkeyNothingIsSafeTest.test-seed#[32A2BE9420DDAF12]) [    ] o.a.s.c.c.SolrZkClient makePath: /security.json
   [junit4]   2> 1162177 INFO  (TEST-ChaosMonkeyNothingIsSafeTest.test-seed#[32A2BE9420DDAF12]) [    ] o.a.s.c.ZkController Register node as live in ZooKeeper:/live_nodes/127.0.0.1:37011_
   [junit4]   2> 1162177 INFO  (TEST-ChaosMonkeyNothingIsSafeTest.test-seed#[32A2BE9420DDAF12]) [    ] o.a.s.c.c.SolrZkClient makePath: /live_nodes/127.0.0.1:37011_
   [junit4]   2> 1162177 INFO  (TEST-ChaosMonkeyNothingIsSafeTest.test-seed#[32A2BE9420DDAF12]) [    ] o.a.s.c.c.SolrZkClient makePath: /overseer_elect
   [junit4]   2> 1162178 INFO  (TEST-ChaosMonkeyNothingIsSafeTest.test-seed#[32A2BE9420DDAF12]) [    ] o.a.s.c.c.SolrZkClient makePath: /overseer_elect/election
   [junit4]   2> 1162178 INFO  (TEST-ChaosMonkeyNothingIsSafeTest.test-seed#[32A2BE9420DDAF12]) [    ] o.a.s.c.Overseer Overseer (id=null) closing
   [junit4]   2> 1162178 INFO  (TEST-ChaosMonkeyNothingIsSafeTest.test-seed#[32A2BE9420DDAF12]) [    ] o.a.s.c.LeaderElector Joined leadership election with path: /overseer_elect/election/95131928156504068-127.0.0.1:37011_-n_0000000000
   [junit4]   2> 1162178 INFO  (TEST-ChaosMonkeyNothingIsSafeTest.test-seed#[32A2BE9420DDAF12]) [    ] o.a.s.c.OverseerElectionContext I am going to be the leader 127.0.0.1:37011_
   [junit4]   2> 1162178 INFO  (TEST-ChaosMonkeyNothingIsSafeTest.test-seed#[32A2BE9420DDAF12]) [    ] o.a.s.c.c.SolrZkClient makePath: /overseer_elect/leader
   [junit4]   2> 1162179 INFO  (TEST-ChaosMonkeyNothingIsSafeTest.test-seed#[32A2BE9420DDAF12]) [    ] o.a.s.c.Overseer Overseer (id=95131928156504068-127.0.0.1:37011_-n_0000000000) starting
   [junit4]   2> 1162179 INFO  (TEST-ChaosMonkeyNothingIsSafeTest.test-seed#[32A2BE9420DDAF12]) [    ] o.a.s.c.c.SolrZkClient makePath: /overseer/queue-work
   [junit4]   2> 1162181 INFO  (TEST-ChaosMonkeyNothingIsSafeTest.test-seed#[32A2BE9420DDAF12]) [    ] o.a.s.c.OverseerAutoReplicaFailoverThread Starting OverseerAutoReplicaFailoverThread autoReplicaFailoverWorkLoopDelay=10000 autoReplicaFailoverWaitAfterExpiration=30000 autoReplicaFailoverBadNodeExpiration=60000
   [junit4]   2> 1162181 INFO  (OverseerCollectionConfigSetProcessor-95131928156504068-127.0.0.1:37011_-n_0000000000) [    ] o.a.s.c.OverseerTaskProcessor Process current queue of overseer operations
   [junit4]   2> 1162182 INFO  (TEST-ChaosMonkeyNothingIsSafeTest.test-seed#[32A2BE9420DDAF12]) [    ] o.a.s.c.c.ZkStateReader Updating cluster state from ZooKeeper... 
   [junit4]   2> 1162182 INFO  (OverseerStateUpdate-95131928156504068-127.0.0.1:37011_-n_0000000000) [    ] o.a.s.c.Overseer Starting to work on the main queue
   [junit4]   2> 1162200 INFO  (TEST-ChaosMonkeyNothingIsSafeTest.test-seed#[32A2BE9420DDAF12]) [    ] o.a.s.c.CoreContainer Security conf doesn't exist. Skipping setup for authorization module.
   [junit4]   2> 1162200 INFO  (TEST-ChaosMonkeyNothingIsSafeTest.test-seed#[32A2BE9420DDAF12]) [    ] o.a.s.c.CoreContainer No authentication plugin used.
   [junit4]   2> 1162201 INFO  (TEST-ChaosMonkeyNothingIsSafeTest.test-seed#[32A2BE9420DDAF12]) [    ] o.a.s.c.CorePropertiesLocator Looking for core definitions underneath /home/jenkins/workspace/Lucene-Solr-trunk-Linux/solr/build/solr-core/test/J0/temp/solr.cloud.ChaosMonkeyNothingIsSafeTest_32A2BE9420DDAF12-001/control-001/cores
   [junit4]   2> 1162201 INFO  (TEST-ChaosMonkeyNothingIsSafeTest.test-seed#[32A2BE9420DDAF12]) [    ] o.a.s.c.CoreDescriptor Created CoreDescriptor: {name=collection1, config=solrconfig.xml, transient=false, schema=schema.xml, loadOnStartup=true, configSetProperties=configsetprops.json, collection=control_collection, coreNodeName=, dataDir=data/, shard=}
   [junit4]   2> 1162201 INFO  (TEST-ChaosMonkeyNothingIsSafeTest.test-seed#[32A2BE9420DDAF12]) [    ] o.a.s.c.CorePropertiesLocator Found core collection1 in /home/jenkins/workspace/Lucene-Solr-trunk-Linux/solr/build/solr-core/test/J0/temp/solr.cloud.ChaosMonkeyNothingIsSafeTest_32A2BE9420DDAF12-001/control-001/cores/collection1
   [junit4]   2> 1162201 INFO  (TEST-ChaosMonkeyNothingIsSafeTest.test-seed#[32A2BE9420DDAF12]) [    ] o.a.s.c.CorePropertiesLocator Found 1 core definitions
   [junit4]   2> 1162202 INFO  (TEST-ChaosMonkeyNothingIsSafeTest.test-seed#[32A2BE9420DDAF12]) [    ] o.a.s.s.SolrDispatchFilter user.dir=/home/jenkins/workspace/Lucene-Solr-trunk-Linux/solr/build/solr-core/test/J0
   [junit4]   2> 1162202 INFO  (TEST-ChaosMonkeyNothingIsSafeTest.test-seed#[32A2BE9420DDAF12]) [    ] o.a.s.s.SolrDispatchFilter SolrDispatchFilter.init() done
   [junit4]   2> 1162202 INFO  (coreLoadExecutor-3639-thread-1) [    ] o.a.s.c.ZkController publishing state=down
   [junit4]   2> 1162202 INFO  (coreLoadExecutor-3639-thread-1) [    ] o.a.s.c.ZkController numShards not found on descriptor - reading it from system property
   [junit4]   2> 1162203 INFO  (OverseerStateUpdate-95131928156504068-127.0.0.1:37011_-n_0000000000) [    ] o.a.s.c.Overseer processMessage: queueSize: 1, message = {
   [junit4]   2>   "core":"collection1",
   [junit4]   2>   "roles":null,
   [junit4]   2>   "base_url":"http://127.0.0.1:37011",
   [junit4]   2>   "node_name":"127.0.0.1:37011_",
   [junit4]   2>   "numShards":"1",
   [junit4]   2>   "state":"down",
   [junit4]   2>   "shard":null,
   [junit4]   2>   "collection":"control_collection",
   [junit4]   2>   "operation":"state"} current state version: 0
   [junit4]   2> 1162203 INFO  (coreLoadExecutor-3639-thread-1) [    ] o.a.s.c.ZkController look for our core node name
   [junit4]   2> 1162203 INFO  (OverseerStateUpdate-95131928156504068-127.0.0.1:37011_-n_0000000000) [    ] o.a.s.c.o.ReplicaMutator Update state numShards=1 message={
   [junit4]   2>   "core":"collection1",
   [junit4]   2>   "roles":null,
   [junit4]   2>   "base_url":"http://127.0.0.1:37011",
   [junit4]   2>   "node_name":"127.0.0.1:37011_",
   [junit4]   2>   "numShards":"1",
   [junit4]   2>   "state":"down",
   [junit4]   2>   "shard":null,
   [junit4]   2>   "collection":"control_collection",
   [junit4]   2>   "operation":"state"}
   [junit4]   2> 1162203 INFO  (OverseerStateUpdate-95131928156504068-127.0.0.1:37011_-n_0000000000) [    ] o.a.s.c.o.ClusterStateMutator building a new cName: control_collection
   [junit4]   2> 1162203 INFO  (OverseerStateUpdate-95131928156504068-127.0.0.1:37011_-n_0000000000) [    ] o.a.s.c.o.ReplicaMutator Assigning new node to shard shard=shard1
   [junit4]   2> 1162204 INFO  (zkCallback-1114-thread-1) [    ] o.a.s.c.c.ZkStateReader A cluster state change: [WatchedEvent state:SyncConnected type:NodeDataChanged path:/clusterstate.json], has occurred - updating... (live nodes size: [1])
   [junit4]   2> 1163203 INFO  (coreLoadExecutor-3639-thread-1) [    ] o.a.s.c.ZkController waiting to find shard id in clusterstate for collection1
   [junit4]   2> 1163203 INFO  (coreLoadExecutor-3639-thread-1) [    ] o.a.s.c.ZkController Check for collection zkNode:control_collection
   [junit4]   2> 1163204 INFO  (coreLoadExecutor-3639-thread-1) [    ] o.a.s.c.ZkController Collection zkNode exists
   [junit4]   2> 1163204 INFO  (coreLoadExecutor-3639-thread-1) [    ] o.a.s.c.c.ZkStateReader Load collection config from: [/collections/control_collection]
   [junit4]   2> 1163204 INFO  (coreLoadExecutor-3639-thread-1) [    ] o.a.s.c.c.ZkStateReader path=[/collections/control_collection] [configName]=[conf1] specified config exists in ZooKeeper
   [junit4]   2> 1163204 INFO  (coreLoadExecutor-3639-thread-1) [    ] o.a.s.c.SolrResourceLoader new SolrResourceLoader for directory: '/home/jenkins/workspace/Lucene-Solr-trunk-Linux/solr/build/solr-core/test/J0/temp/solr.cloud.ChaosMonkeyNothingIsSafeTest_32A2BE9420DDAF12-001/control-001/cores/collection1'
   [junit4]   2> 1163204 INFO  (coreLoadExecutor-3639-thread-1) [    ] o.a.s.c.SolrResourceLoader JNDI not configured for solr (NoInitialContextEx)
   [junit4]   2> 1163204 INFO  (coreLoadExecutor-3639-thread-1) [    ] o.a.s.c.SolrResourceLoader solr home defaulted to 'solr/' (could not find system property or JNDI)
   [junit4]   2> 1163205 INFO  (coreLoadExecutor-3639-thread-1) [    ] o.a.s.c.Config loaded config solrconfig.xml with version 0 
   [junit4]   2> 1163208 INFO  (coreLoadExecutor-3639-thread-1) [    ] o.a.s.c.SolrConfig current version of requestparams : -1
   [junit4]   2> 1163210 INFO  (coreLoadExecutor-3639-thread-1) [    ] o.a.s.c.SolrConfig Using Lucene MatchVersion: 6.0.0
   [junit4]   2> 1163215 INFO  (coreLoadExecutor-3639-thread-1) [    ] o.a.s.c.SolrConfig Loaded SolrConfig: solrconfig.xml
   [junit4]   2> 1163219 INFO  (coreLoadExecutor-3639-thread-1) [    ] o.a.s.s.IndexSchema [collection1] Schema name=test
   [junit4]   2> 1163269 INFO  (coreLoadExecutor-3639-thread-1) [    ] o.a.s.s.IndexSchema default search field in schema is text
   [junit4]   2> 1163269 INFO  (coreLoadExecutor-3639-thread-1) [    ] o.a.s.s.IndexSchema unique key field: id
   [junit4]   2> 1163270 INFO  (coreLoadExecutor-3639-thread-1) [    ] o.a.s.s.FileExchangeRateProvider Reloading exchange rates from file currency.xml
   [junit4]   2> 1163271 INFO  (coreLoadExecutor-3639-thread-1) [    ] o.a.s.s.FileExchangeRateProvider Reloading exchange rates from file currency.xml
   [junit4]   2> 1163277 INFO  (coreLoadExecutor-3639-thread-1) [    ] o.a.s.c.ConfigSetProperties Did not find ConfigSet properties, assuming default properties: Can't find resource 'configsetprops.json' in classpath or '/configs/conf1', cwd=/home/jenkins/workspace/Lucene-Solr-trunk-Linux/solr/build/solr-core/test/J0
   [junit4]   2> 1163277 INFO  (coreLoadExecutor-3639-thread-1) [    ] o.a.s.c.CoreContainer Creating SolrCore 'collection1' using configuration from collection control_collection
   [junit4]   2> 1163277 INFO  (coreLoadExecutor-3639-thread-1) [    ] o.a.s.c.SolrCore solr.StandardDirectoryFactory
   [junit4]   2> 1163277 INFO  (coreLoadExecutor-3639-thread-1) [    ] o.a.s.c.SolrCore [[collection1] ] Opening new SolrCore at [/home/jenkins/workspace/Lucene-Solr-trunk-Linux/solr/build/solr-core/test/J0/temp/solr.cloud.ChaosMonkeyNothingIsSafeTest_32A2BE9420DDAF12-001/control-001/cores/collection1], dataDir=[/home/jenkins/workspace/Lucene-Solr-trunk-Linux/solr/build/solr-core/test/J0/temp/solr.cloud.ChaosMonkeyNothingIsSafeTest_32A2BE9420DDAF12-001/control-001/cores/collection1/data/]
   [junit4]   2> 1163277 INFO  (coreLoadExecutor-3639-thread-1) [    ] o.a.s.c.JmxMonitoredMap JMX monitoring is enabled. Adding Solr mbeans to JMX Server: com.sun.jmx.mbeanserver.JmxMBeanServer@15aee47
   [junit4]   2> 1163278 INFO  (coreLoadExecutor-3639-thread-1) [    ] o.a.s.c.CachingDirectoryFactory return new directory for /home/jenkins/workspace/Lucene-Solr-trunk-Linux/solr/build/solr-core/test/J0/temp/solr.cloud.ChaosMonkeyNothingIsSafeTest_32A2BE9420DDAF12-001/control-001/cores/collection1/data
   [junit4]   2> 1163278 INFO  (coreLoadExecutor-3639-thread-1) [    ] o.a.s.c.SolrCore New index directory detected: old=null new=/home/jenkins/workspace/Lucene-Solr-trunk-Linux/solr/build/solr-core/test/J0/temp/solr.cloud.ChaosMonkeyNothingIsSafeTest_32A2BE9420DDAF12-001/control-001/cores/collection1/data/index/
   [junit4]   2> 1163278 WARN  (coreLoadExecutor-3639-thread-1) [    ] o.a.s.c.SolrCore [collection1] Solr index directory '/home/jenkins/workspace/Lucene-Solr-trunk-Linux/solr/build/solr-core/test/J0/temp/solr.cloud.ChaosMonkeyNothingIsSafeTest_32A2BE9420DDAF12-001/control-001/cores/collection1/data/index' doesn't exist. Creating new index...
   [junit4]   2> 1163278 INFO  (coreLoadExecutor-3639-thread-1) [    ] o.a.s.c.CachingDirectoryFactory return new directory for /home/jenkins/workspace/Lucene-Solr-trunk-Linux/solr/build/solr-core/test/J0/temp/solr.cloud.ChaosMonkeyNothingIsSafeTest_32A2BE9420DDAF12-001/control-001/cores/collection1/data/index
   [junit4]   2> 1163279 INFO  (coreLoadExecutor-3639-thread-1) [    ] o.a.s.u.RandomMergePolicy RandomMergePolicy wrapping class org.apache.lucene.index.LogDocMergePolicy: [LogDocMergePolicy: minMergeSize=1000, mergeFactor=16, maxMergeSize=9223372036854775807, maxMergeSizeForForcedMerge=9223372036854775807, calibrateSizeByDeletes=false, maxMergeDocs=2147483647, maxCFSSegmentSizeMB=8.796093022207999E12, noCFSRatio=0.8863733345841441]
   [junit4]   2> 1164041 INFO  (coreLoadExecutor-3639-thread-1) [    ] o.a.s.c.SolrDeletionPolicy SolrDeletionPolicy.onCommit: commits: num=1
   [junit4]   2> 	commit{dir=/home/jenkins/workspace/Lucene-Solr-trunk-Linux/solr/build/solr-core/test/J0/temp/solr.cloud.ChaosMonkeyNothingIsSafeTest_32A2BE9420DDAF12-001/control-001/cores/collection1/data/index,segFN=segments_1,generation=1}
   [junit4]   2> 1164041 INFO  (coreLoadExecutor-3639-thread-1) [    ] o.a.s.c.SolrDeletionPolicy newest commit generation = 1
   [junit4]   2> 1164041 INFO  (OldIndexDirectoryCleanupThreadForCore-collection1) [    ] o.a.s.c.SolrCore Looking for old index directories to cleanup for core collection1 in /home/jenkins/workspace/Lucene-Solr-trunk-Linux/solr/build/solr-core/test/J0/temp/solr.cloud.ChaosMonkeyNothingIsSafeTest_32A2BE9420DDAF12-001/control-001/cores/collection1/data/
   [junit4]   2> 1164043 INFO  (coreLoadExecutor-3639-thread-1) [    ] o.a.s.u.p.UpdateRequestProcessorChain creating updateRequestProcessorChain "nodistrib"
   [junit4]   2> 1164043 INFO  (coreLoadExecutor-3639-thread-1) [    ] o.a.s.u.p.UpdateRequestProcessorChain creating updateRequestProcessorChain "dedupe"
   [junit4]   2> 1164043 INFO  (coreLoadExecutor-3639-thread-1) [    ] o.a.s.u.p.UpdateRequestProcessorChain inserting DistributedUpdateProcessorFactory into updateRequestProcessorChain "dedupe"
   [junit4]   2> 1164043 INFO  (coreLoadExecutor-3639-thread-1) [    ] o.a.s.u.p.UpdateRequestProcessorChain creating updateRequestProcessorChain "stored_sig"
   [junit4]   2> 1164043 INFO  (coreLoadExecutor-3639-thread-1) [    ] o.a.s.u.p.UpdateRequestProcessorChain inserting DistributedUpdateProcessorFactory into updateRequestProcessorChain "stored_sig"
   [junit4]   2> 1164043 INFO  (coreLoadExecutor-3639-thread-1) [    ] o.a.s.u.p.UpdateRequestProcessorChain creating updateRequestProcessorChain "distrib-dup-test-chain-explicit"
   [junit4]   2> 1164043 INFO  (coreLoadExecutor-3639-thread-1) [    ] o.a.s.u.p.UpdateRequestProcessorChain creating updateRequestProcessorChain "distrib-dup-test-chain-implicit"
   [junit4]   2> 1164043 INFO  (coreLoadExecutor-3639-thread-1) [    ] o.a.s.u.p.UpdateRequestProcessorChain inserting DistributedUpdateProcessorFactory into updateRequestProcessorChain "distrib-dup-test-chain-implicit"
   [junit4]   2> 1164043 INFO  (coreLoadExecutor-3639-thread-1) [    ] o.a.s.c.SolrCore no updateRequestProcessorChain defined as default, creating implicit default
   [junit4]   2> 1164043 WARN  (coreLoadExecutor-3639-thread-1) [    ] o.a.s.c.RequestHandlers INVALID paramSet a in requestHandler {type = requestHandler,name = /dump,class = DumpRequestHandler,args = {defaults={a=A,b=B}}}
   [junit4]   2> 1164044 INFO  (coreLoadExecutor-3639-thread-1) [    ] o.a.s.h.l.XMLLoader xsltCacheLifetimeSeconds=60
   [junit4]   2> 1164045 INFO  (coreLoadExecutor-3639-thread-1) [    ] o.a.s.h.l.XMLLoader xsltCacheLifetimeSeconds=60
   [junit4]   2> 1164045 INFO  (coreLoadExecutor-3639-thread-1) [    ] o.a.s.h.l.XMLLoader xsltCacheLifetimeSeconds=60
   [junit4]   2> 1164046 INFO  (coreLoadExecutor-3639-thread-1) [    ] o.a.s.h.l.XMLLoader xsltCacheLifetimeSeconds=60
   [junit4]   2> 1164047 INFO  (coreLoadExecutor-3639-thread-1) [    ] o.a.s.c.RequestHandlers Registered paths: /admin/mbeans,standard,/dump,/update/csv,/sql,/update/json/docs,/admin/luke,/export,/admin/segments,/get,/admin/system,/replication,/admin/properties,/config,/stream,/schema,/admin/plugins,/admin/logging,/update/json,/admin/threads,/admin/ping,/update,/admin/file
   [junit4]   2> 1164047 INFO  (coreLoadExecutor-3639-thread-1) [    ] o.a.s.c.SolrCore Using default statsCache cache: org.apache.solr.search.stats.LocalStatsCache
   [junit4]   2> 1164048 INFO  (coreLoadExecutor-3639-thread-1) [    ] o.a.s.u.UpdateHandler Using UpdateLog implementation: org.apache.solr.update.UpdateLog
   [junit4]   2> 1164048 INFO  (coreLoadExecutor-3639-thread-1) [    ] o.a.s.u.UpdateLog Initializing UpdateLog: dataDir= defaultSyncLevel=FLUSH numRecordsToKeep=100 maxNumLogsToKeep=10 numVersionBuckets=65536
   [junit4]   2> 1164048 INFO  (coreLoadExecutor-3639-thread-1) [    ] o.a.s.u.CommitTracker Hard AutoCommit: if uncommited for 15000ms; 
   [junit4]   2> 1164048 INFO  (coreLoadExecutor-3639-thread-1) [    ] o.a.s.u.CommitTracker Soft AutoCommit: disabled
   [junit4]   2> 1164048 INFO  (coreLoadExecutor-3639-thread-1) [    ] o.a.s.u.RandomMergePolicy RandomMergePolicy wrapping class org.apache.lucene.index.AlcoholicMergePolicy: [AlcoholicMergePolicy: minMergeSize=0, mergeFactor=10, maxMergeSize=1618476022, maxMergeSizeForForcedMerge=9223372036854775807, calibrateSizeByDeletes=true, maxMergeDocs=2147483647, maxCFSSegmentSizeMB=8.796093022207999E12, noCFSRatio=0.1]
   [junit4]   2> 1164049 INFO  (coreLoadExecutor-3639-thread-1) [    ] o.a.s.c.SolrDeletionPolicy SolrDeletionPolicy.onInit: commits: num=1
   [junit4]   2> 	commit{dir=/home/jenkins/workspace/Lucene-Solr-trunk-Linux/solr/build/solr-core/test/J0/temp/solr.cloud.ChaosMonkeyNothingIsSafeTest_32A2BE9420DDAF12-001/control-001/cores/collection1/data/index,segFN=segments_1,generation=1}
   [junit4]   2> 1164049 INFO  (coreLoadExecutor-3639-thread-1) [    ] o.a.s.c.SolrDeletionPolicy newest commit generation = 1
   [junit4]   2> 1164049 INFO  (coreLoadExecutor-3639-thread-1) [    ] o.a.s.s.SolrIndexSearcher Opening Searcher@3484e2[collection1] main
   [junit4]   2> 1164049 INFO  (coreLoadExecutor-3639-thread-1) [    ] o.a.s.c.c.ZkStateReader Load collection config from: [/collections/control_collection]
   [junit4]   2> 1164049 INFO  (coreLoadExecutor-3639-thread-1) [    ] o.a.s.c.c.ZkStateReader path=[/collections/control_collection] [configName]=[conf1] specified config exists in ZooKeeper
   [junit4]   2> 1164049 INFO  (coreLoadExecutor-3639-thread-1) [    ] o.a.s.r.ManagedResourceStorage Setting up ZooKeeper-based storage for the RestManager with znodeBase: /configs/conf1
   [junit4]   2> 1164049 INFO  (coreLoadExecutor-3639-thread-1) [    ] o.a.s.r.ManagedResourceStorage Configured ZooKeeperStorageIO with znodeBase: /configs/conf1
   [junit4]   2> 1164049 INFO  (coreLoadExecutor-3639-thread-1) [    ] o.a.s.r.RestManager Initializing RestManager with initArgs: {}
   [junit4]   2> 1164049 INFO  (coreLoadExecutor-3639-thread-1) [    ] o.a.s.r.ManagedResourceStorage Reading _rest_managed.json using ZooKeeperStorageIO:path=/configs/conf1
   [junit4]   2> 1164050 INFO  (coreLoadExecutor-3639-thread-1) [    ] o.a.s.r.ManagedResourceStorage No data found for znode /configs/conf1/_rest_managed.json
   [junit4]   2> 1164050 INFO  (coreLoadExecutor-3639-thread-1) [    ] o.a.s.r.ManagedResourceStorage Loaded null at path _rest_managed.json using ZooKeeperStorageIO:path=/configs/conf1
   [junit4]   2> 1164050 INFO  (coreLoadExecutor-3639-thread-1) [    ] o.a.s.r.RestManager Initializing 0 registered ManagedResources
   [junit4]   2> 1164050 INFO  (coreLoadExecutor-3639-thread-1) [    ] o.a.s.h.ReplicationHandler Commits will be reserved for  10000
   [junit4]   2> 1164050 INFO  (searcherExecutor-3640-thread-1) [    ] o.a.s.c.SolrCore [collection1] Registered new searcher Searcher@3484e2[collection1] main{ExitableDirectoryReader(UninvertingDirectoryReader())}
   [junit4]   2> 1164050 INFO  (coreLoadExecutor-3639-thread-1) [    ] o.a.s.u.UpdateLog Looking up max value of version field to seed version buckets
   [junit4]   2> 1164050 INFO  (coreLoadExecutor-3639-thread-1) [    ] o.a.s.u.VersionInfo Refreshing highest value of _version_ for 65536 version buckets from index
   [junit4]   2> 1164050 INFO  (coreLoadExecutor-3639-thread-1) [    ] o.a.s.u.VersionInfo No terms found for _version_, cannot seed version bucket highest value from index
   [junit4]   2> 1164050 INFO  (coreLoadExecutor-3639-thread-1) [    ] o.a.s.u.UpdateLog Could not find max version in index or recent updates, using new clock 1522110852679860224
   [junit4]   2> 1164052 INFO  (coreLoadExecutor-3639-thread-1) [    ] o.a.s.u.UpdateLog Took 1.0ms to seed version buckets with highest version 1522110852679860224
   [junit4]   2> 1164052 INFO  (coreLoadExecutor-3639-thread-1) [    ] o.a.s.c.ZkController watch zkdir /configs/conf1
   [junit4]   2> 1164052 INFO  (coreLoadExecutor-3639-thread-1) [    ] o.a.s.c.CoreContainer registering core: collection1
   [junit4]   2> 1164053 INFO  (coreZkRegister-3633-thread-1) [    ] o.a.s.c.ZkController Register replica - core:collection1 address:http://127.0.0.1:37011 collection:control_collection shard:shard1
   [junit4]   2> 1164053 INFO  (coreZkRegister-3633-thread-1) [    ] o.a.s.c.c.SolrZkClient makePath: /collections/control_collection/leader_elect/shard1/election
   [junit4]   2> 1164054 INFO  (coreZkRegister-3633-thread-1) [    ] o.a.s.c.LeaderElector Joined leadership election with path: /collections/control_collection/leader_elect/shard1/election/95131928156504068-core_node1-n_0000000000
   [junit4]   2> 1164054 INFO  (coreZkRegister-3633-thread-1) [    ] o.a.s.c.ShardLeaderElectionContext Running the leader process for shard=shard1 and weAreReplacement=false and leaderVoteWait=10000
   [junit4]   2> 1164055 INFO  (coreZkRegister-3633-thread-1) [    ] o.a.s.c.ShardLeaderElectionContext Enough replicas found to continue.
   [junit4]   2> 1164055 INFO  (coreZkRegister-3633-thread-1) [    ] o.a.s.c.ShardLeaderElectionContext I may be the new leader - try and sync
   [junit4]   2> 1164055 INFO  (coreZkRegister-3633-thread-1) [    ] o.a.s.c.SyncStrategy Sync replicas to http://127.0.0.1:37011/collection1/
   [junit4]   2> 1164055 INFO  (coreZkRegister-3633-thread-1) [    ] o.a.s.c.SyncStrategy Sync Success - now sync replicas to me
   [junit4]   2> 1164055 INFO  (OverseerStateUpdate-95131928156504068-127.0.0.1:37011_-n_0000000000) [    ] o.a.s.c.Overseer processMessage: queueSize: 1, message = {
   [junit4]   2>   "operation":"leader",
   [junit4]   2>   "shard":"shard1",
   [junit4]   2>   "collection":"control_collection"} current state version: 1
   [junit4]   2> 1164055 INFO  (coreZkRegister-3633-thread-1) [    ] o.a.s.c.SyncStrategy http://127.0.0.1:37011/collection1/ has no replicas
   [junit4]   2> 1164055 INFO  (zkCallback-1114-thread-1) [    ] o.a.s.c.c.ZkStateReader A cluster state change: [WatchedEvent state:SyncConnected type:NodeDataChanged path:/clusterstate.json], has occurred - updating... (live nodes size: [1])
   [junit4]   2> 1164055 INFO  (coreZkRegister-3633-thread-1) [    ] o.a.s.c.c.SolrZkClient makePath: /collections/control_collection/leaders/shard1
   [junit4]   2> 1164056 INFO  (coreZkRegister-3633-thread-1) [    ] o.a.s.c.ShardLeaderElectionContextBase Creating leader registration node
   [junit4]   2> 1164057 INFO  (coreZkRegister-3633-thread-1) [    ] o.a.s.c.ShardLeaderElectionContext I am the new leader: http://127.0.0.1:37011/collection1/ shard1
   [junit4]   2> 1164057 INFO  (OverseerStateUpdate-95131928156504068-127.0.0.1:37011_-n_0000000000) [    ] o.a.s.c.Overseer processMessage: queueSize: 1, message = {
   [junit4]   2>   "operation":"leader",
   [junit4]   2>   "shard":"shard1",
   [junit4]   2>   "collection":"control_collection",
   [junit4]   2>   "base_url":"http://127.0.0.1:37011",
   [junit4]   2>   "core":"collection1",
   [junit4]   2>   "state":"active"} current state version: 2
   [junit4]   2> 1164158 INFO  (zkCallback-1114-thread-1) [    ] o.a.s.c.c.ZkStateReader A cluster state change: [WatchedEvent state:SyncConnected type:NodeDataChanged path:/clusterstate.json], has occurred - updating... (live nodes size: [1])
   [junit4]   2> 1164203 INFO  (TEST-ChaosMonkeyNothingIsSafeTest.test-seed#[32A2BE9420DDAF12]) [    ] o.a.s.c.c.SolrZkClient Using default ZkCredentialsProvider
   [junit4]   2> 1164203 INFO  (TEST-ChaosMonkeyNothingIsSafeTest.test-seed#[32A2BE9420DDAF12]) [    ] o.a.s.c.c.ConnectionManager Waiting for client to connect to ZooKeeper
   [junit4]   2> 1164204 INFO  (zkCallback-1116-thread-1) [    ] o.a.s.c.c.ConnectionManager Watcher org.apache.solr.common.cloud.ConnectionManager@4a1be name:ZooKeeperConnection Watcher:127.0.0.1:40110/solr got event WatchedEvent state:SyncConnected type:None path:null path:null type:None
   [junit4]   2> 1164204 INFO  (TEST-ChaosMonkeyNothingIsSafeTest.test-seed#[32A2BE9420DDAF12]) [    ] o.a.s.c.c.ConnectionManager Client is connected to ZooKeeper
   [junit4]   2> 1164204 INFO  (TEST-ChaosMonkeyNothingIsSafeTest.test-seed#[32A2BE9420DDAF12]) [    ] o.a.s.c.c.SolrZkClient Using default ZkACLProvider
   [junit4]   2> 1164204 INFO  (TEST-ChaosMonkeyNothingIsSafeTest.test-seed#[32A2BE9420DDAF12]) [    ] o.a.s.c.c.ZkStateReader Updating cluster state from ZooKeeper... 
   [junit4]   2> 1164205 INFO  (TEST-ChaosMonkeyNothingIsSafeTest.test-seed#[32A2BE9420DDAF12]) [    ] o.a.s.c.ChaosMonkey monkey: init - expire sessions:false cause connection loss:false
   [junit4]   2> 1164205 INFO  (TEST-ChaosMonkeyNothingIsSafeTest.test-seed#[32A2BE9420DDAF12]) [    ] o.a.s.c.AbstractFullDistribZkTestBase Creating collection1 with stateFormat=2
   [junit4]   2> 1164205 INFO  (TEST-ChaosMonkeyNothingIsSafeTest.test-seed#[32A2BE9420DDAF12]) [    ] o.a.s.c.c.SolrZkClient Using default ZkCredentialsProvider
   [junit4]   2> 1164206 INFO  (TEST-ChaosMonkeyNothingIsSafeTest.test-seed#[32A2BE9420DDAF12]) [    ] o.a.s.c.c.ConnectionManager Waiting for client to connect to ZooKeeper
   [junit4]   2> 1164206 INFO  (zkCallback-1117-thread-1) [    ] o.a.s.c.c.ConnectionManager Watcher org.apache.solr.common.cloud.ConnectionManager@11b7fb3 name:ZooKeeperConnection Watcher:127.0.0.1:40110/solr got event WatchedEvent state:SyncConnected type:None path:null path:null type:None
   [junit4]   2> 1164206 INFO  (TEST-ChaosMonkeyNothingIsSafeTest.test-seed#[32A2BE9420DDAF12]) [    ] o.a.s.c.c.ConnectionManager Client is connected to ZooKeeper
   [junit4]   2> 1164206 INFO  (TEST-ChaosMonkeyNothingIsSafeTest.test-seed#[32A2BE9420DDAF12]) [    ] o.a.s.c.c.SolrZkClient Using default ZkACLProvider
   [junit4]   2> 1164207 INFO  (OverseerStateUpdate-95131928156504068-127.0.0.1:37011_-n_0000000000) [    ] o.a.s.c.Overseer processMessage: queueSize: 1, message = {
   [junit4]   2>   "operation":"create",
   [junit4]   2>   "name":"collection1",
   [junit4]   2>   "numShards":"2",
   [junit4]   2>   "stateFormat":"2"} current state version: 3
   [junit4]   2> 1164207 INFO  (OverseerStateUpdate-95131928156504068-127.0.0.1:37011_-n_0000000000) [    ] o.a.s.c.o.ClusterStateMutator building a new cName: collection1
   [junit4]   2> 1164208 INFO  (coreZkRegister-3633-thread-1) [    ] o.a.s.c.ZkController We are http://127.0.0.1:37011/collection1/ and leader is http://127.0.0.1:37011/collection1/
   [junit4]   2> 1164208 INFO  (coreZkRegister-3633-thread-1) [    ] o.a.s.c.ZkController No LogReplay needed for core=collection1 baseURL=http://127.0.0.1:37011
   [junit4]   2> 1164208 INFO  (coreZkRegister-3633-thread-1) [    ] o.a.s.c.ZkController I am the leader, no recovery necessary
   [junit4]   2> 1164208 INFO  (coreZkRegister-3633-thread-1) [    ] o.a.s.c.ZkController publishing state=active
   [junit4]   2> 1164208 INFO  (coreZkRegister-3633-thread-1) [    ] o.a.s.c.ZkController numShards not found on descriptor - reading it from system property
   [junit4]   2> 1164208 INFO  (OverseerStateUpdate-95131928156504068-127.0.0.1:37011_-n_0000000000) [    ] o.a.s.c.Overseer processMessage: queueSize: 1, message = {
   [junit4]   2>   "core":"collection1",
   [junit4]   2>   "core_node_name":"core_node1",
   [junit4]   2>   "roles":null,
   [junit4]   2>   "base_url":"http://127.0.0.1:37011",
   [junit4]   2>   "node_name":"127.0.0.1:37011_",
   [junit4]   2>   "numShards":"2",
   [junit4]   2>   "state":"active",
   [junit4]   2>   "shard":"shard1",
   [junit4]   2>   "collection":"control_collection",
   [junit4]   2>   "operation":"state"} current state version: 3
   [junit4]   2> 1164208 INFO  (OverseerStateUpdate-95131928156504068-127.0.0.1:37011_-n_0000000000) [    ] o.a.s.c.o.ReplicaMutator Update state numShards=2 message={
   [junit4]   2>   "core":"collection1",
   [junit4]   2>   "core_node_name":"core_node1",
   [junit4]   2>   "roles":null,
   [junit4]   2>   "base_url":"http://127.0.0.1:37011",
   [junit4]   2>   "node_name":"127.0.0.1:37011_",
   [junit4]   2>   "numShards":"2",
   [junit4]   2>   "state":"active",
   [junit4]   2>   "shard":"shard1",
   [junit4]   2>   "collection":"control_collection",
   [junit4]   2>   "operation":"state"}
   [junit4]   2> 1164209 INFO  (OverseerStateUpdate-95131928156504068-127.0.0.1:37011_-n_0000000000) [    ] o.a.s.c.o.ZkStateWriter going to create_collection /collections/collection1/state.json
   [junit4]   2> 1164262 INFO  (TEST-ChaosMonkeyNothingIsSafeTest.test-seed#[32A2BE9420DDAF12]) [    ] o.a.s.SolrTestCaseJ4 Writing core.properties file to /home/jenkins/workspace/Lucene-Solr-trunk-Linux/solr/build/solr-core/test/J0/temp/solr.cloud.ChaosMonkeyNothingIsSafeTest_32A2BE9420DDAF12-001/shard-1-001/cores/collection1
   [junit4]   2> 1164262 INFO  (TEST-ChaosMonkeyNothingIsSafeTest.test-seed#[32A2BE9420DDAF12]) [    ] o.a.s.c.AbstractFullDistribZkTestBase create jetty 1 in directory /home/jenkins/workspace/Lucene-Solr-trunk-Linux/solr/build/solr-core/test/J0/temp/solr.cloud.ChaosMonkeyNothingIsSafeTest_32A2BE9420DDAF12-001/shard-1-001
   [junit4]   2> 1164262 INFO  (TEST-ChaosMonkeyNothingIsSafeTest.test-seed#[32A2BE9420DDAF12]) [    ] o.e.j.s.Server jetty-9.3.6.v20151106
   [junit4]   2> 1164263 INFO  (TEST-ChaosMonkeyNothingIsSafeTest.test-seed#[32A2BE9420DDAF12]) [    ] o.e.j.s.h.ContextHandler Started o.e.j.s.ServletContextHandler@1622a35{/,null,AVAILABLE}
   [junit4]   2> 1164263 INFO  (TEST-ChaosMonkeyNothingIsSafeTest.test-seed#[32A2BE9420DDAF12]) [    ] o.e.j.s.ServerConnector Started ServerConnector@631605{HTTP/1.1,[http/1.1]}{127.0.0.1:34875}
   [junit4]   2> 1164264 INFO  (TEST-ChaosMonkeyNothingIsSafeTest.test-seed#[32A2BE9420DDAF12]) [    ] o.e.j.s.Server Started @1166135ms
   [junit4]   2> 1164264 INFO  (TEST-ChaosMonkeyNothingIsSafeTest.test-seed#[32A2BE9420DDAF12]) [    ] o.a.s.c.s.e.JettySolrRunner Jetty properties: {solr.data.dir=/home/jenkins/workspace/Lucene-Solr-trunk-Linux/solr/build/solr-core/test/J0/temp/solr.cloud.ChaosMonkeyNothingIsSafeTest_32A2BE9420DDAF12-001/tempDir-001/jetty1, solrconfig=solrconfig.xml, hostContext=/, hostPort=34875, coreRootDirectory=/home/jenkins/workspace/Lucene-Solr-trunk-Linux/solr/build/solr-core/test/J0/../../../../../../../../../home/jenkins/workspace/Lucene-Solr-trunk-Linux/solr/build/solr-core/test/J0/temp/solr.cloud.ChaosMonkeyNothingIsSafeTest_32A2BE9420DDAF12-001/shard-1-001/cores}
   [junit4]   2> 1164264 INFO  (TEST-ChaosMonkeyNothingIsSafeTest.test-seed#[32A2BE9420DDAF12]) [    ] o.a.s.s.SolrDispatchFilter SolrDispatchFilter.init(): sun.misc.Launcher$AppClassLoader@1521cc1
   [junit4]   2> 1164264 INFO  (TEST-ChaosMonkeyNothingIsSafeTest.test-seed#[32A2BE9420DDAF12]) [    ] o.a.s.c.SolrResourceLoader new SolrResourceLoader for directory: '/home/jenkins/workspace/Lucene-Solr-trunk-Linux/solr/build/solr-core/test/J0/temp/solr.cloud.ChaosMonkeyNothingIsSafeTest_32A2BE9420DDAF12-001/shard-1-001'
   [junit4]   2> 1164264 INFO  (TEST-ChaosMonkeyNothingIsSafeTest.test-seed#[32A2BE9420DDAF12]) [    ] o.a.s.c.SolrResourceLoader JNDI not configured for solr (NoInitialContextEx)
   [junit4]   2> 1164264 INFO  (TEST-ChaosMonkeyNothingIsSafeTest.test-seed#[32A2BE9420DDAF12]) [    ] o.a.s.c.SolrResourceLoader solr home defaulted to 'solr/' (could not find system property or JNDI)
   [junit4]   2> 1164264 INFO  (TEST-ChaosMonkeyNothingIsSafeTest.test-seed#[32A2BE9420DDAF12]) [    ] o.a.s.c.c.SolrZkClient Using default ZkCredentialsProvider
   [junit4]   2> 1164264 INFO  (TEST-ChaosMonkeyNothingIsSafeTest.test-seed#[32A2BE9420DDAF12]) [    ] o.a.s.c.c.ConnectionManager Waiting for client to connect to ZooKeeper
   [junit4]   2> 1164265 INFO  (zkCallback-1118-thread-1) [    ] o.a.s.c.c.ConnectionManager Watcher org.apache.solr.common.cloud.ConnectionManager@ae027d name:ZooKeeperConnection Watcher:127.0.0.1:40110/solr got event WatchedEvent state:SyncConnected type:None path:null path:null type:None
   [junit4]   2> 1164265 INFO  (TEST-ChaosMonkeyNothingIsSafeTest.test-seed#[32A2BE9420DDAF12]) [    ] o.a.s.c.c.ConnectionManager Client is connected to ZooKeeper
   [junit4]   2> 1164265 INFO  (TEST-ChaosMonkeyNothingIsSafeTest.test-seed#[32A2BE9420DDAF12]) [    ] o.a.s.c.c.SolrZkClient Using default ZkACLProvider
   [junit4]   2> 1164266 INFO  (TEST-ChaosMonkeyNothingIsSafeTest.test-seed#[32A2BE9420DDAF12]) [    ] o.a.s.s.SolrDispatchFilter Loading solr.xml from SolrHome (not found in ZooKeeper)
   [junit4]   2> 1164266 INFO  (TEST-ChaosMonkeyNothingIsSafeTest.test-seed#[32A2BE9420DDAF12]) [    ] o.a.s.c.SolrXmlConfig Loading container configuration from /home/jenkins/workspace/Lucene-Solr-trunk-Linux/solr/build/solr-core/test/J0/temp/solr.cloud.ChaosMonkeyNothingIsSafeTest_32A2BE9420DDAF12-001/shard-1-001/solr.xml
   [junit4]   2> 1164269 INFO  (TEST-ChaosMonkeyNothingIsSafeTest.test-seed#[32A2BE9420DDAF12]) [    ] o.a.s.c.CorePropertiesLocator Config-defined core root directory: /home/jenkins/workspace/Lucene-Solr-trunk-Linux/solr/build/solr-core/test/J0/../../../../../../../../../home/jenkins/workspace/Lucene-Solr-trunk-Linux/solr/build/solr-core/test/J0/temp/solr.cloud.ChaosMonkeyNothingIsSafeTest_32A2BE9420DDAF12-001/shard-1-001/cores
   [junit4]   2> 1164269 INFO  (TEST-ChaosMonkeyNothingIsSafeTest.test-seed#[32A2BE9420DDAF12]) [    ] o.a.s.c.CoreContainer New CoreContainer 20134520
   [junit4]   2> 1164269 INFO  (TEST-ChaosMonkeyNothingIsSafeTest.test-seed#[32A2BE9420DDAF12]) [    ] o.a.s.c.CoreContainer Loading cores into CoreContainer [instanceDir=/home/jenkins/workspace/Lucene-Solr-trunk-Linux/solr/build/solr-core/test/J0/temp/solr.cloud.ChaosMonkeyNothingIsSafeTest_32A2BE9420DDAF12-001/shard-1-001]
   [junit4]   2> 1164269 WARN  (TEST-ChaosMonkeyNothingIsSafeTest.test-seed#[32A2BE9420DDAF12]) [    ] o.a.s.c.CoreContainer Couldn't add files from /home/jenkins/workspace/Lucene-Solr-trunk-Linux/solr/build/solr-core/test/J0/temp/solr.cloud.ChaosMonkeyNothingIsSafeTest_32A2BE9420DDAF12-001/shard-1-001/lib to classpath: /home/jenkins/workspace/Lucene-Solr-trunk-Linux/solr/build/solr-core/test/J0/temp/solr.cloud.ChaosMonkeyNothingIsSafeTest_32A2BE9420DDAF12-001/shard-1-001/lib
   [junit4]   2> 1164269 INFO  (TEST-ChaosMonkeyNothingIsSafeTest.test-seed#[32A2BE9420DDAF12]) [    ] o.a.s.h.c.HttpShardHandlerFactory created with socketTimeout : 90000,urlScheme : ,connTimeout : 15000,maxConnectionsPerHost : 20,maxConnections : 10000,corePoolSize : 0,maximumPoolSize : 2147483647,maxThreadIdleTime : 5,sizeOfQueue : -1,fairnessPolicy : false,useRetries : false,
   [junit4]   2> 1164270 INFO  (TEST-ChaosMonkeyNothingIsSafeTest.test-seed#[32A2BE9420DDAF12]) [    ] o.a.s.u.UpdateShardHandler Creating UpdateShardHandler HTTP client with params: socketTimeout=340000&connTimeout=45000&retry=true
   [junit4]   2> 1164270 INFO  (TEST-ChaosMonkeyNothingIsSafeTest.test-seed#[32A2BE9420DDAF12]) [    ] o.a.s.l.LogWatcher SLF4J impl is org.slf4j.impl.Log4jLoggerFactory
   [junit4]   2> 1164270 INFO  (TEST-ChaosMonkeyNothingIsSafeTest.test-seed#[32A2BE9420DDAF12]) [    ] o.a.s.l.LogWatcher Registering Log Listener [Log4j (org.slf4j.impl.Log4jLoggerFactory)]
   [junit4]   2> 1164270 INFO  (TEST-ChaosMonkeyNothingIsSafeTest.test-seed#[32A2BE9420DDAF12]) [    ] o.a.s.c.ZkContainer Zookeeper client=127.0.0.1:40110/solr
   [junit4]   2> 1164270 INFO  (TEST-ChaosMonkeyNothingIsSafeTest.test-seed#[32A2BE9420DDAF12]) [    ] o.a.s.c.ZkController zkHost includes chroot
   [junit4]   2> 1164270 INFO  (TEST-ChaosMonkeyNothingIsSafeTest.test-seed#[32A2BE9420DDAF12]) [    ] o.a.s.c.c.SolrZkClient Using default ZkCredentialsProvider
   [junit4]   2> 1164271 INFO  (TEST-ChaosMonkeyNothingIsSafeTest.test-seed#[32A2BE9420DDAF12]) [    ] o.a.s.c.c.ConnectionManager Waiting for client to connect to ZooKeeper
   [junit4]   2> 1164271 INFO  (zkCallback-1121-thread-1) [    ] o.a.s.c.c.ConnectionManager Watcher org.apache.solr.common.cloud.ConnectionManager@a0d0d0 name:ZooKeeperConnection Watcher:127.0.0.1:40110 got event WatchedEvent state:SyncConnected type:None path:null path:null type:None
   [junit4]   2> 1164271 INFO  (TEST-ChaosMonkeyNothingIsSafeTest.test-seed#[32A2BE9420DDAF12]) [    ] o.a.s.c.c.ConnectionManager Client is connected to ZooKeeper
   [junit4]   2> 1164272 INFO  (TEST-ChaosMonkeyNothingIsSafeTest.test-seed#[32A2BE9420DDAF12]) [    ] o.a.s.c.c.SolrZkClient Using default ZkACLProvider
   [junit4]   2> 1164272 INFO  (TEST-ChaosMonkeyNothingIsSafeTest.test-seed#[32A2BE9420DDAF12]) [    ] o.a.s.c.c.ConnectionManager Waiting for client to connect to ZooKeeper
   [junit4]   2> 1164273 INFO  (zkCallback-1122-thread-1) [    ] o.a.s.c.c.ConnectionManager Watcher org.apache.solr.common.cloud.ConnectionManager@1b97ff3 name:ZooKeeperConnection Watcher:127.0.0.1:40110/solr got event WatchedEvent state:SyncConnected type:None path:null path:null type:None
   [junit4]   2> 1164273 INFO  (TEST-ChaosMonkeyNothingIsSafeTest.test-seed#[32A2BE9420DDAF12]) [    ] o.a.s.c.c.ConnectionManager Client is connected to ZooKeeper
   [junit4]   2> 1164275 INFO  (TEST-ChaosMonkeyNothingIsSafeTest.test-seed#[32A2BE9420DDAF12]) [    ] o.a.s.c.c.ZkStateReader Updating cluster state from ZooKeeper... 
   [junit4]   2> 1164310 INFO  (zkCallback-1114-thread-1) [    ] o.a.s.c.c.ZkStateReader A cluster state change: [WatchedEvent state:SyncConnected type:NodeDataChanged path:/clusterstate.json], has occurred - updating... (live nodes size: [1])
   [junit4]   2> 1164310 INFO  (zkCallback-1116-thread-1) [    ] o.a.s.c.c.ZkStateReader A cluster state change: [WatchedEvent state:SyncConnected type:NodeDataChanged path:/clusterstate.json], has occurred - updating... (live nodes size: [1])
   [junit4]   2> 1164310 INFO  (zkCallback-1122-thread-1) [    ] o.a.s.c.c.ZkStateReader A cluster state change: [WatchedEvent state:SyncConnected type:NodeDataChanged path:/clusterstate.json], has occurred - updating... (live nodes size: [1])
   [junit4]   2> 1165276 INFO  (TEST-ChaosMonkeyNothingIsSafeTest.test-seed#[32A2BE9420DDAF12]) [    ] o.a.s.c.ZkController Register node as live in ZooKeeper:/live_nodes/127.0.0.1:34875_
   [junit4]   2> 1165277 INFO  (TEST-ChaosMonkeyNothingIsSafeTest.test-seed#[32A2BE9420DDAF12]) [    ] o.a.s.c.c.SolrZkClient makePath: /live_nodes/127.0.0.1:34875_
   [junit4]   2> 1165277 INFO  (zkCallback-1116-thread-1) [    ] o.a.s.c.c.ZkStateReader A live node change: [WatchedEvent state:SyncConnected type:NodeChildrenChanged path:/live_nodes], has occurred - updating... (live nodes size: [1])
   [junit4]   2> 1165277 INFO  (zkCallback-1122-thread-1) [    ] o.a.s.c.c.ZkStateReader A live node change: [WatchedEvent state:SyncConnected type:NodeChildrenChanged path:/live_nodes], has occurred - updating... (live nodes size: [1])
   [junit4]   2> 1165277 INFO  (zkCallback-1114-thread-1) [    ] o.a.s.c.c.ZkStateReader A live node change: [WatchedEvent state:SyncConnected type:NodeChildrenChanged path:/live_nodes], has occurred - updating... (live nodes size: [1])
   [junit4]   2> 1165278 INFO  (TEST-ChaosMonkeyNothingIsSafeTest.test-seed#[32A2BE9420DDAF12]) [    ] o.a.s.c.Overseer Overseer (id=null) closing
   [junit4]   2> 1165278 INFO  (TEST-ChaosMonkeyNothingIsSafeTest.test-seed#[32A2BE9420DDAF12]) [    ] o.a.s.c.LeaderElector Joined leadership election with path: /overseer_elect/election/95131928156504073-127.0.0.1:34875_-n_0000000001
   [junit4]   2> 1165278 INFO  (TEST-ChaosMonkeyNothingIsSafeTest.test-seed#[32A2BE9420DDAF12]) [    ] o.a.s.c.LeaderElector Watching path /overseer_elect/election/95131928156504068-127.0.0.1:37011_-n_0000000000 to know if I could be the leader
   [junit4]   2> 1165288 INFO  (TEST-ChaosMonkeyNothingIsSafeTest.test-seed#[32A2BE9420DDAF12]) [    ] o.a.s.c.CoreContainer Security conf doesn't exist. Skipping setup for authorization module.
   [junit4]   2> 1165288 INFO  (TEST-ChaosMonkeyNothingIsSafeTest.test-seed#[32A2BE9420DDAF12]) [    ] o.a.s.c.CoreContainer No authentication plugin used.
   [junit4]   2> 1165288 INFO  (TEST-ChaosMonkeyNothingIsSafeTest.test-seed#[32A2BE9420DDAF12]) [    ] o.a.s.c.CorePropertiesLocator Looking for core definitions underneath /home/jenkins/workspace/Lucene-Solr-trunk-Linux/solr/build/solr-core/test/J0/../../../../../../../../../home/jenkins/workspace/Lucene-Solr-trunk-Linux/solr/build/solr-core/test/J0/temp/solr.cloud.ChaosMonkeyNothingIsSafeTest_32A2BE9420DDAF12-001/shard-1-001/cores
   [junit4]   2> 1165289 INFO  (TEST-ChaosMonkeyNothingIsSafeTest.test-seed#[32A2BE9420DDAF12]) [    ] o.a.s.c.CoreDescriptor Created CoreDescriptor: {name=collection1, config=solrconfig.xml, transient=false, schema=schema.xml, loadOnStartup=true, configSetProperties=configsetprops.json, collection=collection1, coreNodeName=, dataDir=data/, shard=}
   [junit4]   2> 1165289 INFO  (TEST-ChaosMonkeyNothingIsSafeTest.test-seed#[32A2BE9420DDAF12]) [    ] o.a.s.c.CorePropertiesLocator Found core collection1 in /home/jenkins/workspace/Lucene-Solr-trunk-Linux/solr/build/solr-core/test/J0/../../../../../../../../../home/jenkins/workspace/Lucene-Solr-trunk-Linux/solr/build/solr-core/test/J0/temp/solr.cloud.ChaosMonkeyNothingIsSafeTest_32A2BE9420DDAF12-001/shard-1-001/cores/collection1
   [junit4]   2> 1165289 INFO  (TEST-ChaosMonkeyNothingIsSafeTest.test-seed#[32A2BE9420DDAF12]) [    ] o.a.s.c.CorePropertiesLocator Found 1 core definitions
   [junit4]   2> 1165290 INFO  (TEST-ChaosMonkeyNothingIsSafeTest.test-seed#[32A2BE9420DDAF12]) [    ] o.a.s.s.SolrDispatchFilter user.dir=/home/jenkins/workspace/Lucene-Solr-trunk-Linux/solr/build/solr-core/test/J0
   [junit4]   2> 1165290 INFO  (TEST-ChaosMonkeyNothingIsSafeTest.test-seed#[32A2BE9420DDAF12]) [    ] o.a.s.s.SolrDispatchFilter SolrDispatchFilter.init() done
   [junit4]   2> 1165290 INFO  (coreLoadExecutor-3650-thread-1) [    ] o.a.s.c.ZkController publishing state=down
   [junit4]   2> 1165290 INFO  (coreLoadExecutor-3650-thread-1) [    ] o.a.s.c.ZkController numShards not found on descriptor - reading it from system property
   [junit4]   2> 1165290 INFO  (coreLoadExecutor-3650-thread-1) [    ] o.a.s.c.ZkController Registering watch for collection collection1
   [junit4]   2> 1165290 INFO  (coreLoadExecutor-3650-thread-1) [    ] o.a.s.c.c.ZkStateReader addZkWatch [collection1]
   [junit4]   2> 1165290 INFO  (OverseerStateUpdate-95131928156504068-127.0.0.1:37011_-n_0000000000) [    ] o.a.s.c.Overseer processMessage: queueSize: 1, message = {
   [junit4]   2>   "core":"collection1",
   [junit4]   2>   "roles":null,
   [junit4]   2>   "base_url":"http://127.0.0.1:34875",
   [junit4]   2>   "node_name":"127.0.0.1:34875_",
   [junit4]   2>   "numShards":"2",
   [junit4]   2>   "state":"down",
   [junit4]   2>   "shard":null,
   [junit4]   2>   "collection":"collection1",
   [junit4]   2>   "operation":"state"} current state version: 4
   [junit4]   2> 1165290 INFO  (coreLoadExecutor-3650-thread-1) [    ] o.a.s.c.c.ZkStateReader Add data for [collection1] ver [0]
   [junit4]   2> 1165291 INFO  (coreLoadExecutor-3650-thread-1) [    ] o.a.s.c.ZkController look for our core node name
   [junit4]   2> 1165291 INFO  (OverseerStateUpdate-95131928156504068-127.0.0.1:37011_-n_0000000000) [    ] o.a.s.c.o.ReplicaMutator Update state numShards=2 message={
   [junit4]   2>   "core":"collection1",
   [junit4]   2>   "roles":null,
   [junit4]   2>   "base_url":"http://127.0.0.1:34875",
   [junit4]   2>   "node_name":"127.0.0.1:34875_",
   [junit4]   2>   "numShards":"2",
   [junit4]   2>   "state":"down",
   [junit4]   2>   "shard":null,
   [junit4]   2>   "collection":"collection1",
   [junit4]   2>   "operation":"state"}
   [junit4]   2> 1165291 INFO  (OverseerStateUpdate-95131928156504068-127.0.0.1:37011_-n_0000000000) [    ] o.a.s.c.o.ReplicaMutator Collection already exists with numShards=2
   [junit4]   2> 1165291 INFO  (OverseerStateUpdate-95131928156504068-127.0.0.1:37011_-n_0000000000) [    ] o.a.s.c.o.ReplicaMutator Assigning new node to shard shard=shard2
   [junit4]   2> 1165392 INFO  (OverseerStateUpdate-95131928156504068-127.0.0.1:37011_-n_0000000000) [    ] o.a.s.c.o.ZkStateWriter going to update_collection /collections/collection1/state.json version: 0
   [junit4]   2> 1165392 INFO  (zkCallback-1122-thread-1) [    ] o.a.s.c.c.ZkStateReader A cluster state change: [WatchedEvent state:SyncConnected type:NodeDataChanged path:/collections/collection1/state.json] for collection [collection1] has occurred - updating... (live nodes size: [2])
   [junit4]   2> 1165392 INFO  (zkCallback-1122-thread-1) [    ] o.a.s.c.c.ZkStateReader Updating data for [collection1] from [0] to [1]
   [junit4]   2> 1166291 INFO  (coreLoadExecutor-3650-thread-1) [    ] o.a.s.c.ZkController waiting to find shard id in clusterstate for collection1
   [junit4]   2> 1166291 INFO  (coreLoadExecutor-3650-thread-1) [    ] o.a.s.c.ZkController Check for collection zkNode:collection1
   [junit4]   2> 1166291 INFO  (coreLoadExecutor-3650-thread-1) [    ] o.a.s.c.ZkController Collection zkNode exists
   [junit4]   2> 1166291 INFO  (coreLoadExecutor-3650-thread-1) [    ] o.a.s.c.c.ZkStateReader Load collection config from: [/collections/collection1]
   [junit4]   2> 1166291 INFO  (coreLoadExecutor-3650-thread-1) [    ] o.a.s.c.c.ZkStateReader path=[/collections/collection1] [configName]=[conf1] specified config exists in ZooKeeper
   [junit4]   2> 1166291 INFO  (coreLoadExecutor-3650-thread-1) [    ] o.a.s.c.SolrResourceLoader new SolrResourceLoader for directory: '/home/jenkins/workspace/Lucene-Solr-trunk-Linux/solr/build/solr-core/test/J0/temp/solr.cloud.ChaosMonkeyNothingIsSafeTest_32A2BE9420DDAF12-001/shard-1-001/cores/collection1'
   [junit4]   2> 1166291 INFO  (coreLoadExecutor-3650-thread-1) [    ] o.a.s.c.SolrResourceLoader JNDI not configured for solr (NoInitialContextEx)
   [junit4]   2> 1166291 INFO  (coreLoadExecutor-3650-thread-1) [    ] o.a.s.c.SolrResourceLoader solr home defaulted to 'solr/' (could not find system property or JNDI)
   [junit4]   2> 1166292 INFO  (coreLoadExecutor-3650-thread-1) [    ] o.a.s.c.Config loaded config solrconfig.xml with version 0 
   [junit4]   2> 1166295 INFO  (coreLoadExecutor-3650-thread-1) [    ] o.a.s.c.SolrConfig current version of requestparams : -1
   [junit4]   2> 1166298 INFO  (coreLoadExecutor-3650-thread-1) [    ] o.a.s.c.SolrConfig Using Lucene MatchVersion: 6.0.0
   [junit4]   2> 1166308 INFO  (coreLoadExecutor-3650-thread-1) [    ] o.a.s.c.SolrConfig Loaded SolrConfig: solrconfig.xml
   [junit4]   2> 1166313 INFO  (coreLoadExecutor-3650-thread-1) [    ] o.a.s.s.IndexSchema [collection1] Schema name=test
   [junit4]   2> 1166369 INFO  (coreLoadExecutor-3650-thread-1) [    ] o.a.s.s.IndexSchema default search field in schema is text
   [junit4]   2> 1166370 INFO  (coreLoadExecutor-3650-thread-1) [    ] o.a.s.s.IndexSchema unique key field: id
   [junit4]   2> 1166370 INFO  (coreLoadExecutor-3650-thread-1) [    ] o.a.s.s.FileExchangeRateProvider Reloading exchange rates from file currency.xml
   [junit4]   2> 1166372 INFO  (coreLoadExecutor-3650-thread-1) [    ] o.a.s.s.FileExchangeRateProvider Reloading exchange rates from file currency.xml
   [junit4]   2> 1166386 INFO  (coreLoadExecutor-3650-thread-1) [    ] o.a.s.c.ConfigSetProperties Did not find ConfigSet properties, assuming default properties: Can't find resource 'configsetprops.json' in classpath or '/configs/conf1', cwd=/home/jenkins/workspace/Lucene-Solr-trunk-Linux/solr/build/solr-core/test/J0
   [junit4]   2> 1166386 INFO  (coreLoadExecutor-3650-thread-1) [    ] o.a.s.c.CoreContainer Creating SolrCore 'collection1' using configuration from collection collection1
   [junit4]   2> 1166386 INFO  (coreLoadExecutor-3650-thread-1) [    ] o.a.s.c.SolrCore solr.StandardDirectoryFactory
   [junit4]   2> 1166386 INFO  (coreLoadExecutor-3650-thread-1) [    ] o.a.s.c.SolrCore [[collection1] ] Opening new SolrCore at [/home/jenkins/workspace/Lucene-Solr-trunk-Linux/solr/build/solr-core/test/J0/temp/solr.cloud.ChaosMonkeyNothingIsSafeTest_32A2BE9420DDAF12-001/shard-1-001/cores/collection1], dataDir=[/home/jenkins/workspace/Lucene-Solr-trunk-Linux/solr/build/solr-core/test/J0/../../../../../../../../../home/jenkins/workspace/Lucene-Solr-trunk-Linux/solr/build/solr-core/test/J0/temp/solr.cloud.ChaosMonkeyNothingIsSafeTest_32A2BE9420DDAF12-001/shard-1-001/cores/collection1/data/]
   [junit4]   2> 1166386 INFO  (coreLoadExecutor-3650-thread-1) [    ] o.a.s.c.JmxMonitoredMap JMX monitoring is enabled. Adding Solr mbeans to JMX Server: com.sun.jmx.mbeanserver.JmxMBeanServer@15aee47
   [junit4]   2> 1166387 INFO  (coreLoadExecutor-3650-thread-1) [    ] o.a.s.c.CachingDirectoryFactory return new directory for /home/jenkins/workspace/Lucene-Solr-trunk-Linux/solr/build/solr-core/test/J0/temp/solr.cloud.ChaosMonkeyNothingIsSafeTest_32A2BE9420DDAF12-001/shard-1-001/cores/collection1/data
   [junit4]   2> 1166387 INFO  (coreLoadExecutor-3650-thread-1) [    ] o.a.s.c.SolrCore New index directory detected: old=null new=/home/jenkins/workspace/Lucene-Solr-trunk-Linux/solr/build/solr-core/test/J0/../../../../../../../../../home/jenkins/workspace/Lucene-Solr-trunk-Linux/solr/build/solr-core/test/J0/temp/solr.cloud.ChaosMonkeyNothingIsSafeTest_32A2BE9420DDAF12-001/shard-1-001/cores/collection1/data/index/
   [junit4]   2> 1166387 WARN  (coreLoadExecutor-3650-thread-1) [    ] o.a.s.c.SolrCore [collection1] Solr index directory '/home/jenkins/workspace/Lucene-Solr-trunk-Linux/solr/build/solr-core/test/J0/../../../../../../../../../home/jenkins/workspace/Lucene-Solr-trunk-Linux/solr/build/solr-core/test/J0/temp/solr.cloud.ChaosMonkeyNothingIsSafeTest_32A2BE9420DDAF12-001/shard-1-001/cores/collection1/data/index' doesn't exist. Creating new index...
   [junit4]   2> 1166387 INFO  (coreLoadExecutor-3650-thread-1) [    ] o.a.s.c.CachingDirectoryFactory return new directory for /home/jenkins/workspace/Lucene-Solr-trunk-Linux/solr/build/solr-core/test/J0/temp/solr.cloud.ChaosMonkeyNothingIsSafeTest_32A2BE9420DDAF12-001/shard-1-001/cores/collection1/data/index
   [junit4]   2> 1166388 INFO  (coreLoadExecutor-3650-thread-1) [    ] o.a.s.u.RandomMergePolicy RandomMergePolicy wrapping class org.apache.lucene.index.LogDocMergePolicy: [LogDocMergePolicy: minMergeSize=1000, mergeFactor=16, maxMergeSize=9223372036854775807, maxMergeSizeForForcedMerge=9223372036854775807, calibrateSizeByDeletes=false, maxMergeDocs=2147483647, maxCFSSegmentSizeMB=8.796093022207999E12, noCFSRatio=0.8863733345841441]
   [junit4]   2> 1166515 INFO  (coreLoadExecutor-3650-thread-1) [    ] o.a.s.c.SolrDeletionPolicy SolrDeletionPolicy.onCommit: commits: num=1
   [junit4]   2> 	commit{dir=/home/jenkins/workspace/Lucene-Solr-trunk-Linux/solr/build/solr-core/test/J0/temp/solr.cloud.ChaosMonkeyNothingIsSafeTest_32A2BE9420DDAF12-001/shard-1-001/cores/collection1/data/index,segFN=segments_1,generation=1}
   [junit4]   2> 1166515 INFO  (coreLoadExecutor-3650-thread-1) [    ] o.a.s.c.SolrDeletionPolicy newest commit generation = 1
   [junit4]   2> 1166516 INFO  (OldIndexDirectoryCleanupThreadForCore-collection1) [    ] o.a.s.c.SolrCore Looking for old index directories to cleanup for core collection1 in /home/jenkins/workspace/Lucene-Solr-trunk-Linux/solr/build/solr-core/test/J0/../../../../../../../../../home/jenkins/workspace/Lucene-Solr-trunk-Linux/solr/build/solr-core/test/J0/temp/solr.cloud.ChaosMonkeyNothingIsSafeTest_32A2BE9420DDAF12-001/shard-1-001/cores/collection1/data/
   [junit4]   2> 1166518 INFO  (coreLoadExecutor-3650-thread-1) [    ] o.a.s.u.p.UpdateRequestProcessorChain creating updateRequestProcessorChain "nodistrib"
   [junit4]   2> 1166518 INFO  (coreLoadExecutor-3650-thread-1) [    ] o.a.s.u.p.UpdateRequestProcessorChain creating updateRequestProcessorChain "dedupe"
   [junit4]   2> 1166518 INFO  (coreLoadExecutor-3650-thread-1) [    ] o.a.s.u.p.UpdateRequestProcessorChain inserting DistributedUpdateProcessorFactory into updateRequestProcessorChain "dedupe"
   [junit4]   2> 1166518 INFO  (coreLoadExecutor-3650-thread-1) [    ] o.a.s.u.p.UpdateRequestProcessorChain creating updateRequestProcessorChain "stored_sig"
   [junit4]   2> 1166519 INFO  (coreLoadExecutor-3650-thread-1) [    ] o.a.s.u.p.UpdateRequestProcessorChain inserting DistributedUpdateProcessorFactory into updateRequestProcessorChain "stored_sig"
   [junit4]   2> 1166519 INFO  (coreLoadExecutor-3650-thread-1) [    ] o.a.s.u.p.UpdateRequestProcessorChain creating updateRequestProcessorChain "distrib-dup-test-chain-explicit"
   [junit4]   2> 1166519 INFO  (coreLoadExecutor-3650-thread-1) [    ] o.a.s.u.p.UpdateRequestProcessorChain creating updateRequestProcessorChain "distrib-dup-test-chain-implicit"
   [junit4]   2> 1166519 INFO  (coreLoadExecutor-3650-thread-1) [    ] o.a.s.u.p.UpdateRequestProcessorChain inserting DistributedUpdateProcessorFactory into updateRequestProcessorChain "distrib-dup-test-chain-implicit"
   [junit4]   2> 1166519 INFO  (coreLoadExecutor-3650-thread-1) [    ] o.a.s.c.SolrCore no updateRequestProcessorChain defined as default, creating implicit default
   [junit4]   2> 1166519 WARN  (coreLoadExecutor-3650-thread-1) [    ] o.a.s.c.RequestHandlers INVALID paramSet a in requestHandler {type = requestHandler,name = /dump,class = DumpRequestHandler,args = {defaults={a=A,b=B}}}
   [junit4]   2> 1166520 INFO  (coreLoadExecutor-3650-thread-1) [    ] o.a.s.h.l.XMLLoader xsltCacheLifetimeSeconds=60
   [junit4]   2> 1166521 INFO  (coreLoadExecutor-3650-thread-1) [    ] o.a.s.h.l.XMLLoader xsltCacheLifetimeSeconds=60
   [junit4]   2> 1166522 INFO  (coreLoadExecutor-3650-thread-1) [    ] o.a.s.h.l.XMLLoader xsltCacheLifetimeSeconds=60
   [junit4]   2> 1166522 INFO  (coreLoadExecutor-3650-thread-1) [    ] o.a.s.h.l.XMLLoader xsltCacheLifetimeSeconds=60
   [junit4]   2> 1166526 INFO  (coreLoadExecutor-3650-thread-1) [    ] o.a.s.c.RequestHandlers Registered paths: /admin/mbeans,standard,/dump,/update/csv,/sql,/update/json/docs,/admin/luke,/export,/admin/segments,/get,/admin/system,/replication,/admin/properties,/config,/stream,/schema,/admin/plugins,/admin/logging,/update/json,/admin/threads,/admin/ping,/update,/admin/file
   [junit4]   2> 1166526 INFO  (coreLoadExecutor-3650-thread-1) [    ] o.a.s.c.SolrCore Using default statsCache cache: org.apache.solr.search.stats.LocalStatsCache
   [junit4]   2> 1166527 INFO  (coreLoadExecutor-3650-thread-1) [    ] o.a.s.u.UpdateHandler Using UpdateLog implementation: org.apache.solr.update.UpdateLog
   [junit4]   2> 1166527 INFO  (coreLoadExecutor-3650-thread-1) [    ] o.a.s.u.UpdateLog Initializing UpdateLog: dataDir= defaultSyncLevel=FLUSH numRecordsToKeep=100 maxNumLogsToKeep=10 numVersionBuckets=65536
   [junit4]   2> 1166527 INFO  (coreLoadExecutor-3650-thread-1) [    ] o.a.s.u.CommitTracker Hard AutoCommit: if uncommited for 15000ms; 
   [junit4]   2> 1166527 INFO  (coreLoadExecutor-3650-thread-1) [    ] o.a.s.u.CommitTracker Soft AutoCommit: disabled
   [junit4]   2> 1166528 INFO  (coreLoadExecutor-3650-thread-1) [    ] o.a.s.u.RandomMergePolicy RandomMergePolicy wrapping class org.apache.lucene.index.AlcoholicMergePolicy: [AlcoholicMergePolicy: minMergeSize=0, mergeFactor=10, maxMergeSize=1618476022, maxMergeSizeForForcedMerge=9223372036854775807, calibrateSizeByDeletes=true, maxMergeDocs=2147483647, maxCFSSegmentSizeMB=8.796093022207999E12, noCFSRatio=0.1]
   [junit4]   2> 1166529 INFO  (coreLoadExecutor-3650-thread-1) [    ] o.a.s.c.SolrDeletionPolicy SolrDeletionPolicy.onInit: commits: num=1
   [junit4]   2> 	commit{dir=/home/jenkins/workspace/Lucene-Solr-trunk-Linux/solr/build/solr-core/test/J0/temp/solr.cloud.ChaosMonkeyNothingIsSafeTest_32A2BE9420DDAF12-001/shard-1-001/cores/collection1/data/index,segFN=segments_1,generation=1}
   [junit4]   2> 1166529 INFO  (coreLoadExecutor-3650-thread-1) [    ] o.a.s.c.SolrDeletionPolicy newest commit generation = 1
   [junit4]   2> 1166529 INFO  (coreLoadExecutor-3650-thread-1) [    ] o.a.s.s.SolrIndexSearcher Opening Searcher@91d4f2[collection1] main
   [junit4]   2> 1166529 INFO  (coreLoadExecutor-3650-thread-1) [    ] o.a.s.c.c.ZkStateReader Load collection config from: [/collections/collection1]
   [junit4]   2> 1166530 INFO  (coreLoadExecutor-3650-thread-1) [    ] o.a.s.c.c.ZkStateReader path=[/collections/collection1] [configName]=[conf1] specified config exists in ZooKeeper
   [junit4]   2> 1166530 INFO  (coreLoadExecutor-3650-thread-1) [    ] o.a.s.r.ManagedResourceStorage Setting up ZooKeeper-based storage for the RestManager with znodeBase: /configs/conf1
   [junit4]   2> 1166530 INFO  (coreLoadExecutor-3650-thread-1) [    ] o.a.s.r.ManagedResourceStorage Configured ZooKeeperStorageIO with znodeBase: /configs/conf1
   [junit4]   2> 1166530 INFO  (coreLoadExecutor-3650-thread-1) [    ] o.a.s.r.RestManager Initializing RestManager with initArgs: {}
   [junit4]   2> 1166530 INFO  (coreLoadExecutor-3650-thread-1) [    ] o.a.s.r.ManagedResourceStorage Reading _rest_managed.json using ZooKeeperStorageIO:path=/configs/conf1
   [junit4]   2> 1166530 INFO  (coreLoadExecutor-3650-thread-1) [    ] o.a.s.r.ManagedResourceStorage No data found for znode /configs/conf1/_rest_managed.json
   [junit4]   2> 1166530 INFO  (coreLoadExecutor-3650-thread-1) [    ] o.a.s.r.ManagedResourceStorage Loaded null at path _rest_managed.json using ZooKeeperStorageIO:path=/configs/conf1
   [junit4]   2> 1166530 INFO  (coreLoadExecutor-3650-thread-1) [    ] o.a.s.r.RestManager Initializing 0 registered ManagedResources
   [junit4]   2> 1166530 INFO  (coreLoadExecutor-3650-thread-1) [    ] o.a.s.h.ReplicationHandler Commits will be reserved for  10000
   [junit4]   2> 1166530 INFO  (searc

[...truncated too long message...]

 "autoCreated":"true"},
   [junit4]    >   "c8n_1x2":{
   [junit4]    >     "replicationFactor":"2",
   [junit4]    >     "shards":{"shard1":{
   [junit4]    >         "range":"80000000-7fffffff",
   [junit4]    >         "state":"active",
   [junit4]    >         "replicas":{
   [junit4]    >           "core_node1":{
   [junit4]    >             "core":"c8n_1x2_shard1_replica2",
   [junit4]    >             "base_url":"http://127.0.0.1:42769/kh_",
   [junit4]    >             "node_name":"127.0.0.1:42769_kh_",
   [junit4]    >             "state":"recovering"},
   [junit4]    >           "core_node2":{
   [junit4]    >             "core":"c8n_1x2_shard1_replica1",
   [junit4]    >             "base_url":"http://127.0.0.1:34875/kh_",
   [junit4]    >             "node_name":"127.0.0.1:34875_kh_",
   [junit4]    >             "state":"active",
   [junit4]    >             "leader":"true"}}}},
   [junit4]    >     "router":{"name":"compositeId"},
   [junit4]    >     "maxShardsPerNode":"1",
   [junit4]    >     "autoAddReplicas":"false"},
   [junit4]    >   "collMinRf_1x3":{
   [junit4]    >     "replicationFactor":"3",
   [junit4]    >     "shards":{"shard1":{
   [junit4]    >         "range":"80000000-7fffffff",
   [junit4]    >         "state":"active",
   [junit4]    >         "replicas":{
   [junit4]    >           "core_node1":{
   [junit4]    >             "core":"collMinRf_1x3_shard1_replica1",
   [junit4]    >             "base_url":"http://127.0.0.1:42209/kh_",
   [junit4]    >             "node_name":"127.0.0.1:42209_kh_",
   [junit4]    >             "state":"active"},
   [junit4]    >           "core_node2":{
   [junit4]    >             "core":"collMinRf_1x3_shard1_replica2",
   [junit4]    >             "base_url":"http://127.0.0.1:40132/kh_",
   [junit4]    >             "node_name":"127.0.0.1:40132_kh_",
   [junit4]    >             "state":"active",
   [junit4]    >             "leader":"true"},
   [junit4]    >           "core_node3":{
   [junit4]    >             "core":"collMinRf_1x3_shard1_replica3",
   [junit4]    >             "base_url":"http://127.0.0.1:42769/kh_",
   [junit4]    >             "node_name":"127.0.0.1:42769_kh_",
   [junit4]    >             "state":"active"}}}},
   [junit4]    >     "router":{"name":"compositeId"},
   [junit4]    >     "maxShardsPerNode":"1",
   [junit4]    >     "autoAddReplicas":"false"}}
   [junit4]    > 	at __randomizedtesting.SeedInfo.seed([32A2BE9420DDAF12:BAF6814E8E21C2EA]:0)
   [junit4]    > 	at org.apache.solr.cloud.AbstractFullDistribZkTestBase.ensureAllReplicasAreActive(AbstractFullDistribZkTestBase.java:1844)
   [junit4]    > 	at org.apache.solr.cloud.HttpPartitionTest.testRf2(HttpPartitionTest.java:349)
   [junit4]    > 	at org.apache.solr.cloud.HttpPartitionTest.test(HttpPartitionTest.java:109)
   [junit4]    > 	at org.apache.solr.BaseDistributedSearchTestCase$ShardsRepeatRule$ShardsFixedStatement.callStatement(BaseDistributedSearchTestCase.java:965)
   [junit4]    > 	at org.apache.solr.BaseDistributedSearchTestCase$ShardsRepeatRule$ShardsStatement.evaluate(BaseDistributedSearchTestCase.java:940)
   [junit4]    > 	at java.lang.Thread.run(Thread.java:747)
   [junit4]   2> 1593369 INFO  (SUITE-HttpPartitionTest-seed#[32A2BE9420DDAF12]-worker) [    ] o.a.s.SolrTestCaseJ4 ###deleteCore
   [junit4]   2> NOTE: leaving temporary files on disk at: /home/jenkins/workspace/Lucene-Solr-trunk-Linux/solr/build/solr-core/test/J2/temp/solr.cloud.HttpPartitionTest_32A2BE9420DDAF12-001
   [junit4]   2> NOTE: test params are: codec=Asserting(Lucene60): {range_facet_l_dv=TestBloomFilteredLucenePostings(BloomFilteringPostingsFormat(Lucene50(blocksize=128))), _version_=PostingsFormat(name=LuceneFixedGap), multiDefault=FSTOrd50, a_t=FSTOrd50, intDefault=PostingsFormat(name=LuceneFixedGap), id=TestBloomFilteredLucenePostings(BloomFilteringPostingsFormat(Lucene50(blocksize=128))), range_facet_i_dv=FSTOrd50, text=PostingsFormat(name=MockRandom), range_facet_l=FSTOrd50, timestamp=FSTOrd50}, docValues:{range_facet_l_dv=DocValuesFormat(name=Lucene54), range_facet_i_dv=DocValuesFormat(name=Memory), timestamp=DocValuesFormat(name=Memory)}, sim=ClassicSimilarity, locale=si_LK, timezone=Europe/Oslo
   [junit4]   2> NOTE: Linux 3.19.0-42-generic i386/Oracle Corporation 9-ea (32-bit)/cpus=12,threads=1,free=212307960,total=391344128
   [junit4]   2> NOTE: All tests run in this JVM: [DirectUpdateHandlerTest, PluginInfoTest, TestFilteredDocIdSet, ParsingFieldUpdateProcessorsTest, TestJmxMonitoredMap, TestSchemaManager, TestFileDictionaryLookup, TestReloadDeadlock, TestPivotHelperCode, BadIndexSchemaTest, NoCacheHeaderTest, SliceStateTest, DirectSolrConnectionTest, BinaryUpdateRequestHandlerTest, TestStressUserVersions, SolrCloudExampleTest, BlockJoinFacetSimpleTest, FacetPivotSmallTest, TestSolrConfigHandlerCloud, HdfsDirectoryTest, TestManagedSchemaFieldTypeResource, SuggestComponentTest, TestWriterPerf, UnloadDistributedZkTest, OverseerCollectionConfigSetProcessorTest, SuggesterTSTTest, DocValuesMultiTest, TestUniqueKeyFieldResource, TestIndexSearcher, TestSuggestSpellingConverter, TestBulkSchemaAPI, OverseerTaskQueueTest, ConjunctionSolrSpellCheckerTest, MergeStrategyTest, TestExtendedDismaxParser, TestUtils, HdfsUnloadDistributedZkTest, TestRTimerTree, TestConfigOverlay, TestManagedResource, DirectUpdateHandlerOptimizeTest, UpdateParamsTest, TestFieldCollectionResource, TestConfigSetsAPI, CoreAdminHandlerTest, TestReload, UUIDUpdateProcessorFallbackTest, FieldMutatingUpdateProcessorTest, AnalyticsMergeStrategyTest, TestShortCircuitedRequests, FullSolrCloudDistribCmdsTest, TestSolrDeletionPolicy1, TestDefaultStatsCache, TermVectorComponentDistributedTest, TestSerializedLuceneMatchVersion, DocValuesMissingTest, SimpleFacetsTest, TestRecovery, SolrCoreCheckLockOnStartupTest, CoreAdminRequestStatusTest, ExitableDirectoryReaderTest, TestMiniSolrCloudClusterSSL, TestBulkSchemaConcurrent, TestPHPSerializedResponseWriter, TestReloadAndDeleteDocs, TestSolrCLIRunExample, TestElisionMultitermQuery, RuleEngineTest, SecurityConfHandlerTest, PrimitiveFieldTypeTest, CurrencyFieldXmlFileTest, TestCryptoKeys, AutoCommitTest, TestSolrQueryParser, DistributedFacetPivotSmallAdvancedTest, TestCoreDiscovery, TestClusterStateMutator, TestAddFieldRealTimeGet, SearchHandlerTest, TestDocBasedVersionConstraints, TestFuzzyAnalyzedSuggestions, TestSweetSpotSimilarityFactory, TestMinMaxOnMultiValuedField, TestIndexingPerformance, TestCSVResponseWriter, DebugComponentTest, AnalysisErrorHandlingTest, SharedFSAutoReplicaFailoverTest, TestMaxScoreQueryParser, LeaderElectionTest, ReplicationFactorTest, DistributedQueryComponentCustomSortTest, ClusterStateTest, BasicDistributedZkTest, ChaosMonkeySafeLeaderTest, BasicDistributedZk2Test, OpenCloseCoreStressTest, OverseerTest, ClusterStateUpdateTest, TestRandomFaceting, TestZkChroot, ShardRoutingCustomTest, TestDistributedGrouping, TestHashPartitioner, TestStressReorder, TestJoin, TestStressVersions, HardAutoCommitTest, TestSolr4Spatial, SolrCoreTest, StatsComponentTest, SpellCheckComponentTest, TestGroupingSearch, ConvertedLegacyTest, TestSort, SuggesterFSTTest, TestStressLucene, TestCSVLoader, PolyFieldTest, TestPseudoReturnFields, TestWordDelimiterFilterFactory, StatelessScriptUpdateProcessorFactoryTest, LukeRequestHandlerTest, XmlUpdateRequestHandlerTest, PathHierarchyTokenizerFactoryTest, FastVectorHighlighterTest, SolrPluginUtilsTest, TestJmxIntegration, QueryParsingTest, JsonLoaderTest, TestBinaryResponseWriter, SOLR749Test, TestSolrIndexConfig, SolrIndexConfigTest, TestMergePolicyConfig, TestSolrDeletionPolicy2, SampleTest, TestDocSet, TestBinaryField, TestSearchPerf, MinimalSchemaTest, OutputWriterTest, TestSolrCoreProperties, TestPostingsSolrHighlighter, TestLuceneMatchVersion, TestCharFilters, TestXIncludeConfig, EchoParamsTest, TestDFRSimilarityFactory, TestPerFieldSimilarity, TestLMJelinekMercerSimilarityFactory, TestBM25SimilarityFactory, TestFastWriter, ScriptEngineTest, URLClassifyProcessorTest, DOMUtilTest, RAMDirectoryFactoryTest, TestSolrJ, TestDocumentBuilder, ZkNodePropsTest, CircularListTest, CursorPagingTest, DistributedIntervalFacetingTest, SolrTestCaseJ4Test, TestCrossCoreJoin, TestCursorMarkWithoutUniqueKey, TestDistributedMissingSort, TestSimpleTrackingShardHandler, AliasIntegrationTest, BaseCdcrDistributedZkTest, CdcrReplicationDistributedZkTest, CdcrReplicationHandlerTest, CdcrRequestHandlerTest, CdcrVersionReplicationTest, CloudExitableDirectoryReaderTest, ConcurrentDeleteAndCreateCollectionTest, ConfigSetsAPITest, DeleteInactiveReplicaTest, DistribJoinFromCollectionTest, HttpPartitionTest]
   [junit4] Completed [439/573 (2!)] on J2 in 139.90s, 1 test, 1 failure <<< FAILURES!

[...truncated 459 lines...]
BUILD FAILED
/home/jenkins/workspace/Lucene-Solr-trunk-Linux/build.xml:784: The following error occurred while executing this line:
/home/jenkins/workspace/Lucene-Solr-trunk-Linux/build.xml:728: The following error occurred while executing this line:
/home/jenkins/workspace/Lucene-Solr-trunk-Linux/build.xml:59: The following error occurred while executing this line:
/home/jenkins/workspace/Lucene-Solr-trunk-Linux/solr/build.xml:233: The following error occurred while executing this line:
/home/jenkins/workspace/Lucene-Solr-trunk-Linux/solr/common-build.xml:516: The following error occurred while executing this line:
/home/jenkins/workspace/Lucene-Solr-trunk-Linux/lucene/common-build.xml:1424: The following error occurred while executing this line:
/home/jenkins/workspace/Lucene-Solr-trunk-Linux/lucene/common-build.xml:981: There were test failures: 573 suites (8 ignored), 2284 tests, 1 suite-level error, 1 failure, 115 ignored (70 assumptions) [seed: 32A2BE9420DDAF12]

Total time: 57 minutes 54 seconds
Build step 'Invoke Ant' marked build as failure
Archiving artifacts
[WARNINGS] Skipping publisher since build result is FAILURE
Recording test results
Email was triggered for: Failure - Any
Sending email for trigger: Failure - Any



Mime
View raw message