lucene-dev mailing list archives

Site index · List index
Message view « Date » · « Thread »
Top « Date » · « Thread »
From Policeman Jenkins Server <jenk...@thetaphi.de>
Subject [JENKINS] Lucene-Solr-5.x-MacOSX (64bit/jdk1.8.0) - Build # 2903 - Failure!
Date Tue, 22 Dec 2015 22:32:08 GMT
Build: http://jenkins.thetaphi.de/job/Lucene-Solr-5.x-MacOSX/2903/
Java: 64bit/jdk1.8.0 -XX:-UseCompressedOops -XX:+UseG1GC

2 tests failed.
FAILED:  org.apache.solr.cloud.overseer.ZkStateReaderTest.testStateFormatUpdateWithExplicitRefresh

Error Message:
expected:<2> but was:<1>

Stack Trace:
java.lang.AssertionError: expected:<2> but was:<1>
	at __randomizedtesting.SeedInfo.seed([3B2796BB2413CA10:249DE74CF4730CD5]:0)
	at org.junit.Assert.fail(Assert.java:93)
	at org.junit.Assert.failNotEquals(Assert.java:647)
	at org.junit.Assert.assertEquals(Assert.java:128)
	at org.junit.Assert.assertEquals(Assert.java:472)
	at org.junit.Assert.assertEquals(Assert.java:456)
	at org.apache.solr.cloud.overseer.ZkStateReaderTest.testStateFormatUpdate(ZkStateReaderTest.java:137)
	at org.apache.solr.cloud.overseer.ZkStateReaderTest.testStateFormatUpdateWithExplicitRefresh(ZkStateReaderTest.java:42)
	at sun.reflect.NativeMethodAccessorImpl.invoke0(Native Method)
	at sun.reflect.NativeMethodAccessorImpl.invoke(NativeMethodAccessorImpl.java:62)
	at sun.reflect.DelegatingMethodAccessorImpl.invoke(DelegatingMethodAccessorImpl.java:43)
	at java.lang.reflect.Method.invoke(Method.java:497)
	at com.carrotsearch.randomizedtesting.RandomizedRunner.invoke(RandomizedRunner.java:1764)
	at com.carrotsearch.randomizedtesting.RandomizedRunner$8.evaluate(RandomizedRunner.java:871)
	at com.carrotsearch.randomizedtesting.RandomizedRunner$9.evaluate(RandomizedRunner.java:907)
	at com.carrotsearch.randomizedtesting.RandomizedRunner$10.evaluate(RandomizedRunner.java:921)
	at com.carrotsearch.randomizedtesting.rules.SystemPropertiesRestoreRule$1.evaluate(SystemPropertiesRestoreRule.java:57)
	at org.apache.lucene.util.TestRuleSetupTeardownChained$1.evaluate(TestRuleSetupTeardownChained.java:50)
	at org.apache.lucene.util.AbstractBeforeAfterRule$1.evaluate(AbstractBeforeAfterRule.java:46)
	at org.apache.lucene.util.TestRuleThreadAndTestName$1.evaluate(TestRuleThreadAndTestName.java:49)
	at org.apache.lucene.util.TestRuleIgnoreAfterMaxFailures$1.evaluate(TestRuleIgnoreAfterMaxFailures.java:65)
	at org.apache.lucene.util.TestRuleMarkFailure$1.evaluate(TestRuleMarkFailure.java:48)
	at com.carrotsearch.randomizedtesting.rules.StatementAdapter.evaluate(StatementAdapter.java:36)
	at com.carrotsearch.randomizedtesting.ThreadLeakControl$StatementRunner.run(ThreadLeakControl.java:367)
	at com.carrotsearch.randomizedtesting.ThreadLeakControl.forkTimeoutingTask(ThreadLeakControl.java:809)
	at com.carrotsearch.randomizedtesting.ThreadLeakControl$3.evaluate(ThreadLeakControl.java:460)
	at com.carrotsearch.randomizedtesting.RandomizedRunner.runSingleTest(RandomizedRunner.java:880)
	at com.carrotsearch.randomizedtesting.RandomizedRunner$5.evaluate(RandomizedRunner.java:781)
	at com.carrotsearch.randomizedtesting.RandomizedRunner$6.evaluate(RandomizedRunner.java:816)
	at com.carrotsearch.randomizedtesting.RandomizedRunner$7.evaluate(RandomizedRunner.java:827)
	at com.carrotsearch.randomizedtesting.rules.StatementAdapter.evaluate(StatementAdapter.java:36)
	at com.carrotsearch.randomizedtesting.rules.SystemPropertiesRestoreRule$1.evaluate(SystemPropertiesRestoreRule.java:57)
	at org.apache.lucene.util.AbstractBeforeAfterRule$1.evaluate(AbstractBeforeAfterRule.java:46)
	at com.carrotsearch.randomizedtesting.rules.StatementAdapter.evaluate(StatementAdapter.java:36)
	at org.apache.lucene.util.TestRuleStoreClassName$1.evaluate(TestRuleStoreClassName.java:42)
	at com.carrotsearch.randomizedtesting.rules.NoShadowingOrOverridesOnMethodsRule$1.evaluate(NoShadowingOrOverridesOnMethodsRule.java:40)
	at com.carrotsearch.randomizedtesting.rules.NoShadowingOrOverridesOnMethodsRule$1.evaluate(NoShadowingOrOverridesOnMethodsRule.java:40)
	at com.carrotsearch.randomizedtesting.rules.StatementAdapter.evaluate(StatementAdapter.java:36)
	at com.carrotsearch.randomizedtesting.rules.StatementAdapter.evaluate(StatementAdapter.java:36)
	at com.carrotsearch.randomizedtesting.rules.StatementAdapter.evaluate(StatementAdapter.java:36)
	at org.apache.lucene.util.TestRuleAssertionsRequired$1.evaluate(TestRuleAssertionsRequired.java:54)
	at org.apache.lucene.util.TestRuleMarkFailure$1.evaluate(TestRuleMarkFailure.java:48)
	at org.apache.lucene.util.TestRuleIgnoreAfterMaxFailures$1.evaluate(TestRuleIgnoreAfterMaxFailures.java:65)
	at org.apache.lucene.util.TestRuleIgnoreTestSuites$1.evaluate(TestRuleIgnoreTestSuites.java:55)
	at com.carrotsearch.randomizedtesting.rules.StatementAdapter.evaluate(StatementAdapter.java:36)
	at com.carrotsearch.randomizedtesting.ThreadLeakControl$StatementRunner.run(ThreadLeakControl.java:367)
	at java.lang.Thread.run(Thread.java:745)


FAILED:  org.apache.solr.handler.TestReplicationHandlerBackup.doTestBackup

Error Message:
Server returned HTTP response code: 400 for URL: http://127.0.0.1:59087/solr/collection1/replication?command=deletebackup&name=hm

Stack Trace:
java.io.IOException: Server returned HTTP response code: 400 for URL: http://127.0.0.1:59087/solr/collection1/replication?command=deletebackup&name=hm
	at __randomizedtesting.SeedInfo.seed([3B2796BB2413CA10:7AACB6DE03AD395F]:0)
	at sun.net.www.protocol.http.HttpURLConnection.getInputStream0(HttpURLConnection.java:1840)
	at sun.net.www.protocol.http.HttpURLConnection.getInputStream(HttpURLConnection.java:1441)
	at java.net.URL.openStream(URL.java:1038)
	at org.apache.solr.handler.TestReplicationHandlerBackup.runBackupCommand(TestReplicationHandlerBackup.java:277)
	at org.apache.solr.handler.TestReplicationHandlerBackup.testDeleteNamedBackup(TestReplicationHandlerBackup.java:255)
	at org.apache.solr.handler.TestReplicationHandlerBackup.doTestBackup(TestReplicationHandlerBackup.java:220)
	at sun.reflect.NativeMethodAccessorImpl.invoke0(Native Method)
	at sun.reflect.NativeMethodAccessorImpl.invoke(NativeMethodAccessorImpl.java:62)
	at sun.reflect.DelegatingMethodAccessorImpl.invoke(DelegatingMethodAccessorImpl.java:43)
	at java.lang.reflect.Method.invoke(Method.java:497)
	at com.carrotsearch.randomizedtesting.RandomizedRunner.invoke(RandomizedRunner.java:1764)
	at com.carrotsearch.randomizedtesting.RandomizedRunner$8.evaluate(RandomizedRunner.java:871)
	at com.carrotsearch.randomizedtesting.RandomizedRunner$9.evaluate(RandomizedRunner.java:907)
	at com.carrotsearch.randomizedtesting.RandomizedRunner$10.evaluate(RandomizedRunner.java:921)
	at com.carrotsearch.randomizedtesting.rules.SystemPropertiesRestoreRule$1.evaluate(SystemPropertiesRestoreRule.java:57)
	at org.apache.lucene.util.TestRuleSetupTeardownChained$1.evaluate(TestRuleSetupTeardownChained.java:50)
	at org.apache.lucene.util.AbstractBeforeAfterRule$1.evaluate(AbstractBeforeAfterRule.java:46)
	at org.apache.lucene.util.TestRuleThreadAndTestName$1.evaluate(TestRuleThreadAndTestName.java:49)
	at org.apache.lucene.util.TestRuleIgnoreAfterMaxFailures$1.evaluate(TestRuleIgnoreAfterMaxFailures.java:65)
	at org.apache.lucene.util.TestRuleMarkFailure$1.evaluate(TestRuleMarkFailure.java:48)
	at com.carrotsearch.randomizedtesting.rules.StatementAdapter.evaluate(StatementAdapter.java:36)
	at com.carrotsearch.randomizedtesting.ThreadLeakControl$StatementRunner.run(ThreadLeakControl.java:367)
	at com.carrotsearch.randomizedtesting.ThreadLeakControl.forkTimeoutingTask(ThreadLeakControl.java:809)
	at com.carrotsearch.randomizedtesting.ThreadLeakControl$3.evaluate(ThreadLeakControl.java:460)
	at com.carrotsearch.randomizedtesting.RandomizedRunner.runSingleTest(RandomizedRunner.java:880)
	at com.carrotsearch.randomizedtesting.RandomizedRunner$5.evaluate(RandomizedRunner.java:781)
	at com.carrotsearch.randomizedtesting.RandomizedRunner$6.evaluate(RandomizedRunner.java:816)
	at com.carrotsearch.randomizedtesting.RandomizedRunner$7.evaluate(RandomizedRunner.java:827)
	at com.carrotsearch.randomizedtesting.rules.StatementAdapter.evaluate(StatementAdapter.java:36)
	at com.carrotsearch.randomizedtesting.rules.SystemPropertiesRestoreRule$1.evaluate(SystemPropertiesRestoreRule.java:57)
	at org.apache.lucene.util.AbstractBeforeAfterRule$1.evaluate(AbstractBeforeAfterRule.java:46)
	at com.carrotsearch.randomizedtesting.rules.StatementAdapter.evaluate(StatementAdapter.java:36)
	at org.apache.lucene.util.TestRuleStoreClassName$1.evaluate(TestRuleStoreClassName.java:42)
	at com.carrotsearch.randomizedtesting.rules.NoShadowingOrOverridesOnMethodsRule$1.evaluate(NoShadowingOrOverridesOnMethodsRule.java:40)
	at com.carrotsearch.randomizedtesting.rules.NoShadowingOrOverridesOnMethodsRule$1.evaluate(NoShadowingOrOverridesOnMethodsRule.java:40)
	at com.carrotsearch.randomizedtesting.rules.StatementAdapter.evaluate(StatementAdapter.java:36)
	at com.carrotsearch.randomizedtesting.rules.StatementAdapter.evaluate(StatementAdapter.java:36)
	at com.carrotsearch.randomizedtesting.rules.StatementAdapter.evaluate(StatementAdapter.java:36)
	at org.apache.lucene.util.TestRuleAssertionsRequired$1.evaluate(TestRuleAssertionsRequired.java:54)
	at org.apache.lucene.util.TestRuleMarkFailure$1.evaluate(TestRuleMarkFailure.java:48)
	at org.apache.lucene.util.TestRuleIgnoreAfterMaxFailures$1.evaluate(TestRuleIgnoreAfterMaxFailures.java:65)
	at org.apache.lucene.util.TestRuleIgnoreTestSuites$1.evaluate(TestRuleIgnoreTestSuites.java:55)
	at com.carrotsearch.randomizedtesting.rules.StatementAdapter.evaluate(StatementAdapter.java:36)
	at com.carrotsearch.randomizedtesting.ThreadLeakControl$StatementRunner.run(ThreadLeakControl.java:367)
	at java.lang.Thread.run(Thread.java:745)




Build Log:
[...truncated 9858 lines...]
   [junit4] Suite: org.apache.solr.handler.TestReplicationHandlerBackup
   [junit4]   2> Creating dataDir: /Users/jenkins/workspace/Lucene-Solr-5.x-MacOSX/solr/build/solr-core/test/J1/temp/solr.handler.TestReplicationHandlerBackup_3B2796BB2413CA10-001/init-core-data-001
   [junit4]   2> 191375 INFO  (TEST-TestReplicationHandlerBackup.testBackupOnCommit-seed#[3B2796BB2413CA10]) [    ] o.a.s.SolrTestCaseJ4 ###Starting testBackupOnCommit
   [junit4]   2> 191376 INFO  (TEST-TestReplicationHandlerBackup.testBackupOnCommit-seed#[3B2796BB2413CA10]) [    ] o.a.s.SolrTestCaseJ4 Writing core.properties file to /Users/jenkins/workspace/Lucene-Solr-5.x-MacOSX/solr/build/solr-core/test/J1/temp/solr.handler.TestReplicationHandlerBackup_3B2796BB2413CA10-001/solr-instance-001/collection1
   [junit4]   2> 191401 INFO  (TEST-TestReplicationHandlerBackup.testBackupOnCommit-seed#[3B2796BB2413CA10]) [    ] o.e.j.s.Server jetty-9.2.13.v20150730
   [junit4]   2> 191404 INFO  (TEST-TestReplicationHandlerBackup.testBackupOnCommit-seed#[3B2796BB2413CA10]) [    ] o.e.j.s.h.ContextHandler Started o.e.j.s.ServletContextHandler@994b9f5{/solr,null,AVAILABLE}
   [junit4]   2> 191405 INFO  (TEST-TestReplicationHandlerBackup.testBackupOnCommit-seed#[3B2796BB2413CA10]) [    ] o.e.j.s.ServerConnector Started ServerConnector@13287bc6{HTTP/1.1}{127.0.0.1:59066}
   [junit4]   2> 191405 INFO  (TEST-TestReplicationHandlerBackup.testBackupOnCommit-seed#[3B2796BB2413CA10]) [    ] o.e.j.s.Server Started @197074ms
   [junit4]   2> 191405 INFO  (TEST-TestReplicationHandlerBackup.testBackupOnCommit-seed#[3B2796BB2413CA10]) [    ] o.a.s.c.s.e.JettySolrRunner Jetty properties: {solr.data.dir=/Users/jenkins/workspace/Lucene-Solr-5.x-MacOSX/solr/build/solr-core/test/J1/temp/solr.handler.TestReplicationHandlerBackup_3B2796BB2413CA10-001/solr-instance-001/collection1/data, hostContext=/solr, hostPort=59066}
   [junit4]   2> 191406 INFO  (TEST-TestReplicationHandlerBackup.testBackupOnCommit-seed#[3B2796BB2413CA10]) [    ] o.a.s.s.SolrDispatchFilter SolrDispatchFilter.init(): sun.misc.Launcher$AppClassLoader@74a14482
   [junit4]   2> 191406 INFO  (TEST-TestReplicationHandlerBackup.testBackupOnCommit-seed#[3B2796BB2413CA10]) [    ] o.a.s.c.SolrResourceLoader new SolrResourceLoader for directory: '/Users/jenkins/workspace/Lucene-Solr-5.x-MacOSX/solr/build/solr-core/test/J1/temp/solr.handler.TestReplicationHandlerBackup_3B2796BB2413CA10-001/solr-instance-001'
   [junit4]   2> 191406 INFO  (TEST-TestReplicationHandlerBackup.testBackupOnCommit-seed#[3B2796BB2413CA10]) [    ] o.a.s.c.SolrResourceLoader JNDI not configured for solr (NoInitialContextEx)
   [junit4]   2> 191406 INFO  (TEST-TestReplicationHandlerBackup.testBackupOnCommit-seed#[3B2796BB2413CA10]) [    ] o.a.s.c.SolrResourceLoader solr home defaulted to 'solr/' (could not find system property or JNDI)
   [junit4]   2> 191406 INFO  (TEST-TestReplicationHandlerBackup.testBackupOnCommit-seed#[3B2796BB2413CA10]) [    ] o.a.s.c.SolrXmlConfig Loading container configuration from /Users/jenkins/workspace/Lucene-Solr-5.x-MacOSX/solr/build/solr-core/test/J1/temp/solr.handler.TestReplicationHandlerBackup_3B2796BB2413CA10-001/solr-instance-001/solr.xml
   [junit4]   2> 191412 INFO  (TEST-TestReplicationHandlerBackup.testBackupOnCommit-seed#[3B2796BB2413CA10]) [    ] o.a.s.c.CorePropertiesLocator Config-defined core root directory: /Users/jenkins/workspace/Lucene-Solr-5.x-MacOSX/solr/build/solr-core/test/J1/temp/solr.handler.TestReplicationHandlerBackup_3B2796BB2413CA10-001/solr-instance-001/.
   [junit4]   2> 191412 INFO  (TEST-TestReplicationHandlerBackup.testBackupOnCommit-seed#[3B2796BB2413CA10]) [    ] o.a.s.c.CoreContainer New CoreContainer 1609839730
   [junit4]   2> 191412 INFO  (TEST-TestReplicationHandlerBackup.testBackupOnCommit-seed#[3B2796BB2413CA10]) [    ] o.a.s.c.CoreContainer Loading cores into CoreContainer [instanceDir=/Users/jenkins/workspace/Lucene-Solr-5.x-MacOSX/solr/build/solr-core/test/J1/temp/solr.handler.TestReplicationHandlerBackup_3B2796BB2413CA10-001/solr-instance-001]
   [junit4]   2> 191412 WARN  (TEST-TestReplicationHandlerBackup.testBackupOnCommit-seed#[3B2796BB2413CA10]) [    ] o.a.s.c.CoreContainer Couldn't add files from /Users/jenkins/workspace/Lucene-Solr-5.x-MacOSX/solr/build/solr-core/test/J1/temp/solr.handler.TestReplicationHandlerBackup_3B2796BB2413CA10-001/solr-instance-001/lib to classpath: /Users/jenkins/workspace/Lucene-Solr-5.x-MacOSX/solr/build/solr-core/test/J1/temp/solr.handler.TestReplicationHandlerBackup_3B2796BB2413CA10-001/solr-instance-001/lib
   [junit4]   2> 191412 INFO  (TEST-TestReplicationHandlerBackup.testBackupOnCommit-seed#[3B2796BB2413CA10]) [    ] o.a.s.h.c.HttpShardHandlerFactory created with socketTimeout : 90000,urlScheme : ,connTimeout : 15000,maxConnectionsPerHost : 20,maxConnections : 10000,corePoolSize : 0,maximumPoolSize : 2147483647,maxThreadIdleTime : 5,sizeOfQueue : -1,fairnessPolicy : false,useRetries : false,
   [junit4]   2> 191413 INFO  (TEST-TestReplicationHandlerBackup.testBackupOnCommit-seed#[3B2796BB2413CA10]) [    ] o.a.s.u.UpdateShardHandler Creating UpdateShardHandler HTTP client with params: socketTimeout=340000&connTimeout=45000&retry=true
   [junit4]   2> 191414 INFO  (TEST-TestReplicationHandlerBackup.testBackupOnCommit-seed#[3B2796BB2413CA10]) [    ] o.a.s.l.LogWatcher SLF4J impl is org.slf4j.impl.Log4jLoggerFactory
   [junit4]   2> 191414 INFO  (TEST-TestReplicationHandlerBackup.testBackupOnCommit-seed#[3B2796BB2413CA10]) [    ] o.a.s.l.LogWatcher Registering Log Listener [Log4j (org.slf4j.impl.Log4jLoggerFactory)]
   [junit4]   2> 191414 INFO  (TEST-TestReplicationHandlerBackup.testBackupOnCommit-seed#[3B2796BB2413CA10]) [    ] o.a.s.c.CoreContainer Security conf doesn't exist. Skipping setup for authorization module.
   [junit4]   2> 191414 INFO  (TEST-TestReplicationHandlerBackup.testBackupOnCommit-seed#[3B2796BB2413CA10]) [    ] o.a.s.c.CoreContainer No authentication plugin used.
   [junit4]   2> 191415 INFO  (TEST-TestReplicationHandlerBackup.testBackupOnCommit-seed#[3B2796BB2413CA10]) [    ] o.a.s.c.CorePropertiesLocator Looking for core definitions underneath /Users/jenkins/workspace/Lucene-Solr-5.x-MacOSX/solr/build/solr-core/test/J1/temp/solr.handler.TestReplicationHandlerBackup_3B2796BB2413CA10-001/solr-instance-001/.
   [junit4]   2> 191418 INFO  (TEST-TestReplicationHandlerBackup.testBackupOnCommit-seed#[3B2796BB2413CA10]) [    ] o.a.s.c.CoreDescriptor Created CoreDescriptor: {name=collection1, config=solrconfig.xml, loadOnStartup=true, schema=schema.xml, configSetProperties=configsetprops.json, transient=false, dataDir=data/}
   [junit4]   2> 191418 INFO  (TEST-TestReplicationHandlerBackup.testBackupOnCommit-seed#[3B2796BB2413CA10]) [    ] o.a.s.c.CorePropertiesLocator Found core collection1 in /Users/jenkins/workspace/Lucene-Solr-5.x-MacOSX/solr/build/solr-core/test/J1/temp/solr.handler.TestReplicationHandlerBackup_3B2796BB2413CA10-001/solr-instance-001/./collection1
   [junit4]   2> 191418 INFO  (TEST-TestReplicationHandlerBackup.testBackupOnCommit-seed#[3B2796BB2413CA10]) [    ] o.a.s.c.CorePropertiesLocator Found 1 core definitions
   [junit4]   2> 191418 INFO  (coreLoadExecutor-792-thread-1) [    ] o.a.s.c.SolrResourceLoader new SolrResourceLoader for directory: '/Users/jenkins/workspace/Lucene-Solr-5.x-MacOSX/solr/build/solr-core/test/J1/temp/solr.handler.TestReplicationHandlerBackup_3B2796BB2413CA10-001/solr-instance-001/collection1'
   [junit4]   2> 191419 INFO  (coreLoadExecutor-792-thread-1) [    ] o.a.s.c.SolrResourceLoader JNDI not configured for solr (NoInitialContextEx)
   [junit4]   2> 191419 INFO  (coreLoadExecutor-792-thread-1) [    ] o.a.s.c.SolrResourceLoader solr home defaulted to 'solr/' (could not find system property or JNDI)
   [junit4]   2> 191420 INFO  (TEST-TestReplicationHandlerBackup.testBackupOnCommit-seed#[3B2796BB2413CA10]) [    ] o.a.s.s.SolrDispatchFilter user.dir=/Users/jenkins/workspace/Lucene-Solr-5.x-MacOSX/solr/build/solr-core/test/J1
   [junit4]   2> 191420 INFO  (TEST-TestReplicationHandlerBackup.testBackupOnCommit-seed#[3B2796BB2413CA10]) [    ] o.a.s.s.SolrDispatchFilter SolrDispatchFilter.init() done
   [junit4]   2> 191438 INFO  (coreLoadExecutor-792-thread-1) [    ] o.a.s.c.SolrConfig current version of requestparams : -1
   [junit4]   2> 191441 INFO  (coreLoadExecutor-792-thread-1) [    ] o.a.s.c.SolrConfig Using Lucene MatchVersion: 5.5.0
   [junit4]   2> 191448 INFO  (coreLoadExecutor-792-thread-1) [    ] o.a.s.c.SolrConfig Loaded SolrConfig: solrconfig.xml
   [junit4]   2> 191451 INFO  (coreLoadExecutor-792-thread-1) [    ] o.a.s.s.IndexSchema [collection1] Schema name=test
   [junit4]   2> 191455 INFO  (coreLoadExecutor-792-thread-1) [    ] o.a.s.s.IndexSchema unique key field: id
   [junit4]   2> 191461 INFO  (coreLoadExecutor-792-thread-1) [    ] o.a.s.c.ConfigSetProperties Did not find ConfigSet properties, assuming default properties: Can't find resource 'configsetprops.json' in classpath or '/Users/jenkins/workspace/Lucene-Solr-5.x-MacOSX/solr/build/solr-core/test/J1/temp/solr.handler.TestReplicationHandlerBackup_3B2796BB2413CA10-001/solr-instance-001/collection1'
   [junit4]   2> 191461 INFO  (coreLoadExecutor-792-thread-1) [    ] o.a.s.c.CoreContainer Creating SolrCore 'collection1' using configuration from instancedir /Users/jenkins/workspace/Lucene-Solr-5.x-MacOSX/solr/build/solr-core/test/J1/temp/solr.handler.TestReplicationHandlerBackup_3B2796BB2413CA10-001/solr-instance-001/./collection1
   [junit4]   2> 191461 INFO  (coreLoadExecutor-792-thread-1) [    x:collection1] o.a.s.c.SolrCore org.apache.solr.core.MockDirectoryFactory
   [junit4]   2> 191461 INFO  (coreLoadExecutor-792-thread-1) [    x:collection1] o.a.s.c.SolrCore [[collection1] ] Opening new SolrCore at [/Users/jenkins/workspace/Lucene-Solr-5.x-MacOSX/solr/build/solr-core/test/J1/temp/solr.handler.TestReplicationHandlerBackup_3B2796BB2413CA10-001/solr-instance-001/collection1], dataDir=[/Users/jenkins/workspace/Lucene-Solr-5.x-MacOSX/solr/build/solr-core/test/J1/temp/solr.handler.TestReplicationHandlerBackup_3B2796BB2413CA10-001/solr-instance-001/./collection1/data/]
   [junit4]   2> 191461 INFO  (coreLoadExecutor-792-thread-1) [    x:collection1] o.a.s.c.SolrCore JMX monitoring not detected for core: collection1
   [junit4]   2> 191462 INFO  (coreLoadExecutor-792-thread-1) [    x:collection1] o.a.s.c.CachingDirectoryFactory return new directory for /Users/jenkins/workspace/Lucene-Solr-5.x-MacOSX/solr/build/solr-core/test/J1/temp/solr.handler.TestReplicationHandlerBackup_3B2796BB2413CA10-001/solr-instance-001/./collection1/data
   [junit4]   2> 191462 INFO  (coreLoadExecutor-792-thread-1) [    x:collection1] o.a.s.c.SolrCore New index directory detected: old=null new=/Users/jenkins/workspace/Lucene-Solr-5.x-MacOSX/solr/build/solr-core/test/J1/temp/solr.handler.TestReplicationHandlerBackup_3B2796BB2413CA10-001/solr-instance-001/./collection1/data/index/
   [junit4]   2> 191462 WARN  (coreLoadExecutor-792-thread-1) [    x:collection1] o.a.s.c.SolrCore [collection1] Solr index directory '/Users/jenkins/workspace/Lucene-Solr-5.x-MacOSX/solr/build/solr-core/test/J1/temp/solr.handler.TestReplicationHandlerBackup_3B2796BB2413CA10-001/solr-instance-001/./collection1/data/index' doesn't exist. Creating new index...
   [junit4]   2> 191462 INFO  (coreLoadExecutor-792-thread-1) [    x:collection1] o.a.s.c.CachingDirectoryFactory return new directory for /Users/jenkins/workspace/Lucene-Solr-5.x-MacOSX/solr/build/solr-core/test/J1/temp/solr.handler.TestReplicationHandlerBackup_3B2796BB2413CA10-001/solr-instance-001/./collection1/data/index
   [junit4]   2> 191462 INFO  (coreLoadExecutor-792-thread-1) [    x:collection1] o.a.s.u.RandomMergePolicy RandomMergePolicy wrapping class org.apache.lucene.index.AlcoholicMergePolicy: [AlcoholicMergePolicy: minMergeSize=0, mergeFactor=10, maxMergeSize=602761309, maxMergeSizeForForcedMerge=9223372036854775807, calibrateSizeByDeletes=true, maxMergeDocs=2147483647, maxCFSSegmentSizeMB=8.796093022207999E12, noCFSRatio=0.1]
   [junit4]   2> 191463 INFO  (coreLoadExecutor-792-thread-1) [    x:collection1] o.a.s.c.SolrDeletionPolicy SolrDeletionPolicy.onCommit: commits: num=1
   [junit4]   2> 	commit{dir=MockDirectoryWrapper(RAMDirectory@48f42c9a lockFactory=org.apache.lucene.store.SingleInstanceLockFactory@7a9e9d0e),segFN=segments_1,generation=1}
   [junit4]   2> 191463 INFO  (coreLoadExecutor-792-thread-1) [    x:collection1] o.a.s.c.SolrDeletionPolicy newest commit generation = 1
   [junit4]   2> 191464 INFO  (OldIndexDirectoryCleanupThreadForCore-collection1) [    x:collection1] o.a.s.c.SolrCore Looking for old index directories to cleanup for core collection1 in /Users/jenkins/workspace/Lucene-Solr-5.x-MacOSX/solr/build/solr-core/test/J1/temp/solr.handler.TestReplicationHandlerBackup_3B2796BB2413CA10-001/solr-instance-001/./collection1/data/
   [junit4]   2> 191468 INFO  (coreLoadExecutor-792-thread-1) [    x:collection1] o.a.s.c.SolrCore no updateRequestProcessorChain defined as default, creating implicit default
   [junit4]   2> 191473 INFO  (coreLoadExecutor-792-thread-1) [    x:collection1] o.a.s.h.l.XMLLoader xsltCacheLifetimeSeconds=60
   [junit4]   2> 191475 INFO  (coreLoadExecutor-792-thread-1) [    x:collection1] o.a.s.h.l.XMLLoader xsltCacheLifetimeSeconds=60
   [junit4]   2> 191476 INFO  (coreLoadExecutor-792-thread-1) [    x:collection1] o.a.s.h.l.XMLLoader xsltCacheLifetimeSeconds=60
   [junit4]   2> 191477 INFO  (coreLoadExecutor-792-thread-1) [    x:collection1] o.a.s.h.l.XMLLoader xsltCacheLifetimeSeconds=60
   [junit4]   2> 191490 INFO  (coreLoadExecutor-792-thread-1) [    x:collection1] o.a.s.c.PluginBag requestHandler : 'lazy' created with startup=lazy 
   [junit4]   2> 191490 INFO  (coreLoadExecutor-792-thread-1) [    x:collection1] o.a.s.c.RequestHandlers Registered paths: /admin/mbeans,standard,lazy,/update/csv,/update/json/docs,/admin/luke,/admin/segments,/get,/admin/system,/replication,/admin/properties,defaults,/config,/schema,/admin/plugins,/admin/logging,/update/json,/admin/threads,/admin/ping,/update,/admin/file
   [junit4]   2> 191490 INFO  (coreLoadExecutor-792-thread-1) [    x:collection1] o.a.s.c.SolrCore Using default statsCache cache: org.apache.solr.search.stats.LocalStatsCache
   [junit4]   2> 191491 INFO  (coreLoadExecutor-792-thread-1) [    x:collection1] o.a.s.u.CommitTracker Hard AutoCommit: disabled
   [junit4]   2> 191491 INFO  (coreLoadExecutor-792-thread-1) [    x:collection1] o.a.s.u.CommitTracker Soft AutoCommit: disabled
   [junit4]   2> 191491 INFO  (coreLoadExecutor-792-thread-1) [    x:collection1] o.a.s.u.RandomMergePolicy RandomMergePolicy wrapping class org.apache.lucene.index.AlcoholicMergePolicy: [AlcoholicMergePolicy: minMergeSize=0, mergeFactor=10, maxMergeSize=1744686037, maxMergeSizeForForcedMerge=9223372036854775807, calibrateSizeByDeletes=true, maxMergeDocs=2147483647, maxCFSSegmentSizeMB=8.796093022207999E12, noCFSRatio=0.1]
   [junit4]   2> 191492 INFO  (coreLoadExecutor-792-thread-1) [    x:collection1] o.a.s.c.SolrDeletionPolicy SolrDeletionPolicy.onInit: commits: num=1
   [junit4]   2> 	commit{dir=MockDirectoryWrapper(RAMDirectory@48f42c9a lockFactory=org.apache.lucene.store.SingleInstanceLockFactory@7a9e9d0e),segFN=segments_1,generation=1}
   [junit4]   2> 191492 INFO  (coreLoadExecutor-792-thread-1) [    x:collection1] o.a.s.c.SolrDeletionPolicy newest commit generation = 1
   [junit4]   2> 191492 INFO  (coreLoadExecutor-792-thread-1) [    x:collection1] o.a.s.s.SolrIndexSearcher Opening Searcher@6450e5c6[collection1] main
   [junit4]   2> 191492 INFO  (coreLoadExecutor-792-thread-1) [    x:collection1] o.a.s.r.ManagedResourceStorage File-based storage initialized to use dir: /Users/jenkins/workspace/Lucene-Solr-5.x-MacOSX/solr/build/solr-core/test/J1/temp/solr.handler.TestReplicationHandlerBackup_3B2796BB2413CA10-001/solr-instance-001/collection1/conf
   [junit4]   2> 191492 INFO  (coreLoadExecutor-792-thread-1) [    x:collection1] o.a.s.r.RestManager Initializing RestManager with initArgs: {storageDir=/Users/jenkins/workspace/Lucene-Solr-5.x-MacOSX/solr/build/solr-core/test/J1/temp/solr.handler.TestReplicationHandlerBackup_3B2796BB2413CA10-001/solr-instance-001/collection1/conf}
   [junit4]   2> 191492 INFO  (coreLoadExecutor-792-thread-1) [    x:collection1] o.a.s.r.ManagedResourceStorage Reading _rest_managed.json using file:dir=/Users/jenkins/workspace/Lucene-Solr-5.x-MacOSX/solr/build/solr-core/test/J1/temp/solr.handler.TestReplicationHandlerBackup_3B2796BB2413CA10-001/solr-instance-001/collection1/conf
   [junit4]   2> 191493 INFO  (coreLoadExecutor-792-thread-1) [    x:collection1] o.a.s.r.RestManager Initializing 0 registered ManagedResources
   [junit4]   2> 191493 INFO  (coreLoadExecutor-792-thread-1) [    x:collection1] o.a.s.h.ReplicationHandler Replication enabled for following config files: schema-replication2.xml:schema.xml
   [junit4]   2> 191493 INFO  (coreLoadExecutor-792-thread-1) [    x:collection1] o.a.s.h.ReplicationHandler Commits will be reserved for  10000
   [junit4]   2> 191493 INFO  (coreLoadExecutor-792-thread-1) [    x:collection1] o.a.s.c.CoreContainer registering core: collection1
   [junit4]   2> 191493 INFO  (searcherExecutor-793-thread-1-processing-x:collection1) [    x:collection1] o.a.s.c.SolrCore [collection1] Registered new searcher Searcher@6450e5c6[collection1] main{ExitableDirectoryReader(UninvertingDirectoryReader())}
   [junit4]   2> 191929 INFO  (qtp1405962252-1294) [    x:collection1] o.a.s.u.DirectUpdateHandler2 [collection1] REMOVING ALL DOCUMENTS FROM INDEX
   [junit4]   2> 191930 INFO  (qtp1405962252-1294) [    x:collection1] o.a.s.u.p.LogUpdateProcessorFactory [collection1]  webapp=/solr path=/update params={wt=javabin&version=2}{deleteByQuery=*:*} 0 1
   [junit4]   2> 191934 INFO  (qtp1405962252-1295) [    x:collection1] o.a.s.u.p.LogUpdateProcessorFactory [collection1]  webapp=/solr path=/update params={wt=javabin&version=2}{add=[0]} 0 0
   [junit4]   2> 191938 INFO  (qtp1405962252-1296) [    x:collection1] o.a.s.u.p.LogUpdateProcessorFactory [collection1]  webapp=/solr path=/update params={wt=javabin&version=2}{add=[1]} 0 0
   [junit4]   2> 191941 INFO  (qtp1405962252-1297) [    x:collection1] o.a.s.u.p.LogUpdateProcessorFactory [collection1]  webapp=/solr path=/update params={wt=javabin&version=2}{add=[2]} 0 0
   [junit4]   2> 191944 INFO  (qtp1405962252-1298) [    x:collection1] o.a.s.u.p.LogUpdateProcessorFactory [collection1]  webapp=/solr path=/update params={wt=javabin&version=2}{add=[3]} 0 0
   [junit4]   2> 191946 INFO  (qtp1405962252-1299) [    x:collection1] o.a.s.u.p.LogUpdateProcessorFactory [collection1]  webapp=/solr path=/update params={wt=javabin&version=2}{add=[4]} 0 0
   [junit4]   2> 191949 INFO  (qtp1405962252-1294) [    x:collection1] o.a.s.u.p.LogUpdateProcessorFactory [collection1]  webapp=/solr path=/update params={wt=javabin&version=2}{add=[5]} 0 0
   [junit4]   2> 191952 INFO  (qtp1405962252-1295) [    x:collection1] o.a.s.u.p.LogUpdateProcessorFactory [collection1]  webapp=/solr path=/update params={wt=javabin&version=2}{add=[6]} 0 0
   [junit4]   2> 191955 INFO  (qtp1405962252-1296) [    x:collection1] o.a.s.u.p.LogUpdateProcessorFactory [collection1]  webapp=/solr path=/update params={wt=javabin&version=2}{add=[7]} 0 0
   [junit4]   2> 191958 INFO  (qtp1405962252-1297) [    x:collection1] o.a.s.u.p.LogUpdateProcessorFactory [collection1]  webapp=/solr path=/update params={wt=javabin&version=2}{add=[8]} 0 0
   [junit4]   2> 191961 INFO  (qtp1405962252-1298) [    x:collection1] o.a.s.u.p.LogUpdateProcessorFactory [collection1]  webapp=/solr path=/update params={wt=javabin&version=2}{add=[9]} 0 0
   [junit4]   2> 191964 INFO  (qtp1405962252-1299) [    x:collection1] o.a.s.u.p.LogUpdateProcessorFactory [collection1]  webapp=/solr path=/update params={wt=javabin&version=2}{add=[10]} 0 0
   [junit4]   2> 191966 INFO  (qtp1405962252-1294) [    x:collection1] o.a.s.u.p.LogUpdateProcessorFactory [collection1]  webapp=/solr path=/update params={wt=javabin&version=2}{add=[11]} 0 0
   [junit4]   2> 191968 INFO  (qtp1405962252-1295) [    x:collection1] o.a.s.u.p.LogUpdateProcessorFactory [collection1]  webapp=/solr path=/update params={wt=javabin&version=2}{add=[12]} 0 0
   [junit4]   2> 191971 INFO  (qtp1405962252-1296) [    x:collection1] o.a.s.u.p.LogUpdateProcessorFactory [collection1]  webapp=/solr path=/update params={wt=javabin&version=2}{add=[13]} 0 0
   [junit4]   2> 191974 INFO  (qtp1405962252-1297) [    x:collection1] o.a.s.u.p.LogUpdateProcessorFactory [collection1]  webapp=/solr path=/update params={wt=javabin&version=2}{add=[14]} 0 0
   [junit4]   2> 191978 INFO  (qtp1405962252-1298) [    x:collection1] o.a.s.u.p.LogUpdateProcessorFactory [collection1]  webapp=/solr path=/update params={wt=javabin&version=2}{add=[15]} 0 0
   [junit4]   2> 191980 INFO  (qtp1405962252-1299) [    x:collection1] o.a.s.u.p.LogUpdateProcessorFactory [collection1]  webapp=/solr path=/update params={wt=javabin&version=2}{add=[16]} 0 0
   [junit4]   2> 191983 INFO  (qtp1405962252-1294) [    x:collection1] o.a.s.u.DirectUpdateHandler2 start commit{,optimize=false,openSearcher=true,waitSearcher=true,expungeDeletes=false,softCommit=false,prepareCommit=false}
   [junit4]   2> 191988 INFO  (qtp1405962252-1294) [    x:collection1] o.a.s.c.SolrDeletionPolicy SolrDeletionPolicy.onCommit: commits: num=2
   [junit4]   2> 	commit{dir=MockDirectoryWrapper(RAMDirectory@48f42c9a lockFactory=org.apache.lucene.store.SingleInstanceLockFactory@7a9e9d0e),segFN=segments_1,generation=1}
   [junit4]   2> 	commit{dir=MockDirectoryWrapper(RAMDirectory@48f42c9a lockFactory=org.apache.lucene.store.SingleInstanceLockFactory@7a9e9d0e),segFN=segments_2,generation=2}
   [junit4]   2> 191988 INFO  (qtp1405962252-1294) [    x:collection1] o.a.s.c.SolrDeletionPolicy newest commit generation = 2
   [junit4]   2> 191994 INFO  (Thread-605) [    x:collection1] o.a.s.h.SnapShooter Creating backup snapshot <not named> at /Users/jenkins/workspace/Lucene-Solr-5.x-MacOSX/solr/build/solr-core/test/J1/temp/solr.handler.TestReplicationHandlerBackup_3B2796BB2413CA10-001/solr-instance-001/./collection1/data/
   [junit4]   2> 191995 INFO  (qtp1405962252-1294) [    x:collection1] o.a.s.s.SolrIndexSearcher Opening Searcher@15d0e87e[collection1] main
   [junit4]   2> 191995 INFO  (qtp1405962252-1294) [    x:collection1] o.a.s.u.DirectUpdateHandler2 end_commit_flush
   [junit4]   2> 191995 INFO  (searcherExecutor-793-thread-1-processing-x:collection1) [    x:collection1] o.a.s.c.SolrCore [collection1] Registered new searcher Searcher@15d0e87e[collection1] main{ExitableDirectoryReader(UninvertingDirectoryReader(Uninverting(_0(5.5.0):C17)))}
   [junit4]   2> 191995 INFO  (qtp1405962252-1294) [    x:collection1] o.a.s.u.p.LogUpdateProcessorFactory [collection1]  webapp=/solr path=/update params={waitSearcher=true&commit=true&softCommit=false&wt=javabin&version=2}{commit=} 0 12
   [junit4]   2> 192005 INFO  (Thread-605) [    x:collection1] o.a.s.h.SnapShooter Done creating backup snapshot: <not named> at /Users/jenkins/workspace/Lucene-Solr-5.x-MacOSX/solr/build/solr-core/test/J1/temp/solr.handler.TestReplicationHandlerBackup_3B2796BB2413CA10-001/solr-instance-001/./collection1/data/
   [junit4]   2> 192006 INFO  (qtp1405962252-1295) [    x:collection1] o.a.s.c.S.Request [collection1]  webapp=/solr path=/replication params={command=details} status=0 QTime=1
   [junit4]   2> 193027 INFO  (TEST-TestReplicationHandlerBackup.testBackupOnCommit-seed#[3B2796BB2413CA10]) [    ] o.a.s.SolrTestCaseJ4 ###Ending testBackupOnCommit
   [junit4]   2> 193028 INFO  (TEST-TestReplicationHandlerBackup.testBackupOnCommit-seed#[3B2796BB2413CA10]) [    ] o.e.j.s.ServerConnector Stopped ServerConnector@13287bc6{HTTP/1.1}{127.0.0.1:0}
   [junit4]   2> 193029 INFO  (TEST-TestReplicationHandlerBackup.testBackupOnCommit-seed#[3B2796BB2413CA10]) [    ] o.a.s.c.CoreContainer Shutting down CoreContainer instance=1609839730
   [junit4]   2> 193029 INFO  (TEST-TestReplicationHandlerBackup.testBackupOnCommit-seed#[3B2796BB2413CA10]) [    x:collection1] o.a.s.c.SolrCore [collection1]  CLOSING SolrCore org.apache.solr.core.SolrCore@490afcc2
   [junit4]   2> 193029 INFO  (TEST-TestReplicationHandlerBackup.testBackupOnCommit-seed#[3B2796BB2413CA10]) [    x:collection1] o.a.s.u.DirectUpdateHandler2 closing DirectUpdateHandler2{commits=1,autocommits=0,soft autocommits=0,optimizes=0,rollbacks=0,expungeDeletes=0,docsPending=0,adds=0,deletesById=0,deletesByQuery=0,errors=0,cumulative_adds=17,cumulative_deletesById=0,cumulative_deletesByQuery=1,cumulative_errors=0}
   [junit4]   2> 193030 INFO  (TEST-TestReplicationHandlerBackup.testBackupOnCommit-seed#[3B2796BB2413CA10]) [    x:collection1] o.a.s.u.SolrCoreState Closing SolrCoreState
   [junit4]   2> 193030 INFO  (TEST-TestReplicationHandlerBackup.testBackupOnCommit-seed#[3B2796BB2413CA10]) [    x:collection1] o.a.s.u.DefaultSolrCoreState SolrCoreState ref count has reached 0 - closing IndexWriter
   [junit4]   2> 193030 INFO  (TEST-TestReplicationHandlerBackup.testBackupOnCommit-seed#[3B2796BB2413CA10]) [    x:collection1] o.a.s.u.DefaultSolrCoreState closing IndexWriter with IndexWriterCloser
   [junit4]   2> 193031 INFO  (TEST-TestReplicationHandlerBackup.testBackupOnCommit-seed#[3B2796BB2413CA10]) [    x:collection1] o.a.s.c.SolrCore [collection1] Closing main searcher on request.
   [junit4]   2> 193031 INFO  (TEST-TestReplicationHandlerBackup.testBackupOnCommit-seed#[3B2796BB2413CA10]) [    x:collection1] o.a.s.c.CachingDirectoryFactory Closing MockDirectoryFactory - 2 directories currently being tracked
   [junit4]   2> 193031 INFO  (TEST-TestReplicationHandlerBackup.testBackupOnCommit-seed#[3B2796BB2413CA10]) [    x:collection1] o.a.s.c.CachingDirectoryFactory looking to close /Users/jenkins/workspace/Lucene-Solr-5.x-MacOSX/solr/build/solr-core/test/J1/temp/solr.handler.TestReplicationHandlerBackup_3B2796BB2413CA10-001/solr-instance-001/./collection1/data/index [CachedDir<<refCount=0;path=/Users/jenkins/workspace/Lucene-Solr-5.x-MacOSX/solr/build/solr-core/test/J1/temp/solr.handler.TestReplicationHandlerBackup_3B2796BB2413CA10-001/solr-instance-001/./collection1/data/index;done=false>>]
   [junit4]   2> 193031 INFO  (TEST-TestReplicationHandlerBackup.testBackupOnCommit-seed#[3B2796BB2413CA10]) [    x:collection1] o.a.s.c.CachingDirectoryFactory Closing directory: /Users/jenkins/workspace/Lucene-Solr-5.x-MacOSX/solr/build/solr-core/test/J1/temp/solr.handler.TestReplicationHandlerBackup_3B2796BB2413CA10-001/solr-instance-001/./collection1/data/index
   [junit4]   2> 193031 INFO  (TEST-TestReplicationHandlerBackup.testBackupOnCommit-seed#[3B2796BB2413CA10]) [    x:collection1] o.a.s.c.CachingDirectoryFactory looking to close /Users/jenkins/workspace/Lucene-Solr-5.x-MacOSX/solr/build/solr-core/test/J1/temp/solr.handler.TestReplicationHandlerBackup_3B2796BB2413CA10-001/solr-instance-001/./collection1/data [CachedDir<<refCount=0;path=/Users/jenkins/workspace/Lucene-Solr-5.x-MacOSX/solr/build/solr-core/test/J1/temp/solr.handler.TestReplicationHandlerBackup_3B2796BB2413CA10-001/solr-instance-001/./collection1/data;done=false>>]
   [junit4]   2> 193032 INFO  (TEST-TestReplicationHandlerBackup.testBackupOnCommit-seed#[3B2796BB2413CA10]) [    x:collection1] o.a.s.c.CachingDirectoryFactory Closing directory: /Users/jenkins/workspace/Lucene-Solr-5.x-MacOSX/solr/build/solr-core/test/J1/temp/solr.handler.TestReplicationHandlerBackup_3B2796BB2413CA10-001/solr-instance-001/./collection1/data
   [junit4]   2> 193032 INFO  (TEST-TestReplicationHandlerBackup.testBackupOnCommit-seed#[3B2796BB2413CA10]) [    x:collection1] o.e.j.s.h.ContextHandler Stopped o.e.j.s.ServletContextHandler@994b9f5{/solr,null,UNAVAILABLE}
   [junit4]   2> 193036 INFO  (TEST-TestReplicationHandlerBackup.doTestBackup-seed#[3B2796BB2413CA10]) [    ] o.a.s.SolrTestCaseJ4 ###Starting doTestBackup
   [junit4]   2> 193036 INFO  (TEST-TestReplicationHandlerBackup.doTestBackup-seed#[3B2796BB2413CA10]) [    ] o.a.s.SolrTestCaseJ4 Writing core.properties file to /Users/jenkins/workspace/Lucene-Solr-5.x-MacOSX/solr/build/solr-core/test/J1/temp/solr.handler.TestReplicationHandlerBackup_3B2796BB2413CA10-001/solr-instance-002/collection1
   [junit4]   2> 193057 INFO  (TEST-TestReplicationHandlerBackup.doTestBackup-seed#[3B2796BB2413CA10]) [    ] o.e.j.s.Server jetty-9.2.13.v20150730
   [junit4]   2> 193060 INFO  (TEST-TestReplicationHandlerBackup.doTestBackup-seed#[3B2796BB2413CA10]) [    ] o.e.j.s.h.ContextHandler Started o.e.j.s.ServletContextHandler@6026b7dc{/solr,null,AVAILABLE}
   [junit4]   2> 193060 INFO  (TEST-TestReplicationHandlerBackup.doTestBackup-seed#[3B2796BB2413CA10]) [    ] o.e.j.s.ServerConnector Started ServerConnector@1a0466a8{HTTP/1.1}{127.0.0.1:59087}
   [junit4]   2> 193060 INFO  (TEST-TestReplicationHandlerBackup.doTestBackup-seed#[3B2796BB2413CA10]) [    ] o.e.j.s.Server Started @198729ms
   [junit4]   2> 193060 INFO  (TEST-TestReplicationHandlerBackup.doTestBackup-seed#[3B2796BB2413CA10]) [    ] o.a.s.c.s.e.JettySolrRunner Jetty properties: {solr.data.dir=/Users/jenkins/workspace/Lucene-Solr-5.x-MacOSX/solr/build/solr-core/test/J1/temp/solr.handler.TestReplicationHandlerBackup_3B2796BB2413CA10-001/solr-instance-002/collection1/data, hostContext=/solr, hostPort=59087}
   [junit4]   2> 193061 INFO  (TEST-TestReplicationHandlerBackup.doTestBackup-seed#[3B2796BB2413CA10]) [    ] o.a.s.s.SolrDispatchFilter SolrDispatchFilter.init(): sun.misc.Launcher$AppClassLoader@74a14482
   [junit4]   2> 193061 INFO  (TEST-TestReplicationHandlerBackup.doTestBackup-seed#[3B2796BB2413CA10]) [    ] o.a.s.c.SolrResourceLoader new SolrResourceLoader for directory: '/Users/jenkins/workspace/Lucene-Solr-5.x-MacOSX/solr/build/solr-core/test/J1/temp/solr.handler.TestReplicationHandlerBackup_3B2796BB2413CA10-001/solr-instance-002'
   [junit4]   2> 193061 INFO  (TEST-TestReplicationHandlerBackup.doTestBackup-seed#[3B2796BB2413CA10]) [    ] o.a.s.c.SolrResourceLoader JNDI not configured for solr (NoInitialContextEx)
   [junit4]   2> 193061 INFO  (TEST-TestReplicationHandlerBackup.doTestBackup-seed#[3B2796BB2413CA10]) [    ] o.a.s.c.SolrResourceLoader solr home defaulted to 'solr/' (could not find system property or JNDI)
   [junit4]   2> 193061 INFO  (TEST-TestReplicationHandlerBackup.doTestBackup-seed#[3B2796BB2413CA10]) [    ] o.a.s.c.SolrXmlConfig Loading container configuration from /Users/jenkins/workspace/Lucene-Solr-5.x-MacOSX/solr/build/solr-core/test/J1/temp/solr.handler.TestReplicationHandlerBackup_3B2796BB2413CA10-001/solr-instance-002/solr.xml
   [junit4]   2> 193087 INFO  (TEST-TestReplicationHandlerBackup.doTestBackup-seed#[3B2796BB2413CA10]) [    ] o.a.s.c.CorePropertiesLocator Config-defined core root directory: /Users/jenkins/workspace/Lucene-Solr-5.x-MacOSX/solr/build/solr-core/test/J1/temp/solr.handler.TestReplicationHandlerBackup_3B2796BB2413CA10-001/solr-instance-002/.
   [junit4]   2> 193087 INFO  (TEST-TestReplicationHandlerBackup.doTestBackup-seed#[3B2796BB2413CA10]) [    ] o.a.s.c.CoreContainer New CoreContainer 295964230
   [junit4]   2> 193087 INFO  (TEST-TestReplicationHandlerBackup.doTestBackup-seed#[3B2796BB2413CA10]) [    ] o.a.s.c.CoreContainer Loading cores into CoreContainer [instanceDir=/Users/jenkins/workspace/Lucene-Solr-5.x-MacOSX/solr/build/solr-core/test/J1/temp/solr.handler.TestReplicationHandlerBackup_3B2796BB2413CA10-001/solr-instance-002]
   [junit4]   2> 193087 WARN  (TEST-TestReplicationHandlerBackup.doTestBackup-seed#[3B2796BB2413CA10]) [    ] o.a.s.c.CoreContainer Couldn't add files from /Users/jenkins/workspace/Lucene-Solr-5.x-MacOSX/solr/build/solr-core/test/J1/temp/solr.handler.TestReplicationHandlerBackup_3B2796BB2413CA10-001/solr-instance-002/lib to classpath: /Users/jenkins/workspace/Lucene-Solr-5.x-MacOSX/solr/build/solr-core/test/J1/temp/solr.handler.TestReplicationHandlerBackup_3B2796BB2413CA10-001/solr-instance-002/lib
   [junit4]   2> 193088 INFO  (TEST-TestReplicationHandlerBackup.doTestBackup-seed#[3B2796BB2413CA10]) [    ] o.a.s.h.c.HttpShardHandlerFactory created with socketTimeout : 90000,urlScheme : ,connTimeout : 15000,maxConnectionsPerHost : 20,maxConnections : 10000,corePoolSize : 0,maximumPoolSize : 2147483647,maxThreadIdleTime : 5,sizeOfQueue : -1,fairnessPolicy : false,useRetries : false,
   [junit4]   2> 193089 INFO  (TEST-TestReplicationHandlerBackup.doTestBackup-seed#[3B2796BB2413CA10]) [    ] o.a.s.u.UpdateShardHandler Creating UpdateShardHandler HTTP client with params: socketTimeout=340000&connTimeout=45000&retry=true
   [junit4]   2> 193089 INFO  (TEST-TestReplicationHandlerBackup.doTestBackup-seed#[3B2796BB2413CA10]) [    ] o.a.s.l.LogWatcher SLF4J impl is org.slf4j.impl.Log4jLoggerFactory
   [junit4]   2> 193089 INFO  (TEST-TestReplicationHandlerBackup.doTestBackup-seed#[3B2796BB2413CA10]) [    ] o.a.s.l.LogWatcher Registering Log Listener [Log4j (org.slf4j.impl.Log4jLoggerFactory)]
   [junit4]   2> 193089 INFO  (TEST-TestReplicationHandlerBackup.doTestBackup-seed#[3B2796BB2413CA10]) [    ] o.a.s.c.CoreContainer Security conf doesn't exist. Skipping setup for authorization module.
   [junit4]   2> 193089 INFO  (TEST-TestReplicationHandlerBackup.doTestBackup-seed#[3B2796BB2413CA10]) [    ] o.a.s.c.CoreContainer No authentication plugin used.
   [junit4]   2> 193090 INFO  (TEST-TestReplicationHandlerBackup.doTestBackup-seed#[3B2796BB2413CA10]) [    ] o.a.s.c.CorePropertiesLocator Looking for core definitions underneath /Users/jenkins/workspace/Lucene-Solr-5.x-MacOSX/solr/build/solr-core/test/J1/temp/solr.handler.TestReplicationHandlerBackup_3B2796BB2413CA10-001/solr-instance-002/.
   [junit4]   2> 193092 INFO  (TEST-TestReplicationHandlerBackup.doTestBackup-seed#[3B2796BB2413CA10]) [    ] o.a.s.c.CoreDescriptor Created CoreDescriptor: {name=collection1, config=solrconfig.xml, loadOnStartup=true, schema=schema.xml, configSetProperties=configsetprops.json, transient=false, dataDir=data/}
   [junit4]   2> 193092 INFO  (TEST-TestReplicationHandlerBackup.doTestBackup-seed#[3B2796BB2413CA10]) [    ] o.a.s.c.CorePropertiesLocator Found core collection1 in /Users/jenkins/workspace/Lucene-Solr-5.x-MacOSX/solr/build/solr-core/test/J1/temp/solr.handler.TestReplicationHandlerBackup_3B2796BB2413CA10-001/solr-instance-002/./collection1
   [junit4]   2> 193092 INFO  (TEST-TestReplicationHandlerBackup.doTestBackup-seed#[3B2796BB2413CA10]) [    ] o.a.s.c.CorePropertiesLocator Found 1 core definitions
   [junit4]   2> 193092 INFO  (coreLoadExecutor-802-thread-1) [    ] o.a.s.c.SolrResourceLoader new SolrResourceLoader for directory: '/Users/jenkins/workspace/Lucene-Solr-5.x-MacOSX/solr/build/solr-core/test/J1/temp/solr.handler.TestReplicationHandlerBackup_3B2796BB2413CA10-001/solr-instance-002/collection1'
   [junit4]   2> 193093 INFO  (TEST-TestReplicationHandlerBackup.doTestBackup-seed#[3B2796BB2413CA10]) [    ] o.a.s.s.SolrDispatchFilter user.dir=/Users/jenkins/workspace/Lucene-Solr-5.x-MacOSX/solr/build/solr-core/test/J1
   [junit4]   2> 193093 INFO  (coreLoadExecutor-802-thread-1) [    ] o.a.s.c.SolrResourceLoader JNDI not configured for solr (NoInitialContextEx)
   [junit4]   2> 193093 INFO  (coreLoadExecutor-802-thread-1) [    ] o.a.s.c.SolrResourceLoader solr home defaulted to 'solr/' (could not find system property or JNDI)
   [junit4]   2> 193093 INFO  (TEST-TestReplicationHandlerBackup.doTestBackup-seed#[3B2796BB2413CA10]) [    ] o.a.s.s.SolrDispatchFilter SolrDispatchFilter.init() done
   [junit4]   2> 193103 INFO  (coreLoadExecutor-802-thread-1) [    ] o.a.s.c.SolrConfig current version of requestparams : -1
   [junit4]   2> 193105 INFO  (coreLoadExecutor-802-thread-1) [    ] o.a.s.c.SolrConfig Using Lucene MatchVersion: 5.5.0
   [junit4]   2> 193110 INFO  (coreLoadExecutor-802-thread-1) [    ] o.a.s.c.SolrConfig Loaded SolrConfig: solrconfig.xml
   [junit4]   2> 193113 INFO  (coreLoadExecutor-802-thread-1) [    ] o.a.s.s.IndexSchema [collection1] Schema name=test
   [junit4]   2> 193116 INFO  (coreLoadExecutor-802-thread-1) [    ] o.a.s.s.IndexSchema unique key field: id
   [junit4]   2> 193119 INFO  (coreLoadExecutor-802-thread-1) [    ] o.a.s.c.ConfigSetProperties Did not find ConfigSet properties, assuming default properties: Can't find resource 'configsetprops.json' in classpath or '/Users/jenkins/workspace/Lucene-Solr-5.x-MacOSX/solr/build/solr-core/test/J1/temp/solr.handler.TestReplicationHandlerBackup_3B2796BB2413CA10-001/solr-instance-002/collection1'
   [junit4]   2> 193119 INFO  (coreLoadExecutor-802-thread-1) [    ] o.a.s.c.CoreContainer Creating SolrCore 'collection1' using configuration from instancedir /Users/jenkins/workspace/Lucene-Solr-5.x-MacOSX/solr/build/solr-core/test/J1/temp/solr.handler.TestReplicationHandlerBackup_3B2796BB2413CA10-001/solr-instance-002/./collection1
   [junit4]   2> 193119 INFO  (coreLoadExecutor-802-thread-1) [    x:collection1] o.a.s.c.SolrCore org.apache.solr.core.MockDirectoryFactory
   [junit4]   2> 193119 INFO  (coreLoadExecutor-802-thread-1) [    x:collection1] o.a.s.c.SolrCore [[collection1] ] Opening new SolrCore at [/Users/jenkins/workspace/Lucene-Solr-5.x-MacOSX/solr/build/solr-core/test/J1/temp/solr.handler.TestReplicationHandlerBackup_3B2796BB2413CA10-001/solr-instance-002/collection1], dataDir=[/Users/jenkins/workspace/Lucene-Solr-5.x-MacOSX/solr/build/solr-core/test/J1/temp/solr.handler.TestReplicationHandlerBackup_3B2796BB2413CA10-001/solr-instance-002/./collection1/data/]
   [junit4]   2> 193119 INFO  (coreLoadExecutor-802-thread-1) [    x:collection1] o.a.s.c.SolrCore JMX monitoring not detected for core: collection1
   [junit4]   2> 193119 INFO  (coreLoadExecutor-802-thread-1) [    x:collection1] o.a.s.c.CachingDirectoryFactory return new directory for /Users/jenkins/workspace/Lucene-Solr-5.x-MacOSX/solr/build/solr-core/test/J1/temp/solr.handler.TestReplicationHandlerBackup_3B2796BB2413CA10-001/solr-instance-002/./collection1/data
   [junit4]   2> 193119 INFO  (coreLoadExecutor-802-thread-1) [    x:collection1] o.a.s.c.SolrCore New index directory detected: old=null new=/Users/jenkins/workspace/Lucene-Solr-5.x-MacOSX/solr/build/solr-core/test/J1/temp/solr.handler.TestReplicationHandlerBackup_3B2796BB2413CA10-001/solr-instance-002/./collection1/data/index/
   [junit4]   2> 193119 WARN  (coreLoadExecutor-802-thread-1) [    x:collection1] o.a.s.c.SolrCore [collection1] Solr index directory '/Users/jenkins/workspace/Lucene-Solr-5.x-MacOSX/solr/build/solr-core/test/J1/temp/solr.handler.TestReplicationHandlerBackup_3B2796BB2413CA10-001/solr-instance-002/./collection1/data/index' doesn't exist. Creating new index...
   [junit4]   2> 193120 INFO  (coreLoadExecutor-802-thread-1) [    x:collection1] o.a.s.c.CachingDirectoryFactory return new directory for /Users/jenkins/workspace/Lucene-Solr-5.x-MacOSX/solr/build/solr-core/test/J1/temp/solr.handler.TestReplicationHandlerBackup_3B2796BB2413CA10-001/solr-instance-002/./collection1/data/index
   [junit4]   2> 193121 INFO  (coreLoadExecutor-802-thread-1) [    x:collection1] o.a.s.u.RandomMergePolicy RandomMergePolicy wrapping class org.apache.lucene.index.AlcoholicMergePolicy: [AlcoholicMergePolicy: minMergeSize=0, mergeFactor=10, maxMergeSize=602761309, maxMergeSizeForForcedMerge=9223372036854775807, calibrateSizeByDeletes=true, maxMergeDocs=2147483647, maxCFSSegmentSizeMB=8.796093022207999E12, noCFSRatio=0.1]
   [junit4]   2> 193121 INFO  (coreLoadExecutor-802-thread-1) [    x:collection1] o.a.s.c.SolrDeletionPolicy SolrDeletionPolicy.onCommit: commits: num=1
   [junit4]   2> 	commit{dir=MockDirectoryWrapper(RAMDirectory@602f3074 lockFactory=org.apache.lucene.store.SingleInstanceLockFactory@651e67b5),segFN=segments_1,generation=1}
   [junit4]   2> 193121 INFO  (coreLoadExecutor-802-thread-1) [    x:collection1] o.a.s.c.SolrDeletionPolicy newest commit generation = 1
   [junit4]   2> 193124 INFO  (OldIndexDirectoryCleanupThreadForCore-collection1) [    x:collection1] o.a.s.c.SolrCore Looking for old index directories to cleanup for core collection1 in /Users/jenkins/workspace/Lucene-Solr-5.x-MacOSX/solr/build/solr-core/test/J1/temp/solr.handler.TestReplicationHandlerBackup_3B2796BB2413CA10-001/solr-instance-002/./collection1/data/
   [junit4]   2> 193125 INFO  (coreLoadExecutor-802-thread-1) [    x:collection1] o.a.s.c.SolrCore no updateRequestProcessorChain defined as default, creating implicit default
   [junit4]   2> 193129 INFO  (coreLoadExecutor-802-thread-1) [    x:collection1] o.a.s.h.l.XMLLoader xsltCacheLifetimeSeconds=60
   [junit4]   2> 193130 INFO  (coreLoadExecutor-802-thread-1) [    x:collection1] o.a.s.h.l.XMLLoader xsltCacheLifetimeSeconds=60
   [junit4]   2> 193130 INFO  (coreLoadExecutor-802-thread-1) [    x:collection1] o.a.s.h.l.XMLLoader xsltCacheLifetimeSeconds=60
   [junit4]   2> 193131 INFO  (coreLoadExecutor-802-thread-1) [    x:collection1] o.a.s.h.l.XMLLoader xsltCacheLifetimeSeconds=60
   [junit4]   2> 193133 INFO  (coreLoadExecutor-802-thread-1) [    x:collection1] o.a.s.c.RequestHandlers Registered paths: /admin/mbeans,standard,/update/csv,/update/json/docs,/admin/luke,/admin/segments,/get,/admin/system,/replication,/admin/properties,/config,/schema,/admin/plugins,/admin/logging,/update/json,/admin/threads,/admin/ping,/update,/admin/file
   [junit4]   2> 193133 INFO  (coreLoadExecutor-802-thread-1) [    x:collection1] o.a.s.c.SolrCore Using default statsCache cache: org.apache.solr.search.stats.LocalStatsCache
   [junit4]   2> 193133 INFO  (coreLoadExecutor-802-thread-1) [    x:collection1] o.a.s.u.CommitTracker Hard AutoCommit: disabled
   [junit4]   2> 193133 INFO  (coreLoadExecutor-802-thread-1) [    x:collection1] o.a.s.u.CommitTracker Soft AutoCommit: disabled
   [junit4]   2> 193134 INFO  (coreLoadExecutor-802-thread-1) [    x:collection1] o.a.s.u.RandomMergePolicy RandomMergePolicy wrapping class org.apache.lucene.index.AlcoholicMergePolicy: [AlcoholicMergePolicy: minMergeSize=0, mergeFactor=10, maxMergeSize=1744686037, maxMergeSizeForForcedMerge=9223372036854775807, calibrateSizeByDeletes=true, maxMergeDocs=2147483647, maxCFSSegmentSizeMB=8.796093022207999E12, noCFSRatio=0.1]
   [junit4]   2> 193134 INFO  (coreLoadExecutor-802-thread-1) [    x:collection1] o.a.s.c.SolrDeletionPolicy SolrDeletionPolicy.onInit: commits: num=1
   [junit4]   2> 	commit{dir=MockDirectoryWrapper(RAMDirectory@602f3074 lockFactory=org.apache.lucene.store.SingleInstanceLockFactory@651e67b5),segFN=segments_1,generation=1}
   [junit4]   2> 193134 INFO  (coreLoadExecutor-802-thread-1) [    x:collection1] o.a.s.c.SolrDeletionPolicy newest commit generation = 1
   [junit4]   2> 193134 INFO  (coreLoadExecutor-802-thread-1) [    x:collection1] o.a.s.s.SolrIndexSearcher Opening Searcher@584e6acb[collection1] main
   [junit4]   2> 193134 INFO  (coreLoadExecutor-802-thread-1) [    x:collection1] o.a.s.r.ManagedResourceStorage File-based storage initialized to use dir: /Users/jenkins/workspace/Lucene-Solr-5.x-MacOSX/solr/build/solr-core/test/J1/temp/solr.handler.TestReplicationHandlerBackup_3B2796BB2413CA10-001/solr-instance-002/collection1/conf
   [junit4]   2> 193134 INFO  (coreLoadExecutor-802-thread-1) [    x:collection1] o.a.s.r.RestManager Initializing RestManager with initArgs: {storageDir=/Users/jenkins/workspace/Lucene-Solr-5.x-MacOSX/solr/build/solr-core/test/J1/temp/solr.handler.TestReplicationHandlerBackup_3B2796BB2413CA10-001/solr-instance-002/collection1/conf}
   [junit4]   2> 193134 INFO  (coreLoadExecutor-802-thread-1) [    x:collection1] o.a.s.r.ManagedResourceStorage Reading _rest_managed.json using file:dir=/Users/jenkins/workspace/Lucene-Solr-5.x-MacOSX/solr/build/solr-core/test/J1/temp/solr.handler.TestReplicationHandlerBackup_3B2796BB2413CA10-001/solr-instance-002/collection1/conf
   [junit4]   2> 193134 INFO  (coreLoadExecutor-802-thread-1) [    x:collection1] o.a.s.r.RestManager Initializing 0 registered ManagedResources
   [junit4]   2> 193135 INFO  (coreLoadExecutor-802-thread-1) [    x:collection1] o.a.s.h.ReplicationHandler Replication enabled for following config files: schema-replication2.xml:schema.xml
   [junit4]   2> 193135 INFO  (coreLoadExecutor-802-thread-1) [    x:collection1] o.a.s.h.ReplicationHandler Commits will be reserved for  10000
   [junit4]   2> 193135 INFO  (coreLoadExecutor-802-thread-1) [    x:collection1] o.a.s.c.CoreContainer registering core: collection1
   [junit4]   2> 193135 INFO  (searcherExecutor-803-thread-1-processing-x:collection1) [    x:collection1] o.a.s.c.SolrCore [collection1] Registered new searcher Searcher@584e6acb[collection1] main{ExitableDirectoryReader(UninvertingDirectoryReader())}
   [junit4]   2> 193600 INFO  (qtp394730340-1315) [    x:collection1] o.a.s.u.DirectUpdateHandler2 [collection1] REMOVING ALL DOCUMENTS FROM INDEX
   [junit4]   2> 193601 INFO  (qtp394730340-1315) [    x:collection1] o.a.s.u.p.LogUpdateProcessorFactory [collection1]  webapp=/solr path=/update params={wt=javabin&version=2}{deleteByQuery=*:*} 0 1
   [junit4]   2> 193606 INFO  (qtp394730340-1316) [    x:collection1] o.a.s.u.p.LogUpdateProcessorFactory [collection1]  webapp=/solr path=/update params={wt=javabin&version=2}{add=[0]} 0 1
   [junit4]   2> 193610 INFO  (qtp394730340-1317) [    x:collection1] o.a.s.u.p.LogUpdateProcessorFactory [collection1]  webapp=/solr path=/update params={wt=javabin&version=2}{add=[1]} 0 0
   [junit4]   2> 193613 INFO  (qtp394730340-1318) [    x:collection1] o.a.s.u.p.LogUpdateProcessorFactory [collection1]  webapp=/solr path=/update params={wt=javabin&version=2}{add=[2]} 0 0
   [junit4]   2> 193615 INFO  (qtp394730340-1319) [    x:collection1] o.a.s.u.p.LogUpdateProcessorFactory [collection1]  webapp=/solr path=/update params={wt=javabin&version=2}{add=[3]} 0 0
   [junit4]   2> 193618 INFO  (qtp394730340-1320) [    x:collection1] o.a.s.u.p.LogUpdateProcessorFactory [collection1]  webapp=/solr path=/update params={wt=javabin&version=2}{add=[4]} 0 0
   [junit4]   2> 193620 INFO  (qtp394730340-1315) [    x:collection1] o.a.s.u.p.LogUpdateProcessorFactory [collection1]  webapp=/solr path=/update params={wt=javabin&version=2}{add=[5]} 0 0
   [junit4]   2> 193623 INFO  (qtp394730340-1316) [    x:collection1] o.a.s.u.p.LogUpdateProcessorFactory [collection1]  webapp=/solr path=/update params={wt=javabin&version=2}{add=[6]} 0 0
   [junit4]   2> 193625 INFO  (qtp394730340-1317) [    x:collection1] o.a.s.u.p.LogUpdateProcessorFactory [collection1]  webapp=/solr path=/update params={wt=javabin&version=2}{add=[7]} 0 0
   [junit4]   2> 193627 INFO  (qtp394730340-1318) [    x:collection1] o.a.s.u.p.LogUpdateProcessorFactory [collection1]  webapp=/solr path=/update params={wt=javabin&version=2}{add=[8]} 0 0
   [junit4]   2> 193630 INFO  (qtp394730340-1319) [    x:collection1] o.a.s.u.p.LogUpdateProcessorFactory [collection1]  webapp=/solr path=/update params={wt=javabin&version=2}{add=[9]} 0 0
   [junit4]   2> 193633 INFO  (qtp394730340-1320) [    x:collection1] o.a.s.u.p.LogUpdateProcessorFactory [collection1]  webapp=/solr path=/update params={wt=javabin&version=2}{add=[10]} 0 0
   [junit4]   2> 193637 INFO  (qtp394730340-1315) [    x:collection1] o.a.s.u.p.LogUpdateProcessorFactory [collection1]  webapp=/solr path=/update params={wt=javabin&version=2}{add=[11]} 0 0
   [junit4]   2> 193640 INFO  (qtp394730340-1316) [    x:collection1] o.a.s.u.p.LogUpdateProcessorFactory [collection1]  webapp=/solr path=/update params={wt=javabin&version=2}{add=[12]} 0 0
   [junit4]   2> 193642 INFO  (qtp394730340-1317) [    x:collection1] o.a.s.u.p.LogUpdateProcessorFactory [collection1]  webapp=/solr path=/update params={wt=javabin&version=2}{add=[13]} 0 0
   [junit4]   2> 193644 INFO  (qtp394730340-1318) [    x:collection1] o.a.s.u.p.LogUpdateProcessorFactory [collection1]  webapp=/solr path=/update params={wt=javabin&version=2}{add=[14]} 0 0
   [junit4]   2> 193647 INFO  (qtp394730340-1319) [    x:collection1] o.a.s.u.p.LogUpdateProcessorFactory [collection1]  webapp=/solr path=/update params={wt=javabin&version=2}{add=[15]} 0 0
   [junit4]   2> 193649 INFO  (qtp394730340-1320) [    x:collection1] o.a.s.u.p.LogUpdateProcessorFactory [collection1]  webapp=/solr path=/update params={wt=javabin&version=2}{add=[16]} 0 0
   [junit4]   2> 193651 INFO  (qtp394730340-1315) [    x:collection1] o.a.s.u.p.LogUpdateProcessorFactory [collection1]  webapp=/solr path=/update params={wt=javabin&version=2}{add=[17]} 0 0
   [junit4]   2> 193654 INFO  (qtp394730340-1316) [    x:collection1] o.a.s.u.p.LogUpdateProcessorFactory [collection1]  webapp=/solr path=/update params={wt=javabin&version=2}{add=[18]} 0 0
   [junit4]   2> 193656 INFO  (qtp394730340-1317) [    x:collection1] o.a.s.u.p.LogUpdateProcessorFactory [collection1]  webapp=/solr path=/update params={wt=javabin&version=2}{add=[19]} 0 0
   [junit4]   2> 193659 INFO  (qtp394730340-1318) [    x:collection1] o.a.s.u.p.LogUpdateProcessorFactory [collection1]  webapp=/solr path=/update params={wt=javabin&version=2}{add=[20]} 0 0
   [junit4]   2> 193662 INFO  (qtp394730340-1319) [    x:collection1] o.a.s.u.p.LogUpdateProcessorFactory [collection1]  webapp=/solr path=/update params={wt=javabin&version=2}{add=[21]} 0 0
   [junit4]   2> 193666 INFO  (qtp394730340-1320) [    x:collection1] o.a.s.u.p.LogUpdateProcessorFactory [collection1]  webapp=/solr path=/update params={wt=javabin&version=2}{add=[22]} 0 0
   [junit4]   2> 193668 INFO  (qtp394730340-1315) [    x:collection1] o.a.s.u.p.LogUpdateProcessorFactory [collection1]  webapp=/solr path=/update params={wt=javabin&version=2}{add=[23]} 0 0
   [junit4]   2> 193671 INFO  (qtp394730340-1316) [    x:collection1] o.a.s.u.p.LogUpdateProcessorFactory [collection1]  webapp=/solr path=/update params={wt=javabin&version=2}{add=[24]} 0 0
   [junit4]   2> 193673 INFO  (qtp394730340-1317) [    x:collection1] o.a.s.u.p.LogUpdateProcessorFactory [collection1]  webapp=/solr path=/update params={wt=javabin&version=2}{add=[25]} 0 0
   [junit4]   2> 193676 INFO  (qtp394730340-1318) [    x:collection1] o.a.s.u.p.LogUpdateProcessorFactory [collection1]  webapp=/solr path=/update params={wt=javabin&version=2}{add=[26]} 0 0
   [junit4]   2> 193679 INFO  (qtp394730340-1319) [    x:collection1] o.a.s.u.p.LogUpdateProcessorFactory [collection1]  webapp=/solr path=/update params={wt=javabin&version=2}{add=[27]} 0 0
   [junit4]   2> 193682 INFO  (qtp394730340-1320) [    x:collection1] o.a.s.u.p.LogUpdateProcessorFactory [collection1]  webapp=/solr path=/update params={wt=javabin&version=2}{add=[28]} 0 0
   [junit4]   2> 193684 INFO  (qtp394730340-1315) [    x:collection1] o.a.s.u.p.LogUpdateProcessorFactory [collection1]  webapp=/solr path=/update params={wt=javabin&version=2}{add=[29]} 0 0
   [junit4]   2> 193687 INFO  (qtp394730340-1316) [    x:collection1] o.a.s.u.p.LogUpdateProcessorFactory [collection1]  webapp=/solr path=/update params={wt=javabin&version=2}{add=[30]} 0 0
   [junit4]   2> 193689 INFO  (qtp394730340-1317) [    x:collection1] o.a.s.u.p.LogUpdateProcessorFactory [collection1]  webapp=/solr path=/update params={wt=javabin&version=2}{add=[31]} 0 0
   [junit4]   2> 193692 INFO  (qtp394730340-1318) [    x:collection1] o.a.s.u.p.LogUpdateProcessorFactory [collection1]  webapp=/solr path=/update params={wt=javabin&version=2}{add=[32]} 0 0
   [junit4]   2> 193694 INFO  (qtp394730340-1319) [    x:collection1] o.a.s.u.p.LogUpdateProcessorFactory [collection1]  webapp=/solr path=/update params={wt=javabin&version=2}{add=[33]} 0 0
   [junit4]   2> 193696 INFO  (qtp394730340-1320) [    x:collection1] o.a.s.u.p.LogUpdateProcessorFactory [collection1]  webapp=/solr path=/update params={wt=javabin&version=2}{add=[34]} 0 0
   [junit4]   2> 193699 INFO  (qtp394730340-1315) [    x:collection1] o.a.s.u.p.LogUpdateProcessorFactory [collection1]  webapp=/solr path=/update params={wt=javabin&version=2}{add=[35]} 0 0
   [junit4]   2> 193701 INFO  (qtp394730340-1316) [    x:collection1] o.a.s.u.p.LogUpdateProcessorFactory [collection1]  webapp=/solr path=/update params={wt=javabin&version=2}{add=[36]} 0 0
   [junit4]   2> 193704 INFO  (qtp394730340-1317) [    x:collection1] o.a.s.u.p.LogUpdateProcessorFactory [collection1]  webapp=/solr path=/update params={wt=javabin&version=2}{add=[37]} 0 0
   [junit4]   2> 193707 INFO  (qtp394730340-1318) [    x:collection1] o.a.s.u.p.LogUpdateProcessorFactory [collection1]  webapp=/solr path=/update params={wt=javabin&version=2}{add=[38]} 0 0
   [junit4]   2> 193709 INFO  (qtp394730340-1319) [    x:collection1] o.a.s.u.p.LogUpdateProcessorFactory [collection1]  webapp=/solr path=/update params={wt=javabin&version=2}{add=[39]} 0 0
   [junit4]   2> 193712 INFO  (qtp394730340-1320) [    x:collection1] o.a.s.u.p.LogUpdateProcessorFactory [collection1]  webapp=/solr path=/update params={wt=javabin&version=2}{add=[40]} 0 0
   [junit4]   2> 193715 INFO  (qtp394730340-1315) [    x:collection1] o.a.s.u.p.LogUpdateProcessorFactory [collection1]  webapp=/solr path=/update params={wt=javabin&version=2}{add=[41]} 0 0
   [junit4]   2> 193719 INFO  (qtp394730340-1316) [    x:collection1] o.a.s.u.p.LogUpdateProcessorFactory [collection1]  webapp=/solr path=/update params={wt=javabin&version=2}{add=[42]} 0 0
   [junit4]   2> 193722 INFO  (qtp394730340-1317) [    x:collection1] o.a.s.u.p.LogUpdateProcessorFactory [collection1]  webapp=/solr path=/update params={wt=javabin&version=2}{add=[43]} 0 0
   [junit4]   2> 193724 INFO  (qtp394730340-1318) [    x:collection1] o.a.s.u.p.LogUpdateProcessorFactory [collection1]  webapp=/solr path=/update params={wt=javabin&version=2}{add=[44]} 0 0
   [junit4]   2> 193727 INFO  (qtp394730340-1319) [    x:collection1] o.a.s.u.p.LogUpdateProcessorFactory [collection1]  webapp=/solr path=/update params={wt=javabin&version=2}{add=[45]} 0 0
   [junit4]   2> 193729 INFO  (qtp394730340-1320) [    x:collection1] o.a.s.u.p.LogUpdateProcessorFactory [collection1]  webapp=/solr path=/update params={wt=javabin&version=2}{add=[46]} 0 0
   [junit4]   2> 193732 INFO  (qtp394730340-1315) [    x:collection1] o.a.s.u.p.LogUpdateProcessorFactory [collection1]  webapp=/solr path=/update params={wt=javabin&version=2}{add=[47]} 0 0
   [junit4]   2> 193735 INFO  (qtp394730340-1316) [    x:collection1] o.a.s.u.p.LogUpdateProcessorFactory [collection1]  webapp=/solr path=/update params={wt=javabin&version=2}{add=[48]} 0 0
   [junit4]   2> 193740 INFO  (qtp394730340-1317) [    x:collection1] o.a.s.u.p.LogUpdateProcessorFactory [collection1]  webapp=/solr path=/update params={wt=javabin&version=2}{add=[49]} 0 1
   [junit4]   2> 193744 INFO  (qtp394730340-1318) [    x:collection1] o.a.s.u.p.LogUpdateProcessorFactory [collection1]  webapp=/solr path=/update params={wt=javabin&version=2}{add=[50]} 0 0
   [junit4]   2> 193747 INFO  (qtp394730340-1319) [    x:collection1] o.a.s.u.p.LogUpdateProcessorFactory [collection1]  webapp=/solr path=/update params={wt=javabin&version=2}{add=[51]} 0 0
   [junit4]   2> 193749 INFO  (qtp394730340-1320) [    x:collection1] o.a.s.u.p.LogUpdateProcessorFactory [collection1]  webapp=/solr path=/update params={wt=javabin&version=2}{add=[52]} 0 0
   [junit4]   2> 193752 INFO  (qtp394730340-1315) [    x:collection1] o.a.s.u.p.LogUpdateProcessorFactory [collection1]  webapp=/solr path=/update params={wt=javabin&version=2}{add=[53]} 0 0
   [junit4]   2> 193754 INFO  (qtp394730340-1316) [    x:collection1] o.a.s.u.p.LogUpdateProcessorFactory [collection1]  webapp=/solr path=/update params={wt=javabin&version=2}{add=[54]} 0 0
   [junit4]   2> 193757 INFO  (qtp394730340-1317) [    x:collection1] o.a.s.u.p.LogUpdateProcessorFactory [collection1]  webapp=/solr path=/update params={wt=javabin&version=2}{add=[55]} 0 0
   [junit4]   2> 193760 INFO  (qtp394730340-1318) [    x:collection1] o.a.s.u.p.LogUpdateProcessorFactory [collection1]  webapp=/solr path=/update params={wt=javabin&version=2}{add=[56]} 0 0
   [junit4]   2> 193763 INFO  (qtp394730340-1319) [    x:collection1] o.a.s.u.p.LogUpdateProcessorFactory [collection1]  webapp=/solr path=/update params={wt=javabin&version=2}{add=[57]} 0 0
   [junit4]   2> 193765 INFO  (qtp394730340-1320) [    x:collection1] o.a.s.u.p.LogUpdateProcessorFactory [collection1]  webapp=/solr path=/update params={wt=javabin&version=2}{add=[58]} 0 0
   [junit4]   2> 193769 INFO  (qtp394730340-1315) [    x:collection1] o.a.s.u.p.LogUpdateProcessorFactory [collection1]  webapp=/solr path=/update params={wt=javabin&version=2}{add=[59]} 0 0
   [junit4]   2> 193773 INFO  (qtp394730340-1316) [    x:collection1] o.a.s.u.p.LogUpdateProcessorFactory [collection1]  webapp=/solr path=/update params={wt=javabin&version=2}{add=[60]} 0 0
   [junit4]   2> 193775 INFO  (qtp394730340-1317) [    x:collection1] o.a.s.u.p.LogUpdateProcessorFactory [collection1]  webapp=/solr path=/update params={wt=javabin&version=2}{add=[61]} 0 0
   [junit4]   2> 193778 INFO  (qtp394730340-1318) [    x:collection1] o.a.s.u.p.LogUpdateProcessorFactory [collection1]  webapp=/solr path=/update params={wt=javabin&version=2}{add=[62]} 0 0
   [junit4]   2> 193782 INFO  (qtp394730340-1319) [    x:collection1] o.a.s.u.p.LogUpdateProcessorFactory [collection1]  webapp=/solr path=/update params={wt=javabin&version=2}{add=[63]} 0 0
   [junit4]   2> 193787 INFO  (qtp394730340-1320) [    x:collection1] o.a.s.u.p.LogUpdateProcessorFactory [collection1]  webapp=/solr path=/update params={wt=javabin&version=2}{add=[64]} 0 2
   [junit4]   2> 193789 INFO  (qtp394730340-1315) [    x:collection1] o.a.s.u.p.LogUpdateProcessorFactory [collection1]  webapp=/solr path=/update params={wt=javabin&version=2}{add=[65]} 0 0
   [junit4]   2> 193793 INFO  (qtp394730340-1316) [    x:collection1] o.a.s.u.p.LogUpdateProcessorFactory [collection1]  webapp=/solr path=/update params={wt=javabin&version=2}{add=[66]} 0 0
   [junit4]   2> 193796 INFO  (qtp394730340-1317) [    x:collection1] o.a.s.u.p.LogUpdateProcessorFactory [collection1]  webapp=/solr path=/update params={wt=javabin&version=2}{add=[67]} 0 0
   [junit4]   2> 193799 INFO  (qtp394730340-1318) [    x:collection1] o.a.s.u.p.LogUpdateProcessorFactory [collection1]  webapp=/solr path=/update params={wt=javabin&version=2}{add=[68]} 0 0
   [junit4]   2> 193802 INFO  (qtp394730340-1319) [    x:collection1] o.a.s.u.p.LogUpdateProcessorFactory [collection1]  webapp=/solr path=/update params={wt=javabin&version=2}{add=[69]} 0 0
   [junit4]   2> 193806 INFO  (qtp394730340-1320) [    x:collection1] o.a.s.u.p.LogUpdateProcessorFactory [collection1]  webapp=/solr path=/update params={wt=javabin&version=2}{add=[70]} 0 0
   [junit4]   2> 193809 INFO  (qtp394730340-1315) [    x:collection1] o.a.s.u.p.LogUpdateProcessorFactory [collection1]  webapp=/solr path=/update params={wt=javabin&version=2}{add=[71]} 0 0
   [junit4]   2> 193811 INFO  (qtp394730340-1316) [    x:collection1] o.a.s.u.p.LogUpdateProcessorFactory [collection1]  webapp=/solr path=/update params={wt=javabin&version=2}{add=[72]} 0 0
   [junit4]   2> 193814 INFO  (qtp394730340-1317) [    x:collection1] o.a.s.u.p.LogUpdateProcessorFactory [collection1]  webapp=/solr path=/update params={wt=javabin&version=2}{add=[73]} 0 0
   [junit4]   2> 193817 INFO  (qtp394730340-1318) [    x:collection1] o.a.s.u.p.LogUpdateProcessorFactory [collection1]  webapp=/solr path=/update params={wt=javabin&version=2}{add=[74]} 0 0
   [junit4]   2> 193819 INFO  (qtp394730340-1319) [    x:collection1] o.a.s.u.p.LogUpdateProcessorFactory [collection1]  webapp=/solr path=/update params={wt=javabin&version=2}{add=[75]} 0 0
   [junit4]   2> 193828 INFO  (qtp394730340-1320) [    x:collection1] o.a.s.u.p.LogUpdateProcessorFactory [collection1]  webapp=/solr path=/update params={wt=javabin&version=2}{add=[76]} 0 1
   [junit4]   2> 193832 INFO  (qtp394730340-1315) [    x:collection1] o.a.s.u.p.LogUpdateProcessorFactory [collection1]  webapp=/solr path=/update params={wt=javabin&version=2}{add=[77]} 0 0
   [junit4]   2> 193834 INFO  (qtp394730340-1316) [    x:collection1] o.a.s.u.p.LogUpdateProcessorFactory [collection1]  webapp=/solr path=/update params={wt=javabin&version=2}{add=[78]} 0 0
   [junit4]   2> 193837 INFO  (qtp394730340-1317) [    x:collection1] o.a.s.u.p.LogUpdateProcessorFactory [collection1]  webapp=/solr path=/update params={wt=javabin&version=2}{add=[79]} 0 0
   [junit4]   2> 193841 INFO  (qtp394730340-1318) [    x:collection1] o.a.s.u.p.LogUpdateProcessorFactory [collection1]  webapp=/solr path=/update params={wt=javabin&version=2}{add=[80]} 0 0
   [junit4]   2> 193845 INFO  (qtp394730340-1319) [    x:collection1] o.a.s.u.p.LogUpdateProcessorFactory [collection1]  webapp=/solr path=/update params={wt=javabin&version=2}{add=[81]} 0 0
   [junit4]   2> 193847 INFO  (qtp394730340-1320) [    x:collection1] o.a.s.u.p.LogUpdateProcessorFactory [collection1]  webapp=/solr path=/update params={wt=javabin&version=2}{add=[82]} 0 0
   [junit4]   2> 193851 INFO  (qtp394730340-1315) [    x:collection1] o.a.s.u.p.LogUpdateProcessorFactory [collection1]  webapp=/solr path=/update params={wt=javabin&version=2}{add=[83]} 0 0
   [junit4]   2> 193853 INFO  (qtp394730340-1316) [    x:collection1] o.a.s.u.p.LogUpdateProcessorFactory [collection1]  webapp=/solr path=/update params={wt=javabin&version=2}{add=[84]} 0 0
   [junit4]   2> 193856 INFO  (qtp394730340-1317) [    x:collection1] o.a.s.u.p.LogUpdateProcessorFactory [collection1]  webapp=/solr path=/update params={wt=javabin&version=2}{add=[85]} 0 0
   [junit4]   2> 193860 INFO  (qtp394730340-1318) [    x:collection1] o.a.s.u.p.LogUpdateProcessorFactory [collection1]  webapp=/solr path=/update params={wt=javabin&version=2}{add=[86]} 0 0
   [junit4]   2> 193863 INFO  (qtp394730340-1319) [    x:collection1] o.a.s.u.DirectUpdateHandler2 start commit{,optimize=false,openSearcher=true,waitSearcher=true,expungeDeletes=false,softCommit=false,prepareCommit=false}
   [junit4]   2> 193868 INFO  (qtp394730340-1319) [    x:collection1] o.a.s.c.SolrDeletionPolicy SolrDeletionPolicy.onCommit: commits: num=2
   [junit4]   2> 	commit{dir=MockDirectoryWrapper(RAMDirectory@602f3074 lockFactory=org.apache.lucene.store.SingleInstanceLockFactory@651e67b5),segFN=segments_1,generation=1}
   [junit4]   2> 	commit{dir=MockDirectoryWrapper(RAMDirectory@602f3074 lockFactory=org.apache.lucene.store.SingleInstanceLockFactory@651e67b5),segFN=segments_2,generation=2}
   [junit4]   2> 193869 INFO  (qtp394730340-1319) [    x:collection1] o.a.s.c.SolrDeletionPolicy newest commit generation = 2
   [junit4]   2> 193871 INFO  (Thread-620) [    x:collection1] o.a.s.h.SnapShooter Creating backup snapshot <not named> at /Users/jenkins/workspace/Lucene-Solr-5.x-MacOSX/solr/build/solr-core/test/J1/temp/solr.handler.TestReplicationHandlerBackup_3B2796BB2413CA10-001/solr-instance-002/./collection1/data/
   [junit4]   2> 193877 INFO  (qtp394730340-1319) [    x:collection1] o.a.s.s.SolrIndexSearcher Opening Searcher@56fb2067[collection1] main
   [junit4]   2> 193877 INFO  (qtp394730340-1319) [    x:collection1] o.a.s.u.DirectUpdateHandler2 end_commit_flush
   [junit4]   2> 193877 INFO  (searcherExecutor-803-thread-1-processing-x:collection1) [    x:collection1] o.a.s.c.SolrCore [collection1] Registered new searcher Searcher@56fb2067[collection1] main{ExitableDirectoryReader(UninvertingDirectoryReader(Uninverting(_0(5.5.0):C87)))}
   [junit4]   2> 193877 INFO  (qtp394730340-1319) [    x:collection1] o.a.s.u.p.LogUpdateProcessorFactory [collection1]  webapp=/solr path=/update params={waitSearcher=true&commit=true&softCommit=false&wt=javabin&version=2}{commit=} 0 14
   [junit4]   2> 193884 INFO  (Thread-620) [    x:collection1] o.a.s.h.SnapShooter Done creating backup snapshot: <not named> at /Users/jenkins/workspace/Lucene-Solr-5.x-MacOSX/solr/build/solr-core/test/J1/temp/solr.handler.TestReplicationHandlerBackup_3B2796BB2413CA10-001/solr-instance-002/./collection1/data/
   [junit4]   2> 193946 INFO  (qtp394730340-1320) [    x:collection1] o.a.s.c.S.Request [collection1]  webapp=/solr path=/replication params={name=hm&command=backup} status=0 QTime=1
   [junit4]   2> 193948 INFO  (Thread-621) [    x:collection1] o.a.s.h.SnapShooter Creating backup snapshot hm at /Users/jenkins/workspace/Lucene-Solr-5.x-MacOSX/solr/build/solr-core/test/J1/temp/solr.handler.TestReplicationHandlerBackup_3B2796BB2413CA10-001/solr-instance-002/./collection1/data/
   [junit4]   2> 193955 INFO  (Thread-621) [    x:collection1] o.a.s.h.SnapShooter Done creating backup snapshot: hm at /Users/jenkins/workspace/Lucene-Solr-5.x-MacOSX/solr/build/solr-core/test/J1/temp/solr.handler.TestReplicationHandlerBackup_3B2796BB2413CA10-001/solr-instance-002/./collection1/data/
   [junit4]   2> 193966 INFO  (qtp394730340-1315) [    x:collection1] o.a.s.c.S.Request [collection1]  webapp=/solr path=/replication params={command=details} status=0 QTime=0
   [junit4]   2> 194973 WARN  (qtp394730340-1316) [    x:collection1] o.a.s.h.ReplicationHandler Exception during creating a snapshot
   [junit4]   2> org.apache.solr.common.SolrException: Snapshot directory already exists: /Users/jenkins/workspace/Lucene-Solr-5.x-MacOSX/solr/build/solr-core/test/J1/temp/solr.handler.TestReplicationHandlerBackup_3B2796BB2413CA10-001/solr-instance-002/./collection1/data/snapshot.hm
   [junit4]   2> 	at org.apache.solr.handler.SnapShooter.validateCreateSnapshot(SnapShooter.java:119)
   [junit4]   2> 	at org.apache.solr.handler.ReplicationHandler.doSnapShoot(ReplicationHandler.java:500)
   [junit4]   2> 	at org.apache.solr.handler.ReplicationHandler.handleRequestBody(ReplicationHandler.java:252)
   [junit4]   2> 	at org.apache.solr.handler.RequestHandlerBase.handleRequest(RequestHandlerBase.java:156)
   [junit4]   2> 	at org.apache.solr.core.SolrCore.execute(SolrCore.java:2070)
   [junit4]   2> 	at org.apache.solr.servlet.HttpSolrCall.execute(HttpSolrCall.java:658)
   [junit4]   2> 	at org.apache.solr.servlet.HttpSolrCall.call(HttpSolrCall.java:457)
   [junit4]   2> 	at org.apache.solr.servlet.SolrDispatchFilter.doFilter(SolrDispatchFilter.java:223)
   [junit4]   2> 	at org.apache.solr.servlet.SolrDispatchFilter.doFilter(SolrDispatchFilter.java:181)
   [junit4]   2> 	at org.eclipse.jetty.servlet.ServletHandler$CachedChain.doFilter(ServletHandler.java:1652)
   [junit4]   2> 	at org.apache.solr.client.solrj.embedded.JettySolrRunner$DebugFilter.doFilter(JettySolrRunner.java:110)
   [junit4]   2> 	at org.eclipse.jetty.servlet.ServletHandler$CachedChain.doFilter(ServletHandler.java:1652)
   [junit4]   2> 	at org.eclipse.jetty.servlets.UserAgentFilter.doFilter(UserAgentFilter.java:83)
   [junit4]   2> 	at org.eclipse.jetty.servlets.GzipFilter.doFilter(GzipFilter.java:364)
   [junit4]   2> 	at org.eclipse.jetty.servlet.ServletHandler$CachedChain.doFilter(ServletHandler.java:1652)
   [junit4]   2> 	at org.eclipse.jetty.servlet.ServletHandler.doHandle(ServletHandler.java:585)
   [junit4]   2> 	at org.eclipse.jetty.server.session.SessionHandler.doHandle(SessionHandler.java:221)
   [junit4]   2> 	at org.eclipse.jetty.server.handler.ContextHandler.doHandle(ContextHandler.java:1127)
   [junit4]   2> 	at org.eclipse.jetty.servlet.ServletHandler.doScope(ServletHandler.java:515)
   [junit4]   2> 	at org.eclipse.jetty.server.session.SessionHandler.doScope(SessionHandler.java:185)
   [junit4]   2> 	at org.eclipse.jetty.server.handler.ContextHandler.doScope(ContextHandler.java:1061)
   [junit4]   2> 	at org.eclipse.jetty.server.handler.ScopedHandler.handle(ScopedHandler.java:141)
   [junit4]   2> 	at org.eclipse.jetty.server.handler.HandlerWrapper.handle(HandlerWrapper.java:97)
   [junit4]   2> 	at org.eclipse.jetty.server.Server.handle(Server.java:499)
   [junit4]   2> 	at org.eclipse.jetty.server.HttpChannel.handle(HttpChannel.java:310)
   [junit4]   2> 	at org.eclipse.jetty.server.HttpConnection.onFillable(HttpConnection.java:257)
   [junit4]   2> 	at org.eclipse.jetty.io.AbstractConnection$2.run(AbstractConnection.java:540)
   [junit4]   2> 	at org.eclipse.jetty.util.thread.QueuedThreadPool.runJob(QueuedThreadPool.java:635)
   [junit4]   2> 	at org.eclipse.jetty.util.thread.QueuedThreadPool$3.run(QueuedThreadPool.java:555)
   [junit4]   2> 	at java.lang.Thread.run(Thread.java:745)
   [junit4]   2> 194974 INFO  (qtp394730340-1316) [    x:collection1] o.a.s.c.S.Request [collection1]  webapp=/solr path=/replication params={name=hm&command=backup} status=0 QTime=1
   [junit4]   2> 194978 INFO  (qtp394730340-1317) [    x:collection1] o.a.s.c.S.Request [collection1]  webapp=/solr path=/replication params={command=details} status=0 QTime=0
   [junit4]   2> 195984 INFO  (qtp394730340-1318) [    x:collection1] o.a.s.c.S.Request [collection1]  webapp=/solr path=/replication params={name=siduxzxbfakorhrow&command=backup} status=0 QTime=0
   [junit4]   2> 195984 INFO  (Thread-622) [    x:collection1] o.a.s.h.SnapShooter Creating backup snapshot siduxzxbfakorhrow at /Users/jenkins/workspace/Lucene-Solr-5.x-MacOSX/solr/build/solr-core/test/J1/temp/solr.handler.TestReplicationHandlerBackup_3B2796BB2413CA10-001/solr-instance-002/./collection1/data/
   [junit4]   2> 195987 INFO  (qtp394730340-1319) [    x:collection1] o.a.s.c.S.Request [collection1]  webapp=/solr path=/replication params={command=details} status=0 QTime=0
   [junit4]   2> 195991 INFO  (Thread-622) [    x:collection1] o.a.s.h.SnapShooter Done creating backup snapshot: siduxzxbfakorhrow at /Users/jenkins/workspace/Lucene-Solr-5.x-MacOSX/solr/build/solr-core/test/J1/temp/solr.handler.TestReplicationHandlerBackup_3B2796BB2413CA10-001/solr-instance-002/./collection1/data/
   [junit4]   2> 196993 INFO  (qtp394730340-1320) [    x:collection1] o.a.s.c.S.Request [collection1]  webapp=/solr path=/replication params={name=ajhmxgwwizmkjmksvsl&command=backup} status=0 QTime=0
   [junit4]   2> 196993 INFO  (Thread-623) [    x:collection1] o.a.s.h.SnapShooter Creating backup snapshot ajhmxgwwizmkjmksvsl at /Users/jenkins/workspace/Lucene-Solr-5.x-MacOSX/solr/build/solr-core/test/J1/temp/solr.handler.TestReplicationHandlerBackup_3B2796BB2413CA10-001/solr-instance-002/./collection1/data/
   [junit4]   2> 196996 INFO  (qtp394730340-1315) [    x:collection1] o.a.s.c.S.Request [collection1]  webapp=/solr path=/replication params={command=details} status=0 QTime=0
   [junit4]   2> 196998 INFO  (Thread-623) [    x:collection1] o.a.s.h.SnapShooter Done creating backup snapshot: ajhmxgwwizmkjmksvsl at /Users/jenkins/workspace/Lucene-Solr-5.x-MacOSX/solr/build/solr-core/test/J1/temp/solr.handler.TestReplicationHandlerBackup_3B2796BB2413CA10-001/solr-instance-002/./collection1/data/
   [junit4]   2> 198005 INFO  (qtp394730340-1316) [    x:collection1] o.a.s.c.S.Request [collection1]  webapp=/solr path=/replication params={name=hm&command=deletebackup} status=0 QTime=3
   [junit4]   2> 198006 INFO  (Thread-624) [    x:collection1] o.a.s.h.SnapShooter Deleting snapshot: hm
   [junit4]   2> 198030 INFO  (qtp394730340-1317) [    x:collection1] o.a.s.c.S.Request [collection1]  webapp=/solr path=/replication params={command=details} status=0 QTime=0
   [junit4]   2> 199034 ERROR (qtp394730340-1318) [    x:collection1] o.a.s.h.RequestHandlerBase org.apache.solr.common.SolrException: Snapshot cannot be found in directory: /Users/jenkins/workspace/Lucene-Solr-5.x-MacOSX/solr/build/solr-core/test/J1/temp/solr.handler.TestReplicationHandlerBackup_3B2796BB2413CA10-001/solr-instance-002/./collection1/data/
   [junit4]   2> 	at org.apache.solr.handler.SnapShooter.validateDeleteSnapshot(SnapShooter.java:102)
   [junit4]   2> 	at org.apache.solr.handler.ReplicationHandler.deleteSnapshot(ReplicationHandler.java:327)
   [junit4]   2> 	at org.apache.solr.handler.ReplicationHandler.handleRequestBody(ReplicationHandler.java:260)
   [junit4]   2> 	at org.apache.solr.handler.RequestHandlerBase.handleRequest(RequestHandlerBase.java:156)
   [junit4]   2> 	at org.apache.solr.core.SolrCore.execute(SolrCore.java:2070)
   [junit4]   2> 	at org.apache.solr.servlet.HttpSolrCall.execute(HttpSolrCall.java:658)
   [junit4]   2> 	at org.apache.solr.servlet.HttpSolrCall.call(HttpSolrCall.java:457)
   [junit4]   2> 	at org.apache.solr.servlet.SolrDispatchFilter.doFilter(SolrDispatchFilter.java:223)
   [junit4]   2> 	at org.apache.solr.servlet.SolrDispatchFilter.doFilter(SolrDispatchFilter.java:181)
   [junit4]   2> 	at org.eclipse.jetty.servlet.ServletHandler$CachedChain.doFilter(ServletHandler.java:1652)
   [junit4]   2> 	at org.apache.solr.client.solrj.embedded.JettySolrRunner$DebugFilter.doFilter(JettySolrRunner.java:110)
   [junit4]   2> 	at org.eclipse.jetty.servlet.ServletHandler$CachedChain.doFilter(ServletHandler.java:1652)
   [junit4]   2> 	at org.eclipse.jetty.servlets.UserAgentFilter.doFilter(UserAgentFilter.java:83)
   [junit4]   2> 	at org.eclipse.jetty.servlets.GzipFilter.doFilter(GzipFilter.java:364)
   [junit4]   2> 	at org.eclipse.jetty.servlet.ServletHandler$CachedChain.doFilter(ServletHandler.java:1652)
   [junit4]   2> 	at org.eclipse.jetty.servlet.ServletHandler.doHandle(ServletHandler.java:585)
   [junit4]   2> 	at org.eclipse.jetty.server.session.SessionHandler.doHandle(SessionHandler.java:221)
   [junit4]   2> 	at org.eclipse.jetty.server.handler.ContextHandler.doHandle(ContextHandler.java:1127)
   [junit4]   2> 	at org.eclipse.jetty.servlet.ServletHandler.doScope(ServletHandler.java:515)
   [junit4]   2> 	at org.eclipse.jetty.server.session.SessionHandler.doScope(SessionHandler.java:185)
   [junit4]   2> 	at org.eclipse.jetty.server.handler.ContextHandler.doScope(ContextHandler.java:1061)
   [junit4]   2> 	at org.eclipse.jetty.server.handler.ScopedHandler.handle(ScopedHandler.java:141)
   [junit4]   2> 	at org.eclipse.jetty.server.handler.HandlerWrapper.handle(HandlerWrapper.java:97)
   [junit4]   2> 	at org.eclipse.jetty.server.Server.handle(Server.java:499)
   [junit4]   2> 	at org.eclipse.jetty.server.HttpChannel.handle(HttpChannel.java:310)
   [junit4]   2> 	at org.eclipse.jetty.server.HttpConnection.onFillable(HttpConnection.java:257)
   [junit4]   2> 	at org.eclipse.jetty.io.AbstractConnection$2.run(AbstractConnection.java:540)
   [junit4]   2> 	at org.eclipse.jetty.util.thread.QueuedThreadPool.runJob(QueuedThreadPool.java:635)
   [junit4]   2> 	at org.eclipse.jetty.util.thread.QueuedThreadPool$3.run(QueuedThreadPool.java:555)
   [junit4]   2> 	at java.lang.Thread.run(Thread.java:745)
   [junit4]   2> 
   [junit4]   2> 199034 INFO  (qtp394730340-1318) [    x:collection1] o.a.s.c.S.Request [collection1]  webapp=/solr path=/replication params={name=hm&command=deletebackup} status=400 QTime=1
   [junit4]   2> 199035 INFO  (TEST-TestReplicationHandlerBackup.doTestBackup-seed#[3B2796BB2413CA10]) [    ] o.a.s.SolrTestCaseJ4 ###Ending doTestBackup
   [junit4]   2> 199036 INFO  (TEST-TestReplicationHandlerBackup.doTestBackup-seed#[3B2796BB2413CA10]) [    ] o.e.j.s.ServerConnector Stopped ServerConnector@1a0466a8{HTTP/1.1}{127.0.0.1:0}
   [junit4]   2> 199036 INFO  (TEST-TestReplicationHandlerBackup.doTestBackup-seed#[3B2796BB2413CA10]) [    ] o.a.s.c.CoreContainer Shutting down CoreContainer instance=295964230
   [junit4]   2> 199037 INFO  (TEST-TestReplicationHandlerBackup.doTestBackup-seed#[3B2796BB2413CA10]) [    x:collection1] o.a.s.c.SolrCore [collection1]  CLOSING SolrCore org.apache.solr.core.SolrCore@357dfeb2
   [junit4]   2> 199037 INFO  (TEST-TestReplicationHandlerBackup.doTestBackup-seed#[3B2796BB2413CA10]) [    x:collection1] o.a.s.u.DirectUpdateHandler2 closing DirectUpdateHandler2{commits=1,autocommits=0,soft autocommits=0,optimizes=0,rollbacks=0,expungeDeletes=0,docsPending=0,adds=0,deletesById=0,deletesByQuery=0,errors=0,cumulative_adds=87,cumulative_deletesById=0,cumulative_deletesByQuery=1,cumulative_errors=0}
   [junit4]   2> 199038 INFO  (TEST-TestReplicationHandlerBackup.doTestBackup-seed#[3B2796BB2413CA10]) [    x:collection1] o.a.s.u.SolrCoreState Closing SolrCoreState
   [junit4]   2> 199038 INFO  (TEST-TestReplicationHandlerBackup.doTestBackup-seed#[3B2796BB2413CA10]) [    x:collection1] o.a.s.u.DefaultSolrCoreState SolrCoreState ref count has reached 0 - closing IndexWriter
   [junit4]   2> 199038 INFO  (TEST-TestReplicationHandlerBackup.doTestBackup-seed#[3B2796BB2413CA10]) [    x:collection1] o.a.s.u.DefaultSolrCoreState closing IndexWriter with IndexWriterCloser
   [junit4]   2> 199038 INFO  (TEST-TestReplicationHandlerBackup.doTestBackup-seed#[3B2796BB2413CA10]) [    x:collection1] o.a.s.c.SolrCore [collection1] Closing main searcher on request.
   [junit4]   2> 199038 INFO  (TEST-TestReplicationHandlerBackup.doTestBackup-seed#[3B2796BB2413CA10]) [    x:collection1] o.a.s.c.CachingDirectoryFactory Closing MockDirectoryFactory - 2 directories currently being tracked
   [junit4]   2> 199038 INFO  (TEST-TestReplicationHandlerBackup.doTestBackup-seed#[3B2796BB2413CA10]) [    x:collection1] o.a.s.c.CachingDirectoryFactory looking to close /Users/jenkins/workspace/Lucene-Solr-5.x-MacOSX/solr/build/solr-core/test/J1/temp/solr.handler.TestReplicationHandlerBackup_3B2796BB2413CA10-001/solr-instance-002/./collection1/data/index [CachedDir<<refCount=0;path=/Users/jenkins/workspace/Lucene-Solr-5.x-MacOSX/solr/build/solr-core/test/J1/temp/solr.handler.TestReplicationHandlerBackup_3B2796BB2413CA10-001/solr-instance-002/./collection1/data/index;done=false>>]
   [junit4]   2> 199038 INFO  (TEST-TestReplicationHandlerBackup.doTestBackup-seed#[3B2796BB2413CA10]) [    x:collection1] o.a.s.c.CachingDirectoryFactory Closing directory: /Users/jenkins/workspace/Lucene-Solr-5.x-MacOSX/solr/build/solr-core/test/J1/temp/solr.handler.TestReplicationHandlerBackup_3B2796BB2413CA10-001/solr-instance-002/./collection1/data/index
   [junit4]   2> 199038 INFO  (TEST-TestReplicationHandlerBackup.doTestBackup-seed#[3B2796BB2413CA10]) [    x:collection1] o.a.s.c.CachingDirectoryFactory looking to close /Users/jenkins/workspace/Lucene-Solr-5.x-MacOSX/solr/build/solr-core/test/J1/temp/solr.handler.TestReplicationHandlerBackup_3B2796BB2413CA10-001/solr-instance-002/./collection1/data [CachedDir<<refCount=0;path=/Users/jenkins/workspace/Lucene-Solr-5.x-MacOSX/solr/build/solr-core/test/J1/temp/solr.handler.TestReplicationHandlerBackup_3B2796BB2413CA10-001/solr-instance-002/./collection1/data;done=false>>]
   [junit4]   2> 199038 INFO  (TEST-TestReplicationHandlerBackup.doTestBackup-seed#[3B2796BB2413CA10]) [    x:collection1] o.a.s.c.CachingDirectoryFactory Closing directory: /Users/jenkins/workspace/Lucene-Solr-5.x-MacOSX/solr/build/solr-core/test/J1/temp/solr.handler.TestReplicationHandlerBackup_3B2796BB2413CA10-001/solr-instance-002/./collection1/data
   [junit4]   2> 199039 INFO  (TEST-TestReplicationHandlerBackup.doTestBackup-seed#[3B2796BB2413CA10]) [    x:collection1] o.e.j.s.h.ContextHandler Stopped o.e.j.s.ServletContextHandler@6026b7dc{/solr,null,UNAVAILABLE}
   [junit4]   2> NOTE: reproduce with: ant test  -Dtestcase=TestReplicationHandlerBackup -Dtests.method=doTestBackup -Dtests.seed=3B2796BB2413CA10 -Dtests.slow=true -Dtests.locale=hu -Dtests.timezone=US/Indiana-Starke -Dtests.asserts=true -Dtests.file.encoding=UTF-8
   [junit4] ERROR   6.01s J1 | TestReplicationHandlerBackup.doTestBackup <<<
   [junit4]    > Throwable #1: java.io.IOException: Server returned HTTP response code: 400 for URL: http://127.0.0.1:59087/solr/collection1/replication?command=deletebackup&name=hm
   [junit4]    > 	at __randomizedtesting.SeedInfo.seed([3B2796BB2413CA10:7AACB6DE03AD395F]:0)
   [junit4]    > 	at sun.net.www.protocol.http.HttpURLConnection.getInputStream0(HttpURLConnection.java:1840)
   [junit4]    > 	at sun.net.www.protocol.http.HttpURLConnection.getInputStream(HttpURLConnection.java:1441)
   [junit4]    > 	at java.net.URL.openStream(URL.java:1038)
   [junit4]    > 	at org.apache.solr.handler.TestReplicationHandlerBackup.runBackupCommand(TestReplicationHandlerBackup.java:277)
   [junit4]    > 	at org.apache.solr.handler.TestReplicationHandlerBackup.testDeleteNamedBackup(TestReplicationHandlerBackup.java:255)
   [junit4]    > 	at org.apache.solr.handler.TestReplicationHandlerBackup.doTestBackup(TestReplicationHandlerBackup.java:220)
   [junit4]    > 	at java.lang.Thread.run(Thread.java:745)
   [junit4]   2> 199044 INFO  (SUITE-TestReplicationHandlerBackup-seed#[3B2796BB2413CA10]-worker) [    ] o.a.s.SolrTestCaseJ4 ###deleteCore
   [junit4]   2> NOTE: leaving temporary files on disk at: /Users/jenkins/workspace/Lucene-Solr-5.x-MacOSX/solr/build/solr-core/test/J1/temp/so

[...truncated too long message...]

ec3bb name:ZooKeeperConnection Watcher:127.0.0.1:61734 got event WatchedEvent state:SyncConnected type:None path:null path:null type:None
   [junit4]   2> 1058946 INFO  (TEST-ZkStateReaderTest.testStateFormatUpdateWithExplicitRefreshLazy-seed#[3B2796BB2413CA10]) [    ] o.a.s.c.c.ConnectionManager Client is connected to ZooKeeper
   [junit4]   2> 1058947 INFO  (TEST-ZkStateReaderTest.testStateFormatUpdateWithExplicitRefreshLazy-seed#[3B2796BB2413CA10]) [    ] o.a.s.c.c.SolrZkClient Using default ZkACLProvider
   [junit4]   2> 1058948 INFO  (TEST-ZkStateReaderTest.testStateFormatUpdateWithExplicitRefreshLazy-seed#[3B2796BB2413CA10]) [    ] o.a.s.c.c.SolrZkClient Using default ZkCredentialsProvider
   [junit4]   2> 1058949 INFO  (TEST-ZkStateReaderTest.testStateFormatUpdateWithExplicitRefreshLazy-seed#[3B2796BB2413CA10]) [    ] o.a.s.c.c.ConnectionManager Waiting for client to connect to ZooKeeper
   [junit4]   2> 1058950 INFO  (zkCallback-909-thread-1) [    ] o.a.s.c.c.ConnectionManager Watcher org.apache.solr.common.cloud.ConnectionManager@6bea7533 name:ZooKeeperConnection Watcher:127.0.0.1:61734 got event WatchedEvent state:SyncConnected type:None path:null path:null type:None
   [junit4]   2> 1058951 INFO  (TEST-ZkStateReaderTest.testStateFormatUpdateWithExplicitRefreshLazy-seed#[3B2796BB2413CA10]) [    ] o.a.s.c.c.ConnectionManager Client is connected to ZooKeeper
   [junit4]   2> 1058951 INFO  (TEST-ZkStateReaderTest.testStateFormatUpdateWithExplicitRefreshLazy-seed#[3B2796BB2413CA10]) [    ] o.a.s.c.c.SolrZkClient Using default ZkACLProvider
   [junit4]   2> 1058951 INFO  (TEST-ZkStateReaderTest.testStateFormatUpdateWithExplicitRefreshLazy-seed#[3B2796BB2413CA10]) [    ] o.a.s.c.c.SolrZkClient makePath: /solr
   [junit4]   2> 1058954 INFO  (TEST-ZkStateReaderTest.testStateFormatUpdateWithExplicitRefreshLazy-seed#[3B2796BB2413CA10]) [    ] o.a.s.c.c.SolrZkClient Using default ZkCredentialsProvider
   [junit4]   2> 1058955 INFO  (TEST-ZkStateReaderTest.testStateFormatUpdateWithExplicitRefreshLazy-seed#[3B2796BB2413CA10]) [    ] o.a.s.c.c.ConnectionManager Waiting for client to connect to ZooKeeper
   [junit4]   2> 1058956 INFO  (zkCallback-910-thread-1) [    ] o.a.s.c.c.ConnectionManager Watcher org.apache.solr.common.cloud.ConnectionManager@1c97f7ff name:ZooKeeperConnection Watcher:127.0.0.1:61734/solr got event WatchedEvent state:SyncConnected type:None path:null path:null type:None
   [junit4]   2> 1058956 INFO  (TEST-ZkStateReaderTest.testStateFormatUpdateWithExplicitRefreshLazy-seed#[3B2796BB2413CA10]) [    ] o.a.s.c.c.ConnectionManager Client is connected to ZooKeeper
   [junit4]   2> 1058957 INFO  (TEST-ZkStateReaderTest.testStateFormatUpdateWithExplicitRefreshLazy-seed#[3B2796BB2413CA10]) [    ] o.a.s.c.c.SolrZkClient Using default ZkACLProvider
   [junit4]   2> 1058957 INFO  (TEST-ZkStateReaderTest.testStateFormatUpdateWithExplicitRefreshLazy-seed#[3B2796BB2413CA10]) [    ] o.a.s.c.c.SolrZkClient makePath: /live_nodes
   [junit4]   2> 1058960 INFO  (TEST-ZkStateReaderTest.testStateFormatUpdateWithExplicitRefreshLazy-seed#[3B2796BB2413CA10]) [    ] o.a.s.c.c.SolrZkClient makePath: /collections
   [junit4]   2> 1058962 INFO  (TEST-ZkStateReaderTest.testStateFormatUpdateWithExplicitRefreshLazy-seed#[3B2796BB2413CA10]) [    ] o.a.s.c.c.SolrZkClient makePath: /aliases.json
   [junit4]   2> 1058964 INFO  (TEST-ZkStateReaderTest.testStateFormatUpdateWithExplicitRefreshLazy-seed#[3B2796BB2413CA10]) [    ] o.a.s.c.c.SolrZkClient makePath: /clusterstate.json
   [junit4]   2> 1058967 INFO  (TEST-ZkStateReaderTest.testStateFormatUpdateWithExplicitRefreshLazy-seed#[3B2796BB2413CA10]) [    ] o.a.s.c.c.SolrZkClient makePath: /security.json
   [junit4]   2> 1058968 INFO  (TEST-ZkStateReaderTest.testStateFormatUpdateWithExplicitRefreshLazy-seed#[3B2796BB2413CA10]) [    ] o.a.s.c.c.ZkStateReader Updating cluster state from ZooKeeper... 
   [junit4]   2> 1058972 INFO  (TEST-ZkStateReaderTest.testStateFormatUpdateWithExplicitRefreshLazy-seed#[3B2796BB2413CA10]) [    ] o.a.s.c.c.SolrZkClient makePath: /collections/c1
   [junit4]   2> 1058974 INFO  (zkCallback-910-thread-1) [    ] o.a.s.c.c.ZkStateReader A collections change: [WatchedEvent state:SyncConnected type:NodeChildrenChanged path:/collections], has occurred - updating...
   [junit4]   2> 1058976 INFO  (zkCallback-910-thread-2) [    ] o.a.s.c.c.ZkStateReader A cluster state change: [WatchedEvent state:SyncConnected type:NodeDataChanged path:/clusterstate.json], has occurred - updating... (live nodes size: [0])
   [junit4]   2> 1058980 INFO  (TEST-ZkStateReaderTest.testStateFormatUpdateWithExplicitRefreshLazy-seed#[3B2796BB2413CA10]) [    ] o.a.s.c.o.ZkStateWriter going to create_collection /collections/c1/state.json
   [junit4]   2> 1058981 INFO  (zkCallback-910-thread-2) [    ] o.a.s.c.c.ZkStateReader A cluster state change: [WatchedEvent state:SyncConnected type:NodeDataChanged path:/clusterstate.json], has occurred - updating... (live nodes size: [0])
   [junit4]   2> 1058987 INFO  (TEST-ZkStateReaderTest.testStateFormatUpdateWithExplicitRefreshLazy-seed#[3B2796BB2413CA10]) [    ] o.a.s.c.ZkTestServer connecting to 127.0.0.1:61734 61734
   [junit4]   2> 1059079 INFO  (Thread-2563) [    ] o.a.s.c.ZkTestServer connecting to 127.0.0.1:61734 61734
   [junit4]   2> 1060606 INFO  (TEST-ZkStateReaderTest.testStateFormatUpdateWithExplicitRefreshLazy-seed#[3B2796BB2413CA10]) [    ] o.a.s.SolrTestCaseJ4 ###Ending testStateFormatUpdateWithExplicitRefreshLazy
   [junit4]   2> 1060607 INFO  (SUITE-ZkStateReaderTest-seed#[3B2796BB2413CA10]-worker) [    ] o.a.s.SolrTestCaseJ4 ###deleteCore
   [junit4]   2> NOTE: leaving temporary files on disk at: /Users/jenkins/workspace/Lucene-Solr-5.x-MacOSX/solr/build/solr-core/test/J0/temp/solr.cloud.overseer.ZkStateReaderTest_3B2796BB2413CA10-001
   [junit4]   2> NOTE: test params are: codec=Asserting(Lucene54), sim=DefaultSimilarity, locale=en_CA, timezone=Australia/Yancowinna
   [junit4]   2> NOTE: Mac OS X 10.8.5 x86_64/Oracle Corporation 1.8.0_66 (64-bit)/cpus=3,threads=1,free=142745712,total=536870912
   [junit4]   2> NOTE: All tests run in this JVM: [SOLR749Test, DistributedQueryElevationComponentTest, TestExactStatsCache, TestReqParamsAPI, TestSchemaNameResource, VersionInfoTest, TestConfigSetsAPIZkFailure, HighlighterTest, ForceLeaderTest, ScriptEngineTest, DeleteShardTest, OverseerRolesTest, SystemInfoHandlerTest, SSLMigrationTest, TestSolrDynamicMBean, DistributedSpellCheckComponentTest, TestCursorMarkWithoutUniqueKey, CoreAdminCreateDiscoverTest, PrimitiveFieldTypeTest, ResponseHeaderTest, TestConfig, TestElisionMultitermQuery, SampleTest, TestFunctionQuery, SchemaVersionSpecificBehaviorTest, TestSolrDeletionPolicy1, UUIDFieldTest, TestOverriddenPrefixQueryForCustomFieldType, TestDynamicLoading, SolrTestCaseJ4Test, DeleteLastCustomShardedReplicaTest, TestPostingsSolrHighlighter, TestSmileRequest, TestCustomDocTransformer, URLClassifyProcessorTest, PeerSyncTest, TermsComponentTest, TestLazyCores, RestartWhileUpdatingTest, TestLMDirichletSimilarityFactory, ParsingFieldUpdateProcessorsTest, TestWordDelimiterFilterFactory, TestManagedSchemaFieldTypeResource, AnalysisAfterCoreReloadTest, DocumentBuilderTest, TestInitQParser, TestDistribDocBasedVersion, TestFaceting, TestNonDefinedSimilarityFactory, BitVectorTest, ShardRoutingTest, TestSerializedLuceneMatchVersion, TestCollationFieldDocValues, TestStandardQParsers, ZkCLITest, ChaosMonkeyNothingIsSafeTest, HdfsChaosMonkeyNothingIsSafeTest, BigEndianAscendingWordDeserializerTest, TestRandomDVFaceting, QueryElevationComponentTest, TestRemoteStreaming, TestTrieFacet, TestXIncludeConfig, MBeansHandlerTest, TestSearchPerf, TestHashPartitioner, TestStressReorder, TestCoreContainer, TestSchemaSimilarityResource, HdfsDirectoryTest, TestExclusionRuleCollectionAccess, TestShardHandlerFactory, OverseerTest, TestDistribIDF, AsyncCallRequestStatusResponseTest, CurrencyFieldXmlFileTest, TestSearcherReuse, SuggesterFSTTest, TestCodecSupport, TestRecoveryHdfs, AliasIntegrationTest, BasicAuthIntegrationTest, DistributedFacetPivotLargeTest, SolrCoreTest, PingRequestHandlerTest, AlternateDirectoryTest, FacetPivotSmallTest, MergeStrategyTest, StatelessScriptUpdateProcessorFactoryTest, JavabinLoaderTest, SolrRequestParserTest, TestStressVersions, TestExceedMaxTermLength, DistanceUnitsTest, DirectUpdateHandlerTest, TestAnalyzeInfixSuggestions, TestDistributedSearch, DistributedFacetPivotWhiteBoxTest, AddBlockUpdateTest, SolrCloudExampleTest, QueryEqualityTest, TestHighlightDedupGrouping, TestFieldCollectionResource, DistributedFacetPivotSmallAdvancedTest, ZkStateReaderTest]
   [junit4] Completed [222/555 (2!)] on J0 in 9.93s, 5 tests, 1 failure <<< FAILURES!

[...truncated 1058 lines...]
BUILD FAILED
/Users/jenkins/workspace/Lucene-Solr-5.x-MacOSX/build.xml:794: The following error occurred while executing this line:
/Users/jenkins/workspace/Lucene-Solr-5.x-MacOSX/build.xml:738: The following error occurred while executing this line:
/Users/jenkins/workspace/Lucene-Solr-5.x-MacOSX/build.xml:59: The following error occurred while executing this line:
/Users/jenkins/workspace/Lucene-Solr-5.x-MacOSX/solr/build.xml:233: The following error occurred while executing this line:
/Users/jenkins/workspace/Lucene-Solr-5.x-MacOSX/solr/common-build.xml:526: The following error occurred while executing this line:
/Users/jenkins/workspace/Lucene-Solr-5.x-MacOSX/lucene/common-build.xml:1456: The following error occurred while executing this line:
/Users/jenkins/workspace/Lucene-Solr-5.x-MacOSX/lucene/common-build.xml:1010: There were test failures: 555 suites (7 ignored), 2208 tests, 1 error, 1 failure, 87 ignored (37 assumptions) [seed: 3B2796BB2413CA10]

Total time: 72 minutes 44 seconds
Build step 'Invoke Ant' marked build as failure
Archiving artifacts
[WARNINGS] Skipping publisher since build result is FAILURE
Recording test results
Email was triggered for: Failure - Any
Sending email for trigger: Failure - Any



Mime
View raw message