lucene-dev mailing list archives

Site index · List index
Message view « Date » · « Thread »
Top « Date » · « Thread »
From Policeman Jenkins Server <jenk...@thetaphi.de>
Subject [JENKINS-EA] Lucene-Solr-trunk-Linux (32bit/jdk1.9.0-ea-b93) - Build # 15110 - Still Failing!
Date Fri, 04 Dec 2015 12:15:56 GMT
Build: http://jenkins.thetaphi.de/job/Lucene-Solr-trunk-Linux/15110/
Java: 32bit/jdk1.9.0-ea-b93 -client -XX:+UseSerialGC -XX:-CompactStrings

3 tests failed.
FAILED:  junit.framework.TestSuite.org.apache.solr.cloud.CollectionsAPIDistributedZkTest

Error Message:
5 threads leaked from SUITE scope at org.apache.solr.cloud.CollectionsAPIDistributedZkTest:     1) Thread[id=4551, name=TEST-CollectionsAPIDistributedZkTest.test-seed#[830BEEBD1B477A53]-EventThread, state=WAITING, group=TGRP-CollectionsAPIDistributedZkTest]         at jdk.internal.misc.Unsafe.park(Native Method)         at java.util.concurrent.locks.LockSupport.park(LockSupport.java:178)         at java.util.concurrent.locks.AbstractQueuedSynchronizer$ConditionObject.await(AbstractQueuedSynchronizer.java:2061)         at java.util.concurrent.LinkedBlockingQueue.take(LinkedBlockingQueue.java:442)         at org.apache.zookeeper.ClientCnxn$EventThread.run(ClientCnxn.java:494)    2) Thread[id=4777, name=zkCallback-505-thread-3, state=TIMED_WAITING, group=TGRP-CollectionsAPIDistributedZkTest]         at jdk.internal.misc.Unsafe.park(Native Method)         at java.util.concurrent.locks.LockSupport.parkNanos(LockSupport.java:218)         at java.util.concurrent.SynchronousQueue$TransferStack.awaitFulfill(SynchronousQueue.java:461)         at java.util.concurrent.SynchronousQueue$TransferStack.transfer(SynchronousQueue.java:362)         at java.util.concurrent.SynchronousQueue.poll(SynchronousQueue.java:937)         at java.util.concurrent.ThreadPoolExecutor.getTask(ThreadPoolExecutor.java:1082)         at java.util.concurrent.ThreadPoolExecutor.runWorker(ThreadPoolExecutor.java:1143)         at java.util.concurrent.ThreadPoolExecutor$Worker.run(ThreadPoolExecutor.java:632)         at java.lang.Thread.run(Thread.java:747)    3) Thread[id=4552, name=zkCallback-505-thread-1, state=TIMED_WAITING, group=TGRP-CollectionsAPIDistributedZkTest]         at jdk.internal.misc.Unsafe.park(Native Method)         at java.util.concurrent.locks.LockSupport.parkNanos(LockSupport.java:218)         at java.util.concurrent.SynchronousQueue$TransferStack.awaitFulfill(SynchronousQueue.java:461)         at java.util.concurrent.SynchronousQueue$TransferStack.transfer(SynchronousQueue.java:362)         at java.util.concurrent.SynchronousQueue.poll(SynchronousQueue.java:937)         at java.util.concurrent.ThreadPoolExecutor.getTask(ThreadPoolExecutor.java:1082)         at java.util.concurrent.ThreadPoolExecutor.runWorker(ThreadPoolExecutor.java:1143)         at java.util.concurrent.ThreadPoolExecutor$Worker.run(ThreadPoolExecutor.java:632)         at java.lang.Thread.run(Thread.java:747)    4) Thread[id=4550, name=TEST-CollectionsAPIDistributedZkTest.test-seed#[830BEEBD1B477A53]-SendThread(127.0.0.1:51938), state=TIMED_WAITING, group=TGRP-CollectionsAPIDistributedZkTest]         at java.lang.Thread.sleep(Native Method)         at org.apache.zookeeper.ClientCnxnSocketNIO.cleanup(ClientCnxnSocketNIO.java:230)         at org.apache.zookeeper.ClientCnxn$SendThread.cleanup(ClientCnxn.java:1185)         at org.apache.zookeeper.ClientCnxn$SendThread.run(ClientCnxn.java:1110)    5) Thread[id=4776, name=zkCallback-505-thread-2, state=TIMED_WAITING, group=TGRP-CollectionsAPIDistributedZkTest]         at jdk.internal.misc.Unsafe.park(Native Method)         at java.util.concurrent.locks.LockSupport.parkNanos(LockSupport.java:218)         at java.util.concurrent.SynchronousQueue$TransferStack.awaitFulfill(SynchronousQueue.java:461)         at java.util.concurrent.SynchronousQueue$TransferStack.transfer(SynchronousQueue.java:362)         at java.util.concurrent.SynchronousQueue.poll(SynchronousQueue.java:937)         at java.util.concurrent.ThreadPoolExecutor.getTask(ThreadPoolExecutor.java:1082)         at java.util.concurrent.ThreadPoolExecutor.runWorker(ThreadPoolExecutor.java:1143)         at java.util.concurrent.ThreadPoolExecutor$Worker.run(ThreadPoolExecutor.java:632)         at java.lang.Thread.run(Thread.java:747)

Stack Trace:
com.carrotsearch.randomizedtesting.ThreadLeakError: 5 threads leaked from SUITE scope at org.apache.solr.cloud.CollectionsAPIDistributedZkTest: 
   1) Thread[id=4551, name=TEST-CollectionsAPIDistributedZkTest.test-seed#[830BEEBD1B477A53]-EventThread, state=WAITING, group=TGRP-CollectionsAPIDistributedZkTest]
        at jdk.internal.misc.Unsafe.park(Native Method)
        at java.util.concurrent.locks.LockSupport.park(LockSupport.java:178)
        at java.util.concurrent.locks.AbstractQueuedSynchronizer$ConditionObject.await(AbstractQueuedSynchronizer.java:2061)
        at java.util.concurrent.LinkedBlockingQueue.take(LinkedBlockingQueue.java:442)
        at org.apache.zookeeper.ClientCnxn$EventThread.run(ClientCnxn.java:494)
   2) Thread[id=4777, name=zkCallback-505-thread-3, state=TIMED_WAITING, group=TGRP-CollectionsAPIDistributedZkTest]
        at jdk.internal.misc.Unsafe.park(Native Method)
        at java.util.concurrent.locks.LockSupport.parkNanos(LockSupport.java:218)
        at java.util.concurrent.SynchronousQueue$TransferStack.awaitFulfill(SynchronousQueue.java:461)
        at java.util.concurrent.SynchronousQueue$TransferStack.transfer(SynchronousQueue.java:362)
        at java.util.concurrent.SynchronousQueue.poll(SynchronousQueue.java:937)
        at java.util.concurrent.ThreadPoolExecutor.getTask(ThreadPoolExecutor.java:1082)
        at java.util.concurrent.ThreadPoolExecutor.runWorker(ThreadPoolExecutor.java:1143)
        at java.util.concurrent.ThreadPoolExecutor$Worker.run(ThreadPoolExecutor.java:632)
        at java.lang.Thread.run(Thread.java:747)
   3) Thread[id=4552, name=zkCallback-505-thread-1, state=TIMED_WAITING, group=TGRP-CollectionsAPIDistributedZkTest]
        at jdk.internal.misc.Unsafe.park(Native Method)
        at java.util.concurrent.locks.LockSupport.parkNanos(LockSupport.java:218)
        at java.util.concurrent.SynchronousQueue$TransferStack.awaitFulfill(SynchronousQueue.java:461)
        at java.util.concurrent.SynchronousQueue$TransferStack.transfer(SynchronousQueue.java:362)
        at java.util.concurrent.SynchronousQueue.poll(SynchronousQueue.java:937)
        at java.util.concurrent.ThreadPoolExecutor.getTask(ThreadPoolExecutor.java:1082)
        at java.util.concurrent.ThreadPoolExecutor.runWorker(ThreadPoolExecutor.java:1143)
        at java.util.concurrent.ThreadPoolExecutor$Worker.run(ThreadPoolExecutor.java:632)
        at java.lang.Thread.run(Thread.java:747)
   4) Thread[id=4550, name=TEST-CollectionsAPIDistributedZkTest.test-seed#[830BEEBD1B477A53]-SendThread(127.0.0.1:51938), state=TIMED_WAITING, group=TGRP-CollectionsAPIDistributedZkTest]
        at java.lang.Thread.sleep(Native Method)
        at org.apache.zookeeper.ClientCnxnSocketNIO.cleanup(ClientCnxnSocketNIO.java:230)
        at org.apache.zookeeper.ClientCnxn$SendThread.cleanup(ClientCnxn.java:1185)
        at org.apache.zookeeper.ClientCnxn$SendThread.run(ClientCnxn.java:1110)
   5) Thread[id=4776, name=zkCallback-505-thread-2, state=TIMED_WAITING, group=TGRP-CollectionsAPIDistributedZkTest]
        at jdk.internal.misc.Unsafe.park(Native Method)
        at java.util.concurrent.locks.LockSupport.parkNanos(LockSupport.java:218)
        at java.util.concurrent.SynchronousQueue$TransferStack.awaitFulfill(SynchronousQueue.java:461)
        at java.util.concurrent.SynchronousQueue$TransferStack.transfer(SynchronousQueue.java:362)
        at java.util.concurrent.SynchronousQueue.poll(SynchronousQueue.java:937)
        at java.util.concurrent.ThreadPoolExecutor.getTask(ThreadPoolExecutor.java:1082)
        at java.util.concurrent.ThreadPoolExecutor.runWorker(ThreadPoolExecutor.java:1143)
        at java.util.concurrent.ThreadPoolExecutor$Worker.run(ThreadPoolExecutor.java:632)
        at java.lang.Thread.run(Thread.java:747)
	at __randomizedtesting.SeedInfo.seed([830BEEBD1B477A53]:0)


FAILED:  junit.framework.TestSuite.org.apache.solr.cloud.CollectionsAPIDistributedZkTest

Error Message:
There are still zombie threads that couldn't be terminated:    1) Thread[id=4777, name=zkCallback-505-thread-3, state=TIMED_WAITING, group=TGRP-CollectionsAPIDistributedZkTest]         at jdk.internal.misc.Unsafe.park(Native Method)         at java.util.concurrent.locks.LockSupport.parkNanos(LockSupport.java:218)         at java.util.concurrent.SynchronousQueue$TransferStack.awaitFulfill(SynchronousQueue.java:461)         at java.util.concurrent.SynchronousQueue$TransferStack.transfer(SynchronousQueue.java:362)         at java.util.concurrent.SynchronousQueue.poll(SynchronousQueue.java:937)         at java.util.concurrent.ThreadPoolExecutor.getTask(ThreadPoolExecutor.java:1082)         at java.util.concurrent.ThreadPoolExecutor.runWorker(ThreadPoolExecutor.java:1143)         at java.util.concurrent.ThreadPoolExecutor$Worker.run(ThreadPoolExecutor.java:632)         at java.lang.Thread.run(Thread.java:747)    2) Thread[id=4552, name=zkCallback-505-thread-1, state=TIMED_WAITING, group=TGRP-CollectionsAPIDistributedZkTest]         at jdk.internal.misc.Unsafe.park(Native Method)         at java.util.concurrent.locks.LockSupport.parkNanos(LockSupport.java:218)         at java.util.concurrent.SynchronousQueue$TransferStack.awaitFulfill(SynchronousQueue.java:461)         at java.util.concurrent.SynchronousQueue$TransferStack.transfer(SynchronousQueue.java:362)         at java.util.concurrent.SynchronousQueue.poll(SynchronousQueue.java:937)         at java.util.concurrent.ThreadPoolExecutor.getTask(ThreadPoolExecutor.java:1082)         at java.util.concurrent.ThreadPoolExecutor.runWorker(ThreadPoolExecutor.java:1143)         at java.util.concurrent.ThreadPoolExecutor$Worker.run(ThreadPoolExecutor.java:632)         at java.lang.Thread.run(Thread.java:747)    3) Thread[id=4550, name=TEST-CollectionsAPIDistributedZkTest.test-seed#[830BEEBD1B477A53]-SendThread(127.0.0.1:51938), state=TIMED_WAITING, group=TGRP-CollectionsAPIDistributedZkTest]         at java.lang.Thread.sleep(Native Method)         at org.apache.zookeeper.ClientCnxn$SendThread.run(ClientCnxn.java:994)    4) Thread[id=4776, name=zkCallback-505-thread-2, state=TIMED_WAITING, group=TGRP-CollectionsAPIDistributedZkTest]         at jdk.internal.misc.Unsafe.park(Native Method)         at java.util.concurrent.locks.LockSupport.parkNanos(LockSupport.java:218)         at java.util.concurrent.SynchronousQueue$TransferStack.awaitFulfill(SynchronousQueue.java:461)         at java.util.concurrent.SynchronousQueue$TransferStack.transfer(SynchronousQueue.java:362)         at java.util.concurrent.SynchronousQueue.poll(SynchronousQueue.java:937)         at java.util.concurrent.ThreadPoolExecutor.getTask(ThreadPoolExecutor.java:1082)         at java.util.concurrent.ThreadPoolExecutor.runWorker(ThreadPoolExecutor.java:1143)         at java.util.concurrent.ThreadPoolExecutor$Worker.run(ThreadPoolExecutor.java:632)         at java.lang.Thread.run(Thread.java:747)

Stack Trace:
com.carrotsearch.randomizedtesting.ThreadLeakError: There are still zombie threads that couldn't be terminated:
   1) Thread[id=4777, name=zkCallback-505-thread-3, state=TIMED_WAITING, group=TGRP-CollectionsAPIDistributedZkTest]
        at jdk.internal.misc.Unsafe.park(Native Method)
        at java.util.concurrent.locks.LockSupport.parkNanos(LockSupport.java:218)
        at java.util.concurrent.SynchronousQueue$TransferStack.awaitFulfill(SynchronousQueue.java:461)
        at java.util.concurrent.SynchronousQueue$TransferStack.transfer(SynchronousQueue.java:362)
        at java.util.concurrent.SynchronousQueue.poll(SynchronousQueue.java:937)
        at java.util.concurrent.ThreadPoolExecutor.getTask(ThreadPoolExecutor.java:1082)
        at java.util.concurrent.ThreadPoolExecutor.runWorker(ThreadPoolExecutor.java:1143)
        at java.util.concurrent.ThreadPoolExecutor$Worker.run(ThreadPoolExecutor.java:632)
        at java.lang.Thread.run(Thread.java:747)
   2) Thread[id=4552, name=zkCallback-505-thread-1, state=TIMED_WAITING, group=TGRP-CollectionsAPIDistributedZkTest]
        at jdk.internal.misc.Unsafe.park(Native Method)
        at java.util.concurrent.locks.LockSupport.parkNanos(LockSupport.java:218)
        at java.util.concurrent.SynchronousQueue$TransferStack.awaitFulfill(SynchronousQueue.java:461)
        at java.util.concurrent.SynchronousQueue$TransferStack.transfer(SynchronousQueue.java:362)
        at java.util.concurrent.SynchronousQueue.poll(SynchronousQueue.java:937)
        at java.util.concurrent.ThreadPoolExecutor.getTask(ThreadPoolExecutor.java:1082)
        at java.util.concurrent.ThreadPoolExecutor.runWorker(ThreadPoolExecutor.java:1143)
        at java.util.concurrent.ThreadPoolExecutor$Worker.run(ThreadPoolExecutor.java:632)
        at java.lang.Thread.run(Thread.java:747)
   3) Thread[id=4550, name=TEST-CollectionsAPIDistributedZkTest.test-seed#[830BEEBD1B477A53]-SendThread(127.0.0.1:51938), state=TIMED_WAITING, group=TGRP-CollectionsAPIDistributedZkTest]
        at java.lang.Thread.sleep(Native Method)
        at org.apache.zookeeper.ClientCnxn$SendThread.run(ClientCnxn.java:994)
   4) Thread[id=4776, name=zkCallback-505-thread-2, state=TIMED_WAITING, group=TGRP-CollectionsAPIDistributedZkTest]
        at jdk.internal.misc.Unsafe.park(Native Method)
        at java.util.concurrent.locks.LockSupport.parkNanos(LockSupport.java:218)
        at java.util.concurrent.SynchronousQueue$TransferStack.awaitFulfill(SynchronousQueue.java:461)
        at java.util.concurrent.SynchronousQueue$TransferStack.transfer(SynchronousQueue.java:362)
        at java.util.concurrent.SynchronousQueue.poll(SynchronousQueue.java:937)
        at java.util.concurrent.ThreadPoolExecutor.getTask(ThreadPoolExecutor.java:1082)
        at java.util.concurrent.ThreadPoolExecutor.runWorker(ThreadPoolExecutor.java:1143)
        at java.util.concurrent.ThreadPoolExecutor$Worker.run(ThreadPoolExecutor.java:632)
        at java.lang.Thread.run(Thread.java:747)
	at __randomizedtesting.SeedInfo.seed([830BEEBD1B477A53]:0)


FAILED:  org.apache.solr.cloud.CollectionsAPIDistributedZkTest.test

Error Message:
Error from server at http://127.0.0.1:35481/_nl/gg/awholynewcollection_0: non ok status: 500, message:Server Error

Stack Trace:
org.apache.solr.client.solrj.impl.HttpSolrClient$RemoteSolrException: Error from server at http://127.0.0.1:35481/_nl/gg/awholynewcollection_0: non ok status: 500, message:Server Error
	at __randomizedtesting.SeedInfo.seed([830BEEBD1B477A53:B5FD167B5BB17AB]:0)
	at org.apache.solr.client.solrj.impl.HttpSolrClient.executeMethod(HttpSolrClient.java:509)
	at org.apache.solr.client.solrj.impl.HttpSolrClient.request(HttpSolrClient.java:241)
	at org.apache.solr.client.solrj.impl.HttpSolrClient.request(HttpSolrClient.java:230)
	at org.apache.solr.client.solrj.SolrRequest.process(SolrRequest.java:150)
	at org.apache.solr.client.solrj.SolrClient.query(SolrClient.java:943)
	at org.apache.solr.client.solrj.SolrClient.query(SolrClient.java:958)
	at org.apache.solr.cloud.AbstractFullDistribZkTestBase.waitForNon403or404or503(AbstractFullDistribZkTestBase.java:1754)
	at org.apache.solr.cloud.CollectionsAPIDistributedZkTest.testCollectionsAPI(CollectionsAPIDistributedZkTest.java:638)
	at org.apache.solr.cloud.CollectionsAPIDistributedZkTest.test(CollectionsAPIDistributedZkTest.java:160)
	at sun.reflect.NativeMethodAccessorImpl.invoke0(Native Method)
	at sun.reflect.NativeMethodAccessorImpl.invoke(NativeMethodAccessorImpl.java:62)
	at sun.reflect.DelegatingMethodAccessorImpl.invoke(DelegatingMethodAccessorImpl.java:43)
	at java.lang.reflect.Method.invoke(Method.java:520)
	at com.carrotsearch.randomizedtesting.RandomizedRunner.invoke(RandomizedRunner.java:1764)
	at com.carrotsearch.randomizedtesting.RandomizedRunner$8.evaluate(RandomizedRunner.java:871)
	at com.carrotsearch.randomizedtesting.RandomizedRunner$9.evaluate(RandomizedRunner.java:907)
	at com.carrotsearch.randomizedtesting.RandomizedRunner$10.evaluate(RandomizedRunner.java:921)
	at org.apache.solr.BaseDistributedSearchTestCase$ShardsRepeatRule$ShardsFixedStatement.callStatement(BaseDistributedSearchTestCase.java:965)
	at org.apache.solr.BaseDistributedSearchTestCase$ShardsRepeatRule$ShardsStatement.evaluate(BaseDistributedSearchTestCase.java:940)
	at com.carrotsearch.randomizedtesting.rules.SystemPropertiesRestoreRule$1.evaluate(SystemPropertiesRestoreRule.java:57)
	at org.apache.lucene.util.TestRuleSetupTeardownChained$1.evaluate(TestRuleSetupTeardownChained.java:50)
	at org.apache.lucene.util.AbstractBeforeAfterRule$1.evaluate(AbstractBeforeAfterRule.java:46)
	at org.apache.lucene.util.TestRuleThreadAndTestName$1.evaluate(TestRuleThreadAndTestName.java:49)
	at org.apache.lucene.util.TestRuleIgnoreAfterMaxFailures$1.evaluate(TestRuleIgnoreAfterMaxFailures.java:65)
	at org.apache.lucene.util.TestRuleMarkFailure$1.evaluate(TestRuleMarkFailure.java:48)
	at com.carrotsearch.randomizedtesting.rules.StatementAdapter.evaluate(StatementAdapter.java:36)
	at com.carrotsearch.randomizedtesting.ThreadLeakControl$StatementRunner.run(ThreadLeakControl.java:367)
	at com.carrotsearch.randomizedtesting.ThreadLeakControl.forkTimeoutingTask(ThreadLeakControl.java:809)
	at com.carrotsearch.randomizedtesting.ThreadLeakControl$3.evaluate(ThreadLeakControl.java:460)
	at com.carrotsearch.randomizedtesting.RandomizedRunner.runSingleTest(RandomizedRunner.java:880)
	at com.carrotsearch.randomizedtesting.RandomizedRunner$5.evaluate(RandomizedRunner.java:781)
	at com.carrotsearch.randomizedtesting.RandomizedRunner$6.evaluate(RandomizedRunner.java:816)
	at com.carrotsearch.randomizedtesting.RandomizedRunner$7.evaluate(RandomizedRunner.java:827)
	at com.carrotsearch.randomizedtesting.rules.StatementAdapter.evaluate(StatementAdapter.java:36)
	at com.carrotsearch.randomizedtesting.rules.SystemPropertiesRestoreRule$1.evaluate(SystemPropertiesRestoreRule.java:57)
	at org.apache.lucene.util.AbstractBeforeAfterRule$1.evaluate(AbstractBeforeAfterRule.java:46)
	at com.carrotsearch.randomizedtesting.rules.StatementAdapter.evaluate(StatementAdapter.java:36)
	at org.apache.lucene.util.TestRuleStoreClassName$1.evaluate(TestRuleStoreClassName.java:42)
	at com.carrotsearch.randomizedtesting.rules.NoShadowingOrOverridesOnMethodsRule$1.evaluate(NoShadowingOrOverridesOnMethodsRule.java:40)
	at com.carrotsearch.randomizedtesting.rules.NoShadowingOrOverridesOnMethodsRule$1.evaluate(NoShadowingOrOverridesOnMethodsRule.java:40)
	at com.carrotsearch.randomizedtesting.rules.StatementAdapter.evaluate(StatementAdapter.java:36)
	at com.carrotsearch.randomizedtesting.rules.StatementAdapter.evaluate(StatementAdapter.java:36)
	at com.carrotsearch.randomizedtesting.rules.StatementAdapter.evaluate(StatementAdapter.java:36)
	at org.apache.lucene.util.TestRuleAssertionsRequired$1.evaluate(TestRuleAssertionsRequired.java:54)
	at org.apache.lucene.util.TestRuleMarkFailure$1.evaluate(TestRuleMarkFailure.java:48)
	at org.apache.lucene.util.TestRuleIgnoreAfterMaxFailures$1.evaluate(TestRuleIgnoreAfterMaxFailures.java:65)
	at org.apache.lucene.util.TestRuleIgnoreTestSuites$1.evaluate(TestRuleIgnoreTestSuites.java:55)
	at com.carrotsearch.randomizedtesting.rules.StatementAdapter.evaluate(StatementAdapter.java:36)
	at com.carrotsearch.randomizedtesting.ThreadLeakControl$StatementRunner.run(ThreadLeakControl.java:367)
	at java.lang.Thread.run(Thread.java:747)




Build Log:
[...truncated 10056 lines...]
   [junit4] Suite: org.apache.solr.cloud.CollectionsAPIDistributedZkTest
   [junit4]   2> Creating dataDir: /home/jenkins/workspace/Lucene-Solr-trunk-Linux/solr/build/solr-core/test/J1/temp/solr.cloud.CollectionsAPIDistributedZkTest_830BEEBD1B477A53-001/init-core-data-001
   [junit4]   2> 586497 INFO  (SUITE-CollectionsAPIDistributedZkTest-seed#[830BEEBD1B477A53]-worker) [    ] o.a.s.SolrTestCaseJ4 Randomized ssl (false) and clientAuth (true)
   [junit4]   2> 586497 INFO  (SUITE-CollectionsAPIDistributedZkTest-seed#[830BEEBD1B477A53]-worker) [    ] o.a.s.BaseDistributedSearchTestCase Setting hostContext system property: /_nl/gg
   [junit4]   2> 586498 INFO  (TEST-CollectionsAPIDistributedZkTest.test-seed#[830BEEBD1B477A53]) [    ] o.a.s.c.ZkTestServer STARTING ZK TEST SERVER
   [junit4]   2> 586499 INFO  (Thread-1831) [    ] o.a.s.c.ZkTestServer client port:0.0.0.0/0.0.0.0:0
   [junit4]   2> 586499 INFO  (Thread-1831) [    ] o.a.s.c.ZkTestServer Starting server
   [junit4]   2> 586599 INFO  (TEST-CollectionsAPIDistributedZkTest.test-seed#[830BEEBD1B477A53]) [    ] o.a.s.c.ZkTestServer start zk server on port:51938
   [junit4]   2> 586599 INFO  (TEST-CollectionsAPIDistributedZkTest.test-seed#[830BEEBD1B477A53]) [    ] o.a.s.c.c.SolrZkClient Using default ZkCredentialsProvider
   [junit4]   2> 586599 INFO  (TEST-CollectionsAPIDistributedZkTest.test-seed#[830BEEBD1B477A53]) [    ] o.a.s.c.c.ConnectionManager Waiting for client to connect to ZooKeeper
   [junit4]   2> 586601 INFO  (zkCallback-473-thread-1) [    ] o.a.s.c.c.ConnectionManager Watcher org.apache.solr.common.cloud.ConnectionManager@547105 name:ZooKeeperConnection Watcher:127.0.0.1:51938 got event WatchedEvent state:SyncConnected type:None path:null path:null type:None
   [junit4]   2> 586601 INFO  (TEST-CollectionsAPIDistributedZkTest.test-seed#[830BEEBD1B477A53]) [    ] o.a.s.c.c.ConnectionManager Client is connected to ZooKeeper
   [junit4]   2> 586601 INFO  (TEST-CollectionsAPIDistributedZkTest.test-seed#[830BEEBD1B477A53]) [    ] o.a.s.c.c.SolrZkClient Using default ZkACLProvider
   [junit4]   2> 586601 INFO  (TEST-CollectionsAPIDistributedZkTest.test-seed#[830BEEBD1B477A53]) [    ] o.a.s.c.c.SolrZkClient makePath: /solr
   [junit4]   2> 586603 INFO  (TEST-CollectionsAPIDistributedZkTest.test-seed#[830BEEBD1B477A53]) [    ] o.a.s.c.c.SolrZkClient Using default ZkCredentialsProvider
   [junit4]   2> 586603 INFO  (TEST-CollectionsAPIDistributedZkTest.test-seed#[830BEEBD1B477A53]) [    ] o.a.s.c.c.ConnectionManager Waiting for client to connect to ZooKeeper
   [junit4]   2> 586604 INFO  (zkCallback-474-thread-1) [    ] o.a.s.c.c.ConnectionManager Watcher org.apache.solr.common.cloud.ConnectionManager@1134e4f name:ZooKeeperConnection Watcher:127.0.0.1:51938/solr got event WatchedEvent state:SyncConnected type:None path:null path:null type:None
   [junit4]   2> 586604 INFO  (TEST-CollectionsAPIDistributedZkTest.test-seed#[830BEEBD1B477A53]) [    ] o.a.s.c.c.ConnectionManager Client is connected to ZooKeeper
   [junit4]   2> 586604 INFO  (TEST-CollectionsAPIDistributedZkTest.test-seed#[830BEEBD1B477A53]) [    ] o.a.s.c.c.SolrZkClient Using default ZkACLProvider
   [junit4]   2> 586604 INFO  (TEST-CollectionsAPIDistributedZkTest.test-seed#[830BEEBD1B477A53]) [    ] o.a.s.c.c.SolrZkClient makePath: /collections/collection1
   [junit4]   2> 586605 INFO  (TEST-CollectionsAPIDistributedZkTest.test-seed#[830BEEBD1B477A53]) [    ] o.a.s.c.c.SolrZkClient makePath: /collections/collection1/shards
   [junit4]   2> 586606 INFO  (TEST-CollectionsAPIDistributedZkTest.test-seed#[830BEEBD1B477A53]) [    ] o.a.s.c.c.SolrZkClient makePath: /collections/control_collection
   [junit4]   2> 586607 INFO  (TEST-CollectionsAPIDistributedZkTest.test-seed#[830BEEBD1B477A53]) [    ] o.a.s.c.c.SolrZkClient makePath: /collections/control_collection/shards
   [junit4]   2> 586608 INFO  (TEST-CollectionsAPIDistributedZkTest.test-seed#[830BEEBD1B477A53]) [    ] o.a.s.c.AbstractZkTestCase put /home/jenkins/workspace/Lucene-Solr-trunk-Linux/solr/core/src/test-files/solr/collection1/conf/solrconfig-tlog.xml to /configs/conf1/solrconfig.xml
   [junit4]   2> 586608 INFO  (TEST-CollectionsAPIDistributedZkTest.test-seed#[830BEEBD1B477A53]) [    ] o.a.s.c.c.SolrZkClient makePath: /configs/conf1/solrconfig.xml
   [junit4]   2> 586609 INFO  (TEST-CollectionsAPIDistributedZkTest.test-seed#[830BEEBD1B477A53]) [    ] o.a.s.c.AbstractZkTestCase put /home/jenkins/workspace/Lucene-Solr-trunk-Linux/solr/core/src/test-files/solr/collection1/conf/schema.xml to /configs/conf1/schema.xml
   [junit4]   2> 586609 INFO  (TEST-CollectionsAPIDistributedZkTest.test-seed#[830BEEBD1B477A53]) [    ] o.a.s.c.c.SolrZkClient makePath: /configs/conf1/schema.xml
   [junit4]   2> 586611 INFO  (TEST-CollectionsAPIDistributedZkTest.test-seed#[830BEEBD1B477A53]) [    ] o.a.s.c.AbstractZkTestCase put /home/jenkins/workspace/Lucene-Solr-trunk-Linux/solr/core/src/test-files/solr/collection1/conf/solrconfig.snippet.randomindexconfig.xml to /configs/conf1/solrconfig.snippet.randomindexconfig.xml
   [junit4]   2> 586611 INFO  (TEST-CollectionsAPIDistributedZkTest.test-seed#[830BEEBD1B477A53]) [    ] o.a.s.c.c.SolrZkClient makePath: /configs/conf1/solrconfig.snippet.randomindexconfig.xml
   [junit4]   2> 586611 INFO  (TEST-CollectionsAPIDistributedZkTest.test-seed#[830BEEBD1B477A53]) [    ] o.a.s.c.AbstractZkTestCase put /home/jenkins/workspace/Lucene-Solr-trunk-Linux/solr/core/src/test-files/solr/collection1/conf/stopwords.txt to /configs/conf1/stopwords.txt
   [junit4]   2> 586612 INFO  (TEST-CollectionsAPIDistributedZkTest.test-seed#[830BEEBD1B477A53]) [    ] o.a.s.c.c.SolrZkClient makePath: /configs/conf1/stopwords.txt
   [junit4]   2> 586612 INFO  (TEST-CollectionsAPIDistributedZkTest.test-seed#[830BEEBD1B477A53]) [    ] o.a.s.c.AbstractZkTestCase put /home/jenkins/workspace/Lucene-Solr-trunk-Linux/solr/core/src/test-files/solr/collection1/conf/protwords.txt to /configs/conf1/protwords.txt
   [junit4]   2> 586612 INFO  (TEST-CollectionsAPIDistributedZkTest.test-seed#[830BEEBD1B477A53]) [    ] o.a.s.c.c.SolrZkClient makePath: /configs/conf1/protwords.txt
   [junit4]   2> 586613 INFO  (TEST-CollectionsAPIDistributedZkTest.test-seed#[830BEEBD1B477A53]) [    ] o.a.s.c.AbstractZkTestCase put /home/jenkins/workspace/Lucene-Solr-trunk-Linux/solr/core/src/test-files/solr/collection1/conf/currency.xml to /configs/conf1/currency.xml
   [junit4]   2> 586613 INFO  (TEST-CollectionsAPIDistributedZkTest.test-seed#[830BEEBD1B477A53]) [    ] o.a.s.c.c.SolrZkClient makePath: /configs/conf1/currency.xml
   [junit4]   2> 586614 INFO  (TEST-CollectionsAPIDistributedZkTest.test-seed#[830BEEBD1B477A53]) [    ] o.a.s.c.AbstractZkTestCase put /home/jenkins/workspace/Lucene-Solr-trunk-Linux/solr/core/src/test-files/solr/collection1/conf/enumsConfig.xml to /configs/conf1/enumsConfig.xml
   [junit4]   2> 586614 INFO  (TEST-CollectionsAPIDistributedZkTest.test-seed#[830BEEBD1B477A53]) [    ] o.a.s.c.c.SolrZkClient makePath: /configs/conf1/enumsConfig.xml
   [junit4]   2> 586615 INFO  (TEST-CollectionsAPIDistributedZkTest.test-seed#[830BEEBD1B477A53]) [    ] o.a.s.c.AbstractZkTestCase put /home/jenkins/workspace/Lucene-Solr-trunk-Linux/solr/core/src/test-files/solr/collection1/conf/open-exchange-rates.json to /configs/conf1/open-exchange-rates.json
   [junit4]   2> 586615 INFO  (TEST-CollectionsAPIDistributedZkTest.test-seed#[830BEEBD1B477A53]) [    ] o.a.s.c.c.SolrZkClient makePath: /configs/conf1/open-exchange-rates.json
   [junit4]   2> 586616 INFO  (TEST-CollectionsAPIDistributedZkTest.test-seed#[830BEEBD1B477A53]) [    ] o.a.s.c.AbstractZkTestCase put /home/jenkins/workspace/Lucene-Solr-trunk-Linux/solr/core/src/test-files/solr/collection1/conf/mapping-ISOLatin1Accent.txt to /configs/conf1/mapping-ISOLatin1Accent.txt
   [junit4]   2> 586616 INFO  (TEST-CollectionsAPIDistributedZkTest.test-seed#[830BEEBD1B477A53]) [    ] o.a.s.c.c.SolrZkClient makePath: /configs/conf1/mapping-ISOLatin1Accent.txt
   [junit4]   2> 586617 INFO  (TEST-CollectionsAPIDistributedZkTest.test-seed#[830BEEBD1B477A53]) [    ] o.a.s.c.AbstractZkTestCase put /home/jenkins/workspace/Lucene-Solr-trunk-Linux/solr/core/src/test-files/solr/collection1/conf/old_synonyms.txt to /configs/conf1/old_synonyms.txt
   [junit4]   2> 586617 INFO  (TEST-CollectionsAPIDistributedZkTest.test-seed#[830BEEBD1B477A53]) [    ] o.a.s.c.c.SolrZkClient makePath: /configs/conf1/old_synonyms.txt
   [junit4]   2> 586617 INFO  (TEST-CollectionsAPIDistributedZkTest.test-seed#[830BEEBD1B477A53]) [    ] o.a.s.c.AbstractZkTestCase put /home/jenkins/workspace/Lucene-Solr-trunk-Linux/solr/core/src/test-files/solr/collection1/conf/synonyms.txt to /configs/conf1/synonyms.txt
   [junit4]   2> 586617 INFO  (TEST-CollectionsAPIDistributedZkTest.test-seed#[830BEEBD1B477A53]) [    ] o.a.s.c.c.SolrZkClient makePath: /configs/conf1/synonyms.txt
   [junit4]   2> 586682 INFO  (TEST-CollectionsAPIDistributedZkTest.test-seed#[830BEEBD1B477A53]) [    ] o.a.s.SolrTestCaseJ4 Writing core.properties file to /home/jenkins/workspace/Lucene-Solr-trunk-Linux/solr/build/solr-core/test/J1/temp/solr.cloud.CollectionsAPIDistributedZkTest_830BEEBD1B477A53-001/control-001/cores/collection1
   [junit4]   2> 586684 INFO  (TEST-CollectionsAPIDistributedZkTest.test-seed#[830BEEBD1B477A53]) [    ] o.e.j.s.Server jetty-9.3.6.v20151106
   [junit4]   2> 586685 INFO  (TEST-CollectionsAPIDistributedZkTest.test-seed#[830BEEBD1B477A53]) [    ] o.e.j.s.h.ContextHandler Started o.e.j.s.ServletContextHandler@136aa69{/_nl/gg,null,AVAILABLE}
   [junit4]   2> 586689 INFO  (TEST-CollectionsAPIDistributedZkTest.test-seed#[830BEEBD1B477A53]) [    ] o.e.j.s.ServerConnector Started ServerConnector@7e19a{HTTP/1.1,[http/1.1]}{127.0.0.1:39167}
   [junit4]   2> 586689 INFO  (TEST-CollectionsAPIDistributedZkTest.test-seed#[830BEEBD1B477A53]) [    ] o.e.j.s.Server Started @587980ms
   [junit4]   2> 586689 INFO  (TEST-CollectionsAPIDistributedZkTest.test-seed#[830BEEBD1B477A53]) [    ] o.a.s.c.s.e.JettySolrRunner Jetty properties: {solr.data.dir=/home/jenkins/workspace/Lucene-Solr-trunk-Linux/solr/build/solr-core/test/J1/temp/solr.cloud.CollectionsAPIDistributedZkTest_830BEEBD1B477A53-001/tempDir-001/control/data, hostContext=/_nl/gg, hostPort=39167, coreRootDirectory=/home/jenkins/workspace/Lucene-Solr-trunk-Linux/solr/build/solr-core/test/J1/../../../../../../../../../home/jenkins/workspace/Lucene-Solr-trunk-Linux/solr/build/solr-core/test/J1/temp/solr.cloud.CollectionsAPIDistributedZkTest_830BEEBD1B477A53-001/control-001/cores}
   [junit4]   2> 586689 INFO  (TEST-CollectionsAPIDistributedZkTest.test-seed#[830BEEBD1B477A53]) [    ] o.a.s.s.SolrDispatchFilter SolrDispatchFilter.init(): sun.misc.Launcher$AppClassLoader@1521cc1
   [junit4]   2> 586689 INFO  (TEST-CollectionsAPIDistributedZkTest.test-seed#[830BEEBD1B477A53]) [    ] o.a.s.c.SolrResourceLoader new SolrResourceLoader for directory: '/home/jenkins/workspace/Lucene-Solr-trunk-Linux/solr/build/solr-core/test/J1/temp/solr.cloud.CollectionsAPIDistributedZkTest_830BEEBD1B477A53-001/control-001'
   [junit4]   2> 586689 INFO  (TEST-CollectionsAPIDistributedZkTest.test-seed#[830BEEBD1B477A53]) [    ] o.a.s.c.SolrResourceLoader JNDI not configured for solr (NoInitialContextEx)
   [junit4]   2> 586689 INFO  (TEST-CollectionsAPIDistributedZkTest.test-seed#[830BEEBD1B477A53]) [    ] o.a.s.c.SolrResourceLoader solr home defaulted to 'solr/' (could not find system property or JNDI)
   [junit4]   2> 586689 INFO  (TEST-CollectionsAPIDistributedZkTest.test-seed#[830BEEBD1B477A53]) [    ] o.a.s.c.c.SolrZkClient Using default ZkCredentialsProvider
   [junit4]   2> 586690 INFO  (TEST-CollectionsAPIDistributedZkTest.test-seed#[830BEEBD1B477A53]) [    ] o.a.s.c.c.ConnectionManager Waiting for client to connect to ZooKeeper
   [junit4]   2> 586691 INFO  (zkCallback-475-thread-1) [    ] o.a.s.c.c.ConnectionManager Watcher org.apache.solr.common.cloud.ConnectionManager@16d1a97 name:ZooKeeperConnection Watcher:127.0.0.1:51938/solr got event WatchedEvent state:SyncConnected type:None path:null path:null type:None
   [junit4]   2> 586691 INFO  (TEST-CollectionsAPIDistributedZkTest.test-seed#[830BEEBD1B477A53]) [    ] o.a.s.c.c.ConnectionManager Client is connected to ZooKeeper
   [junit4]   2> 586691 INFO  (TEST-CollectionsAPIDistributedZkTest.test-seed#[830BEEBD1B477A53]) [    ] o.a.s.c.c.SolrZkClient Using default ZkACLProvider
   [junit4]   2> 586692 INFO  (TEST-CollectionsAPIDistributedZkTest.test-seed#[830BEEBD1B477A53]) [    ] o.a.s.s.SolrDispatchFilter Loading solr.xml from SolrHome (not found in ZooKeeper)
   [junit4]   2> 586692 INFO  (TEST-CollectionsAPIDistributedZkTest.test-seed#[830BEEBD1B477A53]) [    ] o.a.s.c.SolrXmlConfig Loading container configuration from /home/jenkins/workspace/Lucene-Solr-trunk-Linux/solr/build/solr-core/test/J1/temp/solr.cloud.CollectionsAPIDistributedZkTest_830BEEBD1B477A53-001/control-001/solr.xml
   [junit4]   2> 586697 INFO  (TEST-CollectionsAPIDistributedZkTest.test-seed#[830BEEBD1B477A53]) [    ] o.a.s.c.CorePropertiesLocator Config-defined core root directory: /home/jenkins/workspace/Lucene-Solr-trunk-Linux/solr/build/solr-core/test/J1/../../../../../../../../../home/jenkins/workspace/Lucene-Solr-trunk-Linux/solr/build/solr-core/test/J1/temp/solr.cloud.CollectionsAPIDistributedZkTest_830BEEBD1B477A53-001/control-001/cores
   [junit4]   2> 586697 INFO  (TEST-CollectionsAPIDistributedZkTest.test-seed#[830BEEBD1B477A53]) [    ] o.a.s.c.CoreContainer New CoreContainer 27405165
   [junit4]   2> 586697 INFO  (TEST-CollectionsAPIDistributedZkTest.test-seed#[830BEEBD1B477A53]) [    ] o.a.s.c.CoreContainer Loading cores into CoreContainer [instanceDir=/home/jenkins/workspace/Lucene-Solr-trunk-Linux/solr/build/solr-core/test/J1/temp/solr.cloud.CollectionsAPIDistributedZkTest_830BEEBD1B477A53-001/control-001]
   [junit4]   2> 586697 WARN  (TEST-CollectionsAPIDistributedZkTest.test-seed#[830BEEBD1B477A53]) [    ] o.a.s.c.CoreContainer Couldn't add files from /home/jenkins/workspace/Lucene-Solr-trunk-Linux/solr/build/solr-core/test/J1/temp/solr.cloud.CollectionsAPIDistributedZkTest_830BEEBD1B477A53-001/control-001/lib to classpath: /home/jenkins/workspace/Lucene-Solr-trunk-Linux/solr/build/solr-core/test/J1/temp/solr.cloud.CollectionsAPIDistributedZkTest_830BEEBD1B477A53-001/control-001/lib
   [junit4]   2> 586698 INFO  (TEST-CollectionsAPIDistributedZkTest.test-seed#[830BEEBD1B477A53]) [    ] o.a.s.h.c.HttpShardHandlerFactory created with socketTimeout : 90000,urlScheme : ,connTimeout : 15000,maxConnectionsPerHost : 20,maxConnections : 10000,corePoolSize : 0,maximumPoolSize : 2147483647,maxThreadIdleTime : 5,sizeOfQueue : -1,fairnessPolicy : false,useRetries : false,
   [junit4]   2> 586699 INFO  (TEST-CollectionsAPIDistributedZkTest.test-seed#[830BEEBD1B477A53]) [    ] o.a.s.u.UpdateShardHandler Creating UpdateShardHandler HTTP client with params: socketTimeout=340000&connTimeout=45000&retry=true
   [junit4]   2> 586699 INFO  (TEST-CollectionsAPIDistributedZkTest.test-seed#[830BEEBD1B477A53]) [    ] o.a.s.l.LogWatcher SLF4J impl is org.slf4j.impl.Log4jLoggerFactory
   [junit4]   2> 586699 INFO  (TEST-CollectionsAPIDistributedZkTest.test-seed#[830BEEBD1B477A53]) [    ] o.a.s.l.LogWatcher Registering Log Listener [Log4j (org.slf4j.impl.Log4jLoggerFactory)]
   [junit4]   2> 586699 INFO  (TEST-CollectionsAPIDistributedZkTest.test-seed#[830BEEBD1B477A53]) [    ] o.a.s.c.ZkContainer Zookeeper client=127.0.0.1:51938/solr
   [junit4]   2> 586699 INFO  (TEST-CollectionsAPIDistributedZkTest.test-seed#[830BEEBD1B477A53]) [    ] o.a.s.c.ZkController zkHost includes chroot
   [junit4]   2> 586700 INFO  (TEST-CollectionsAPIDistributedZkTest.test-seed#[830BEEBD1B477A53]) [    ] o.a.s.c.c.SolrZkClient Using default ZkCredentialsProvider
   [junit4]   2> 586700 INFO  (TEST-CollectionsAPIDistributedZkTest.test-seed#[830BEEBD1B477A53]) [    ] o.a.s.c.c.ConnectionManager Waiting for client to connect to ZooKeeper
   [junit4]   2> 586701 INFO  (zkCallback-477-thread-1) [    ] o.a.s.c.c.ConnectionManager Watcher org.apache.solr.common.cloud.ConnectionManager@b9d7e8 name:ZooKeeperConnection Watcher:127.0.0.1:51938 got event WatchedEvent state:SyncConnected type:None path:null path:null type:None
   [junit4]   2> 586701 INFO  (TEST-CollectionsAPIDistributedZkTest.test-seed#[830BEEBD1B477A53]) [    ] o.a.s.c.c.ConnectionManager Client is connected to ZooKeeper
   [junit4]   2> 586702 INFO  (TEST-CollectionsAPIDistributedZkTest.test-seed#[830BEEBD1B477A53]) [    ] o.a.s.c.c.SolrZkClient Using default ZkACLProvider
   [junit4]   2> 586703 INFO  (TEST-CollectionsAPIDistributedZkTest.test-seed#[830BEEBD1B477A53]) [n:127.0.0.1:39167__nl%2Fgg    ] o.a.s.c.c.ConnectionManager Waiting for client to connect to ZooKeeper
   [junit4]   2> 586704 INFO  (zkCallback-478-thread-1-processing-n:127.0.0.1:39167__nl%2Fgg) [n:127.0.0.1:39167__nl%2Fgg    ] o.a.s.c.c.ConnectionManager Watcher org.apache.solr.common.cloud.ConnectionManager@285a4d name:ZooKeeperConnection Watcher:127.0.0.1:51938/solr got event WatchedEvent state:SyncConnected type:None path:null path:null type:None
   [junit4]   2> 586704 INFO  (TEST-CollectionsAPIDistributedZkTest.test-seed#[830BEEBD1B477A53]) [n:127.0.0.1:39167__nl%2Fgg    ] o.a.s.c.c.ConnectionManager Client is connected to ZooKeeper
   [junit4]   2> 586705 INFO  (TEST-CollectionsAPIDistributedZkTest.test-seed#[830BEEBD1B477A53]) [n:127.0.0.1:39167__nl%2Fgg    ] o.a.s.c.c.SolrZkClient makePath: /overseer/queue
   [junit4]   2> 586705 INFO  (TEST-CollectionsAPIDistributedZkTest.test-seed#[830BEEBD1B477A53]) [n:127.0.0.1:39167__nl%2Fgg    ] o.a.s.c.c.SolrZkClient makePath: /overseer/collection-queue-work
   [junit4]   2> 586707 INFO  (TEST-CollectionsAPIDistributedZkTest.test-seed#[830BEEBD1B477A53]) [n:127.0.0.1:39167__nl%2Fgg    ] o.a.s.c.c.SolrZkClient makePath: /overseer/collection-map-running
   [junit4]   2> 586708 INFO  (TEST-CollectionsAPIDistributedZkTest.test-seed#[830BEEBD1B477A53]) [n:127.0.0.1:39167__nl%2Fgg    ] o.a.s.c.c.SolrZkClient makePath: /overseer/collection-map-completed
   [junit4]   2> 586709 INFO  (TEST-CollectionsAPIDistributedZkTest.test-seed#[830BEEBD1B477A53]) [n:127.0.0.1:39167__nl%2Fgg    ] o.a.s.c.c.SolrZkClient makePath: /overseer/collection-map-failure
   [junit4]   2> 586710 INFO  (TEST-CollectionsAPIDistributedZkTest.test-seed#[830BEEBD1B477A53]) [n:127.0.0.1:39167__nl%2Fgg    ] o.a.s.c.c.SolrZkClient makePath: /live_nodes
   [junit4]   2> 586710 INFO  (TEST-CollectionsAPIDistributedZkTest.test-seed#[830BEEBD1B477A53]) [n:127.0.0.1:39167__nl%2Fgg    ] o.a.s.c.c.SolrZkClient makePath: /aliases.json
   [junit4]   2> 586711 INFO  (TEST-CollectionsAPIDistributedZkTest.test-seed#[830BEEBD1B477A53]) [n:127.0.0.1:39167__nl%2Fgg    ] o.a.s.c.c.SolrZkClient makePath: /clusterstate.json
   [junit4]   2> 586711 INFO  (TEST-CollectionsAPIDistributedZkTest.test-seed#[830BEEBD1B477A53]) [n:127.0.0.1:39167__nl%2Fgg    ] o.a.s.c.c.SolrZkClient makePath: /security.json
   [junit4]   2> 586712 INFO  (TEST-CollectionsAPIDistributedZkTest.test-seed#[830BEEBD1B477A53]) [n:127.0.0.1:39167__nl%2Fgg    ] o.a.s.c.ZkController Register node as live in ZooKeeper:/live_nodes/127.0.0.1:39167__nl%2Fgg
   [junit4]   2> 586712 INFO  (TEST-CollectionsAPIDistributedZkTest.test-seed#[830BEEBD1B477A53]) [n:127.0.0.1:39167__nl%2Fgg    ] o.a.s.c.c.SolrZkClient makePath: /live_nodes/127.0.0.1:39167__nl%2Fgg
   [junit4]   2> 586713 INFO  (TEST-CollectionsAPIDistributedZkTest.test-seed#[830BEEBD1B477A53]) [n:127.0.0.1:39167__nl%2Fgg    ] o.a.s.c.c.SolrZkClient makePath: /overseer_elect
   [junit4]   2> 586713 INFO  (TEST-CollectionsAPIDistributedZkTest.test-seed#[830BEEBD1B477A53]) [n:127.0.0.1:39167__nl%2Fgg    ] o.a.s.c.c.SolrZkClient makePath: /overseer_elect/election
   [junit4]   2> 586714 INFO  (TEST-CollectionsAPIDistributedZkTest.test-seed#[830BEEBD1B477A53]) [n:127.0.0.1:39167__nl%2Fgg    ] o.a.s.c.Overseer Overseer (id=null) closing
   [junit4]   2> 586714 INFO  (TEST-CollectionsAPIDistributedZkTest.test-seed#[830BEEBD1B477A53]) [n:127.0.0.1:39167__nl%2Fgg    ] o.a.s.c.LeaderElector Joined leadership election with path: /overseer_elect/election/94976812472270852-127.0.0.1:39167__nl%2Fgg-n_0000000000
   [junit4]   2> 586714 INFO  (TEST-CollectionsAPIDistributedZkTest.test-seed#[830BEEBD1B477A53]) [n:127.0.0.1:39167__nl%2Fgg    ] o.a.s.c.OverseerElectionContext I am going to be the leader 127.0.0.1:39167__nl%2Fgg
   [junit4]   2> 586714 INFO  (TEST-CollectionsAPIDistributedZkTest.test-seed#[830BEEBD1B477A53]) [n:127.0.0.1:39167__nl%2Fgg    ] o.a.s.c.c.SolrZkClient makePath: /overseer_elect/leader
   [junit4]   2> 586715 INFO  (TEST-CollectionsAPIDistributedZkTest.test-seed#[830BEEBD1B477A53]) [n:127.0.0.1:39167__nl%2Fgg    ] o.a.s.c.Overseer Overseer (id=94976812472270852-127.0.0.1:39167__nl%2Fgg-n_0000000000) starting
   [junit4]   2> 586716 INFO  (TEST-CollectionsAPIDistributedZkTest.test-seed#[830BEEBD1B477A53]) [n:127.0.0.1:39167__nl%2Fgg    ] o.a.s.c.c.SolrZkClient makePath: /overseer/queue-work
   [junit4]   2> 586719 INFO  (TEST-CollectionsAPIDistributedZkTest.test-seed#[830BEEBD1B477A53]) [n:127.0.0.1:39167__nl%2Fgg    ] o.a.s.c.OverseerAutoReplicaFailoverThread Starting OverseerAutoReplicaFailoverThread autoReplicaFailoverWorkLoopDelay=10000 autoReplicaFailoverWaitAfterExpiration=10000 autoReplicaFailoverBadNodeExpiration=60000
   [junit4]   2> 586719 INFO  (OverseerCollectionConfigSetProcessor-94976812472270852-127.0.0.1:39167__nl%2Fgg-n_0000000000) [n:127.0.0.1:39167__nl%2Fgg    ] o.a.s.c.OverseerTaskProcessor Process current queue of overseer operations
   [junit4]   2> 586719 INFO  (TEST-CollectionsAPIDistributedZkTest.test-seed#[830BEEBD1B477A53]) [n:127.0.0.1:39167__nl%2Fgg    ] o.a.s.c.c.ZkStateReader Updating cluster state from ZooKeeper... 
   [junit4]   2> 586719 INFO  (OverseerStateUpdate-94976812472270852-127.0.0.1:39167__nl%2Fgg-n_0000000000) [n:127.0.0.1:39167__nl%2Fgg    ] o.a.s.c.Overseer Starting to work on the main queue
   [junit4]   2> 586753 INFO  (TEST-CollectionsAPIDistributedZkTest.test-seed#[830BEEBD1B477A53]) [n:127.0.0.1:39167__nl%2Fgg    ] o.a.s.c.CoreContainer Security conf doesn't exist. Skipping setup for authorization module.
   [junit4]   2> 586754 INFO  (TEST-CollectionsAPIDistributedZkTest.test-seed#[830BEEBD1B477A53]) [n:127.0.0.1:39167__nl%2Fgg    ] o.a.s.c.CoreContainer No authentication plugin used.
   [junit4]   2> 586754 INFO  (TEST-CollectionsAPIDistributedZkTest.test-seed#[830BEEBD1B477A53]) [n:127.0.0.1:39167__nl%2Fgg    ] o.a.s.c.CorePropertiesLocator Looking for core definitions underneath /home/jenkins/workspace/Lucene-Solr-trunk-Linux/solr/build/solr-core/test/J1/../../../../../../../../../home/jenkins/workspace/Lucene-Solr-trunk-Linux/solr/build/solr-core/test/J1/temp/solr.cloud.CollectionsAPIDistributedZkTest_830BEEBD1B477A53-001/control-001/cores
   [junit4]   2> 586755 INFO  (TEST-CollectionsAPIDistributedZkTest.test-seed#[830BEEBD1B477A53]) [n:127.0.0.1:39167__nl%2Fgg    ] o.a.s.c.CoreDescriptor Created CoreDescriptor: {name=collection1, config=solrconfig.xml, transient=false, schema=schema.xml, loadOnStartup=true, configSetProperties=configsetprops.json, collection=control_collection, coreNodeName=, dataDir=data/, shard=}
   [junit4]   2> 586755 INFO  (TEST-CollectionsAPIDistributedZkTest.test-seed#[830BEEBD1B477A53]) [n:127.0.0.1:39167__nl%2Fgg    ] o.a.s.c.CorePropertiesLocator Found core collection1 in /home/jenkins/workspace/Lucene-Solr-trunk-Linux/solr/build/solr-core/test/J1/../../../../../../../../../home/jenkins/workspace/Lucene-Solr-trunk-Linux/solr/build/solr-core/test/J1/temp/solr.cloud.CollectionsAPIDistributedZkTest_830BEEBD1B477A53-001/control-001/cores/collection1
   [junit4]   2> 586755 INFO  (TEST-CollectionsAPIDistributedZkTest.test-seed#[830BEEBD1B477A53]) [n:127.0.0.1:39167__nl%2Fgg    ] o.a.s.c.CorePropertiesLocator Found 1 core definitions
   [junit4]   2> 586755 INFO  (TEST-CollectionsAPIDistributedZkTest.test-seed#[830BEEBD1B477A53]) [n:127.0.0.1:39167__nl%2Fgg    ] o.a.s.s.SolrDispatchFilter user.dir=/home/jenkins/workspace/Lucene-Solr-trunk-Linux/solr/build/solr-core/test/J1
   [junit4]   2> 586756 INFO  (TEST-CollectionsAPIDistributedZkTest.test-seed#[830BEEBD1B477A53]) [n:127.0.0.1:39167__nl%2Fgg    ] o.a.s.s.SolrDispatchFilter SolrDispatchFilter.init() done
   [junit4]   2> 586756 INFO  (coreLoadExecutor-2059-thread-1-processing-n:127.0.0.1:39167__nl%2Fgg) [n:127.0.0.1:39167__nl%2Fgg c:control_collection   x:collection1] o.a.s.c.ZkController publishing state=down
   [junit4]   2> 586756 INFO  (coreLoadExecutor-2059-thread-1-processing-n:127.0.0.1:39167__nl%2Fgg) [n:127.0.0.1:39167__nl%2Fgg c:control_collection   x:collection1] o.a.s.c.ZkController numShards not found on descriptor - reading it from system property
   [junit4]   2> 586757 INFO  (OverseerStateUpdate-94976812472270852-127.0.0.1:39167__nl%2Fgg-n_0000000000) [n:127.0.0.1:39167__nl%2Fgg    ] o.a.s.c.Overseer processMessage: queueSize: 1, message = {
   [junit4]   2>   "core":"collection1",
   [junit4]   2>   "roles":null,
   [junit4]   2>   "base_url":"http://127.0.0.1:39167/_nl/gg",
   [junit4]   2>   "node_name":"127.0.0.1:39167__nl%2Fgg",
   [junit4]   2>   "numShards":"1",
   [junit4]   2>   "state":"down",
   [junit4]   2>   "shard":null,
   [junit4]   2>   "collection":"control_collection",
   [junit4]   2>   "operation":"state"} current state version: 0
   [junit4]   2> 586757 INFO  (coreLoadExecutor-2059-thread-1-processing-n:127.0.0.1:39167__nl%2Fgg) [n:127.0.0.1:39167__nl%2Fgg c:control_collection   x:collection1] o.a.s.c.ZkController look for our core node name
   [junit4]   2> 586757 INFO  (OverseerStateUpdate-94976812472270852-127.0.0.1:39167__nl%2Fgg-n_0000000000) [n:127.0.0.1:39167__nl%2Fgg    ] o.a.s.c.o.ReplicaMutator Update state numShards=1 message={
   [junit4]   2>   "core":"collection1",
   [junit4]   2>   "roles":null,
   [junit4]   2>   "base_url":"http://127.0.0.1:39167/_nl/gg",
   [junit4]   2>   "node_name":"127.0.0.1:39167__nl%2Fgg",
   [junit4]   2>   "numShards":"1",
   [junit4]   2>   "state":"down",
   [junit4]   2>   "shard":null,
   [junit4]   2>   "collection":"control_collection",
   [junit4]   2>   "operation":"state"}
   [junit4]   2> 586757 INFO  (OverseerStateUpdate-94976812472270852-127.0.0.1:39167__nl%2Fgg-n_0000000000) [n:127.0.0.1:39167__nl%2Fgg    ] o.a.s.c.o.ClusterStateMutator building a new cName: control_collection
   [junit4]   2> 586757 INFO  (OverseerStateUpdate-94976812472270852-127.0.0.1:39167__nl%2Fgg-n_0000000000) [n:127.0.0.1:39167__nl%2Fgg    ] o.a.s.c.o.ReplicaMutator Assigning new node to shard shard=shard1
   [junit4]   2> 586758 INFO  (zkCallback-478-thread-1-processing-n:127.0.0.1:39167__nl%2Fgg) [n:127.0.0.1:39167__nl%2Fgg    ] o.a.s.c.c.ZkStateReader A cluster state change: WatchedEvent state:SyncConnected type:NodeDataChanged path:/clusterstate.json, has occurred - updating... (live nodes size: 1)
   [junit4]   2> 587757 INFO  (coreLoadExecutor-2059-thread-1-processing-n:127.0.0.1:39167__nl%2Fgg) [n:127.0.0.1:39167__nl%2Fgg c:control_collection   x:collection1] o.a.s.c.ZkController waiting to find shard id in clusterstate for collection1
   [junit4]   2> 587757 INFO  (coreLoadExecutor-2059-thread-1-processing-n:127.0.0.1:39167__nl%2Fgg) [n:127.0.0.1:39167__nl%2Fgg c:control_collection   x:collection1] o.a.s.c.ZkController Check for collection zkNode:control_collection
   [junit4]   2> 587758 INFO  (coreLoadExecutor-2059-thread-1-processing-n:127.0.0.1:39167__nl%2Fgg) [n:127.0.0.1:39167__nl%2Fgg c:control_collection   x:collection1] o.a.s.c.ZkController Collection zkNode exists
   [junit4]   2> 587758 INFO  (coreLoadExecutor-2059-thread-1-processing-n:127.0.0.1:39167__nl%2Fgg) [n:127.0.0.1:39167__nl%2Fgg c:control_collection   x:collection1] o.a.s.c.c.ZkStateReader Load collection config from:/collections/control_collection
   [junit4]   2> 587758 INFO  (coreLoadExecutor-2059-thread-1-processing-n:127.0.0.1:39167__nl%2Fgg) [n:127.0.0.1:39167__nl%2Fgg c:control_collection   x:collection1] o.a.s.c.c.ZkStateReader path=/collections/control_collection configName=conf1 specified config exists in ZooKeeper
   [junit4]   2> 587758 INFO  (coreLoadExecutor-2059-thread-1-processing-n:127.0.0.1:39167__nl%2Fgg) [n:127.0.0.1:39167__nl%2Fgg c:control_collection   x:collection1] o.a.s.c.SolrResourceLoader new SolrResourceLoader for directory: '/home/jenkins/workspace/Lucene-Solr-trunk-Linux/solr/build/solr-core/test/J1/temp/solr.cloud.CollectionsAPIDistributedZkTest_830BEEBD1B477A53-001/control-001/cores/collection1'
   [junit4]   2> 587758 INFO  (coreLoadExecutor-2059-thread-1-processing-n:127.0.0.1:39167__nl%2Fgg) [n:127.0.0.1:39167__nl%2Fgg c:control_collection   x:collection1] o.a.s.c.SolrResourceLoader JNDI not configured for solr (NoInitialContextEx)
   [junit4]   2> 587758 INFO  (coreLoadExecutor-2059-thread-1-processing-n:127.0.0.1:39167__nl%2Fgg) [n:127.0.0.1:39167__nl%2Fgg c:control_collection   x:collection1] o.a.s.c.SolrResourceLoader solr home defaulted to 'solr/' (could not find system property or JNDI)
   [junit4]   2> 587760 INFO  (coreLoadExecutor-2059-thread-1-processing-n:127.0.0.1:39167__nl%2Fgg) [n:127.0.0.1:39167__nl%2Fgg c:control_collection   x:collection1] o.a.s.c.Config loaded config solrconfig.xml with version 0 
   [junit4]   2> 587764 INFO  (coreLoadExecutor-2059-thread-1-processing-n:127.0.0.1:39167__nl%2Fgg) [n:127.0.0.1:39167__nl%2Fgg c:control_collection   x:collection1] o.a.s.c.SolrConfig current version of requestparams : -1
   [junit4]   2> 587768 INFO  (coreLoadExecutor-2059-thread-1-processing-n:127.0.0.1:39167__nl%2Fgg) [n:127.0.0.1:39167__nl%2Fgg c:control_collection   x:collection1] o.a.s.c.SolrConfig Using Lucene MatchVersion: 6.0.0
   [junit4]   2> 587781 INFO  (coreLoadExecutor-2059-thread-1-processing-n:127.0.0.1:39167__nl%2Fgg) [n:127.0.0.1:39167__nl%2Fgg c:control_collection   x:collection1] o.a.s.c.SolrConfig Loaded SolrConfig: solrconfig.xml
   [junit4]   2> 587787 INFO  (coreLoadExecutor-2059-thread-1-processing-n:127.0.0.1:39167__nl%2Fgg) [n:127.0.0.1:39167__nl%2Fgg c:control_collection   x:collection1] o.a.s.s.IndexSchema [collection1] Schema name=test
   [junit4]   2> 587878 INFO  (coreLoadExecutor-2059-thread-1-processing-n:127.0.0.1:39167__nl%2Fgg) [n:127.0.0.1:39167__nl%2Fgg c:control_collection   x:collection1] o.a.s.s.OpenExchangeRatesOrgProvider Initialized with rates=open-exchange-rates.json, refreshInterval=1440.
   [junit4]   2> 587883 INFO  (coreLoadExecutor-2059-thread-1-processing-n:127.0.0.1:39167__nl%2Fgg) [n:127.0.0.1:39167__nl%2Fgg c:control_collection   x:collection1] o.a.s.s.IndexSchema default search field in schema is text
   [junit4]   2> 587883 INFO  (coreLoadExecutor-2059-thread-1-processing-n:127.0.0.1:39167__nl%2Fgg) [n:127.0.0.1:39167__nl%2Fgg c:control_collection   x:collection1] o.a.s.s.IndexSchema unique key field: id
   [junit4]   2> 587889 INFO  (coreLoadExecutor-2059-thread-1-processing-n:127.0.0.1:39167__nl%2Fgg) [n:127.0.0.1:39167__nl%2Fgg c:control_collection   x:collection1] o.a.s.s.FileExchangeRateProvider Reloading exchange rates from file currency.xml
   [junit4]   2> 587891 INFO  (coreLoadExecutor-2059-thread-1-processing-n:127.0.0.1:39167__nl%2Fgg) [n:127.0.0.1:39167__nl%2Fgg c:control_collection   x:collection1] o.a.s.s.FileExchangeRateProvider Reloading exchange rates from file currency.xml
   [junit4]   2> 587892 INFO  (coreLoadExecutor-2059-thread-1-processing-n:127.0.0.1:39167__nl%2Fgg) [n:127.0.0.1:39167__nl%2Fgg c:control_collection   x:collection1] o.a.s.s.OpenExchangeRatesOrgProvider Reloading exchange rates from open-exchange-rates.json
   [junit4]   2> 587893 WARN  (coreLoadExecutor-2059-thread-1-processing-n:127.0.0.1:39167__nl%2Fgg) [n:127.0.0.1:39167__nl%2Fgg c:control_collection   x:collection1] o.a.s.s.OpenExchangeRatesOrgProvider Unknown key IMPORTANT NOTE
   [junit4]   2> 587893 WARN  (coreLoadExecutor-2059-thread-1-processing-n:127.0.0.1:39167__nl%2Fgg) [n:127.0.0.1:39167__nl%2Fgg c:control_collection   x:collection1] o.a.s.s.OpenExchangeRatesOrgProvider Expected key, got STRING
   [junit4]   2> 587893 INFO  (coreLoadExecutor-2059-thread-1-processing-n:127.0.0.1:39167__nl%2Fgg) [n:127.0.0.1:39167__nl%2Fgg c:control_collection   x:collection1] o.a.s.s.OpenExchangeRatesOrgProvider Reloading exchange rates from open-exchange-rates.json
   [junit4]   2> 587893 WARN  (coreLoadExecutor-2059-thread-1-processing-n:127.0.0.1:39167__nl%2Fgg) [n:127.0.0.1:39167__nl%2Fgg c:control_collection   x:collection1] o.a.s.s.OpenExchangeRatesOrgProvider Unknown key IMPORTANT NOTE
   [junit4]   2> 587893 WARN  (coreLoadExecutor-2059-thread-1-processing-n:127.0.0.1:39167__nl%2Fgg) [n:127.0.0.1:39167__nl%2Fgg c:control_collection   x:collection1] o.a.s.s.OpenExchangeRatesOrgProvider Expected key, got STRING
   [junit4]   2> 587894 INFO  (coreLoadExecutor-2059-thread-1-processing-n:127.0.0.1:39167__nl%2Fgg) [n:127.0.0.1:39167__nl%2Fgg c:control_collection   x:collection1] o.a.s.c.ConfigSetProperties Did not find ConfigSet properties, assuming default properties: Can't find resource 'configsetprops.json' in classpath or '/configs/conf1', cwd=/home/jenkins/workspace/Lucene-Solr-trunk-Linux/solr/build/solr-core/test/J1
   [junit4]   2> 587894 INFO  (coreLoadExecutor-2059-thread-1-processing-n:127.0.0.1:39167__nl%2Fgg) [n:127.0.0.1:39167__nl%2Fgg c:control_collection   x:collection1] o.a.s.c.CoreContainer Creating SolrCore 'collection1' using configuration from collection control_collection
   [junit4]   2> 587895 INFO  (coreLoadExecutor-2059-thread-1-processing-n:127.0.0.1:39167__nl%2Fgg) [n:127.0.0.1:39167__nl%2Fgg c:control_collection s:shard1 r:core_node1 x:collection1] o.a.s.c.SolrCore org.apache.solr.core.MockDirectoryFactory
   [junit4]   2> 587895 INFO  (coreLoadExecutor-2059-thread-1-processing-n:127.0.0.1:39167__nl%2Fgg) [n:127.0.0.1:39167__nl%2Fgg c:control_collection s:shard1 r:core_node1 x:collection1] o.a.s.c.SolrCore [[collection1] ] Opening new SolrCore at [/home/jenkins/workspace/Lucene-Solr-trunk-Linux/solr/build/solr-core/test/J1/temp/solr.cloud.CollectionsAPIDistributedZkTest_830BEEBD1B477A53-001/control-001/cores/collection1], dataDir=[null]
   [junit4]   2> 587895 INFO  (coreLoadExecutor-2059-thread-1-processing-n:127.0.0.1:39167__nl%2Fgg) [n:127.0.0.1:39167__nl%2Fgg c:control_collection s:shard1 r:core_node1 x:collection1] o.a.s.c.JmxMonitoredMap JMX monitoring is enabled. Adding Solr mbeans to JMX Server: com.sun.jmx.mbeanserver.JmxMBeanServer@1e60fb2
   [junit4]   2> 587895 INFO  (coreLoadExecutor-2059-thread-1-processing-n:127.0.0.1:39167__nl%2Fgg) [n:127.0.0.1:39167__nl%2Fgg c:control_collection s:shard1 r:core_node1 x:collection1] o.a.s.c.CachingDirectoryFactory return new directory for /home/jenkins/workspace/Lucene-Solr-trunk-Linux/solr/build/solr-core/test/J1/../../../../../../../../../home/jenkins/workspace/Lucene-Solr-trunk-Linux/solr/build/solr-core/test/J1/temp/solr.cloud.CollectionsAPIDistributedZkTest_830BEEBD1B477A53-001/control-001/cores/collection1/data
   [junit4]   2> 587895 INFO  (coreLoadExecutor-2059-thread-1-processing-n:127.0.0.1:39167__nl%2Fgg) [n:127.0.0.1:39167__nl%2Fgg c:control_collection s:shard1 r:core_node1 x:collection1] o.a.s.c.SolrCore New index directory detected: old=null new=/home/jenkins/workspace/Lucene-Solr-trunk-Linux/solr/build/solr-core/test/J1/../../../../../../../../../home/jenkins/workspace/Lucene-Solr-trunk-Linux/solr/build/solr-core/test/J1/temp/solr.cloud.CollectionsAPIDistributedZkTest_830BEEBD1B477A53-001/control-001/cores/collection1/data/index/
   [junit4]   2> 587896 WARN  (coreLoadExecutor-2059-thread-1-processing-n:127.0.0.1:39167__nl%2Fgg) [n:127.0.0.1:39167__nl%2Fgg c:control_collection s:shard1 r:core_node1 x:collection1] o.a.s.c.SolrCore [collection1] Solr index directory '/home/jenkins/workspace/Lucene-Solr-trunk-Linux/solr/build/solr-core/test/J1/../../../../../../../../../home/jenkins/workspace/Lucene-Solr-trunk-Linux/solr/build/solr-core/test/J1/temp/solr.cloud.CollectionsAPIDistributedZkTest_830BEEBD1B477A53-001/control-001/cores/collection1/data/index' doesn't exist. Creating new index...
   [junit4]   2> 587896 INFO  (coreLoadExecutor-2059-thread-1-processing-n:127.0.0.1:39167__nl%2Fgg) [n:127.0.0.1:39167__nl%2Fgg c:control_collection s:shard1 r:core_node1 x:collection1] o.a.s.c.CachingDirectoryFactory return new directory for /home/jenkins/workspace/Lucene-Solr-trunk-Linux/solr/build/solr-core/test/J1/../../../../../../../../../home/jenkins/workspace/Lucene-Solr-trunk-Linux/solr/build/solr-core/test/J1/temp/solr.cloud.CollectionsAPIDistributedZkTest_830BEEBD1B477A53-001/control-001/cores/collection1/data/index
   [junit4]   2> 587896 INFO  (coreLoadExecutor-2059-thread-1-processing-n:127.0.0.1:39167__nl%2Fgg) [n:127.0.0.1:39167__nl%2Fgg c:control_collection s:shard1 r:core_node1 x:collection1] o.a.s.u.RandomMergePolicy RandomMergePolicy wrapping class org.apache.lucene.index.TieredMergePolicy: [TieredMergePolicy: maxMergeAtOnce=43, maxMergeAtOnceExplicit=38, maxMergedSegmentMB=60.4638671875, floorSegmentMB=1.271484375, forceMergeDeletesPctAllowed=10.25616496035706, segmentsPerTier=18.0, maxCFSSegmentSizeMB=8.796093022207999E12, noCFSRatio=0.35105122516526543
   [junit4]   2> 587896 INFO  (coreLoadExecutor-2059-thread-1-processing-n:127.0.0.1:39167__nl%2Fgg) [n:127.0.0.1:39167__nl%2Fgg c:control_collection s:shard1 r:core_node1 x:collection1] o.a.s.c.SolrDeletionPolicy SolrDeletionPolicy.onCommit: commits: num=1
   [junit4]   2> 	commit{dir=MockDirectoryWrapper(RAMDirectory@4d7351 lockFactory=org.apache.lucene.store.SingleInstanceLockFactory@c7ff57),segFN=segments_1,generation=1}
   [junit4]   2> 587897 INFO  (coreLoadExecutor-2059-thread-1-processing-n:127.0.0.1:39167__nl%2Fgg) [n:127.0.0.1:39167__nl%2Fgg c:control_collection s:shard1 r:core_node1 x:collection1] o.a.s.c.SolrDeletionPolicy newest commit generation = 1
   [junit4]   2> 587897 INFO  (OldIndexDirectoryCleanupThreadForCore-collection1) [n:127.0.0.1:39167__nl%2Fgg c:control_collection s:shard1 r:core_node1 x:collection1] o.a.s.c.SolrCore Looking for old index directories to cleanup for core collection1 in /home/jenkins/workspace/Lucene-Solr-trunk-Linux/solr/build/solr-core/test/J1/../../../../../../../../../home/jenkins/workspace/Lucene-Solr-trunk-Linux/solr/build/solr-core/test/J1/temp/solr.cloud.CollectionsAPIDistributedZkTest_830BEEBD1B477A53-001/control-001/cores/collection1/data/
   [junit4]   2> 587897 WARN  (OldIndexDirectoryCleanupThreadForCore-collection1) [n:127.0.0.1:39167__nl%2Fgg c:control_collection s:shard1 r:core_node1 x:collection1] o.a.s.c.DirectoryFactory /home/jenkins/workspace/Lucene-Solr-trunk-Linux/solr/build/solr-core/test/J1/../../../../../../../../../home/jenkins/workspace/Lucene-Solr-trunk-Linux/solr/build/solr-core/test/J1/temp/solr.cloud.CollectionsAPIDistributedZkTest_830BEEBD1B477A53-001/control-001/cores/collection1/data/ does not point to a valid data directory; skipping clean-up of old index directories.
   [junit4]   2> 587900 INFO  (coreLoadExecutor-2059-thread-1-processing-n:127.0.0.1:39167__nl%2Fgg) [n:127.0.0.1:39167__nl%2Fgg c:control_collection s:shard1 r:core_node1 x:collection1] o.a.s.u.p.UpdateRequestProcessorChain creating updateRequestProcessorChain "nodistrib"
   [junit4]   2> 587900 INFO  (coreLoadExecutor-2059-thread-1-processing-n:127.0.0.1:39167__nl%2Fgg) [n:127.0.0.1:39167__nl%2Fgg c:control_collection s:shard1 r:core_node1 x:collection1] o.a.s.u.p.UpdateRequestProcessorChain creating updateRequestProcessorChain "dedupe"
   [junit4]   2> 587900 INFO  (coreLoadExecutor-2059-thread-1-processing-n:127.0.0.1:39167__nl%2Fgg) [n:127.0.0.1:39167__nl%2Fgg c:control_collection s:shard1 r:core_node1 x:collection1] o.a.s.u.p.UpdateRequestProcessorChain inserting DistributedUpdateProcessorFactory into updateRequestProcessorChain "dedupe"
   [junit4]   2> 587900 INFO  (coreLoadExecutor-2059-thread-1-processing-n:127.0.0.1:39167__nl%2Fgg) [n:127.0.0.1:39167__nl%2Fgg c:control_collection s:shard1 r:core_node1 x:collection1] o.a.s.u.p.UpdateRequestProcessorChain creating updateRequestProcessorChain "stored_sig"
   [junit4]   2> 587900 INFO  (coreLoadExecutor-2059-thread-1-processing-n:127.0.0.1:39167__nl%2Fgg) [n:127.0.0.1:39167__nl%2Fgg c:control_collection s:shard1 r:core_node1 x:collection1] o.a.s.u.p.UpdateRequestProcessorChain inserting DistributedUpdateProcessorFactory into updateRequestProcessorChain "stored_sig"
   [junit4]   2> 587900 INFO  (coreLoadExecutor-2059-thread-1-processing-n:127.0.0.1:39167__nl%2Fgg) [n:127.0.0.1:39167__nl%2Fgg c:control_collection s:shard1 r:core_node1 x:collection1] o.a.s.u.p.UpdateRequestProcessorChain creating updateRequestProcessorChain "distrib-dup-test-chain-explicit"
   [junit4]   2> 587900 INFO  (coreLoadExecutor-2059-thread-1-processing-n:127.0.0.1:39167__nl%2Fgg) [n:127.0.0.1:39167__nl%2Fgg c:control_collection s:shard1 r:core_node1 x:collection1] o.a.s.u.p.UpdateRequestProcessorChain creating updateRequestProcessorChain "distrib-dup-test-chain-implicit"
   [junit4]   2> 587900 INFO  (coreLoadExecutor-2059-thread-1-processing-n:127.0.0.1:39167__nl%2Fgg) [n:127.0.0.1:39167__nl%2Fgg c:control_collection s:shard1 r:core_node1 x:collection1] o.a.s.u.p.UpdateRequestProcessorChain inserting DistributedUpdateProcessorFactory into updateRequestProcessorChain "distrib-dup-test-chain-implicit"
   [junit4]   2> 587900 INFO  (coreLoadExecutor-2059-thread-1-processing-n:127.0.0.1:39167__nl%2Fgg) [n:127.0.0.1:39167__nl%2Fgg c:control_collection s:shard1 r:core_node1 x:collection1] o.a.s.c.SolrCore no updateRequestProcessorChain defined as default, creating implicit default
   [junit4]   2> 587900 WARN  (coreLoadExecutor-2059-thread-1-processing-n:127.0.0.1:39167__nl%2Fgg) [n:127.0.0.1:39167__nl%2Fgg c:control_collection s:shard1 r:core_node1 x:collection1] o.a.s.c.RequestHandlers INVALID paramSet a in requestHandler {type = requestHandler,name = /dump,class = DumpRequestHandler,args = {defaults={a=A,b=B}}}
   [junit4]   2> 587902 INFO  (coreLoadExecutor-2059-thread-1-processing-n:127.0.0.1:39167__nl%2Fgg) [n:127.0.0.1:39167__nl%2Fgg c:control_collection s:shard1 r:core_node1 x:collection1] o.a.s.h.l.XMLLoader xsltCacheLifetimeSeconds=60
   [junit4]   2> 587903 INFO  (coreLoadExecutor-2059-thread-1-processing-n:127.0.0.1:39167__nl%2Fgg) [n:127.0.0.1:39167__nl%2Fgg c:control_collection s:shard1 r:core_node1 x:collection1] o.a.s.h.l.XMLLoader xsltCacheLifetimeSeconds=60
   [junit4]   2> 587904 INFO  (coreLoadExecutor-2059-thread-1-processing-n:127.0.0.1:39167__nl%2Fgg) [n:127.0.0.1:39167__nl%2Fgg c:control_collection s:shard1 r:core_node1 x:collection1] o.a.s.h.l.XMLLoader xsltCacheLifetimeSeconds=60
   [junit4]   2> 587905 INFO  (coreLoadExecutor-2059-thread-1-processing-n:127.0.0.1:39167__nl%2Fgg) [n:127.0.0.1:39167__nl%2Fgg c:control_collection s:shard1 r:core_node1 x:collection1] o.a.s.h.l.XMLLoader xsltCacheLifetimeSeconds=60
   [junit4]   2> 587907 INFO  (coreLoadExecutor-2059-thread-1-processing-n:127.0.0.1:39167__nl%2Fgg) [n:127.0.0.1:39167__nl%2Fgg c:control_collection s:shard1 r:core_node1 x:collection1] o.a.s.c.RequestHandlers Registered paths: /admin/mbeans,standard,/dump,/update/csv,/update/json/docs,/admin/luke,/admin/segments,/get,/admin/system,/replication,/admin/properties,/config,/schema,/admin/plugins,/admin/logging,/update/json,/admin/threads,/admin/ping,/update,/admin/file
   [junit4]   2> 587908 INFO  (coreLoadExecutor-2059-thread-1-processing-n:127.0.0.1:39167__nl%2Fgg) [n:127.0.0.1:39167__nl%2Fgg c:control_collection s:shard1 r:core_node1 x:collection1] o.a.s.c.SolrCore Using default statsCache cache: org.apache.solr.search.stats.LocalStatsCache
   [junit4]   2> 587908 INFO  (coreLoadExecutor-2059-thread-1-processing-n:127.0.0.1:39167__nl%2Fgg) [n:127.0.0.1:39167__nl%2Fgg c:control_collection s:shard1 r:core_node1 x:collection1] o.a.s.u.UpdateHandler Using UpdateLog implementation: org.apache.solr.update.UpdateLog
   [junit4]   2> 587908 INFO  (coreLoadExecutor-2059-thread-1-processing-n:127.0.0.1:39167__nl%2Fgg) [n:127.0.0.1:39167__nl%2Fgg c:control_collection s:shard1 r:core_node1 x:collection1] o.a.s.u.UpdateLog Initializing UpdateLog: dataDir= defaultSyncLevel=FLUSH numRecordsToKeep=100 maxNumLogsToKeep=10 numVersionBuckets=65536
   [junit4]   2> 587909 INFO  (coreLoadExecutor-2059-thread-1-processing-n:127.0.0.1:39167__nl%2Fgg) [n:127.0.0.1:39167__nl%2Fgg c:control_collection s:shard1 r:core_node1 x:collection1] o.a.s.u.CommitTracker Hard AutoCommit: disabled
   [junit4]   2> 587909 INFO  (coreLoadExecutor-2059-thread-1-processing-n:127.0.0.1:39167__nl%2Fgg) [n:127.0.0.1:39167__nl%2Fgg c:control_collection s:shard1 r:core_node1 x:collection1] o.a.s.u.CommitTracker Soft AutoCommit: disabled
   [junit4]   2> 587909 INFO  (coreLoadExecutor-2059-thread-1-processing-n:127.0.0.1:39167__nl%2Fgg) [n:127.0.0.1:39167__nl%2Fgg c:control_collection s:shard1 r:core_node1 x:collection1] o.a.s.u.RandomMergePolicy RandomMergePolicy wrapping class org.apache.lucene.index.TieredMergePolicy: [TieredMergePolicy: maxMergeAtOnce=28, maxMergeAtOnceExplicit=44, maxMergedSegmentMB=3.6953125, floorSegmentMB=1.21484375, forceMergeDeletesPctAllowed=15.526549856106852, segmentsPerTier=30.0, maxCFSSegmentSizeMB=8.796093022207999E12, noCFSRatio=0.5136036913622232
   [junit4]   2> 587910 INFO  (coreLoadExecutor-2059-thread-1-processing-n:127.0.0.1:39167__nl%2Fgg) [n:127.0.0.1:39167__nl%2Fgg c:control_collection s:shard1 r:core_node1 x:collection1] o.a.s.c.SolrDeletionPolicy SolrDeletionPolicy.onInit: commits: num=1
   [junit4]   2> 	commit{dir=MockDirectoryWrapper(RAMDirectory@4d7351 lockFactory=org.apache.lucene.store.SingleInstanceLockFactory@c7ff57),segFN=segments_1,generation=1}
   [junit4]   2> 587910 INFO  (coreLoadExecutor-2059-thread-1-processing-n:127.0.0.1:39167__nl%2Fgg) [n:127.0.0.1:39167__nl%2Fgg c:control_collection s:shard1 r:core_node1 x:collection1] o.a.s.c.SolrDeletionPolicy newest commit generation = 1
   [junit4]   2> 587910 INFO  (coreLoadExecutor-2059-thread-1-processing-n:127.0.0.1:39167__nl%2Fgg) [n:127.0.0.1:39167__nl%2Fgg c:control_collection s:shard1 r:core_node1 x:collection1] o.a.s.s.SolrIndexSearcher Opening Searcher@1c21a26[collection1] main
   [junit4]   2> 587910 INFO  (coreLoadExecutor-2059-thread-1-processing-n:127.0.0.1:39167__nl%2Fgg) [n:127.0.0.1:39167__nl%2Fgg c:control_collection s:shard1 r:core_node1 x:collection1] o.a.s.c.c.ZkStateReader Load collection config from:/collections/control_collection
   [junit4]   2> 587911 INFO  (coreLoadExecutor-2059-thread-1-processing-n:127.0.0.1:39167__nl%2Fgg) [n:127.0.0.1:39167__nl%2Fgg c:control_collection s:shard1 r:core_node1 x:collection1] o.a.s.c.c.ZkStateReader path=/collections/control_collection configName=conf1 specified config exists in ZooKeeper
   [junit4]   2> 587911 INFO  (coreLoadExecutor-2059-thread-1-processing-n:127.0.0.1:39167__nl%2Fgg) [n:127.0.0.1:39167__nl%2Fgg c:control_collection s:shard1 r:core_node1 x:collection1] o.a.s.r.ManagedResourceStorage Setting up ZooKeeper-based storage for the RestManager with znodeBase: /configs/conf1
   [junit4]   2> 587911 INFO  (coreLoadExecutor-2059-thread-1-processing-n:127.0.0.1:39167__nl%2Fgg) [n:127.0.0.1:39167__nl%2Fgg c:control_collection s:shard1 r:core_node1 x:collection1] o.a.s.r.ManagedResourceStorage Configured ZooKeeperStorageIO with znodeBase: /configs/conf1
   [junit4]   2> 587911 INFO  (coreLoadExecutor-2059-thread-1-processing-n:127.0.0.1:39167__nl%2Fgg) [n:127.0.0.1:39167__nl%2Fgg c:control_collection s:shard1 r:core_node1 x:collection1] o.a.s.r.RestManager Initializing RestManager with initArgs: {}
   [junit4]   2> 587911 INFO  (coreLoadExecutor-2059-thread-1-processing-n:127.0.0.1:39167__nl%2Fgg) [n:127.0.0.1:39167__nl%2Fgg c:control_collection s:shard1 r:core_node1 x:collection1] o.a.s.r.ManagedResourceStorage Reading _rest_managed.json using ZooKeeperStorageIO:path=/configs/conf1
   [junit4]   2> 587911 INFO  (coreLoadExecutor-2059-thread-1-processing-n:127.0.0.1:39167__nl%2Fgg) [n:127.0.0.1:39167__nl%2Fgg c:control_collection s:shard1 r:core_node1 x:collection1] o.a.s.r.ManagedResourceStorage No data found for znode /configs/conf1/_rest_managed.json
   [junit4]   2> 587911 INFO  (coreLoadExecutor-2059-thread-1-processing-n:127.0.0.1:39167__nl%2Fgg) [n:127.0.0.1:39167__nl%2Fgg c:control_collection s:shard1 r:core_node1 x:collection1] o.a.s.r.ManagedResourceStorage Loaded null at path _rest_managed.json using ZooKeeperStorageIO:path=/configs/conf1
   [junit4]   2> 587911 INFO  (coreLoadExecutor-2059-thread-1-processing-n:127.0.0.1:39167__nl%2Fgg) [n:127.0.0.1:39167__nl%2Fgg c:control_collection s:shard1 r:core_node1 x:collection1] o.a.s.r.RestManager Initializing 0 registered ManagedResources
   [junit4]   2> 587911 INFO  (coreLoadExecutor-2059-thread-1-processing-n:127.0.0.1:39167__nl%2Fgg) [n:127.0.0.1:39167__nl%2Fgg c:control_collection s:shard1 r:core_node1 x:collection1] o.a.s.h.ReplicationHandler Commits will be reserved for  10000
   [junit4]   2> 587912 INFO  (searcherExecutor-2060-thread-1-processing-n:127.0.0.1:39167__nl%2Fgg x:collection1 s:shard1 c:control_collection r:core_node1) [n:127.0.0.1:39167__nl%2Fgg c:control_collection s:shard1 r:core_node1 x:collection1] o.a.s.c.SolrCore [collection1] Registered new searcher Searcher@1c21a26[collection1] main{ExitableDirectoryReader(UninvertingDirectoryReader())}
   [junit4]   2> 587912 INFO  (coreLoadExecutor-2059-thread-1-processing-n:127.0.0.1:39167__nl%2Fgg) [n:127.0.0.1:39167__nl%2Fgg c:control_collection s:shard1 r:core_node1 x:collection1] o.a.s.u.UpdateLog Looking up max value of version field to seed version buckets
   [junit4]   2> 587912 INFO  (coreLoadExecutor-2059-thread-1-processing-n:127.0.0.1:39167__nl%2Fgg) [n:127.0.0.1:39167__nl%2Fgg c:control_collection s:shard1 r:core_node1 x:collection1] o.a.s.u.VersionInfo Refreshing highest value of _version_ for 65536 version buckets from index
   [junit4]   2> 587912 INFO  (coreLoadExecutor-2059-thread-1-processing-n:127.0.0.1:39167__nl%2Fgg) [n:127.0.0.1:39167__nl%2Fgg c:control_collection s:shard1 r:core_node1 x:collection1] o.a.s.u.VersionInfo No terms found for _version_, cannot seed version bucket highest value from index
   [junit4]   2> 587912 INFO  (coreLoadExecutor-2059-thread-1-processing-n:127.0.0.1:39167__nl%2Fgg) [n:127.0.0.1:39167__nl%2Fgg c:control_collection s:shard1 r:core_node1 x:collection1] o.a.s.u.UpdateLog Could not find max version in index or recent updates, using new clock 1519629001036922880
   [junit4]   2> 587913 INFO  (coreLoadExecutor-2059-thread-1-processing-n:127.0.0.1:39167__nl%2Fgg) [n:127.0.0.1:39167__nl%2Fgg c:control_collection s:shard1 r:core_node1 x:collection1] o.a.s.u.UpdateLog Took 1.0ms to seed version buckets with highest version 1519629001036922880
   [junit4]   2> 587914 INFO  (coreLoadExecutor-2059-thread-1-processing-n:127.0.0.1:39167__nl%2Fgg) [n:127.0.0.1:39167__nl%2Fgg c:control_collection s:shard1 r:core_node1 x:collection1] o.a.s.c.ZkController watch zkdir /configs/conf1
   [junit4]   2> 587914 INFO  (coreLoadExecutor-2059-thread-1-processing-n:127.0.0.1:39167__nl%2Fgg) [n:127.0.0.1:39167__nl%2Fgg c:control_collection s:shard1 r:core_node1 x:collection1] o.a.s.c.CoreContainer registering core: collection1
   [junit4]   2> 587914 INFO  (coreZkRegister-2053-thread-1-processing-n:127.0.0.1:39167__nl%2Fgg x:collection1 s:shard1 c:control_collection r:core_node1) [n:127.0.0.1:39167__nl%2Fgg c:control_collection s:shard1 r:core_node1 x:collection1] o.a.s.c.ZkController Register replica - core:collection1 address:http://127.0.0.1:39167/_nl/gg collection:control_collection shard:shard1
   [junit4]   2> 587915 INFO  (coreZkRegister-2053-thread-1-processing-n:127.0.0.1:39167__nl%2Fgg x:collection1 s:shard1 c:control_collection r:core_node1) [n:127.0.0.1:39167__nl%2Fgg c:control_collection s:shard1 r:core_node1 x:collection1] o.a.s.c.c.SolrZkClient makePath: /collections/control_collection/leader_elect/shard1/election
   [junit4]   2> 587916 INFO  (coreZkRegister-2053-thread-1-processing-n:127.0.0.1:39167__nl%2Fgg x:collection1 s:shard1 c:control_collection r:core_node1) [n:127.0.0.1:39167__nl%2Fgg c:control_collection s:shard1 r:core_node1 x:collection1] o.a.s.c.LeaderElector Joined leadership election with path: /collections/control_collection/leader_elect/shard1/election/94976812472270852-core_node1-n_0000000000
   [junit4]   2> 587916 INFO  (coreZkRegister-2053-thread-1-processing-n:127.0.0.1:39167__nl%2Fgg x:collection1 s:shard1 c:control_collection r:core_node1) [n:127.0.0.1:39167__nl%2Fgg c:control_collection s:shard1 r:core_node1 x:collection1] o.a.s.c.ShardLeaderElectionContext Running the leader process for shard shard1
   [junit4]   2> 587917 INFO  (coreZkRegister-2053-thread-1-processing-n:127.0.0.1:39167__nl%2Fgg x:collection1 s:shard1 c:control_collection r:core_node1) [n:127.0.0.1:39167__nl%2Fgg c:control_collection s:shard1 r:core_node1 x:collection1] o.a.s.c.ShardLeaderElectionContext Enough replicas found to continue.
   [junit4]   2> 587917 INFO  (coreZkRegister-2053-thread-1-processing-n:127.0.0.1:39167__nl%2Fgg x:collection1 s:shard1 c:control_collection r:core_node1) [n:127.0.0.1:39167__nl%2Fgg c:control_collection s:shard1 r:core_node1 x:collection1] o.a.s.c.ShardLeaderElectionContext I may be the new leader - try and sync
   [junit4]   2> 587917 INFO  (coreZkRegister-2053-thread-1-processing-n:127.0.0.1:39167__nl%2Fgg x:collection1 s:shard1 c:control_collection r:core_node1) [n:127.0.0.1:39167__nl%2Fgg c:control_collection s:shard1 r:core_node1 x:collection1] o.a.s.c.SyncStrategy Sync replicas to http://127.0.0.1:39167/_nl/gg/collection1/
   [junit4]   2> 587917 INFO  (coreZkRegister-2053-thread-1-processing-n:127.0.0.1:39167__nl%2Fgg x:collection1 s:shard1 c:control_collection r:core_node1) [n:127.0.0.1:39167__nl%2Fgg c:control_collection s:shard1 r:core_node1 x:collection1] o.a.s.c.SyncStrategy Sync Success - now sync replicas to me
   [junit4]   2> 587917 INFO  (OverseerStateUpdate-94976812472270852-127.0.0.1:39167__nl%2Fgg-n_0000000000) [n:127.0.0.1:39167__nl%2Fgg    ] o.a.s.c.Overseer processMessage: queueSize: 1, message = {
   [junit4]   2>   "operation":"leader",
   [junit4]   2>   "shard":"shard1",
   [junit4]   2>   "collection":"control_collection"} current state version: 1
   [junit4]   2> 587918 INFO  (coreZkRegister-2053-thread-1-processing-n:127.0.0.1:39167__nl%2Fgg x:collection1 s:shard1 c:control_collection r:core_node1) [n:127.0.0.1:39167__nl%2Fgg c:control_collection s:shard1 r:core_node1 x:collection1] o.a.s.c.SyncStrategy http://127.0.0.1:39167/_nl/gg/collection1/ has no replicas
   [junit4]   2> 587918 INFO  (coreZkRegister-2053-thread-1-processing-n:127.0.0.1:39167__nl%2Fgg x:collection1 s:shard1 c:control_collection r:core_node1) [n:127.0.0.1:39167__nl%2Fgg c:control_collection s:shard1 r:core_node1 x:collection1] o.a.s.c.c.SolrZkClient makePath: /collections/control_collection/leaders/shard1
   [junit4]   2> 587920 INFO  (coreZkRegister-2053-thread-1-processing-n:127.0.0.1:39167__nl%2Fgg x:collection1 s:shard1 c:control_collection r:core_node1) [n:127.0.0.1:39167__nl%2Fgg c:control_collection s:shard1 r:core_node1 x:collection1] o.a.s.c.ShardLeaderElectionContextBase Creating leader registration node
   [junit4]   2> 587921 INFO  (coreZkRegister-2053-thread-1-processing-n:127.0.0.1:39167__nl%2Fgg x:collection1 s:shard1 c:control_collection r:core_node1) [n:127.0.0.1:39167__nl%2Fgg c:control_collection s:shard1 r:core_node1 x:collection1] o.a.s.c.ShardLeaderElectionContext I am the new leader: http://127.0.0.1:39167/_nl/gg/collection1/ shard1
   [junit4]   2> 587921 INFO  (OverseerStateUpdate-94976812472270852-127.0.0.1:39167__nl%2Fgg-n_0000000000) [n:127.0.0.1:39167__nl%2Fgg    ] o.a.s.c.Overseer processMessage: queueSize: 1, message = {
   [junit4]   2>   "operation":"leader",
   [junit4]   2>   "shard":"shard1",
   [junit4]   2>   "collection":"control_collection",
   [junit4]   2>   "base_url":"http://127.0.0.1:39167/_nl/gg",
   [junit4]   2>   "core":"collection1",
   [junit4]   2>   "state":"active"} current state version: 1
   [junit4]   2> 588022 INFO  (zkCallback-478-thread-1-processing-n:127.0.0.1:39167__nl%2Fgg) [n:127.0.0.1:39167__nl%2Fgg    ] o.a.s.c.c.ZkStateReader A cluster state change: WatchedEvent state:SyncConnected type:NodeDataChanged path:/clusterstate.json, has occurred - updating... (live nodes size: 1)
   [junit4]   2> 588071 INFO  (coreZkRegister-2053-thread-1-processing-n:127.0.0.1:39167__nl%2Fgg x:collection1 s:shard1 c:control_collection r:core_node1) [n:127.0.0.1:39167__nl%2Fgg c:control_collection s:shard1 r:core_node1 x:collection1] o.a.s.c.ZkController We are http://127.0.0.1:39167/_nl/gg/collection1/ and leader is http://127.0.0.1:39167/_nl/gg/collection1/
   [junit4]   2> 588071 INFO  (coreZkRegister-2053-thread-1-processing-n:127.0.0.1:39167__nl%2Fgg x:collection1 s:shard1 c:control_collection r:core_node1) [n:127.0.0.1:39167__nl%2Fgg c:control_collection s:shard1 r:core_node1 x:collection1] o.a.s.c.ZkController No LogReplay needed for core=collection1 baseURL=http://127.0.0.1:39167/_nl/gg
   [junit4]   2> 588071 INFO  (coreZkRegister-2053-thread-1-processing-n:127.0.0.1:39167__nl%2Fgg x:collection1 s:shard1 c:control_collection r:core_node1) [n:127.0.0.1:39167__nl%2Fgg c:control_collection s:shard1 r:core_node1 x:collection1] o.a.s.c.ZkController I am the leader, no recovery necessary
   [junit4]   2> 588072 INFO  (coreZkRegister-2053-thread-1-processing-n:127.0.0.1:39167__nl%2Fgg x:collection1 s:shard1 c:control_collection r:core_node1) [n:127.0.0.1:39167__nl%2Fgg c:control_collection s:shard1 r:core_node1 x:collection1] o.a.s.c.ZkController publishing state=active
   [junit4]   2> 588072 INFO  (coreZkRegister-2053-thread-1-processing-n:127.0.0.1:39167__nl%2Fgg x:collection1 s:shard1 c:control_collection r:core_node1) [n:127.0.0.1:39167__nl%2Fgg c:control_collection s:shard1 r:core_node1 x:collection1] o.a.s.c.ZkController numShards not found on descriptor - reading it from system property
   [junit4]   2> 588073 INFO  (OverseerStateUpdate-94976812472270852-127.0.0.1:39167__nl%2Fgg-n_0000000000) [n:127.0.0.1:39167__nl%2Fgg    ] o.a.s.c.Overseer processMessage: queueSize: 1, message = {
   [junit4]   2>   "core":"collection1",
   [junit4]   2>   "core_node_name":"core_node1",
   [junit4]   2>   "roles":null,
   [junit4]   2>   "base_url":"http://127.0.0.1:39167/_nl/gg",
   [junit4]   2>   "node_name":"127.0.0.1:39167__nl%2Fgg",
   [junit4]   2>   "numShards":"1",
   [junit4]   2>   "state":"active",
   [junit4]   2>   "shard":"shard1",
   [junit4]   2>   "collection":"control_collection",
   [junit4]   2>   "operation":"state"} current state version: 2
   [junit4]   2> 588073 INFO  (OverseerStateUpdate-94976812472270852-127.0.0.1:39167__nl%2Fgg-n_0000000000) [n:127.0.0.1:39167__nl%2Fgg    ] o.a.s.c.o.ReplicaMutator Update state numShards=1 message={
   [junit4]   2>   "core":"collection1",
   [junit4]   2>   "core_node_name":"core_node1",
   [junit4]   2>   "roles":null,
   [junit4]   2>   "base_url":"http://127.0.0.1:39167/_nl/gg",
   [junit4]   2>   "node_name":"127.0.0.1:39167__nl%2Fgg",
   [junit4]   2>   "numShards":"1",
   [junit4]   2>   "state":"active",
   [junit4]   2>   "shard":"shard1",
   [junit4]   2>   "collection":"control_collection",
   [junit4]   2>   "operation":"state"}
   [junit4]   2> 588174 INFO  (zkCallback-478-thread-2-processing-n:127.0.0.1:39167__nl%2Fgg) [n:127.0.0.1:39167__nl%2Fgg    ] o.a.s.c.c.ZkStateReader A cluster state change: WatchedEvent state:SyncConnected type:NodeDataChanged path:/clusterstate.json, has occurred - updating... (live nodes size: 1)
   [junit4]   2> 588257 INFO  (TEST-CollectionsAPIDistributedZkTest.test-seed#[830BEEBD1B477A53]) [    ] o.a.s.c.c.SolrZkClient Using default ZkCredentialsProvider
   [junit4]   2> 588257 INFO  (TEST-CollectionsAPIDistributedZkTest.test-seed#[830BEEBD1B477A53]) [    ] o.a.s.c.c.ConnectionManager Waiting for client to connect to ZooKeeper
   [junit4]   2> 588258 INFO  (zkCallback-480-thread-1) [    ] o.a.s.c.c.ConnectionManager Watcher org.apache.solr.common.cloud.ConnectionManager@c77311 name:ZooKeeperConnection Watcher:127.0.0.1:51938/solr got event WatchedEvent state:SyncConnected type:None path:null path:null type:None
   [junit4]   2> 588258 INFO  (TEST-CollectionsAPIDistributedZkTest.test-seed#[830BEEBD1B477A53]) [    ] o.a.s.c.c.ConnectionManager Client is connected to ZooKeeper
   [junit4]   2> 588259 INFO  (TEST-CollectionsAPIDistributedZkTest.test-seed#[830BEEBD1B477A53]) [    ] o.a.s.c.c.SolrZkClient Using default ZkACLProvider
   [junit4]   2> 588259 INFO  (TEST-CollectionsAPIDistributedZkTest.test-seed#[830BEEBD1B477A53]) [    ] o.a.s.c.c.ZkStateReader Updating cluster state from ZooKeeper... 
   [junit4]   2> 588260 INFO  (TEST-CollectionsAPIDistributedZkTest.test-seed#[830BEEBD1B477A53]) [    ] o.a.s.c.ChaosMonkey monkey: init - expire sessions:false cause connection loss:false
   [junit4]   2> 588260 INFO  (TEST-CollectionsAPIDistributedZkTest.test-seed#[830BEEBD1B477A53]) [    ] o.a.s.c.AbstractFullDistribZkTestBase Creating collection1 with stateFormat=2
   [junit4]   2> 588260 INFO  (TEST-CollectionsAPIDistributedZkTest.test-seed#[830BEEBD1B477A53]) [    ] o.a.s.c.c.SolrZkClient Using default ZkCredentialsProvider
   [junit4]   2> 588260 INFO  (TEST-CollectionsAPIDistributedZkTest.test-seed#[830BEEBD1B477A53]) [    ] o.a.s.c.c.ConnectionManager Waiting for client to connect to ZooKeeper
   [junit4]   2> 588261 INFO  (zkCallback-481-thread-1) [    ] o.a.s.c.c.ConnectionManager Watcher org.apache.solr.common.cloud.ConnectionManager@63c8e4 name:ZooKeeperConnection Watcher:127.0.0.1:51938/solr got event WatchedEvent state:SyncConnected type:None path:null path:null type:None
   [junit4]   2> 588261 INFO  (TEST-CollectionsAPIDistributedZkTest.test-seed#[830BEEBD1B477A53]) [    ] o.a.s.c.c.ConnectionManager Client is connected to ZooKeeper
   [junit4]   2> 588261 INFO  (TEST-CollectionsAPIDistributedZkTest.test-seed#[830BEEBD1B477A53]) [    ] o.a.s.c.c.SolrZkClient Using default ZkACLProvider
   [junit4]   2> 588263 INFO  (OverseerStateUpdate-94976812472270852-127.0.0.1:39167__nl%2Fgg-n_0000000000) [n:127.0.0.1:39167__nl%2Fgg    ] o.a.s.c.Overseer processMessage: queueSize: 1, message = {
   [junit4]   2>   "operation":"create",
   [junit4]   2>   "name":"collection1",
   [junit4]   2>   "numShards":"2",
   [junit4]   2>   "stateFormat":"2"} current state version: 3
   [junit4]   2> 588263 INFO  (OverseerStateUpdate-94976812472270852-127.0.0.1:39167__nl%2Fgg-n_0000000000) [n:127.0.0.1:39167__nl%2Fgg    ] o.a.s.c.o.ClusterStateMutator building a new cName: collection1
   [junit4]   2> 588321 INFO  (TEST-CollectionsAPIDistributedZkTest.test-seed#[830BEEBD1B477A53]) [    ] o.a.s.SolrTestCaseJ4 Writing core.properties file to /home/jenkins/workspace/Lucene-Solr-trunk-Linux/solr/build/solr-core/test/J1/temp/solr.cloud.CollectionsAPIDistributedZkTest_830BEEBD1B477A53-001/shard-1-001/cores/collection1
   [junit4]   2> 588322 INFO  (TEST-CollectionsAPIDistributedZkTest.test-seed#[830BEEBD1B477A53]) [    ] o.a.s.c.AbstractFullDistribZkTestBase create jetty 1 in directory /home/jenkins/workspace/Lucene-Solr-trunk-Linux/solr/build/solr-core/test/J1/temp/solr.cloud.CollectionsAPIDistributedZkTest_830BEEBD1B477A53-001/shard-1-001
   [junit4]   2> 588323 INFO  (TEST-CollectionsAPIDistributedZkTest.test-seed#[830BEEBD1B477A53]) [    ] o.e.j.s.Server jetty-9.3.6.v20151106
   [junit4]   2> 588324 INFO  (TEST-CollectionsAPIDistributedZkTest.test-seed#[830BEEBD1B477A53]) [    ] o.e.j.s.h.ContextHandler Started o.e.j.s.ServletContextHandler@1e7a14f{/_nl/gg,null,AVAILABLE}
   [junit4]   2> 588324 INFO  (TEST-CollectionsAPIDistributedZkTest.test-seed#[830BEEBD1B477A53]) [    ] o.e.j.s.ServerConnector Started ServerConnector@111f8f8{HTTP/1.1,[http/1.1]}{127.0.0.1:52604}
   [junit4]   2> 588324 INFO  (TEST-CollectionsAPIDistributedZkTest.test-seed#[830BEEBD1B477A53]) [    ] o.e.j.s.Server Started @589615ms
   [junit4]   2> 588324 INFO  (TEST-CollectionsAPIDistributedZkTest.test-seed#[830BEEBD1B477A53]) [    ] o.a.s.c.s.e.JettySolrRunner Jetty properties: {solr.data.dir=/home/jenkins/workspace/Lucene-Solr-trunk-Linux/solr/build/solr-core/test/J1/temp/solr.cloud.CollectionsAPIDistributedZkTest_830BEEBD1B477A53-001/tempDir-001/jetty1, solrconfig=solrconfig.xml, hostContext=/_nl/gg, hostPort=52604, coreRootDirectory=/home/jenkins/workspace/Lucene-Solr-trunk-Linux/solr/build/solr-core/test/J1/temp/solr.cloud.CollectionsAPIDistributedZkTest_830BEEBD1B477A53-001/shard-1-001/cores}
   [junit4]   2> 588325 INFO  (TEST-CollectionsAPIDistributedZkTest.test-seed#[830BEEBD1B477A53]) [    ] o.a.s.s.SolrDispatchFilter SolrDispatchFilter.init(): sun.misc.Launcher$AppClassLoader@1521cc1
   [junit4]   2> 588325 INFO  (TEST-CollectionsAPIDistributedZkTest.test-seed#[830BEEBD1B477A53]) [    ] o.a.s.c.SolrResourceLoader new SolrResourceLoader for directory: '/home/jenkins/workspace/Lucene-Solr-trunk-Linux/solr/build/solr-core/test/J1/temp/solr.cloud.CollectionsAPIDistributedZkTest_830BEEBD1B477A53-001/shard-1-001'
   [junit4]   2> 588325 INFO  (TEST-CollectionsAPIDistributedZkTest.test-seed#[830BEEBD1B477A53]) [    ] o.a.s.c.SolrResourceLoader JNDI not configured for solr (NoInitialContextEx)
   [junit4]   2> 588325 INFO  (TEST-CollectionsAPIDistributedZkTest.test-seed#[830BEEBD1B477A53]) [    ] o.a.s.c.SolrResourceLoader solr home defaulted to 'solr/' (could not find system property or JNDI)
   [junit4]   2> 588325 INFO  (TEST-CollectionsAPIDistributedZkTest.test-seed#[830BEEBD1B477A53]) [    ] o.a.s.c.c.SolrZkClient Using default ZkCredentialsProvider
   [junit4]   2> 588325 INFO  (TEST-CollectionsAPIDistributedZkTest.test-seed#[830BEEBD1B477A53]) [    ] o.a.s.c.c.ConnectionManager Waiting for client to connect to ZooKeeper
   [junit4]   2> 588327 INFO  (zkCallback-482-thread-1) [    ] o.a.s.c.c.ConnectionManager Watcher org.apache.solr.common.cloud.ConnectionManager@1418eb9 name:ZooKeeperConnection Watcher:127.0.0.1:51938/solr got event WatchedEvent state:SyncConnected type:None path:null path:null type:None
   [junit4]   2> 588327 INFO  (TEST-CollectionsAPIDistributedZkTest.test-seed#[830BEEBD1B477A53]) [    ] o.a.s.c.c.ConnectionManager Client is connected to ZooKeeper
   [junit4]   2> 588327 INFO  (TEST-CollectionsAPIDistributedZkTest.test-seed#[830BEEBD1B477A53]) [    ] o.a.s.c.c.SolrZkClient Using default ZkACLProvider
   [junit4]   2> 588328 INFO  (TEST-CollectionsAPIDistributedZkTest.test-seed#[830BEEBD1B477A53]) [    ] o.a.s.s.SolrDispatchFilter Loading solr.xml from SolrHome (not found in ZooKeeper)
   [junit4]   2> 588328 INFO  (TEST-CollectionsAPIDistributedZkTest.test-seed#[830BEEBD1B477A53]) [    ] o.a.s.c.SolrXmlConfig Loading container configuration from /home/jenkins/workspace/Lucene-Solr-trunk-Linux/solr/build/solr-core/test/J1/temp/solr.cloud.CollectionsAPIDistributedZkTest_830BEEBD1B477A53-001/shard-1-001/solr.xml
   [junit4]   2> 588332 INFO  (TEST-CollectionsAPIDistributedZkTest.test-seed#[830BEEBD1B477A53]) [    ] o.a.s.c.CorePropertiesLocator Config-defined core root directory: /home/jenkins/workspace/Lucene-Solr-trunk-Linux/solr/build/solr-core/test/J1/temp/solr.cloud.CollectionsAPIDistributedZkTest_830BEEBD1B477A53-001/shard-1-001/cores
   [junit4]   2> 588332 INFO  (TEST-CollectionsAPIDistributedZkTest.test-seed#[830BEEBD1B477A53]) [    ] o.a.s.c.CoreContainer New CoreContainer 7039558
   [junit4]   2> 588332 INFO  (TEST-CollectionsAPIDistributedZkTest.test-seed#[830BEEBD1B477A53]) [    ] o.a.s.c.CoreContainer Loading cores into CoreContainer [instanceDir=/home/jenkins/workspace/Lucene-Solr-trunk-Linux/solr/build/solr-core/test/J1/temp/solr.cloud.CollectionsAPIDistributedZkTest_830BEEBD1B477A53-001/shard-1-001]
   [junit4]   2> 588332 WARN  (TEST-CollectionsAPIDistributedZkTest.test-seed#[830BEEBD1B477A53]) [    ] o.a.s.c.CoreContainer Couldn't add files from /home/jenkins/workspace/Lucene-Solr-trunk-Linux/solr/build/solr-core/test/J1/temp/solr.cloud.CollectionsAPIDistributedZkTest_830BEEBD1B477A53-001/shard-1-001/lib to classpath: /home/jenkins/workspace/Lucene-Solr-trunk-Linux/solr/build/solr-core/test/J1/temp/solr.cloud.CollectionsAPIDistributedZkTest_830BEEBD1B477A53-001/shard-1-001/lib
   [junit4]   2> 588332 INFO  (TEST-CollectionsAPIDistributedZkTest.test-seed#[830BEEBD1B477A53]) [    ] o.a.s.h.c.HttpShardHandlerFactory created with socketTimeout : 90000,urlScheme : ,connTimeout : 15000,maxConnectionsPerHost : 20,maxConnections : 10000,corePoolSize : 0,maximumPoolSize : 2147483647,maxThreadIdleTime : 5,sizeOfQueue : -1,fairnessPolicy : false,useRetries : false,
   [junit4]   2> 588333 INFO  (TEST-CollectionsAPIDistributedZkTest.test-seed#[830BEEBD1B477A53]) [    ] o.a.s.u.UpdateShardHandler Creating UpdateShardHandler HTTP client with params: socketTimeout=340000&connTimeout=45000&retry=true
   [junit4]   2> 588333 INFO  (TEST-CollectionsAPIDistributedZkTest.test-seed#[830BEEBD1B477A53]) [    ] o.a.s.l.LogWatcher SLF4J impl is org.slf4j.impl.Log4jLoggerFactory
   [junit4]   2> 588333 INFO  (TEST-CollectionsAPIDistributedZkTest.test-seed#[830BEEBD1B477A53]) [    ] o.a.s.l.LogWatcher Registering Log Listener [Log4j (org.slf4j.impl.Log4jLoggerFactory)]
   [junit4]   2> 588333 INFO  (TEST-CollectionsAPIDistributedZkTest.test-seed#[830BEEBD1B477A53]) [    ] o.a.s.c.ZkContainer Zookeeper client=127.0.0.1:51938/solr
   [junit4]   2> 588334 INFO  (TEST-CollectionsAPIDistributedZkTest.test-seed#[830BEEBD1B477A53]) [    ] o.a.s.c.ZkController zkHost includes chroot
   [junit4]   2> 588334 INFO  (TEST-CollectionsAPIDistributedZkTest.test-seed#[830BEEBD1B477A53]) [    ] o.a.s.c.c.SolrZkClient Using default ZkCredentialsProvider
   [junit4]   2> 588334 INFO  (TEST-CollectionsAPIDistributedZkTest.test-seed#[830BEEBD1B477A53]) [    ] o.a.s.c.c.ConnectionManager Waiting for client to connect to ZooKeeper
   [junit4]   2> 588335 INFO  (zkCallback-484-thread-1) [    ] o.a.s.c.c.ConnectionManager Watcher org.apache.solr.common.cloud.ConnectionManager@a22ad2 name:ZooKeeperConnection Watcher:127.0.0.1:51938 got event WatchedEvent state:SyncConnected type:None path:null path:null type:None
   [junit4]   2> 588335 INFO  (TEST-CollectionsAPIDistributedZkTest.test-seed#[830BEEBD1B477A53]) [    ] o.a.s.c.c.ConnectionManager Client is connected to ZooKeeper
   [junit

[...truncated too long message...]

fsUpdateLog, CollectionsAPIDistributedZkTest]
   [junit4]   2> NOTE: reproduce with: ant test  -Dtestcase=CollectionsAPIDistributedZkTest -Dtests.seed=830BEEBD1B477A53 -Dtests.multiplier=3 -Dtests.slow=true -Dtests.locale=da_DK -Dtests.timezone=America/Recife -Dtests.asserts=true -Dtests.file.encoding=UTF-8
   [junit4] ERROR   0.00s J1 | CollectionsAPIDistributedZkTest (suite) <<<
   [junit4]    > Throwable #1: com.carrotsearch.randomizedtesting.ThreadLeakError: 5 threads leaked from SUITE scope at org.apache.solr.cloud.CollectionsAPIDistributedZkTest: 
   [junit4]    >    1) Thread[id=4551, name=TEST-CollectionsAPIDistributedZkTest.test-seed#[830BEEBD1B477A53]-EventThread, state=WAITING, group=TGRP-CollectionsAPIDistributedZkTest]
   [junit4]    >         at jdk.internal.misc.Unsafe.park(Native Method)
   [junit4]    >         at java.util.concurrent.locks.LockSupport.park(LockSupport.java:178)
   [junit4]    >         at java.util.concurrent.locks.AbstractQueuedSynchronizer$ConditionObject.await(AbstractQueuedSynchronizer.java:2061)
   [junit4]    >         at java.util.concurrent.LinkedBlockingQueue.take(LinkedBlockingQueue.java:442)
   [junit4]    >         at org.apache.zookeeper.ClientCnxn$EventThread.run(ClientCnxn.java:494)
   [junit4]    >    2) Thread[id=4777, name=zkCallback-505-thread-3, state=TIMED_WAITING, group=TGRP-CollectionsAPIDistributedZkTest]
   [junit4]    >         at jdk.internal.misc.Unsafe.park(Native Method)
   [junit4]    >         at java.util.concurrent.locks.LockSupport.parkNanos(LockSupport.java:218)
   [junit4]    >         at java.util.concurrent.SynchronousQueue$TransferStack.awaitFulfill(SynchronousQueue.java:461)
   [junit4]    >         at java.util.concurrent.SynchronousQueue$TransferStack.transfer(SynchronousQueue.java:362)
   [junit4]    >         at java.util.concurrent.SynchronousQueue.poll(SynchronousQueue.java:937)
   [junit4]    >         at java.util.concurrent.ThreadPoolExecutor.getTask(ThreadPoolExecutor.java:1082)
   [junit4]    >         at java.util.concurrent.ThreadPoolExecutor.runWorker(ThreadPoolExecutor.java:1143)
   [junit4]    >         at java.util.concurrent.ThreadPoolExecutor$Worker.run(ThreadPoolExecutor.java:632)
   [junit4]    >         at java.lang.Thread.run(Thread.java:747)
   [junit4]    >    3) Thread[id=4552, name=zkCallback-505-thread-1, state=TIMED_WAITING, group=TGRP-CollectionsAPIDistributedZkTest]
   [junit4]    >         at jdk.internal.misc.Unsafe.park(Native Method)
   [junit4]    >         at java.util.concurrent.locks.LockSupport.parkNanos(LockSupport.java:218)
   [junit4]    >         at java.util.concurrent.SynchronousQueue$TransferStack.awaitFulfill(SynchronousQueue.java:461)
   [junit4]    >         at java.util.concurrent.SynchronousQueue$TransferStack.transfer(SynchronousQueue.java:362)
   [junit4]    >         at java.util.concurrent.SynchronousQueue.poll(SynchronousQueue.java:937)
   [junit4]    >         at java.util.concurrent.ThreadPoolExecutor.getTask(ThreadPoolExecutor.java:1082)
   [junit4]    >         at java.util.concurrent.ThreadPoolExecutor.runWorker(ThreadPoolExecutor.java:1143)
   [junit4]    >         at java.util.concurrent.ThreadPoolExecutor$Worker.run(ThreadPoolExecutor.java:632)
   [junit4]    >         at java.lang.Thread.run(Thread.java:747)
   [junit4]    >    4) Thread[id=4550, name=TEST-CollectionsAPIDistributedZkTest.test-seed#[830BEEBD1B477A53]-SendThread(127.0.0.1:51938), state=TIMED_WAITING, group=TGRP-CollectionsAPIDistributedZkTest]
   [junit4]    >         at java.lang.Thread.sleep(Native Method)
   [junit4]    >         at org.apache.zookeeper.ClientCnxnSocketNIO.cleanup(ClientCnxnSocketNIO.java:230)
   [junit4]    >         at org.apache.zookeeper.ClientCnxn$SendThread.cleanup(ClientCnxn.java:1185)
   [junit4]    >         at org.apache.zookeeper.ClientCnxn$SendThread.run(ClientCnxn.java:1110)
   [junit4]    >    5) Thread[id=4776, name=zkCallback-505-thread-2, state=TIMED_WAITING, group=TGRP-CollectionsAPIDistributedZkTest]
   [junit4]    >         at jdk.internal.misc.Unsafe.park(Native Method)
   [junit4]    >         at java.util.concurrent.locks.LockSupport.parkNanos(LockSupport.java:218)
   [junit4]    >         at java.util.concurrent.SynchronousQueue$TransferStack.awaitFulfill(SynchronousQueue.java:461)
   [junit4]    >         at java.util.concurrent.SynchronousQueue$TransferStack.transfer(SynchronousQueue.java:362)
   [junit4]    >         at java.util.concurrent.SynchronousQueue.poll(SynchronousQueue.java:937)
   [junit4]    >         at java.util.concurrent.ThreadPoolExecutor.getTask(ThreadPoolExecutor.java:1082)
   [junit4]    >         at java.util.concurrent.ThreadPoolExecutor.runWorker(ThreadPoolExecutor.java:1143)
   [junit4]    >         at java.util.concurrent.ThreadPoolExecutor$Worker.run(ThreadPoolExecutor.java:632)
   [junit4]    >         at java.lang.Thread.run(Thread.java:747)
   [junit4]    > 	at __randomizedtesting.SeedInfo.seed([830BEEBD1B477A53]:0)Throwable #2: com.carrotsearch.randomizedtesting.ThreadLeakError: There are still zombie threads that couldn't be terminated:
   [junit4]    >    1) Thread[id=4777, name=zkCallback-505-thread-3, state=TIMED_WAITING, group=TGRP-CollectionsAPIDistributedZkTest]
   [junit4]    >         at jdk.internal.misc.Unsafe.park(Native Method)
   [junit4]    >         at java.util.concurrent.locks.LockSupport.parkNanos(LockSupport.java:218)
   [junit4]    >         at java.util.concurrent.SynchronousQueue$TransferStack.awaitFulfill(SynchronousQueue.java:461)
   [junit4]    >         at java.util.concurrent.SynchronousQueue$TransferStack.transfer(SynchronousQueue.java:362)
   [junit4]    >         at java.util.concurrent.SynchronousQueue.poll(SynchronousQueue.java:937)
   [junit4]    >         at java.util.concurrent.ThreadPoolExecutor.getTask(ThreadPoolExecutor.java:1082)
   [junit4]    >         at java.util.concurrent.ThreadPoolExecutor.runWorker(ThreadPoolExecutor.java:1143)
   [junit4]    >         at java.util.concurrent.ThreadPoolExecutor$Worker.run(ThreadPoolExecutor.java:632)
   [junit4]    >         at java.lang.Thread.run(Thread.java:747)
   [junit4]    >    2) Thread[id=4552, name=zkCallback-505-thread-1, state=TIMED_WAITING, group=TGRP-CollectionsAPIDistributedZkTest]
   [junit4]    >         at jdk.internal.misc.Unsafe.park(Native Method)
   [junit4]    >         at java.util.concurrent.locks.LockSupport.parkNanos(LockSupport.java:218)
   [junit4]    >         at java.util.concurrent.SynchronousQueue$TransferStack.awaitFulfill(SynchronousQueue.java:461)
   [junit4]    >         at java.util.concurrent.SynchronousQueue$TransferStack.transfer(SynchronousQueue.java:362)
   [junit4]    >         at java.util.concurrent.SynchronousQueue.poll(SynchronousQueue.java:937)
   [junit4]    >         at java.util.concurrent.ThreadPoolExecutor.getTask(ThreadPoolExecutor.java:1082)
   [junit4]    >         at java.util.concurrent.ThreadPoolExecutor.runWorker(ThreadPoolExecutor.java:1143)
   [junit4]    >         at java.util.concurrent.ThreadPoolExecutor$Worker.run(ThreadPoolExecutor.java:632)
   [junit4]    >         at java.lang.Thread.run(Thread.java:747)
   [junit4]    >    3) Thread[id=4550, name=TEST-CollectionsAPIDistributedZkTest.test-seed#[830BEEBD1B477A53]-SendThread(127.0.0.1:51938), state=TIMED_WAITING, group=TGRP-CollectionsAPIDistributedZkTest]
   [junit4]    >         at java.lang.Thread.sleep(Native Method)
   [junit4]    >         at org.apache.zookeeper.ClientCnxn$SendThread.run(ClientCnxn.java:994)
   [junit4]    >    4) Thread[id=4776, name=zkCallback-505-thread-2, state=TIMED_WAITING, group=TGRP-CollectionsAPIDistributedZkTest]
   [junit4]    >         at jdk.internal.misc.Unsafe.park(Native Method)
   [junit4]    >         at java.util.concurrent.locks.LockSupport.parkNanos(LockSupport.java:218)
   [junit4]    >         at java.util.concurrent.SynchronousQueue$TransferStack.awaitFulfill(SynchronousQueue.java:461)
   [junit4]    >         at java.util.concurrent.SynchronousQueue$TransferStack.transfer(SynchronousQueue.java:362)
   [junit4]    >         at java.util.concurrent.SynchronousQueue.poll(SynchronousQueue.java:937)
   [junit4]    >         at java.util.concurrent.ThreadPoolExecutor.getTask(ThreadPoolExecutor.java:1082)
   [junit4]    >         at java.util.concurrent.ThreadPoolExecutor.runWorker(ThreadPoolExecutor.java:1143)
   [junit4]    >         at java.util.concurrent.ThreadPoolExecutor$Worker.run(ThreadPoolExecutor.java:632)
   [junit4]    >         at java.lang.Thread.run(Thread.java:747)
   [junit4]    > 	at __randomizedtesting.SeedInfo.seed([830BEEBD1B477A53]:0)
   [junit4] Completed [240/563] on J1 in 52.12s, 1 test, 3 errors <<< FAILURES!

[...truncated 1040 lines...]
BUILD FAILED
/home/jenkins/workspace/Lucene-Solr-trunk-Linux/build.xml:782: The following error occurred while executing this line:
/home/jenkins/workspace/Lucene-Solr-trunk-Linux/build.xml:726: The following error occurred while executing this line:
/home/jenkins/workspace/Lucene-Solr-trunk-Linux/build.xml:59: The following error occurred while executing this line:
/home/jenkins/workspace/Lucene-Solr-trunk-Linux/solr/build.xml:233: The following error occurred while executing this line:
/home/jenkins/workspace/Lucene-Solr-trunk-Linux/solr/common-build.xml:516: The following error occurred while executing this line:
/home/jenkins/workspace/Lucene-Solr-trunk-Linux/lucene/common-build.xml:1432: The following error occurred while executing this line:
/home/jenkins/workspace/Lucene-Solr-trunk-Linux/lucene/common-build.xml:987: There were test failures: 563 suites (8 ignored), 2236 tests, 2 suite-level errors, 1 error, 1162 ignored (61 assumptions) [seed: 830BEEBD1B477A53]

Total time: 38 minutes 31 seconds
Build step 'Invoke Ant' marked build as failure
Archiving artifacts
[WARNINGS] Skipping publisher since build result is FAILURE
Recording test results
Email was triggered for: Failure - Any
Sending email for trigger: Failure - Any



Mime
View raw message