lucene-dev mailing list archives

Site index · List index
Message view « Date » · « Thread »
Top « Date » · « Thread »
From Policeman Jenkins Server <jenk...@thetaphi.de>
Subject [JENKINS-EA] Lucene-Solr-5.x-Linux (64bit/jdk-9-ea+95) - Build # 15059 - Failure!
Date Mon, 28 Dec 2015 11:51:12 GMT
Build: http://jenkins.thetaphi.de/job/Lucene-Solr-5.x-Linux/15059/
Java: 64bit/jdk-9-ea+95 -XX:-UseCompressedOops -XX:+UseG1GC -XX:-CompactStrings

1 tests failed.
FAILED:  org.apache.lucene.analysis.icu.TestICUFoldingFilter.testRandomStrings

Error Message:
some thread(s) failed

Stack Trace:
java.lang.RuntimeException: some thread(s) failed
	at org.apache.lucene.analysis.BaseTokenStreamTestCase.checkRandomData(BaseTokenStreamTestCase.java:537)
	at org.apache.lucene.analysis.BaseTokenStreamTestCase.checkRandomData(BaseTokenStreamTestCase.java:434)
	at org.apache.lucene.analysis.icu.TestICUFoldingFilter.testRandomStrings(TestICUFoldingFilter.java:94)
	at sun.reflect.NativeMethodAccessorImpl.invoke0(Native Method)
	at sun.reflect.NativeMethodAccessorImpl.invoke(NativeMethodAccessorImpl.java:62)
	at sun.reflect.DelegatingMethodAccessorImpl.invoke(DelegatingMethodAccessorImpl.java:43)
	at java.lang.reflect.Method.invoke(Method.java:520)
	at com.carrotsearch.randomizedtesting.RandomizedRunner.invoke(RandomizedRunner.java:1764)
	at com.carrotsearch.randomizedtesting.RandomizedRunner$8.evaluate(RandomizedRunner.java:871)
	at com.carrotsearch.randomizedtesting.RandomizedRunner$9.evaluate(RandomizedRunner.java:907)
	at com.carrotsearch.randomizedtesting.RandomizedRunner$10.evaluate(RandomizedRunner.java:921)
	at org.apache.lucene.util.TestRuleSetupTeardownChained$1.evaluate(TestRuleSetupTeardownChained.java:50)
	at org.apache.lucene.util.AbstractBeforeAfterRule$1.evaluate(AbstractBeforeAfterRule.java:46)
	at org.apache.lucene.util.TestRuleThreadAndTestName$1.evaluate(TestRuleThreadAndTestName.java:49)
	at org.apache.lucene.util.TestRuleIgnoreAfterMaxFailures$1.evaluate(TestRuleIgnoreAfterMaxFailures.java:65)
	at org.apache.lucene.util.TestRuleMarkFailure$1.evaluate(TestRuleMarkFailure.java:48)
	at com.carrotsearch.randomizedtesting.rules.StatementAdapter.evaluate(StatementAdapter.java:36)
	at com.carrotsearch.randomizedtesting.ThreadLeakControl$StatementRunner.run(ThreadLeakControl.java:367)
	at com.carrotsearch.randomizedtesting.ThreadLeakControl.forkTimeoutingTask(ThreadLeakControl.java:809)
	at com.carrotsearch.randomizedtesting.ThreadLeakControl$3.evaluate(ThreadLeakControl.java:460)
	at com.carrotsearch.randomizedtesting.RandomizedRunner.runSingleTest(RandomizedRunner.java:880)
	at com.carrotsearch.randomizedtesting.RandomizedRunner$5.evaluate(RandomizedRunner.java:781)
	at com.carrotsearch.randomizedtesting.RandomizedRunner$6.evaluate(RandomizedRunner.java:816)
	at com.carrotsearch.randomizedtesting.RandomizedRunner$7.evaluate(RandomizedRunner.java:827)
	at org.apache.lucene.util.AbstractBeforeAfterRule$1.evaluate(AbstractBeforeAfterRule.java:46)
	at com.carrotsearch.randomizedtesting.rules.StatementAdapter.evaluate(StatementAdapter.java:36)
	at org.apache.lucene.util.TestRuleStoreClassName$1.evaluate(TestRuleStoreClassName.java:42)
	at com.carrotsearch.randomizedtesting.rules.NoShadowingOrOverridesOnMethodsRule$1.evaluate(NoShadowingOrOverridesOnMethodsRule.java:40)
	at com.carrotsearch.randomizedtesting.rules.NoShadowingOrOverridesOnMethodsRule$1.evaluate(NoShadowingOrOverridesOnMethodsRule.java:40)
	at com.carrotsearch.randomizedtesting.rules.StatementAdapter.evaluate(StatementAdapter.java:36)
	at com.carrotsearch.randomizedtesting.rules.StatementAdapter.evaluate(StatementAdapter.java:36)
	at com.carrotsearch.randomizedtesting.rules.StatementAdapter.evaluate(StatementAdapter.java:36)
	at org.apache.lucene.util.TestRuleAssertionsRequired$1.evaluate(TestRuleAssertionsRequired.java:54)
	at org.apache.lucene.util.TestRuleMarkFailure$1.evaluate(TestRuleMarkFailure.java:48)
	at org.apache.lucene.util.TestRuleIgnoreAfterMaxFailures$1.evaluate(TestRuleIgnoreAfterMaxFailures.java:65)
	at org.apache.lucene.util.TestRuleIgnoreTestSuites$1.evaluate(TestRuleIgnoreTestSuites.java:55)
	at com.carrotsearch.randomizedtesting.rules.StatementAdapter.evaluate(StatementAdapter.java:36)
	at com.carrotsearch.randomizedtesting.ThreadLeakControl$StatementRunner.run(ThreadLeakControl.java:367)
	at java.lang.Thread.run(Thread.java:747)




Build Log:
[...truncated 3254 lines...]
   [junit4] Suite: org.apache.lucene.analysis.icu.TestICUFoldingFilter
   [junit4]   2> TEST FAIL: useCharFilter=false text='\u2480\u248b\u24be\u2491\u2469'
   [junit4]   2> Dec 28, 2015 6:51:07 AM com.carrotsearch.randomizedtesting.RandomizedRunner$QueueUncaughtExceptionsHandler
uncaughtException
   [junit4]   2> WARNING: Uncaught exception in thread: Thread[Thread-4,5,TGRP-TestICUFoldingFilter]
   [junit4]   2> java.lang.AssertionError
   [junit4]   2> 	at __randomizedtesting.SeedInfo.seed([3968019BE9F68859]:0)
   [junit4]   2> 	at org.apache.lucene.index.TieredMergePolicy.findMerges(TieredMergePolicy.java:409)
   [junit4]   2> 	at org.apache.lucene.index.IndexWriter.updatePendingMerges(IndexWriter.java:1966)
   [junit4]   2> 	at org.apache.lucene.index.IndexWriter.maybeMerge(IndexWriter.java:1930)
   [junit4]   2> 	at org.apache.lucene.index.IndexWriter.doAfterSegmentFlushed(IndexWriter.java:4719)
   [junit4]   2> 	at org.apache.lucene.index.DocumentsWriter$MergePendingEvent.process(DocumentsWriter.java:695)
   [junit4]   2> 	at org.apache.lucene.index.IndexWriter.processEvents(IndexWriter.java:4750)
   [junit4]   2> 	at org.apache.lucene.index.IndexWriter.processEvents(IndexWriter.java:4741)
   [junit4]   2> 	at org.apache.lucene.index.IndexWriter.updateDocument(IndexWriter.java:1478)
   [junit4]   2> 	at org.apache.lucene.index.IndexWriter.addDocument(IndexWriter.java:1256)
   [junit4]   2> 	at org.apache.lucene.index.RandomIndexWriter.addDocument(RandomIndexWriter.java:170)
   [junit4]   2> 	at org.apache.lucene.analysis.BaseTokenStreamTestCase.checkRandomData(BaseTokenStreamTestCase.java:625)
   [junit4]   2> 	at org.apache.lucene.analysis.BaseTokenStreamTestCase.access$000(BaseTokenStreamTestCase.java:61)
   [junit4]   2> 	at org.apache.lucene.analysis.BaseTokenStreamTestCase$AnalysisThread.run(BaseTokenStreamTestCase.java:485)
   [junit4]   2> 
   [junit4]   2> NOTE: reproduce with: ant test  -Dtestcase=TestICUFoldingFilter -Dtests.method=testRandomStrings
-Dtests.seed=3968019BE9F68859 -Dtests.multiplier=3 -Dtests.slow=true -Dtests.locale=en_US
-Dtests.timezone=Jamaica -Dtests.asserts=true -Dtests.file.encoding=UTF-8
   [junit4] ERROR   4.30s J0 | TestICUFoldingFilter.testRandomStrings <<<
   [junit4]    > Throwable #1: java.lang.RuntimeException: some thread(s) failed
   [junit4]    > 	at org.apache.lucene.analysis.BaseTokenStreamTestCase.checkRandomData(BaseTokenStreamTestCase.java:537)
   [junit4]    > 	at org.apache.lucene.analysis.BaseTokenStreamTestCase.checkRandomData(BaseTokenStreamTestCase.java:434)
   [junit4]    > 	at org.apache.lucene.analysis.icu.TestICUFoldingFilter.testRandomStrings(TestICUFoldingFilter.java:94)
   [junit4]    > 	at java.lang.Thread.run(Thread.java:747)Throwable #2: com.carrotsearch.randomizedtesting.UncaughtExceptionError:
Captured an uncaught exception in thread: Thread[id=21, name=Thread-4, state=RUNNABLE, group=TGRP-TestICUFoldingFilter]
   [junit4]    > Caused by: java.lang.AssertionError
   [junit4]    > 	at __randomizedtesting.SeedInfo.seed([3968019BE9F68859]:0)
   [junit4]    > 	at org.apache.lucene.index.TieredMergePolicy.findMerges(TieredMergePolicy.java:409)
   [junit4]    > 	at org.apache.lucene.index.IndexWriter.updatePendingMerges(IndexWriter.java:1966)
   [junit4]    > 	at org.apache.lucene.index.IndexWriter.maybeMerge(IndexWriter.java:1930)
   [junit4]    > 	at org.apache.lucene.index.IndexWriter.doAfterSegmentFlushed(IndexWriter.java:4719)
   [junit4]    > 	at org.apache.lucene.index.DocumentsWriter$MergePendingEvent.process(DocumentsWriter.java:695)
   [junit4]    > 	at org.apache.lucene.index.IndexWriter.processEvents(IndexWriter.java:4750)
   [junit4]    > 	at org.apache.lucene.index.IndexWriter.processEvents(IndexWriter.java:4741)
   [junit4]    > 	at org.apache.lucene.index.IndexWriter.updateDocument(IndexWriter.java:1478)
   [junit4]    > 	at org.apache.lucene.index.IndexWriter.addDocument(IndexWriter.java:1256)
   [junit4]    > 	at org.apache.lucene.index.RandomIndexWriter.addDocument(RandomIndexWriter.java:170)
   [junit4]    > 	at org.apache.lucene.analysis.BaseTokenStreamTestCase.checkRandomData(BaseTokenStreamTestCase.java:625)
   [junit4]    > 	at org.apache.lucene.analysis.BaseTokenStreamTestCase.access$000(BaseTokenStreamTestCase.java:61)
   [junit4]    > 	at org.apache.lucene.analysis.BaseTokenStreamTestCase$AnalysisThread.run(BaseTokenStreamTestCase.java:485)
   [junit4]   2> NOTE: leaving temporary files on disk at: /home/jenkins/workspace/Lucene-Solr-5.x-Linux/lucene/build/analysis/icu/test/J0/temp/lucene.analysis.icu.TestICUFoldingFilter_3968019BE9F68859-001
   [junit4]   2> NOTE: test params are: codec=FastCompressingStoredFields(storedFieldsFormat=CompressingStoredFieldsFormat(compressionMode=FAST,
chunkSize=7, maxDocsPerChunk=2, blockSize=124), termVectorsFormat=CompressingTermVectorsFormat(compressionMode=FAST,
chunkSize=7, blockSize=124)), sim=DefaultSimilarity, locale=en_US, timezone=Jamaica
   [junit4]   2> NOTE: Linux 3.19.0-42-generic amd64/Oracle Corporation 9-ea (64-bit)/cpus=12,threads=1,free=381507736,total=526385152
   [junit4]   2> NOTE: All tests run in this JVM: [TestICUNormalizer2CharFilter, TestICUFoldingFilter]
   [junit4] Completed [7/15 (1!)] on J0 in 4.35s, 3 tests, 1 error <<< FAILURES!

[...truncated 39 lines...]
BUILD FAILED
/home/jenkins/workspace/Lucene-Solr-5.x-Linux/build.xml:794: The following error occurred
while executing this line:
/home/jenkins/workspace/Lucene-Solr-5.x-Linux/build.xml:738: The following error occurred
while executing this line:
/home/jenkins/workspace/Lucene-Solr-5.x-Linux/build.xml:59: The following error occurred while
executing this line:
/home/jenkins/workspace/Lucene-Solr-5.x-Linux/lucene/build.xml:472: The following error occurred
while executing this line:
/home/jenkins/workspace/Lucene-Solr-5.x-Linux/lucene/common-build.xml:2252: The following
error occurred while executing this line:
/home/jenkins/workspace/Lucene-Solr-5.x-Linux/lucene/analysis/build.xml:106: The following
error occurred while executing this line:
/home/jenkins/workspace/Lucene-Solr-5.x-Linux/lucene/analysis/build.xml:38: The following
error occurred while executing this line:
/home/jenkins/workspace/Lucene-Solr-5.x-Linux/lucene/module-build.xml:58: The following error
occurred while executing this line:
/home/jenkins/workspace/Lucene-Solr-5.x-Linux/lucene/common-build.xml:1456: The following
error occurred while executing this line:
/home/jenkins/workspace/Lucene-Solr-5.x-Linux/lucene/common-build.xml:1010: There were test
failures: 15 suites, 113 tests, 1 error, 3 ignored (3 assumptions) [seed: 3968019BE9F68859]

Total time: 11 minutes 29 seconds
Build step 'Invoke Ant' marked build as failure
Archiving artifacts
[WARNINGS] Skipping publisher since build result is FAILURE
Recording test results
Email was triggered for: Failure - Any
Sending email for trigger: Failure - Any



Mime
View raw message