lucene-dev mailing list archives

Site index · List index
Message view « Date » · « Thread »
Top « Date » · « Thread »
From Apache Jenkins Server <jenk...@builds.apache.org>
Subject [JENKINS] Lucene-Solr-NightlyTests-5.x - Build # 1049 - Still Failing
Date Fri, 18 Dec 2015 01:16:05 GMT
Build: https://builds.apache.org/job/Lucene-Solr-NightlyTests-5.x/1049/

1 tests failed.
FAILED:  org.apache.solr.handler.TestReplicationHandler.doTestStressReplication

Error Message:
timed out waiting for collection1 startAt time to exceed: Fri Dec 18 02:24:23 EET 2015

Stack Trace:
java.lang.AssertionError: timed out waiting for collection1 startAt time to exceed: Fri Dec 18 02:24:23 EET 2015
	at __randomizedtesting.SeedInfo.seed([F2331FC137F6700E:29981F0732DE19BD]:0)
	at org.junit.Assert.fail(Assert.java:93)
	at org.apache.solr.handler.TestReplicationHandler.watchCoreStartAt(TestReplicationHandler.java:1419)
	at org.apache.solr.handler.TestReplicationHandler.doTestStressReplication(TestReplicationHandler.java:771)
	at sun.reflect.NativeMethodAccessorImpl.invoke0(Native Method)
	at sun.reflect.NativeMethodAccessorImpl.invoke(NativeMethodAccessorImpl.java:57)
	at sun.reflect.DelegatingMethodAccessorImpl.invoke(DelegatingMethodAccessorImpl.java:43)
	at java.lang.reflect.Method.invoke(Method.java:606)
	at com.carrotsearch.randomizedtesting.RandomizedRunner.invoke(RandomizedRunner.java:1764)
	at com.carrotsearch.randomizedtesting.RandomizedRunner$8.evaluate(RandomizedRunner.java:871)
	at com.carrotsearch.randomizedtesting.RandomizedRunner$9.evaluate(RandomizedRunner.java:907)
	at com.carrotsearch.randomizedtesting.RandomizedRunner$10.evaluate(RandomizedRunner.java:921)
	at com.carrotsearch.randomizedtesting.rules.SystemPropertiesRestoreRule$1.evaluate(SystemPropertiesRestoreRule.java:57)
	at org.apache.lucene.util.TestRuleSetupTeardownChained$1.evaluate(TestRuleSetupTeardownChained.java:50)
	at org.apache.lucene.util.AbstractBeforeAfterRule$1.evaluate(AbstractBeforeAfterRule.java:46)
	at org.apache.lucene.util.TestRuleThreadAndTestName$1.evaluate(TestRuleThreadAndTestName.java:49)
	at org.apache.lucene.util.TestRuleIgnoreAfterMaxFailures$1.evaluate(TestRuleIgnoreAfterMaxFailures.java:65)
	at org.apache.lucene.util.TestRuleMarkFailure$1.evaluate(TestRuleMarkFailure.java:48)
	at com.carrotsearch.randomizedtesting.rules.StatementAdapter.evaluate(StatementAdapter.java:36)
	at com.carrotsearch.randomizedtesting.ThreadLeakControl$StatementRunner.run(ThreadLeakControl.java:367)
	at com.carrotsearch.randomizedtesting.ThreadLeakControl.forkTimeoutingTask(ThreadLeakControl.java:809)
	at com.carrotsearch.randomizedtesting.ThreadLeakControl$3.evaluate(ThreadLeakControl.java:460)
	at com.carrotsearch.randomizedtesting.RandomizedRunner.runSingleTest(RandomizedRunner.java:880)
	at com.carrotsearch.randomizedtesting.RandomizedRunner$5.evaluate(RandomizedRunner.java:781)
	at com.carrotsearch.randomizedtesting.RandomizedRunner$6.evaluate(RandomizedRunner.java:816)
	at com.carrotsearch.randomizedtesting.RandomizedRunner$7.evaluate(RandomizedRunner.java:827)
	at com.carrotsearch.randomizedtesting.rules.StatementAdapter.evaluate(StatementAdapter.java:36)
	at com.carrotsearch.randomizedtesting.rules.SystemPropertiesRestoreRule$1.evaluate(SystemPropertiesRestoreRule.java:57)
	at org.apache.lucene.util.AbstractBeforeAfterRule$1.evaluate(AbstractBeforeAfterRule.java:46)
	at com.carrotsearch.randomizedtesting.rules.StatementAdapter.evaluate(StatementAdapter.java:36)
	at org.apache.lucene.util.TestRuleStoreClassName$1.evaluate(TestRuleStoreClassName.java:42)
	at com.carrotsearch.randomizedtesting.rules.NoShadowingOrOverridesOnMethodsRule$1.evaluate(NoShadowingOrOverridesOnMethodsRule.java:40)
	at com.carrotsearch.randomizedtesting.rules.NoShadowingOrOverridesOnMethodsRule$1.evaluate(NoShadowingOrOverridesOnMethodsRule.java:40)
	at com.carrotsearch.randomizedtesting.rules.StatementAdapter.evaluate(StatementAdapter.java:36)
	at com.carrotsearch.randomizedtesting.rules.StatementAdapter.evaluate(StatementAdapter.java:36)
	at com.carrotsearch.randomizedtesting.rules.StatementAdapter.evaluate(StatementAdapter.java:36)
	at org.apache.lucene.util.TestRuleAssertionsRequired$1.evaluate(TestRuleAssertionsRequired.java:54)
	at org.apache.lucene.util.TestRuleMarkFailure$1.evaluate(TestRuleMarkFailure.java:48)
	at org.apache.lucene.util.TestRuleIgnoreAfterMaxFailures$1.evaluate(TestRuleIgnoreAfterMaxFailures.java:65)
	at org.apache.lucene.util.TestRuleIgnoreTestSuites$1.evaluate(TestRuleIgnoreTestSuites.java:55)
	at com.carrotsearch.randomizedtesting.rules.StatementAdapter.evaluate(StatementAdapter.java:36)
	at com.carrotsearch.randomizedtesting.ThreadLeakControl$StatementRunner.run(ThreadLeakControl.java:367)
	at java.lang.Thread.run(Thread.java:745)




Build Log:
[...truncated 10948 lines...]
   [junit4] JVM J0: stdout was not empty, see: /x1/jenkins/jenkins-slave/workspace/Lucene-Solr-NightlyTests-5.x/solr/build/solr-core/test/temp/junit4-J0-20151217_233455_191.sysout
   [junit4] >>> JVM J0 emitted unexpected output (verbatim) ----
   [junit4] java.lang.OutOfMemoryError: GC overhead limit exceeded
   [junit4] Dumping heap to /x1/jenkins/jenkins-slave/workspace/Lucene-Solr-NightlyTests-5.x/heapdumps/java_pid17674.hprof ...
   [junit4] Heap dump file created [608221880 bytes in 7.988 secs]
   [junit4] <<< JVM J0: EOF ----

   [junit4] JVM J0: stderr was not empty, see: /x1/jenkins/jenkins-slave/workspace/Lucene-Solr-NightlyTests-5.x/solr/build/solr-core/test/temp/junit4-J0-20151217_233455_191.syserr
   [junit4] >>> JVM J0 emitted unexpected output (verbatim) ----
   [junit4] WARN: Unhandled exception in event serialization. -> java.lang.OutOfMemoryError: GC overhead limit exceeded
   [junit4] <<< JVM J0: EOF ----

[...truncated 314 lines...]
   [junit4] Suite: org.apache.solr.handler.TestReplicationHandler
   [junit4]   2> Creating dataDir: /x1/jenkins/jenkins-slave/workspace/Lucene-Solr-NightlyTests-5.x/solr/build/solr-core/test/J1/temp/solr.handler.TestReplicationHandler_F2331FC137F6700E-001/init-core-data-001
   [junit4]   2> 2282389 INFO  (TEST-TestReplicationHandler.doTestReplicateAfterCoreReload-seed#[F2331FC137F6700E]) [    ] o.a.s.SolrTestCaseJ4 ###Starting doTestReplicateAfterCoreReload
   [junit4]   2> 2282390 INFO  (TEST-TestReplicationHandler.doTestReplicateAfterCoreReload-seed#[F2331FC137F6700E]) [    ] o.a.s.SolrTestCaseJ4 Writing core.properties file to /x1/jenkins/jenkins-slave/workspace/Lucene-Solr-NightlyTests-5.x/solr/build/solr-core/test/J1/temp/solr.handler.TestReplicationHandler_F2331FC137F6700E-001/solr-instance-001/collection1
   [junit4]   2> 2282394 INFO  (TEST-TestReplicationHandler.doTestReplicateAfterCoreReload-seed#[F2331FC137F6700E]) [    ] o.e.j.s.Server jetty-9.2.13.v20150730
   [junit4]   2> 2282397 INFO  (TEST-TestReplicationHandler.doTestReplicateAfterCoreReload-seed#[F2331FC137F6700E]) [    ] o.e.j.s.h.ContextHandler Started o.e.j.s.ServletContextHandler@797d1def{/solr,null,AVAILABLE}
   [junit4]   2> 2282406 INFO  (TEST-TestReplicationHandler.doTestReplicateAfterCoreReload-seed#[F2331FC137F6700E]) [    ] o.e.j.s.ServerConnector Started ServerConnector@6cd01ef9{HTTP/1.1}{127.0.0.1:45297}
   [junit4]   2> 2282407 INFO  (TEST-TestReplicationHandler.doTestReplicateAfterCoreReload-seed#[F2331FC137F6700E]) [    ] o.e.j.s.Server Started @2285335ms
   [junit4]   2> 2282407 INFO  (TEST-TestReplicationHandler.doTestReplicateAfterCoreReload-seed#[F2331FC137F6700E]) [    ] o.a.s.c.s.e.JettySolrRunner Jetty properties: {hostPort=45297, solr.data.dir=/x1/jenkins/jenkins-slave/workspace/Lucene-Solr-NightlyTests-5.x/solr/build/solr-core/test/J1/temp/solr.handler.TestReplicationHandler_F2331FC137F6700E-001/solr-instance-001/collection1/data, hostContext=/solr}
   [junit4]   2> 2282407 INFO  (TEST-TestReplicationHandler.doTestReplicateAfterCoreReload-seed#[F2331FC137F6700E]) [    ] o.a.s.s.SolrDispatchFilter SolrDispatchFilter.init(): sun.misc.Launcher$AppClassLoader@3827de24
   [junit4]   2> 2282407 INFO  (TEST-TestReplicationHandler.doTestReplicateAfterCoreReload-seed#[F2331FC137F6700E]) [    ] o.a.s.c.SolrResourceLoader new SolrResourceLoader for directory: '/x1/jenkins/jenkins-slave/workspace/Lucene-Solr-NightlyTests-5.x/solr/build/solr-core/test/J1/temp/solr.handler.TestReplicationHandler_F2331FC137F6700E-001/solr-instance-001'
   [junit4]   2> 2282407 INFO  (TEST-TestReplicationHandler.doTestReplicateAfterCoreReload-seed#[F2331FC137F6700E]) [    ] o.a.s.c.SolrResourceLoader JNDI not configured for solr (NoInitialContextEx)
   [junit4]   2> 2282407 INFO  (TEST-TestReplicationHandler.doTestReplicateAfterCoreReload-seed#[F2331FC137F6700E]) [    ] o.a.s.c.SolrResourceLoader solr home defaulted to 'solr/' (could not find system property or JNDI)
   [junit4]   2> 2282408 INFO  (TEST-TestReplicationHandler.doTestReplicateAfterCoreReload-seed#[F2331FC137F6700E]) [    ] o.a.s.c.SolrXmlConfig Loading container configuration from /x1/jenkins/jenkins-slave/workspace/Lucene-Solr-NightlyTests-5.x/solr/build/solr-core/test/J1/temp/solr.handler.TestReplicationHandler_F2331FC137F6700E-001/solr-instance-001/solr.xml
   [junit4]   2> 2282421 INFO  (TEST-TestReplicationHandler.doTestReplicateAfterCoreReload-seed#[F2331FC137F6700E]) [    ] o.a.s.c.CorePropertiesLocator Config-defined core root directory: /x1/jenkins/jenkins-slave/workspace/Lucene-Solr-NightlyTests-5.x/solr/build/solr-core/test/J1/temp/solr.handler.TestReplicationHandler_F2331FC137F6700E-001/solr-instance-001/.
   [junit4]   2> 2282421 INFO  (TEST-TestReplicationHandler.doTestReplicateAfterCoreReload-seed#[F2331FC137F6700E]) [    ] o.a.s.c.CoreContainer New CoreContainer 6994381
   [junit4]   2> 2282421 INFO  (TEST-TestReplicationHandler.doTestReplicateAfterCoreReload-seed#[F2331FC137F6700E]) [    ] o.a.s.c.CoreContainer Loading cores into CoreContainer [instanceDir=/x1/jenkins/jenkins-slave/workspace/Lucene-Solr-NightlyTests-5.x/solr/build/solr-core/test/J1/temp/solr.handler.TestReplicationHandler_F2331FC137F6700E-001/solr-instance-001]
   [junit4]   2> 2282422 WARN  (TEST-TestReplicationHandler.doTestReplicateAfterCoreReload-seed#[F2331FC137F6700E]) [    ] o.a.s.c.CoreContainer Couldn't add files from /x1/jenkins/jenkins-slave/workspace/Lucene-Solr-NightlyTests-5.x/solr/build/solr-core/test/J1/temp/solr.handler.TestReplicationHandler_F2331FC137F6700E-001/solr-instance-001/lib to classpath: /x1/jenkins/jenkins-slave/workspace/Lucene-Solr-NightlyTests-5.x/solr/build/solr-core/test/J1/temp/solr.handler.TestReplicationHandler_F2331FC137F6700E-001/solr-instance-001/lib
   [junit4]   2> 2282422 INFO  (TEST-TestReplicationHandler.doTestReplicateAfterCoreReload-seed#[F2331FC137F6700E]) [    ] o.a.s.h.c.HttpShardHandlerFactory created with socketTimeout : 90000,urlScheme : ,connTimeout : 15000,maxConnectionsPerHost : 20,maxConnections : 10000,corePoolSize : 0,maximumPoolSize : 2147483647,maxThreadIdleTime : 5,sizeOfQueue : -1,fairnessPolicy : false,useRetries : false,
   [junit4]   2> 2282423 INFO  (TEST-TestReplicationHandler.doTestReplicateAfterCoreReload-seed#[F2331FC137F6700E]) [    ] o.a.s.u.UpdateShardHandler Creating UpdateShardHandler HTTP client with params: socketTimeout=340000&connTimeout=45000&retry=true
   [junit4]   2> 2282424 INFO  (TEST-TestReplicationHandler.doTestReplicateAfterCoreReload-seed#[F2331FC137F6700E]) [    ] o.a.s.l.LogWatcher SLF4J impl is org.slf4j.impl.Log4jLoggerFactory
   [junit4]   2> 2282424 INFO  (TEST-TestReplicationHandler.doTestReplicateAfterCoreReload-seed#[F2331FC137F6700E]) [    ] o.a.s.l.LogWatcher Registering Log Listener [Log4j (org.slf4j.impl.Log4jLoggerFactory)]
   [junit4]   2> 2282424 INFO  (TEST-TestReplicationHandler.doTestReplicateAfterCoreReload-seed#[F2331FC137F6700E]) [    ] o.a.s.c.CoreContainer Security conf doesn't exist. Skipping setup for authorization module.
   [junit4]   2> 2282424 INFO  (TEST-TestReplicationHandler.doTestReplicateAfterCoreReload-seed#[F2331FC137F6700E]) [    ] o.a.s.c.CoreContainer No authentication plugin used.
   [junit4]   2> 2282425 INFO  (TEST-TestReplicationHandler.doTestReplicateAfterCoreReload-seed#[F2331FC137F6700E]) [    ] o.a.s.c.CorePropertiesLocator Looking for core definitions underneath /x1/jenkins/jenkins-slave/workspace/Lucene-Solr-NightlyTests-5.x/solr/build/solr-core/test/J1/temp/solr.handler.TestReplicationHandler_F2331FC137F6700E-001/solr-instance-001/.
   [junit4]   2> 2282426 INFO  (TEST-TestReplicationHandler.doTestReplicateAfterCoreReload-seed#[F2331FC137F6700E]) [    ] o.a.s.c.CoreDescriptor Created CoreDescriptor: {name=collection1, transient=false, configSetProperties=configsetprops.json, loadOnStartup=true, schema=schema.xml, config=solrconfig.xml, dataDir=data/}
   [junit4]   2> 2282426 INFO  (TEST-TestReplicationHandler.doTestReplicateAfterCoreReload-seed#[F2331FC137F6700E]) [    ] o.a.s.c.CorePropertiesLocator Found core collection1 in /x1/jenkins/jenkins-slave/workspace/Lucene-Solr-NightlyTests-5.x/solr/build/solr-core/test/J1/temp/solr.handler.TestReplicationHandler_F2331FC137F6700E-001/solr-instance-001/./collection1
   [junit4]   2> 2282426 INFO  (TEST-TestReplicationHandler.doTestReplicateAfterCoreReload-seed#[F2331FC137F6700E]) [    ] o.a.s.c.CorePropertiesLocator Found 1 core definitions
   [junit4]   2> 2282427 INFO  (coreLoadExecutor-3825-thread-1) [    ] o.a.s.c.SolrResourceLoader new SolrResourceLoader for directory: '/x1/jenkins/jenkins-slave/workspace/Lucene-Solr-NightlyTests-5.x/solr/build/solr-core/test/J1/temp/solr.handler.TestReplicationHandler_F2331FC137F6700E-001/solr-instance-001/collection1'
   [junit4]   2> 2282434 INFO  (coreLoadExecutor-3825-thread-1) [    ] o.a.s.c.SolrResourceLoader JNDI not configured for solr (NoInitialContextEx)
   [junit4]   2> 2282434 INFO  (coreLoadExecutor-3825-thread-1) [    ] o.a.s.c.SolrResourceLoader solr home defaulted to 'solr/' (could not find system property or JNDI)
   [junit4]   2> 2282427 INFO  (TEST-TestReplicationHandler.doTestReplicateAfterCoreReload-seed#[F2331FC137F6700E]) [    ] o.a.s.s.SolrDispatchFilter user.dir=/x1/jenkins/jenkins-slave/workspace/Lucene-Solr-NightlyTests-5.x/solr/build/solr-core/test/J1
   [junit4]   2> 2282439 INFO  (TEST-TestReplicationHandler.doTestReplicateAfterCoreReload-seed#[F2331FC137F6700E]) [    ] o.a.s.s.SolrDispatchFilter SolrDispatchFilter.init() done
   [junit4]   2> 2282442 INFO  (coreLoadExecutor-3825-thread-1) [    ] o.a.s.c.SolrConfig current version of requestparams : -1
   [junit4]   2> 2282454 INFO  (coreLoadExecutor-3825-thread-1) [    ] o.a.s.c.SolrConfig Using Lucene MatchVersion: 5.5.0
   [junit4]   2> 2282478 INFO  (coreLoadExecutor-3825-thread-1) [    ] o.a.s.c.SolrConfig Loaded SolrConfig: solrconfig.xml
   [junit4]   2> 2282482 INFO  (coreLoadExecutor-3825-thread-1) [    ] o.a.s.s.IndexSchema [collection1] Schema name=test
   [junit4]   2> 2282489 INFO  (coreLoadExecutor-3825-thread-1) [    ] o.a.s.s.IndexSchema unique key field: id
   [junit4]   2> 2282492 INFO  (coreLoadExecutor-3825-thread-1) [    ] o.a.s.c.ConfigSetProperties Did not find ConfigSet properties, assuming default properties: Can't find resource 'configsetprops.json' in classpath or '/x1/jenkins/jenkins-slave/workspace/Lucene-Solr-NightlyTests-5.x/solr/build/solr-core/test/J1/temp/solr.handler.TestReplicationHandler_F2331FC137F6700E-001/solr-instance-001/collection1'
   [junit4]   2> 2282492 INFO  (coreLoadExecutor-3825-thread-1) [    ] o.a.s.c.CoreContainer Creating SolrCore 'collection1' using configuration from instancedir /x1/jenkins/jenkins-slave/workspace/Lucene-Solr-NightlyTests-5.x/solr/build/solr-core/test/J1/temp/solr.handler.TestReplicationHandler_F2331FC137F6700E-001/solr-instance-001/./collection1
   [junit4]   2> 2282492 INFO  (coreLoadExecutor-3825-thread-1) [    x:collection1] o.a.s.c.SolrCore org.apache.solr.core.MockDirectoryFactory
   [junit4]   2> 2282492 INFO  (coreLoadExecutor-3825-thread-1) [    x:collection1] o.a.s.c.SolrCore [[collection1] ] Opening new SolrCore at [/x1/jenkins/jenkins-slave/workspace/Lucene-Solr-NightlyTests-5.x/solr/build/solr-core/test/J1/temp/solr.handler.TestReplicationHandler_F2331FC137F6700E-001/solr-instance-001/collection1], dataDir=[/x1/jenkins/jenkins-slave/workspace/Lucene-Solr-NightlyTests-5.x/solr/build/solr-core/test/J1/temp/solr.handler.TestReplicationHandler_F2331FC137F6700E-001/solr-instance-001/./collection1/data/]
   [junit4]   2> 2282492 INFO  (coreLoadExecutor-3825-thread-1) [    x:collection1] o.a.s.c.SolrCore JMX monitoring not detected for core: collection1
   [junit4]   2> 2282492 INFO  (coreLoadExecutor-3825-thread-1) [    x:collection1] o.a.s.c.CachingDirectoryFactory return new directory for /x1/jenkins/jenkins-slave/workspace/Lucene-Solr-NightlyTests-5.x/solr/build/solr-core/test/J1/temp/solr.handler.TestReplicationHandler_F2331FC137F6700E-001/solr-instance-001/./collection1/data
   [junit4]   2> 2282492 INFO  (coreLoadExecutor-3825-thread-1) [    x:collection1] o.a.s.c.SolrCore New index directory detected: old=null new=/x1/jenkins/jenkins-slave/workspace/Lucene-Solr-NightlyTests-5.x/solr/build/solr-core/test/J1/temp/solr.handler.TestReplicationHandler_F2331FC137F6700E-001/solr-instance-001/./collection1/data/index/
   [junit4]   2> 2282493 WARN  (coreLoadExecutor-3825-thread-1) [    x:collection1] o.a.s.c.SolrCore [collection1] Solr index directory '/x1/jenkins/jenkins-slave/workspace/Lucene-Solr-NightlyTests-5.x/solr/build/solr-core/test/J1/temp/solr.handler.TestReplicationHandler_F2331FC137F6700E-001/solr-instance-001/./collection1/data/index' doesn't exist. Creating new index...
   [junit4]   2> 2282493 INFO  (coreLoadExecutor-3825-thread-1) [    x:collection1] o.a.s.c.CachingDirectoryFactory return new directory for /x1/jenkins/jenkins-slave/workspace/Lucene-Solr-NightlyTests-5.x/solr/build/solr-core/test/J1/temp/solr.handler.TestReplicationHandler_F2331FC137F6700E-001/solr-instance-001/./collection1/data/index
   [junit4]   2> 2282493 INFO  (coreLoadExecutor-3825-thread-1) [    x:collection1] o.a.s.u.RandomMergePolicy RandomMergePolicy wrapping class org.apache.lucene.index.LogDocMergePolicy: [LogDocMergePolicy: minMergeSize=1000, mergeFactor=41, maxMergeSize=9223372036854775807, maxMergeSizeForForcedMerge=9223372036854775807, calibrateSizeByDeletes=true, maxMergeDocs=2147483647, maxCFSSegmentSizeMB=8.796093022207999E12, noCFSRatio=1.0]
   [junit4]   2> 2282493 INFO  (coreLoadExecutor-3825-thread-1) [    x:collection1] o.a.s.c.SolrDeletionPolicy SolrDeletionPolicy.onCommit: commits: num=1
   [junit4]   2> 	commit{dir=RawDirectoryWrapper(RAMDirectory@7bd7811a lockFactory=org.apache.lucene.store.SingleInstanceLockFactory@15d117b),segFN=segments_1,generation=1}
   [junit4]   2> 2282493 INFO  (coreLoadExecutor-3825-thread-1) [    x:collection1] o.a.s.c.SolrDeletionPolicy newest commit generation = 1
   [junit4]   2> 2282495 INFO  (coreLoadExecutor-3825-thread-1) [    x:collection1] o.a.s.c.SolrCore no updateRequestProcessorChain defined as default, creating implicit default
   [junit4]   2> 2282498 INFO  (coreLoadExecutor-3825-thread-1) [    x:collection1] o.a.s.h.l.XMLLoader xsltCacheLifetimeSeconds=60
   [junit4]   2> 2282499 INFO  (coreLoadExecutor-3825-thread-1) [    x:collection1] o.a.s.h.l.XMLLoader xsltCacheLifetimeSeconds=60
   [junit4]   2> 2282500 INFO  (coreLoadExecutor-3825-thread-1) [    x:collection1] o.a.s.h.l.XMLLoader xsltCacheLifetimeSeconds=60
   [junit4]   2> 2282501 INFO  (coreLoadExecutor-3825-thread-1) [    x:collection1] o.a.s.h.l.XMLLoader xsltCacheLifetimeSeconds=60
   [junit4]   2> 2282504 INFO  (OldIndexDirectoryCleanupThreadForCore-collection1) [    x:collection1] o.a.s.c.SolrCore Looking for old index directories to cleanup for core collection1 in /x1/jenkins/jenkins-slave/workspace/Lucene-Solr-NightlyTests-5.x/solr/build/solr-core/test/J1/temp/solr.handler.TestReplicationHandler_F2331FC137F6700E-001/solr-instance-001/./collection1/data/
   [junit4]   2> 2282507 INFO  (coreLoadExecutor-3825-thread-1) [    x:collection1] o.a.s.c.PluginBag requestHandler : 'lazy' created with startup=lazy 
   [junit4]   2> 2282507 INFO  (coreLoadExecutor-3825-thread-1) [    x:collection1] o.a.s.c.RequestHandlers Registered paths: /update/json,defaults,/admin/mbeans,/admin/ping,/admin/plugins,/update/json/docs,/admin/threads,/config,/admin/system,/update/csv,/admin/file,/admin/segments,/admin/logging,/replication,/admin/luke,/get,/schema,/admin/properties,lazy,standard,/update
   [junit4]   2> 2282508 INFO  (coreLoadExecutor-3825-thread-1) [    x:collection1] o.a.s.c.SolrCore Using default statsCache cache: org.apache.solr.search.stats.LocalStatsCache
   [junit4]   2> 2282508 INFO  (coreLoadExecutor-3825-thread-1) [    x:collection1] o.a.s.u.CommitTracker Hard AutoCommit: disabled
   [junit4]   2> 2282508 INFO  (coreLoadExecutor-3825-thread-1) [    x:collection1] o.a.s.u.CommitTracker Soft AutoCommit: disabled
   [junit4]   2> 2282509 INFO  (coreLoadExecutor-3825-thread-1) [    x:collection1] o.a.s.u.RandomMergePolicy RandomMergePolicy wrapping class org.apache.lucene.index.TieredMergePolicy: [TieredMergePolicy: maxMergeAtOnce=45, maxMergeAtOnceExplicit=17, maxMergedSegmentMB=55.583984375, floorSegmentMB=0.830078125, forceMergeDeletesPctAllowed=13.433897403400474, segmentsPerTier=28.0, maxCFSSegmentSizeMB=8.796093022207999E12, noCFSRatio=0.0
   [junit4]   2> 2282509 INFO  (coreLoadExecutor-3825-thread-1) [    x:collection1] o.a.s.c.SolrDeletionPolicy SolrDeletionPolicy.onInit: commits: num=1
   [junit4]   2> 	commit{dir=RawDirectoryWrapper(RAMDirectory@7bd7811a lockFactory=org.apache.lucene.store.SingleInstanceLockFactory@15d117b),segFN=segments_1,generation=1}
   [junit4]   2> 2282509 INFO  (coreLoadExecutor-3825-thread-1) [    x:collection1] o.a.s.c.SolrDeletionPolicy newest commit generation = 1
   [junit4]   2> 2282509 INFO  (coreLoadExecutor-3825-thread-1) [    x:collection1] o.a.s.s.SolrIndexSearcher Opening Searcher@169c0abf[collection1] main
   [junit4]   2> 2282509 INFO  (coreLoadExecutor-3825-thread-1) [    x:collection1] o.a.s.r.ManagedResourceStorage File-based storage initialized to use dir: /x1/jenkins/jenkins-slave/workspace/Lucene-Solr-NightlyTests-5.x/solr/build/solr-core/test/J1/temp/solr.handler.TestReplicationHandler_F2331FC137F6700E-001/solr-instance-001/collection1/conf
   [junit4]   2> 2282509 INFO  (coreLoadExecutor-3825-thread-1) [    x:collection1] o.a.s.r.RestManager Initializing RestManager with initArgs: {storageDir=/x1/jenkins/jenkins-slave/workspace/Lucene-Solr-NightlyTests-5.x/solr/build/solr-core/test/J1/temp/solr.handler.TestReplicationHandler_F2331FC137F6700E-001/solr-instance-001/collection1/conf}
   [junit4]   2> 2282509 INFO  (coreLoadExecutor-3825-thread-1) [    x:collection1] o.a.s.r.ManagedResourceStorage Reading _rest_managed.json using file:dir=/x1/jenkins/jenkins-slave/workspace/Lucene-Solr-NightlyTests-5.x/solr/build/solr-core/test/J1/temp/solr.handler.TestReplicationHandler_F2331FC137F6700E-001/solr-instance-001/collection1/conf
   [junit4]   2> 2282510 INFO  (coreLoadExecutor-3825-thread-1) [    x:collection1] o.a.s.r.RestManager Initializing 0 registered ManagedResources
   [junit4]   2> 2282510 INFO  (coreLoadExecutor-3825-thread-1) [    x:collection1] o.a.s.h.ReplicationHandler Replication enabled for following config files: schema.xml,xslt/dummy.xsl
   [junit4]   2> 2282510 INFO  (coreLoadExecutor-3825-thread-1) [    x:collection1] o.a.s.h.ReplicationHandler Commits will be reserved for  10000
   [junit4]   2> 2282510 INFO  (coreLoadExecutor-3825-thread-1) [    x:collection1] o.a.s.c.CoreContainer registering core: collection1
   [junit4]   2> 2282510 INFO  (searcherExecutor-3826-thread-1-processing-x:collection1) [    x:collection1] o.a.s.c.SolrCore [collection1] Registered new searcher Searcher@169c0abf[collection1] main{ExitableDirectoryReader(UninvertingDirectoryReader())}
   [junit4]   2> 2282941 INFO  (TEST-TestReplicationHandler.doTestReplicateAfterCoreReload-seed#[F2331FC137F6700E]) [    ] o.a.s.SolrTestCaseJ4 Writing core.properties file to /x1/jenkins/jenkins-slave/workspace/Lucene-Solr-NightlyTests-5.x/solr/build/solr-core/test/J1/temp/solr.handler.TestReplicationHandler_F2331FC137F6700E-001/solr-instance-002/collection1
   [junit4]   2> 2282946 INFO  (TEST-TestReplicationHandler.doTestReplicateAfterCoreReload-seed#[F2331FC137F6700E]) [    ] o.e.j.s.Server jetty-9.2.13.v20150730
   [junit4]   2> 2282953 INFO  (TEST-TestReplicationHandler.doTestReplicateAfterCoreReload-seed#[F2331FC137F6700E]) [    ] o.e.j.s.h.ContextHandler Started o.e.j.s.ServletContextHandler@21964594{/solr,null,AVAILABLE}
   [junit4]   2> 2282954 INFO  (TEST-TestReplicationHandler.doTestReplicateAfterCoreReload-seed#[F2331FC137F6700E]) [    ] o.e.j.s.ServerConnector Started ServerConnector@185e07ba{HTTP/1.1}{127.0.0.1:39133}
   [junit4]   2> 2282954 INFO  (TEST-TestReplicationHandler.doTestReplicateAfterCoreReload-seed#[F2331FC137F6700E]) [    ] o.e.j.s.Server Started @2285882ms
   [junit4]   2> 2282954 INFO  (TEST-TestReplicationHandler.doTestReplicateAfterCoreReload-seed#[F2331FC137F6700E]) [    ] o.a.s.c.s.e.JettySolrRunner Jetty properties: {solr.data.dir=/x1/jenkins/jenkins-slave/workspace/Lucene-Solr-NightlyTests-5.x/solr/build/solr-core/test/J1/temp/solr.handler.TestReplicationHandler_F2331FC137F6700E-001/solr-instance-002/collection1/data, hostPort=39133, hostContext=/solr}
   [junit4]   2> 2282954 INFO  (TEST-TestReplicationHandler.doTestReplicateAfterCoreReload-seed#[F2331FC137F6700E]) [    ] o.a.s.s.SolrDispatchFilter SolrDispatchFilter.init(): sun.misc.Launcher$AppClassLoader@3827de24
   [junit4]   2> 2282954 INFO  (TEST-TestReplicationHandler.doTestReplicateAfterCoreReload-seed#[F2331FC137F6700E]) [    ] o.a.s.c.SolrResourceLoader new SolrResourceLoader for directory: '/x1/jenkins/jenkins-slave/workspace/Lucene-Solr-NightlyTests-5.x/solr/build/solr-core/test/J1/temp/solr.handler.TestReplicationHandler_F2331FC137F6700E-001/solr-instance-002'
   [junit4]   2> 2282954 INFO  (TEST-TestReplicationHandler.doTestReplicateAfterCoreReload-seed#[F2331FC137F6700E]) [    ] o.a.s.c.SolrResourceLoader JNDI not configured for solr (NoInitialContextEx)
   [junit4]   2> 2282955 INFO  (TEST-TestReplicationHandler.doTestReplicateAfterCoreReload-seed#[F2331FC137F6700E]) [    ] o.a.s.c.SolrResourceLoader solr home defaulted to 'solr/' (could not find system property or JNDI)
   [junit4]   2> 2282955 INFO  (TEST-TestReplicationHandler.doTestReplicateAfterCoreReload-seed#[F2331FC137F6700E]) [    ] o.a.s.c.SolrXmlConfig Loading container configuration from /x1/jenkins/jenkins-slave/workspace/Lucene-Solr-NightlyTests-5.x/solr/build/solr-core/test/J1/temp/solr.handler.TestReplicationHandler_F2331FC137F6700E-001/solr-instance-002/solr.xml
   [junit4]   2> 2282969 INFO  (TEST-TestReplicationHandler.doTestReplicateAfterCoreReload-seed#[F2331FC137F6700E]) [    ] o.a.s.c.CorePropertiesLocator Config-defined core root directory: /x1/jenkins/jenkins-slave/workspace/Lucene-Solr-NightlyTests-5.x/solr/build/solr-core/test/J1/temp/solr.handler.TestReplicationHandler_F2331FC137F6700E-001/solr-instance-002/.
   [junit4]   2> 2282969 INFO  (TEST-TestReplicationHandler.doTestReplicateAfterCoreReload-seed#[F2331FC137F6700E]) [    ] o.a.s.c.CoreContainer New CoreContainer 1456006135
   [junit4]   2> 2282969 INFO  (TEST-TestReplicationHandler.doTestReplicateAfterCoreReload-seed#[F2331FC137F6700E]) [    ] o.a.s.c.CoreContainer Loading cores into CoreContainer [instanceDir=/x1/jenkins/jenkins-slave/workspace/Lucene-Solr-NightlyTests-5.x/solr/build/solr-core/test/J1/temp/solr.handler.TestReplicationHandler_F2331FC137F6700E-001/solr-instance-002]
   [junit4]   2> 2282970 WARN  (TEST-TestReplicationHandler.doTestReplicateAfterCoreReload-seed#[F2331FC137F6700E]) [    ] o.a.s.c.CoreContainer Couldn't add files from /x1/jenkins/jenkins-slave/workspace/Lucene-Solr-NightlyTests-5.x/solr/build/solr-core/test/J1/temp/solr.handler.TestReplicationHandler_F2331FC137F6700E-001/solr-instance-002/lib to classpath: /x1/jenkins/jenkins-slave/workspace/Lucene-Solr-NightlyTests-5.x/solr/build/solr-core/test/J1/temp/solr.handler.TestReplicationHandler_F2331FC137F6700E-001/solr-instance-002/lib
   [junit4]   2> 2282970 INFO  (TEST-TestReplicationHandler.doTestReplicateAfterCoreReload-seed#[F2331FC137F6700E]) [    ] o.a.s.h.c.HttpShardHandlerFactory created with socketTimeout : 90000,urlScheme : ,connTimeout : 15000,maxConnectionsPerHost : 20,maxConnections : 10000,corePoolSize : 0,maximumPoolSize : 2147483647,maxThreadIdleTime : 5,sizeOfQueue : -1,fairnessPolicy : false,useRetries : false,
   [junit4]   2> 2282972 INFO  (TEST-TestReplicationHandler.doTestReplicateAfterCoreReload-seed#[F2331FC137F6700E]) [    ] o.a.s.u.UpdateShardHandler Creating UpdateShardHandler HTTP client with params: socketTimeout=340000&connTimeout=45000&retry=true
   [junit4]   2> 2282972 INFO  (TEST-TestReplicationHandler.doTestReplicateAfterCoreReload-seed#[F2331FC137F6700E]) [    ] o.a.s.l.LogWatcher SLF4J impl is org.slf4j.impl.Log4jLoggerFactory
   [junit4]   2> 2282972 INFO  (TEST-TestReplicationHandler.doTestReplicateAfterCoreReload-seed#[F2331FC137F6700E]) [    ] o.a.s.l.LogWatcher Registering Log Listener [Log4j (org.slf4j.impl.Log4jLoggerFactory)]
   [junit4]   2> 2282972 INFO  (TEST-TestReplicationHandler.doTestReplicateAfterCoreReload-seed#[F2331FC137F6700E]) [    ] o.a.s.c.CoreContainer Security conf doesn't exist. Skipping setup for authorization module.
   [junit4]   2> 2282972 INFO  (TEST-TestReplicationHandler.doTestReplicateAfterCoreReload-seed#[F2331FC137F6700E]) [    ] o.a.s.c.CoreContainer No authentication plugin used.
   [junit4]   2> 2282973 INFO  (TEST-TestReplicationHandler.doTestReplicateAfterCoreReload-seed#[F2331FC137F6700E]) [    ] o.a.s.c.CorePropertiesLocator Looking for core definitions underneath /x1/jenkins/jenkins-slave/workspace/Lucene-Solr-NightlyTests-5.x/solr/build/solr-core/test/J1/temp/solr.handler.TestReplicationHandler_F2331FC137F6700E-001/solr-instance-002/.
   [junit4]   2> 2282975 INFO  (TEST-TestReplicationHandler.doTestReplicateAfterCoreReload-seed#[F2331FC137F6700E]) [    ] o.a.s.c.CoreDescriptor Created CoreDescriptor: {name=collection1, loadOnStartup=true, dataDir=data/, schema=schema.xml, configSetProperties=configsetprops.json, config=solrconfig.xml, transient=false}
   [junit4]   2> 2282975 INFO  (TEST-TestReplicationHandler.doTestReplicateAfterCoreReload-seed#[F2331FC137F6700E]) [    ] o.a.s.c.CorePropertiesLocator Found core collection1 in /x1/jenkins/jenkins-slave/workspace/Lucene-Solr-NightlyTests-5.x/solr/build/solr-core/test/J1/temp/solr.handler.TestReplicationHandler_F2331FC137F6700E-001/solr-instance-002/./collection1
   [junit4]   2> 2282975 INFO  (TEST-TestReplicationHandler.doTestReplicateAfterCoreReload-seed#[F2331FC137F6700E]) [    ] o.a.s.c.CorePropertiesLocator Found 1 core definitions
   [junit4]   2> 2282975 INFO  (coreLoadExecutor-3835-thread-1) [    ] o.a.s.c.SolrResourceLoader new SolrResourceLoader for directory: '/x1/jenkins/jenkins-slave/workspace/Lucene-Solr-NightlyTests-5.x/solr/build/solr-core/test/J1/temp/solr.handler.TestReplicationHandler_F2331FC137F6700E-001/solr-instance-002/collection1'
   [junit4]   2> 2282975 INFO  (TEST-TestReplicationHandler.doTestReplicateAfterCoreReload-seed#[F2331FC137F6700E]) [    ] o.a.s.s.SolrDispatchFilter user.dir=/x1/jenkins/jenkins-slave/workspace/Lucene-Solr-NightlyTests-5.x/solr/build/solr-core/test/J1
   [junit4]   2> 2282976 INFO  (TEST-TestReplicationHandler.doTestReplicateAfterCoreReload-seed#[F2331FC137F6700E]) [    ] o.a.s.s.SolrDispatchFilter SolrDispatchFilter.init() done
   [junit4]   2> 2282976 INFO  (coreLoadExecutor-3835-thread-1) [    ] o.a.s.c.SolrResourceLoader JNDI not configured for solr (NoInitialContextEx)
   [junit4]   2> 2282976 INFO  (coreLoadExecutor-3835-thread-1) [    ] o.a.s.c.SolrResourceLoader solr home defaulted to 'solr/' (could not find system property or JNDI)
   [junit4]   2> 2282988 INFO  (coreLoadExecutor-3835-thread-1) [    ] o.a.s.c.SolrConfig current version of requestparams : -1
   [junit4]   2> 2283002 INFO  (coreLoadExecutor-3835-thread-1) [    ] o.a.s.c.SolrConfig Using Lucene MatchVersion: 5.5.0
   [junit4]   2> 2283035 INFO  (coreLoadExecutor-3835-thread-1) [    ] o.a.s.c.SolrConfig Loaded SolrConfig: solrconfig.xml
   [junit4]   2> 2283039 INFO  (coreLoadExecutor-3835-thread-1) [    ] o.a.s.s.IndexSchema [collection1] Schema name=test
   [junit4]   2> 2283046 INFO  (coreLoadExecutor-3835-thread-1) [    ] o.a.s.s.IndexSchema unique key field: id
   [junit4]   2> 2283048 INFO  (coreLoadExecutor-3835-thread-1) [    ] o.a.s.c.ConfigSetProperties Did not find ConfigSet properties, assuming default properties: Can't find resource 'configsetprops.json' in classpath or '/x1/jenkins/jenkins-slave/workspace/Lucene-Solr-NightlyTests-5.x/solr/build/solr-core/test/J1/temp/solr.handler.TestReplicationHandler_F2331FC137F6700E-001/solr-instance-002/collection1'
   [junit4]   2> 2283048 INFO  (coreLoadExecutor-3835-thread-1) [    ] o.a.s.c.CoreContainer Creating SolrCore 'collection1' using configuration from instancedir /x1/jenkins/jenkins-slave/workspace/Lucene-Solr-NightlyTests-5.x/solr/build/solr-core/test/J1/temp/solr.handler.TestReplicationHandler_F2331FC137F6700E-001/solr-instance-002/./collection1
   [junit4]   2> 2283048 INFO  (coreLoadExecutor-3835-thread-1) [    x:collection1] o.a.s.c.SolrCore org.apache.solr.core.MockDirectoryFactory
   [junit4]   2> 2283049 INFO  (coreLoadExecutor-3835-thread-1) [    x:collection1] o.a.s.c.SolrCore [[collection1] ] Opening new SolrCore at [/x1/jenkins/jenkins-slave/workspace/Lucene-Solr-NightlyTests-5.x/solr/build/solr-core/test/J1/temp/solr.handler.TestReplicationHandler_F2331FC137F6700E-001/solr-instance-002/collection1], dataDir=[/x1/jenkins/jenkins-slave/workspace/Lucene-Solr-NightlyTests-5.x/solr/build/solr-core/test/J1/temp/solr.handler.TestReplicationHandler_F2331FC137F6700E-001/solr-instance-002/./collection1/data/]
   [junit4]   2> 2283049 INFO  (coreLoadExecutor-3835-thread-1) [    x:collection1] o.a.s.c.SolrCore JMX monitoring not detected for core: collection1
   [junit4]   2> 2283049 INFO  (coreLoadExecutor-3835-thread-1) [    x:collection1] o.a.s.c.CachingDirectoryFactory return new directory for /x1/jenkins/jenkins-slave/workspace/Lucene-Solr-NightlyTests-5.x/solr/build/solr-core/test/J1/temp/solr.handler.TestReplicationHandler_F2331FC137F6700E-001/solr-instance-002/./collection1/data
   [junit4]   2> 2283049 INFO  (coreLoadExecutor-3835-thread-1) [    x:collection1] o.a.s.c.SolrCore New index directory detected: old=null new=/x1/jenkins/jenkins-slave/workspace/Lucene-Solr-NightlyTests-5.x/solr/build/solr-core/test/J1/temp/solr.handler.TestReplicationHandler_F2331FC137F6700E-001/solr-instance-002/./collection1/data/index/
   [junit4]   2> 2283049 WARN  (coreLoadExecutor-3835-thread-1) [    x:collection1] o.a.s.c.SolrCore [collection1] Solr index directory '/x1/jenkins/jenkins-slave/workspace/Lucene-Solr-NightlyTests-5.x/solr/build/solr-core/test/J1/temp/solr.handler.TestReplicationHandler_F2331FC137F6700E-001/solr-instance-002/./collection1/data/index' doesn't exist. Creating new index...
   [junit4]   2> 2283049 INFO  (coreLoadExecutor-3835-thread-1) [    x:collection1] o.a.s.c.CachingDirectoryFactory return new directory for /x1/jenkins/jenkins-slave/workspace/Lucene-Solr-NightlyTests-5.x/solr/build/solr-core/test/J1/temp/solr.handler.TestReplicationHandler_F2331FC137F6700E-001/solr-instance-002/./collection1/data/index
   [junit4]   2> 2283050 INFO  (coreLoadExecutor-3835-thread-1) [    x:collection1] o.a.s.u.RandomMergePolicy RandomMergePolicy wrapping class org.apache.lucene.index.LogDocMergePolicy: [LogDocMergePolicy: minMergeSize=1000, mergeFactor=41, maxMergeSize=9223372036854775807, maxMergeSizeForForcedMerge=9223372036854775807, calibrateSizeByDeletes=true, maxMergeDocs=2147483647, maxCFSSegmentSizeMB=8.796093022207999E12, noCFSRatio=1.0]
   [junit4]   2> 2283050 INFO  (coreLoadExecutor-3835-thread-1) [    x:collection1] o.a.s.c.SolrDeletionPolicy SolrDeletionPolicy.onCommit: commits: num=1
   [junit4]   2> 	commit{dir=RawDirectoryWrapper(RAMDirectory@2f850730 lockFactory=org.apache.lucene.store.SingleInstanceLockFactory@469af8af),segFN=segments_1,generation=1}
   [junit4]   2> 2283050 INFO  (coreLoadExecutor-3835-thread-1) [    x:collection1] o.a.s.c.SolrDeletionPolicy newest commit generation = 1
   [junit4]   2> 2283051 INFO  (OldIndexDirectoryCleanupThreadForCore-collection1) [    x:collection1] o.a.s.c.SolrCore Looking for old index directories to cleanup for core collection1 in /x1/jenkins/jenkins-slave/workspace/Lucene-Solr-NightlyTests-5.x/solr/build/solr-core/test/J1/temp/solr.handler.TestReplicationHandler_F2331FC137F6700E-001/solr-instance-002/./collection1/data/
   [junit4]   2> 2283052 INFO  (coreLoadExecutor-3835-thread-1) [    x:collection1] o.a.s.c.SolrCore no updateRequestProcessorChain defined as default, creating implicit default
   [junit4]   2> 2283055 INFO  (coreLoadExecutor-3835-thread-1) [    x:collection1] o.a.s.h.l.XMLLoader xsltCacheLifetimeSeconds=60
   [junit4]   2> 2283056 INFO  (coreLoadExecutor-3835-thread-1) [    x:collection1] o.a.s.h.l.XMLLoader xsltCacheLifetimeSeconds=60
   [junit4]   2> 2283057 INFO  (coreLoadExecutor-3835-thread-1) [    x:collection1] o.a.s.h.l.XMLLoader xsltCacheLifetimeSeconds=60
   [junit4]   2> 2283058 INFO  (coreLoadExecutor-3835-thread-1) [    x:collection1] o.a.s.h.l.XMLLoader xsltCacheLifetimeSeconds=60
   [junit4]   2> 2283059 INFO  (coreLoadExecutor-3835-thread-1) [    x:collection1] o.a.s.c.PluginBag requestHandler : 'lazy' created with startup=lazy 
   [junit4]   2> 2283059 INFO  (coreLoadExecutor-3835-thread-1) [    x:collection1] o.a.s.c.RequestHandlers Registered paths: /update/json,defaults,/admin/mbeans,/admin/ping,/admin/plugins,/update/json/docs,/admin/threads,/config,/admin/system,/update/csv,/admin/file,/admin/segments,/admin/logging,/replication,/admin/luke,/get,/schema,/admin/properties,lazy,standard,/update
   [junit4]   2> 2283061 INFO  (coreLoadExecutor-3835-thread-1) [    x:collection1] o.a.s.c.SolrCore Using default statsCache cache: org.apache.solr.search.stats.LocalStatsCache
   [junit4]   2> 2283061 INFO  (coreLoadExecutor-3835-thread-1) [    x:collection1] o.a.s.u.CommitTracker Hard AutoCommit: disabled
   [junit4]   2> 2283061 INFO  (coreLoadExecutor-3835-thread-1) [    x:collection1] o.a.s.u.CommitTracker Soft AutoCommit: disabled
   [junit4]   2> 2283061 INFO  (coreLoadExecutor-3835-thread-1) [    x:collection1] o.a.s.u.RandomMergePolicy RandomMergePolicy wrapping class org.apache.lucene.index.TieredMergePolicy: [TieredMergePolicy: maxMergeAtOnce=45, maxMergeAtOnceExplicit=17, maxMergedSegmentMB=55.583984375, floorSegmentMB=0.830078125, forceMergeDeletesPctAllowed=13.433897403400474, segmentsPerTier=28.0, maxCFSSegmentSizeMB=8.796093022207999E12, noCFSRatio=0.0
   [junit4]   2> 2283061 INFO  (coreLoadExecutor-3835-thread-1) [    x:collection1] o.a.s.c.SolrDeletionPolicy SolrDeletionPolicy.onInit: commits: num=1
   [junit4]   2> 	commit{dir=RawDirectoryWrapper(RAMDirectory@2f850730 lockFactory=org.apache.lucene.store.SingleInstanceLockFactory@469af8af),segFN=segments_1,generation=1}
   [junit4]   2> 2283062 INFO  (coreLoadExecutor-3835-thread-1) [    x:collection1] o.a.s.c.SolrDeletionPolicy newest commit generation = 1
   [junit4]   2> 2283062 INFO  (coreLoadExecutor-3835-thread-1) [    x:collection1] o.a.s.s.SolrIndexSearcher Opening Searcher@246503e[collection1] main
   [junit4]   2> 2283062 INFO  (coreLoadExecutor-3835-thread-1) [    x:collection1] o.a.s.r.ManagedResourceStorage File-based storage initialized to use dir: /x1/jenkins/jenkins-slave/workspace/Lucene-Solr-NightlyTests-5.x/solr/build/solr-core/test/J1/temp/solr.handler.TestReplicationHandler_F2331FC137F6700E-001/solr-instance-002/collection1/conf
   [junit4]   2> 2283062 INFO  (coreLoadExecutor-3835-thread-1) [    x:collection1] o.a.s.r.RestManager Initializing RestManager with initArgs: {storageDir=/x1/jenkins/jenkins-slave/workspace/Lucene-Solr-NightlyTests-5.x/solr/build/solr-core/test/J1/temp/solr.handler.TestReplicationHandler_F2331FC137F6700E-001/solr-instance-002/collection1/conf}
   [junit4]   2> 2283062 INFO  (coreLoadExecutor-3835-thread-1) [    x:collection1] o.a.s.r.ManagedResourceStorage Reading _rest_managed.json using file:dir=/x1/jenkins/jenkins-slave/workspace/Lucene-Solr-NightlyTests-5.x/solr/build/solr-core/test/J1/temp/solr.handler.TestReplicationHandler_F2331FC137F6700E-001/solr-instance-002/collection1/conf
   [junit4]   2> 2283062 INFO  (coreLoadExecutor-3835-thread-1) [    x:collection1] o.a.s.r.RestManager Initializing 0 registered ManagedResources
   [junit4]   2> 2283132 INFO  (coreLoadExecutor-3835-thread-1) [    x:collection1] o.a.s.h.ReplicationHandler Poll scheduled at an interval of 1000ms
   [junit4]   2> 2283132 INFO  (coreLoadExecutor-3835-thread-1) [    x:collection1] o.a.s.c.CoreContainer registering core: collection1
   [junit4]   2> 2283132 INFO  (searcherExecutor-3836-thread-1-processing-x:collection1) [    x:collection1] o.a.s.c.SolrCore [collection1] Registered new searcher Searcher@246503e[collection1] main{ExitableDirectoryReader(UninvertingDirectoryReader())}
   [junit4]   2> 2283500 INFO  (TEST-TestReplicationHandler.doTestReplicateAfterCoreReload-seed#[F2331FC137F6700E]) [    ] o.e.j.s.ServerConnector Stopped ServerConnector@185e07ba{HTTP/1.1}{127.0.0.1:0}
   [junit4]   2> 2283500 INFO  (TEST-TestReplicationHandler.doTestReplicateAfterCoreReload-seed#[F2331FC137F6700E]) [    ] o.a.s.c.CoreContainer Shutting down CoreContainer instance=1456006135
   [junit4]   2> 2283501 INFO  (TEST-TestReplicationHandler.doTestReplicateAfterCoreReload-seed#[F2331FC137F6700E]) [    x:collection1] o.a.s.c.SolrCore [collection1]  CLOSING SolrCore org.apache.solr.core.SolrCore@57971b66
   [junit4]   2> 2283501 INFO  (TEST-TestReplicationHandler.doTestReplicateAfterCoreReload-seed#[F2331FC137F6700E]) [    x:collection1] o.a.s.u.DirectUpdateHandler2 closing DirectUpdateHandler2{commits=0,autocommits=0,soft autocommits=0,optimizes=0,rollbacks=0,expungeDeletes=0,docsPending=0,adds=0,deletesById=0,deletesByQuery=0,errors=0,cumulative_adds=0,cumulative_deletesById=0,cumulative_deletesByQuery=0,cumulative_errors=0}
   [junit4]   2> 2283502 INFO  (TEST-TestReplicationHandler.doTestReplicateAfterCoreReload-seed#[F2331FC137F6700E]) [    x:collection1] o.a.s.u.SolrCoreState Closing SolrCoreState
   [junit4]   2> 2283502 INFO  (TEST-TestReplicationHandler.doTestReplicateAfterCoreReload-seed#[F2331FC137F6700E]) [    x:collection1] o.a.s.u.DefaultSolrCoreState SolrCoreState ref count has reached 0 - closing IndexWriter
   [junit4]   2> 2283502 INFO  (TEST-TestReplicationHandler.doTestReplicateAfterCoreReload-seed#[F2331FC137F6700E]) [    x:collection1] o.a.s.u.DefaultSolrCoreState closing IndexWriter with IndexWriterCloser
   [junit4]   2> 2283502 INFO  (TEST-TestReplicationHandler.doTestReplicateAfterCoreReload-seed#[F2331FC137F6700E]) [    x:collection1] o.a.s.c.SolrCore [collection1] Closing main searcher on request.
   [junit4]   2> 2283502 INFO  (TEST-TestReplicationHandler.doTestReplicateAfterCoreReload-seed#[F2331FC137F6700E]) [    x:collection1] o.a.s.c.CachingDirectoryFactory Closing MockDirectoryFactory - 2 directories currently being tracked
   [junit4]   2> 2283502 INFO  (TEST-TestReplicationHandler.doTestReplicateAfterCoreReload-seed#[F2331FC137F6700E]) [    x:collection1] o.a.s.c.CachingDirectoryFactory looking to close /x1/jenkins/jenkins-slave/workspace/Lucene-Solr-NightlyTests-5.x/solr/build/solr-core/test/J1/temp/solr.handler.TestReplicationHandler_F2331FC137F6700E-001/solr-instance-002/./collection1/data [CachedDir<<refCount=0;path=/x1/jenkins/jenkins-slave/workspace/Lucene-Solr-NightlyTests-5.x/solr/build/solr-core/test/J1/temp/solr.handler.TestReplicationHandler_F2331FC137F6700E-001/solr-instance-002/./collection1/data;done=false>>]
   [junit4]   2> 2283502 INFO  (TEST-TestReplicationHandler.doTestReplicateAfterCoreReload-seed#[F2331FC137F6700E]) [    x:collection1] o.a.s.c.CachingDirectoryFactory Closing directory: /x1/jenkins/jenkins-slave/workspace/Lucene-Solr-NightlyTests-5.x/solr/build/solr-core/test/J1/temp/solr.handler.TestReplicationHandler_F2331FC137F6700E-001/solr-instance-002/./collection1/data
   [junit4]   2> 2283503 INFO  (TEST-TestReplicationHandler.doTestReplicateAfterCoreReload-seed#[F2331FC137F6700E]) [    x:collection1] o.a.s.c.CachingDirectoryFactory looking to close /x1/jenkins/jenkins-slave/workspace/Lucene-Solr-NightlyTests-5.x/solr/build/solr-core/test/J1/temp/solr.handler.TestReplicationHandler_F2331FC137F6700E-001/solr-instance-002/./collection1/data/index [CachedDir<<refCount=0;path=/x1/jenkins/jenkins-slave/workspace/Lucene-Solr-NightlyTests-5.x/solr/build/solr-core/test/J1/temp/solr.handler.TestReplicationHandler_F2331FC137F6700E-001/solr-instance-002/./collection1/data/index;done=false>>]
   [junit4]   2> 2283503 INFO  (TEST-TestReplicationHandler.doTestReplicateAfterCoreReload-seed#[F2331FC137F6700E]) [    x:collection1] o.a.s.c.CachingDirectoryFactory Closing directory: /x1/jenkins/jenkins-slave/workspace/Lucene-Solr-NightlyTests-5.x/solr/build/solr-core/test/J1/temp/solr.handler.TestReplicationHandler_F2331FC137F6700E-001/solr-instance-002/./collection1/data/index
   [junit4]   2> 2283503 INFO  (TEST-TestReplicationHandler.doTestReplicateAfterCoreReload-seed#[F2331FC137F6700E]) [    x:collection1] o.e.j.s.h.ContextHandler Stopped o.e.j.s.ServletContextHandler@21964594{/solr,null,UNAVAILABLE}
   [junit4]   2> 2283520 INFO  (TEST-TestReplicationHandler.doTestReplicateAfterCoreReload-seed#[F2331FC137F6700E]) [    ] o.e.j.s.ServerConnector Stopped ServerConnector@6cd01ef9{HTTP/1.1}{127.0.0.1:0}
   [junit4]   2> 2283520 INFO  (TEST-TestReplicationHandler.doTestReplicateAfterCoreReload-seed#[F2331FC137F6700E]) [    ] o.a.s.c.CoreContainer Shutting down CoreContainer instance=6994381
   [junit4]   2> 2283521 INFO  (TEST-TestReplicationHandler.doTestReplicateAfterCoreReload-seed#[F2331FC137F6700E]) [    x:collection1] o.a.s.c.SolrCore [collection1]  CLOSING SolrCore org.apache.solr.core.SolrCore@4821fc6
   [junit4]   2> 2283521 INFO  (TEST-TestReplicationHandler.doTestReplicateAfterCoreReload-seed#[F2331FC137F6700E]) [    x:collection1] o.a.s.u.DirectUpdateHandler2 closing DirectUpdateHandler2{commits=0,autocommits=0,soft autocommits=0,optimizes=0,rollbacks=0,expungeDeletes=0,docsPending=0,adds=0,deletesById=0,deletesByQuery=0,errors=0,cumulative_adds=0,cumulative_deletesById=0,cumulative_deletesByQuery=0,cumulative_errors=0}
   [junit4]   2> 2283521 INFO  (TEST-TestReplicationHandler.doTestReplicateAfterCoreReload-seed#[F2331FC137F6700E]) [    x:collection1] o.a.s.u.SolrCoreState Closing SolrCoreState
   [junit4]   2> 2283521 INFO  (TEST-TestReplicationHandler.doTestReplicateAfterCoreReload-seed#[F2331FC137F6700E]) [    x:collection1] o.a.s.u.DefaultSolrCoreState SolrCoreState ref count has reached 0 - closing IndexWriter
   [junit4]   2> 2283521 INFO  (TEST-TestReplicationHandler.doTestReplicateAfterCoreReload-seed#[F2331FC137F6700E]) [    x:collection1] o.a.s.u.DefaultSolrCoreState closing IndexWriter with IndexWriterCloser
   [junit4]   2> 2283522 INFO  (TEST-TestReplicationHandler.doTestReplicateAfterCoreReload-seed#[F2331FC137F6700E]) [    x:collection1] o.a.s.c.SolrCore [collection1] Closing main searcher on request.
   [junit4]   2> 2283522 INFO  (TEST-TestReplicationHandler.doTestReplicateAfterCoreReload-seed#[F2331FC137F6700E]) [    x:collection1] o.a.s.c.CachingDirectoryFactory Closing MockDirectoryFactory - 2 directories currently being tracked
   [junit4]   2> 2283522 INFO  (TEST-TestReplicationHandler.doTestReplicateAfterCoreReload-seed#[F2331FC137F6700E]) [    x:collection1] o.a.s.c.CachingDirectoryFactory looking to close /x1/jenkins/jenkins-slave/workspace/Lucene-Solr-NightlyTests-5.x/solr/build/solr-core/test/J1/temp/solr.handler.TestReplicationHandler_F2331FC137F6700E-001/solr-instance-001/./collection1/data/index [CachedDir<<refCount=0;path=/x1/jenkins/jenkins-slave/workspace/Lucene-Solr-NightlyTests-5.x/solr/build/solr-core/test/J1/temp/solr.handler.TestReplicationHandler_F2331FC137F6700E-001/solr-instance-001/./collection1/data/index;done=false>>]
   [junit4]   2> 2283522 INFO  (TEST-TestReplicationHandler.doTestReplicateAfterCoreReload-seed#[F2331FC137F6700E]) [    x:collection1] o.a.s.c.CachingDirectoryFactory Closing directory: /x1/jenkins/jenkins-slave/workspace/Lucene-Solr-NightlyTests-5.x/solr/build/solr-core/test/J1/temp/solr.handler.TestReplicationHandler_F2331FC137F6700E-001/solr-instance-001/./collection1/data/index
   [junit4]   2> 2283523 INFO  (TEST-TestReplicationHandler.doTestReplicateAfterCoreReload-seed#[F2331FC137F6700E]) [    x:collection1] o.a.s.c.CachingDirectoryFactory looking to close /x1/jenkins/jenkins-slave/workspace/Lucene-Solr-NightlyTests-5.x/solr/build/solr-core/test/J1/temp/solr.handler.TestReplicationHandler_F2331FC137F6700E-001/solr-instance-001/./collection1/data [CachedDir<<refCount=0;path=/x1/jenkins/jenkins-slave/workspace/Lucene-Solr-NightlyTests-5.x/solr/build/solr-core/test/J1/temp/solr.handler.TestReplicationHandler_F2331FC137F6700E-001/solr-instance-001/./collection1/data;done=false>>]
   [junit4]   2> 2283523 INFO  (TEST-TestReplicationHandler.doTestReplicateAfterCoreReload-seed#[F2331FC137F6700E]) [    x:collection1] o.a.s.c.CachingDirectoryFactory Closing directory: /x1/jenkins/jenkins-slave/workspace/Lucene-Solr-NightlyTests-5.x/solr/build/solr-core/test/J1/temp/solr.handler.TestReplicationHandler_F2331FC137F6700E-001/solr-instance-001/./collection1/data
   [junit4]   2> 2283523 INFO  (TEST-TestReplicationHandler.doTestReplicateAfterCoreReload-seed#[F2331FC137F6700E]) [    x:collection1] o.e.j.s.h.ContextHandler Stopped o.e.j.s.ServletContextHandler@797d1def{/solr,null,UNAVAILABLE}
   [junit4]   2> 2283532 INFO  (TEST-TestReplicationHandler.doTestReplicateAfterCoreReload-seed#[F2331FC137F6700E]) [    ] o.e.j.s.Server jetty-9.2.13.v20150730
   [junit4]   2> 2283621 INFO  (TEST-TestReplicationHandler.doTestReplicateAfterCoreReload-seed#[F2331FC137F6700E]) [    ] o.e.j.s.h.ContextHandler Started o.e.j.s.ServletContextHandler@6a2e3150{/solr,null,AVAILABLE}
   [junit4]   2> 2283621 INFO  (TEST-TestReplicationHandler.doTestReplicateAfterCoreReload-seed#[F2331FC137F6700E]) [    ] o.e.j.s.ServerConnector Started ServerConnector@7ea7b1a5{HTTP/1.1}{127.0.0.1:45472}
   [junit4]   2> 2283621 INFO  (TEST-TestReplicationHandler.doTestReplicateAfterCoreReload-seed#[F2331FC137F6700E]) [    ] o.e.j.s.Server Started @2286549ms
   [junit4]   2> 2283621 INFO  (TEST-TestReplicationHandler.doTestReplicateAfterCoreReload-seed#[F2331FC137F6700E]) [    ] o.a.s.c.s.e.JettySolrRunner Jetty properties: {solr.data.dir=/x1/jenkins/jenkins-slave/workspace/Lucene-Solr-NightlyTests-5.x/solr/build/solr-core/test/J1/temp/solr.handler.TestReplicationHandler_F2331FC137F6700E-001/solr-instance-001/collection1/data, hostPort=45472, hostContext=/solr}
   [junit4]   2> 2283622 INFO  (TEST-TestReplicationHandler.doTestReplicateAfterCoreReload-seed#[F2331FC137F6700E]) [    ] o.a.s.s.SolrDispatchFilter SolrDispatchFilter.init(): sun.misc.Launcher$AppClassLoader@3827de24
   [junit4]   2> 2283622 INFO  (TEST-TestReplicationHandler.doTestReplicateAfterCoreReload-seed#[F2331FC137F6700E]) [    ] o.a.s.c.SolrResourceLoader new SolrResourceLoader for directory: '/x1/jenkins/jenkins-slave/workspace/Lucene-Solr-NightlyTests-5.x/solr/build/solr-core/test/J1/temp/solr.handler.TestReplicationHandler_F2331FC137F6700E-001/solr-instance-001'
   [junit4]   2> 2283622 INFO  (TEST-TestReplicationHandler.doTestReplicateAfterCoreReload-seed#[F2331FC137F6700E]) [    ] o.a.s.c.SolrResourceLoader JNDI not configured for solr (NoInitialContextEx)
   [junit4]   2> 2283622 INFO  (TEST-TestReplicationHandler.doTestReplicateAfterCoreReload-seed#[F2331FC137F6700E]) [    ] o.a.s.c.SolrResourceLoader solr home defaulted to 'solr/' (could not find system property or JNDI)
   [junit4]   2> 2283622 INFO  (TEST-TestReplicationHandler.doTestReplicateAfterCoreReload-seed#[F2331FC137F6700E]) [    ] o.a.s.c.SolrXmlConfig Loading container configuration from /x1/jenkins/jenkins-slave/workspace/Lucene-Solr-NightlyTests-5.x/solr/build/solr-core/test/J1/temp/solr.handler.TestReplicationHandler_F2331FC137F6700E-001/solr-instance-001/solr.xml
   [junit4]   2> 2283637 INFO  (TEST-TestReplicationHandler.doTestReplicateAfterCoreReload-seed#[F2331FC137F6700E]) [    ] o.a.s.c.CorePropertiesLocator Config-defined core root directory: /x1/jenkins/jenkins-slave/workspace/Lucene-Solr-NightlyTests-5.x/solr/build/solr-core/test/J1/temp/solr.handler.TestReplicationHandler_F2331FC137F6700E-001/solr-instance-001/.
   [junit4]   2> 2283637 INFO  (TEST-TestReplicationHandler.doTestReplicateAfterCoreReload-seed#[F2331FC137F6700E]) [    ] o.a.s.c.CoreContainer New CoreContainer 1325395783
   [junit4]   2> 2283637 INFO  (TEST-TestReplicationHandler.doTestReplicateAfterCoreReload-seed#[F2331FC137F6700E]) [    ] o.a.s.c.CoreContainer Loading cores into CoreContainer [instanceDir=/x1/jenkins/jenkins-slave/workspace/Lucene-Solr-NightlyTests-5.x/solr/build/solr-core/test/J1/temp/solr.handler.TestReplicationHandler_F2331FC137F6700E-001/solr-instance-001]
   [junit4]   2> 2283638 WARN  (TEST-TestReplicationHandler.doTestReplicateAfterCoreReload-seed#[F2331FC137F6700E]) [    ] o.a.s.c.CoreContainer Couldn't add files from /x1/jenkins/jenkins-slave/workspace/Lucene-Solr-NightlyTests-5.x/solr/build/solr-core/test/J1/temp/solr.handler.TestReplicationHandler_F2331FC137F6700E-001/solr-instance-001/lib to classpath: /x1/jenkins/jenkins-slave/workspace/Lucene-Solr-NightlyTests-5.x/solr/build/solr-core/test/J1/temp/solr.handler.TestReplicationHandler_F2331FC137F6700E-001/solr-instance-001/lib
   [junit4]   2> 2283640 INFO  (TEST-TestReplicationHandler.doTestReplicateAfterCoreReload-seed#[F2331FC137F6700E]) [    ] o.a.s.h.c.HttpShardHandlerFactory created with socketTimeout : 90000,urlScheme : ,connTimeout : 15000,maxConnectionsPerHost : 20,maxConnections : 10000,corePoolSize : 0,maximumPoolSize : 2147483647,maxThreadIdleTime : 5,sizeOfQueue : -1,fairnessPolicy : false,useRetries : false,
   [junit4]   2> 2283641 INFO  (TEST-TestReplicationHandler.doTestReplicateAfterCoreReload-seed#[F2331FC137F6700E]) [    ] o.a.s.u.UpdateShardHandler Creating UpdateShardHandler HTTP client with params: socketTimeout=340000&connTimeout=45000&retry=true
   [junit4]   2> 2283641 INFO  (TEST-TestReplicationHandler.doTestReplicateAfterCoreReload-seed#[F2331FC137F6700E]) [    ] o.a.s.l.LogWatcher SLF4J impl is org.slf4j.impl.Log4jLoggerFactory
   [junit4]   2> 2283641 INFO  (TEST-TestReplicationHandler.doTestReplicateAfterCoreReload-seed#[F2331FC137F6700E]) [    ] o.a.s.l.LogWatcher Registering Log Listener [Log4j (org.slf4j.impl.Log4jLoggerFactory)]
   [junit4]   2> 2283641 INFO  (TEST-TestReplicationHandler.doTestReplicateAfterCoreReload-seed#[F2331FC137F6700E]) [    ] o.a.s.c.CoreContainer Security conf doesn't exist. Skipping setup for authorization module.
   [junit4]   2> 2283641 INFO  (TEST-TestReplicationHandler.doTestReplicateAfterCoreReload-seed#[F2331FC137F6700E]) [    ] o.a.s.c.CoreContainer No authentication plugin used.
   [junit4]   2> 2283642 INFO  (TEST-TestReplicationHandler.doTestReplicateAfterCoreReload-seed#[F2331FC137F6700E]) [    ] o.a.s.c.CorePropertiesLocator Looking for core definitions underneath /x1/jenkins/jenkins-slave/workspace/Lucene-Solr-NightlyTests-5.x/solr/build/solr-core/test/J1/temp/solr.handler.TestReplicationHandler_F2331FC137F6700E-001/solr-instance-001/.
   [junit4]   2> 2283643 INFO  (TEST-TestReplicationHandler.doTestReplicateAfterCoreReload-seed#[F2331FC137F6700E]) [    ] o.a.s.c.CoreDescriptor Created CoreDescriptor: {loadOnStartup=true, config=solrconfig.xml, name=collection1, configSetProperties=configsetprops.json, schema=schema.xml, transient=false, dataDir=data/}
   [junit4]   2> 2283643 INFO  (TEST-TestReplicationHandler.doTestReplicateAfterCoreReload-seed#[F2331FC137F6700E]) [    ] o.a.s.c.CorePropertiesLocator Found core collection1 in /x1/jenkins/jenkins-slave/workspace/Lucene-Solr-NightlyTests-5.x/solr/build/solr-core/test/J1/temp/solr.handler.TestReplicationHandler_F2331FC137F6700E-001/solr-instance-001/./collection1
   [junit4]   2> 2283643 INFO  (TEST-TestReplicationHandler.doTestReplicateAfterCoreReload-seed#[F2331FC137F6700E]) [    ] o.a.s.c.CorePropertiesLocator Found 1 core definitions
   [junit4]   2> 2283652 INFO  (coreLoadExecutor-3846-thread-1) [    ] o.a.s.c.SolrResourceLoader new SolrResourceLoader for directory: '/x1/jenkins/jenkins-slave/workspace/Lucene-Solr-NightlyTests-5.x/solr/build/solr-core/test/J1/temp/solr.handler.TestReplicationHandler_F2331FC137F6700E-001/solr-instance-001/collection1'
   [junit4]   2> 2283673 INFO  (coreLoadExecutor-3846-thread-1) [    ] o.a.s.c.SolrResourceLoader JNDI not configured for solr (NoInitialContextEx)
   [junit4]   2> 2283673 INFO  (coreLoadExecutor-3846-thread-1) [    ] o.a.s.c.SolrResourceLoader solr home defaulted to 'solr/' (could not find system property or JNDI)
   [junit4]   2> 2283676 INFO  (TEST-TestReplicationHandler.doTestReplicateAfterCoreReload-seed#[F2331FC137F6700E]) [    ] o.a.s.s.SolrDispatchFilter user.dir=/x1/jenkins/jenkins-slave/workspace/Lucene-Solr-NightlyTests-5.x/solr/build/solr-core/test/J1
   [junit4]   2> 2283676 INFO  (TEST-TestReplicationHandler.doTestReplicateAfterCoreReload-seed#[F2331FC137F6700E]) [    ] o.a.s.s.SolrDispatchFilter SolrDispatchFilter.init() done
   [junit4]   2> 2283679 INFO  (coreLoadExecutor-3846-thread-1) [    ] o.a.s.c.SolrConfig current version of requestparams : -1
   [junit4]   2> 2283691 INFO  (coreLoadExecutor-3846-thread-1) [    ] o.a.s.c.SolrConfig Using Lucene MatchVersion: 5.5.0
   [junit4]   2> 2283727 INFO  (coreLoadExecutor-3846-thread-1) [    ] o.a.s.c.SolrConfig Loaded SolrConfig: solrconfig.xml
   [junit4]   2> 2283731 INFO  (coreLoadExecutor-3846-thread-1) [    ] o.a.s.s.IndexSchema [collection1] Schema name=test
   [junit4]   2> 2283738 INFO  (coreLoadExecutor-3846-thread-1) [    ] o.a.s.s.IndexSchema unique key field: id
   [junit4]   2> 2283739 INFO  (coreLoadExecutor-3846-thread-1) [    ] o.a.s.c.ConfigSetProperties Did not find ConfigSet properties, assuming default properties: Can't find resource 'configsetprops.json' in classpath or '/x1/jenkins/jenkins-slave/workspace/Lucene-Solr-NightlyTests-5.x/solr/build/solr-core/test/J1/temp/solr.handler.TestReplicationHandler_F2331FC137F6700E-001/solr-instance-001/collection1'
   [junit4]   2> 2283739 INFO  (coreLoadExecutor-3846-thread-1) [    ] o.a.s.c.CoreContainer Creating SolrCore 'collection1' using configuration from instancedir /x1/jenkins/jenkins-slave/workspace/Lucene-Solr-NightlyTests-5.x/solr/build/solr-core/test/J1/temp/solr.handler.TestReplicationHandler_F2331FC137F6700E-001/solr-instance-001/./collection1
   [junit4]   2> 2283739 INFO  (coreLoadExecutor-3846-thread-1) [    x:collection1] o.a.s.c.SolrCore org.apache.solr.core.MockDirectoryFactory
   [junit4]   2> 2283739 INFO  (coreLoadExecutor-3846-thread-1) [    x:collection1] o.a.s.c.SolrCore [[collection1] ] Opening new SolrCore at [/x1/jenkins/jenkins-slave/workspace/Lucene-Solr-NightlyTests-5.x/solr/build/solr-core/test/J1/temp/solr.handler.TestReplicationHandler_F2331FC137F6700E-001/solr-instance-001/collection1], dataDir=[/x1/jenkins/jenkins-slave/workspace/Lucene-Solr-NightlyTests-5.x/solr/build/solr-core/test/J1/temp/solr.handler.TestReplicationHandler_F2331FC137F6700E-001/solr-instance-001/./collection1/data/]
   [junit4]   2> 2283739 INFO  (coreLoadExecutor-3846-thread-1) [    x:collection1] o.a.s.c.SolrCore JMX monitoring not detected for core: collection1
   [junit4]   2> 2283740 INFO  (coreLoadExecutor-3846-thread-1) [    x:collection1] o.a.s.c.CachingDirectoryFactory return new directory for /x1/jenkins/jenkins-slave/workspace/Lucene-Solr-NightlyTests-5.x/solr/build/solr-core/test/J1/temp/solr.handler.TestReplicationHandler_F2331FC137F6700E-001/solr-instance-001/./collection1/data
   [junit4]   2> 2283740 INFO  (coreLoadExecutor-3846-thread-1) [    x:collection1] o.a.s.c.SolrCore New index directory detected: old=null new=/x1/jenkins/jenkins-slave/workspace/Lucene-Solr-NightlyTests-5.x/solr/build/solr-core/test/J1/temp/solr.handler.TestReplicationHandler_F2331FC137F6700E-001/solr-instance-001/./collection1/data/index/
   [junit4]   2> 2283740 WARN  (coreLoadExecutor-3846-thread-1) [    x:collection1] o.a.s.c.SolrCore [collection1] Solr index directory '/x1/jenkins/jenkins-slave/workspace/Lucene-Solr-NightlyTests-5.x/solr/build/solr-core/test/J1/temp/solr.handler.TestReplicationHandler_F2331FC137F6700E-001/solr-instance-001/./collection1/data/index' doesn't exist. Creating new index...
   [junit4]   2> 2283740 INFO  (coreLoadExecutor-3846-thread-1) [    x:collection1] o.a.s.c.CachingDirectoryFactory return new directory for /x1/jenkins/jenkins-slave/workspace/Lucene-Solr-NightlyTests-5.x/solr/build/solr-core/test/J1/temp/solr.handler.TestReplicationHandler_F2331FC137F6700E-001/solr-instance-001/./collection1/data/index
   [junit4]   2> 2283740 INFO  (coreLoadExecutor-3846-thread-1) [    x:collection1] o.a.s.u.RandomMergePolicy RandomMergePolicy wrapping class org.apache.lucene.index.LogDocMergePolicy: [LogDocMergePolicy: minMergeSize=1000, mergeFactor=41, maxMergeSize=9223372036854775807, maxMergeSizeForForcedMerge=9223372036854775807, calibrateSizeByDeletes=true, maxMergeDocs=2147483647, maxCFSSegmentSizeMB=8.796093022207999E12, noCFSRatio=1.0]
   [junit4]   2> 2283741 INFO  (coreLoadExecutor-3846-thread-1) [    x:collection1] o.a.s.c.SolrDeletionPolicy SolrDeletionPolicy.onCommit: commits: num=1
   [junit4]   2> 	commit{dir=RawDirectoryWrapper(RAMDirectory@5d2d1651 lockFactory=org.apache.lucene.store.SingleInstanceLockFactory@3b144fa1),segFN=segments_1,generation=1}
   [junit4]   2> 2283741 INFO  (coreLoadExecutor-3846-thread-1) [    x:collection1] o.a.s.c.SolrDeletionPolicy newest commit generation = 1
   [junit4]   2> 2283741 INFO  (OldIndexDirectoryCleanupThreadForCore-collection1) [    x:collection1] o.a.s.c.SolrCore Looking for old index directories to cleanup for core collection1 in /x1/jenkins/jenkins-slave/workspace/Lucene-Solr-NightlyTests-5.x/solr/build/solr-core/test/J1/temp/solr.handler.TestReplicationHandler_F2331FC137F6700E-001/solr-instance-001/./collection1/data/
   [junit4]   2> 2283742 INFO  (coreLoadExecutor-3846-thread-1) [    x:collection1] o.a.s.c.SolrCore no updateRequestProcessorChain defined as default, creating implicit default
   [junit4]   2> 2283744 INFO  (coreLoadExecutor-3846-thread-1) [    x:collection1] o.a.s.h.l.XMLLoader xsltCacheLifetimeSeconds=60
   [junit4]   2> 2283745 INFO  (coreLoadExecutor-3846-thread-1) [    x:collection1] o.a.s.h.l.XMLLoader xsltCacheLifetimeSeconds=60
   [junit4]   2> 2283746 INFO  (coreLoadExecutor-3846-thread-1) [    x:collection1] o.a.s.h.l.XMLLoader xsltCacheLifetimeSeconds=60
   [junit4]   2> 2283747 INFO  (coreLoadExecutor-3846-thread-1) [    x:collection1] o.a.s.h.l.XMLLoader xsltCacheLifetimeSeconds=60
   [junit4]   2> 2283749 INFO  (coreLoadExecutor-3846-thread-1) [    x:collection1] o.a.s.c.PluginBag requestHandler : 'lazy' created with startup=lazy 
   [junit4]   2> 2283749 INFO  (coreLoadExecutor-3846-thread-1) [    x:collection1] o.a.s.c.RequestHandlers Registered paths: /update/json,defaults,/admin/mbeans,/admin/ping,/admin/plugins,/update/json/docs,/admin/threads,/config,/admin/system,/update/csv,/admin/file,/admin/segments,/admin/logging,/replication,/admin/luke,/get,/schema,/admin/properties,lazy,standard,/update
   [junit4]   2> 2283750 INFO  (coreLoadExecutor-3846-thread-1) [    x:collection1] o.a.s.c.SolrCore Using default statsCache cache: org.apache.solr.search.stats.LocalStatsCache
   [junit4]   2> 2283750 INFO  (coreLoadExecutor-3846-thread-1) [    x:collection1] o.a.s.u.CommitTracker Hard AutoCommit: disabled
   [junit4]   2> 2283750 INFO  (coreLoadExecutor-3846-thread-1) [    x:collection1] o.a.s.u.CommitTracker Soft AutoCommit: disabled
   [junit4]   2> 2283750 INFO  (coreLoadExecutor-3846-thread-1) [    x:collection1] o.a.s.u.RandomMergePolicy RandomMergePolicy wrapping class org.apache.lucene.index.TieredMergePolicy: [TieredMergePolicy: maxMergeAtOnce=45, maxMergeAtOnceExplicit=17, maxMergedSegmentMB=55.583984375, floorSegmentMB=0.830078125, forceMergeDeletesPctAllowed=13.433897403400474, segmentsPerTier=28.0, maxCFSSegmentSizeMB=8.796093022207999E12, noCFSRatio=0.0
   [junit4]   2> 2283751 INFO  (coreLoadExecutor-3846-thread-1) [    x:collection1] o.a.s.c.SolrDeletionPolicy SolrDeletionPolicy.onInit: commits: num=1
   [junit4]   2> 	commit{dir=RawDirectoryWrapper(RAMDirectory@5d2d1651 lockFactory=org.apache.lucene.store.SingleInstanceLockFactory@3b144fa1),segFN=segments_1,generation=1}
   [junit4]   2> 2283751 INFO  (coreLoadExecutor-3846-thread-1) [    x:collection1] o.a.s.c.SolrDeletionPolicy newest commit generation = 1
   [junit4]   2> 2283751 INFO  (coreLoadExecutor-3846-thread-1) [    x:collection1] o.a.s.s.SolrIndexSearcher Opening Searcher@1b1cac82[collection1] main
   [junit4]   2> 2283751 INFO  (coreLoadExecutor-3846-thread-1) [    x:collection1] o.a.s.r.ManagedResourceStorage File-based storage initialized to use dir: /x1/jenkins/jenkins-slave/workspace/Lucene-Solr-NightlyTests-5.x/solr/build/solr-core/test/J1/temp/solr.handler.TestReplicationHandler_F2331FC137F6700E-001/solr-instance-001/collection1/conf
   [junit4]   2> 2283751 INFO  (coreLoadExecutor-3846-thread-1) [    x:collection1] o.a.s.r.RestManager Initializing RestManager with initArgs: {storageDir=/x1/jenkins/jenkins-slave/workspace/Lucene-Solr-NightlyTests-5.x/solr/build/solr-core/test/J1/temp/solr.handler.TestReplicationHandler_F2331FC137F6700E-001/solr-instance-001/collection1/conf}
   [junit4]   2> 2283751 INFO  (coreLoadExecutor-3846-thread-1) [    x:collection1] o.a.s.r.ManagedResourceStorage Reading _rest_managed.json using file:dir=/x1/jenkins/jenkins-slave/workspace/Lucene-Solr-NightlyTests-5.x/solr/build/solr-core/test/J1/temp/solr.handler.TestReplicationHandler_F2331FC137F6700E-001/solr-instance-001/collection1/conf
   [junit4]   2> 2283752 INFO  (coreLoadExecutor-3846-thread-1) [    x:collection1] o.a.s.r.RestManager Initializing 0 registered ManagedResources
   [junit4]   2> 2283752 INFO  (coreLoadExecutor-3846-thread-1) [    x:collection1] o.a.s.h.ReplicationHandler Replication enabled for following config files: schema.xml
   [junit4]   2> 2283752 INFO  (coreLoadExecutor-3846-thread-1) [    x:collection1] o.a.s.h.ReplicationHandler Commits will be reserved for  10000
   [junit4]   2> 2283752 INFO  (coreLoadExecutor-3846-thread-1) [    x:collection1] o.a.s.c.CoreContainer registering core: collection1
   [junit4]   2> 2283752 INFO  (searcherExecutor-3847-thread-1-processing-x:collection1) [    x:collection1] o.a.s.c.SolrCore [collection1] Registered new searcher Searcher@1b1cac82[collection1] main{ExitableDirectoryReader(UninvertingDirectoryReader())}
   [junit4]   2> 2284189 INFO  (qtp736482640-21009) [    x:collection1] o.a.s.u.DirectUpdateHandler2 [collection1] REMOVING ALL DOCUMENTS FROM INDEX
   [junit4]   2> 2284190 INFO  (qtp736482640-21009) [    x:collection1] o.a.s.u.p.LogUpdateProcessorFactory [collection1]  webapp=/solr path=/update params={version=2&wt=javabin}{deleteByQuery=*:*} 0 0
   [junit4]   2> 2284192 INFO  (qtp736482640-21010) [    x:collection1] o.a.s.u.p.LogUpdateProcessorFactory [collection1]  webapp=/solr path=/update params={version=2&wt=javabin}{add=[0]} 0 0
   [junit4]   2> 2284194 INFO  (qtp736482640-21011) [    x:collection1] o.a.s.u.p.LogUpdateProcessorFactory [collection1]  webapp=/solr path=/update params={version=2&wt=javabin}{add=[1]} 0 0
   [junit4]   2> 2284196 INFO  (qtp736482640-21012) [    x:collection1] o.a.s.u.p.LogUpdateProcessorFactory [collection1]  webapp=/solr path=/update params={version=2&wt=javabin}{add=[2]} 0 0
   [junit4]   2> 2284197 INFO  (qtp736482640-21013) [    x:collection1] o.a.s.u.p.LogUpdateProcessorFactory [collection1]  webapp=/solr path=/update params={version=2&wt=javabin}{add=[3]} 0 0
   [junit4]   2> 2284199 INFO  (qtp736482640-21009) [    x:collection1] o.a.s.u.p.LogUpdateProcessorFactory [collection1]  webapp=/solr path=/update params={version=2&wt=javabin}{add=[4]} 0 0
   [junit4]   2> 2284201 INFO  (qtp736482640-21010) [    x:collection1] o.a.s.u.p.LogUpdateProcessorFactory [collection1]  webapp=/solr path=/update params={version=2&wt=javabin}{add=[5]} 0 0
   [junit4]   2> 2284202 INFO  (qtp736482640-21011) [    x:collection1] o.a.s.u.p.LogUpdateProcessorFactory [collection1]  webapp=/solr path=/update params={version=2&wt=javabin}{add=[6]} 0 0
   [junit4]   2> 2284204 INFO  (qtp736482640-21012) [    x:collection1] o.a.s.u.p.LogUpdateProcessorFactory [collection1]  webapp=/solr path=/update params={version=2&wt=javabin}{add=[7]} 0 0
   [junit4]   2> 2284205 INFO  (qtp736482640-21013) [    x:collection1] o.a.s.u.p.LogUpdateProcessorFactory [collection1]  webapp=/solr path=/update params={version=2&wt=javabin}{add=[8]} 0 0
   [junit4]   2> 2284207 INFO  (qtp736482640-21009) [    x:collection1] o.a.s.u.p.LogUpdateProcessorFactory [collection1]  webapp=/solr path=/update params={version=2&wt=javabin}{add=[9]} 0 0
   [junit4]   2> 2284208 INFO  (qtp736482640-21010) [    x:collection1] o.a.s.u.p.LogUpdateProcessorFactory [collection1]  webapp=/solr path=/update params={version=2&wt=javabin}{add=[10]} 0 0
   [junit4]   2> 2284210 INFO  (qtp736482640-21011) [    x:collection1] o.a.s.u.p.LogUpdateProcessorFactory [collection1]  webapp=/solr path=/update params={version=2&wt=javabin}{add=[11]} 0 0
   [junit4]   2> 2284212 INFO  (qtp736482640-21012) [    x:collection1] o.a.s.u.p.LogUpdateProcessorFactory [collection1]  webapp=/solr path=/update params={version=2&wt=javabin}{add=[12]} 0 0
   [junit4]   2> 2284213 INFO  (qtp736482640-21013) [    x:collection1] o.a.s.u.p.LogUpdateProcessorFactory [collection1]  webapp=/solr path=/update params={version=2&wt=javabin}{add=[13]} 0 0
   [junit4]   2> 2284215 INFO  (qtp736482640-21009) [    x:collection1] o.a.s.u.p.LogUpdateProcessorFactory [collection1]  webapp=/solr path=/update params={version=2&wt=javabin}{add=[14]} 0 0
   [junit4]   2> 2284216 INFO  (qtp736482640-21010) [    x:collection1] o.a.s.u.p.LogUpdateProcessorFactory [collection1]  webapp=/solr path=/update params={version=2&wt=javabin}{add=[15]} 0 0
   [junit4]   2> 2284218 INFO  (qtp736482640-21011) [    x:collection1] o.a.s.u.p.LogUpdateProcessorFactory [collection1]  webapp=/solr path=/update params={version=2&wt=javabin}{add=[16]} 0 0
   [junit4]   2> 2284220 INFO  (qtp736482640-21012) [    x:collection1] o.a.s.u.p.LogUpdateProcessorFactory [collection1]  webapp=/solr path=/update params={version=2&wt=javabin}{add=[17]} 0 0
   [junit4]   2> 2284221 INFO  (qtp736482640-21013) [    x:collection1] o.a.s.u.p.LogUpdateProcessorFactory [collection1]  webapp=/solr path=/update params={version=2&wt=javabin}{add=[18]} 0 0
   [junit4]   2> 2284223 INFO  (qtp736482640-21009) [    x:collection1] o.a.s.u.p.LogUpdateProcessorFactory [collection1]  webapp=/solr path=/update params={version=2&wt=javabin}{add=[19]} 0 0
   [junit4]   2> 2284224 INFO  (qtp736482640-21010) [    x:collection1] o.a.s.u.p.LogUpdateProcessorFactory [collection1]  webapp=/solr path=/update params={version=2&wt=javabin}{add=[20]} 0 0
   [junit4]   2> 2284226 INFO  (qtp736482640-21011) [    x:collection1] o.a.s.u.p.LogUpdateProcessorFactory [collection1]  webapp=/solr path=/update params={version=2&wt=javabin}{add=[21]} 0 0
   [junit4]   2> 2284227 INFO  (qtp736482640-21012) [    x:collection1] o.a.s.u.p.LogUpdateProcessorFactory [collection1]  webapp=/solr path=/update params={version=2&wt=javabin}{add=[22]} 0 0
   [junit4]   2> 2284229 INFO  (qtp736482640-21013) [    x:collection1] o.a.s.u.p.LogUpdateProcessorFactory [collection1]  webapp=/solr path=/update params={version=2&wt=javabin}{add=[23]} 0 0
   [junit4]   2> 2284231 INFO  (qtp736482640-21009) [    x:collection1] o.a.s.u.p.LogUpdateProcessorFactory [collection1]  webapp=/solr path=/update params={version=2&wt=javabin}{add=[24]} 0 0
   [junit4]   2> 2284232 INFO  (qtp736482640-21010) [    x:collection1] o.a.s.u.p.LogUpdateProcessorFactory [collection1]  webapp=/solr path=/update params={version=2&wt=javabin}{add=[25]} 0 0
   [junit4]   2> 2284234 INFO  (qtp736482640-21011) [    x:collection1] o.a.s.u.p.LogUpdateProcessorFactory [collection1]  webapp=/solr path=/update params={version=2&wt=javabin}{add=[26]} 0 0
   [junit4]   2> 2284235 INFO  (qtp736482640-21012) [    x:collection1] o.a.s.u.p.LogUpdateProcessorFactory [collection1]  webapp=/solr path=/update params={version=2&wt=javabin}{add=[27]} 0 0
   [junit4]   2> 2284237 INFO  (qtp736482640-21013) [    x:collection1] o.a.s.u.p.LogUpdateProcessorFactory [collection1]  webapp=/solr path=/update params={version=2&wt=javabin}{add=[28]} 0 0
   [junit4]   2> 2284238 INFO  (qtp736482640-21009) [    x:collection1] o.a.s.u.p.LogUpdateProcessorFactory [collection1]  webapp=/solr path=/update params={version=2&wt=javabin}{add=[29]} 0 0
   [junit4]   2> 2284240 INFO  (qtp736482640-21010) [    x:collection1] o.a.s.u.p.LogUpdateProcessorFactory [collection1]  webapp=/solr path=/update params={version=2&wt=javabin}{add=[30]} 0 0
   [junit4]   2> 2284242 INFO  (qtp736482640-21011) [    x:collection1] o.a.s.u.p.LogUpdateProcessorFactory [collection1]  webapp=/solr path=/update params={version=2&wt=javabin}{add=[31]} 0 0
   [junit4]   2> 2284243 INFO  (qtp736482640-21012) [    x:collection1] o.a.s.u.p.LogUpdateProcessorFactory [collection1]  webapp=/solr path=/update params={version=2&wt=javabin}{add=[32]} 0 0
   [junit4]   2> 2284245 INFO  (qtp736482640-21013) [    x:collection1] o.a.s.u.p.LogUpdateProcessorFactory [collection1]  webapp=/solr path=/update params={version=2&wt=javabin}{add=[33]} 0 0
   [junit4]   2> 2284246 INFO  (qtp736482640-21009) [    x:collection1] o.a.s.u.p.LogUpdateProcessorFactory [collection1]  webapp=/solr path=/update params={version=2&wt=javabin}{add=[34]} 0 0
   [junit4]   2> 2284248 INFO  (qtp736482640-21010) [    x:collection1] o.a.s.u.p.LogUpdateProcessorFactory [collection1]  webapp=/solr path=/update params={version=2&wt=javabin}{add=[35]} 0 0
   [junit4]   2> 2284250 INFO  (qtp736482640-21011) [    x:collection1] o.a.s.u.p.LogUpdateProcessorFactory [collection1]  webapp=/solr path=/update params={version=2&wt=javabin}{add=[36]} 0 0
   [junit4]   2> 2284251 INFO  (qtp736482640-21012) [    x:collection1] o.a.s.u.p.LogUpdateProcessorFactory [collection1]  webapp=/solr path=/update params={version=2&wt=javabin}{add=[37]} 0 0
   [junit4]   2> 2284253 INFO  (qtp736482640-21013) [    x:collection1] o.a.s.u.p.LogUpdateProcessorFactory [collection1]  webapp=/solr path=/update params={version=2&wt=javabin}{add=[38]} 0 0
   [junit4]   2> 2284254 INFO  (qtp736482640-21009) [    x:collection1] o.a.s.u.p.LogUpdateProcessorFactory [collection1]  webapp=/solr path=/update params={version=2&wt=javabin}{add=[39]} 0 0
   [junit4]   2> 2284256 INFO  (qtp736482640-21010) [    x:collection1] o.a.s.u.p.LogUpdateProcessorFactory [collection1]  webapp=/solr path=/update params={version=2&wt=javabin}{add=[40]} 0 0
   [junit4]   2> 2284257 INFO  (qtp736482640-21011) [    x:collection1] o.a.s.u.p.LogUpdateProcessorFactory [collection1]  webapp=/solr path=/update params={version=2&wt=javabin}{add=[41]} 0 0
   [junit4]   2> 2284259 INFO  (qtp736482640-21012) [    x:collection1] o.a.s.u.p.LogUpdateProcessorFactory [collection1]  webapp=/solr path=/update params={version=2&wt=javabin}{add=[42]} 0 0
   [junit4]   2> 2284261 INFO  (qtp736482640-21013) [    x:collection1] o.a.s.u.p.LogUpdateProcessorFactory [collection1]  webapp=/solr path=/update params={version=2&wt=javabin}{add=[43]} 0 0
   [junit4]   2> 2284262 INFO  (qtp736482640-21009) [    x:collection1] o.a.s.u.p.LogUpdateProcessorFactory [collection1]  webapp=/solr path=/update params={version=2&wt=javabin}{add=[44]} 0 0
   [junit4]   2> 2284264 INFO  (qtp736482640-21010) [    x:collection1] o.a.s.u.p.LogUpdateProcessorFactory [collection1]  webapp=/solr path=/update params={version=2&wt=javabin}{add=[45]} 0 0
   [junit4]   2> 2284265 INFO  (qtp736482640-21011) [    x:collection1] o.a.s.u.p.LogUpdateProcessorFactory [collection1]  webapp=/solr path=/update params={version=2&wt=javabin}{add=[46]} 0 0
   [junit4]   2> 2284267 INFO  (qtp736482640-21012) [    x:collection1] o.a.s.u.p.LogUpdateProcessorFactory [collection1]  webapp=/solr path=/update params={version=2&wt=javabin}{add=[47]} 0 0
   [junit4]   2> 2284268 INFO  (qtp736482640-21013) [    x:collection1] o.a.s.u.p.LogUpdateProcessorFactory [collection1]  webapp=/solr path=/update params={version=2&wt=javabin}{add=[48]} 0 0
   [junit4]   2> 2284270 INFO  (qtp736482640-21009) [    x:collection1] o.a.s.u.p.LogUpdateProcessorFactory [collection1]  webapp=/solr path=/update params={version=2&wt=javabin}{add=[49]} 0 0
   [junit4]   2> 2284271 INFO  (qtp736482640-21010) [    x:collection1] o.a.s.u.p.LogUpdateProcessorFactory [collection1]  webapp=/solr path=/update params={version=2&wt=javabin}{add=[50]} 0 0
   [junit4]   2> 2284273 INFO  (qtp736482640-21011) [    x:collection1] o.a.s.u.p.LogUpdateProcessorFactory [collection1]  webapp=/solr path=/update params={version=2&wt=javabin}{add=[51]} 0 0
   [junit4]   2> 2284275 INFO  (qtp736482640-21012) [    x:collection1] o.a.s.u.p.LogUpdateProcessorFactory [collection1]  webapp=/solr path=/update params={version=2&wt=javabin}{add=[52]} 0 0
   [junit4]   2> 2284276 INFO  (qtp736482640-21013) [    x:collection1] o.a.s.u.p.LogUpdateProcessorFactory [collection1]  webapp=/solr path=/update params={version=2&wt=javabin}{add=[53]} 0 0
   [junit4]   2> 2284278 INFO  (qtp736482640-21009) [    x:collection1] o.a.s.u.p.LogUpdateProcessorFactory [collection1]  webapp=/solr path=/update params={version=2&wt=javabin}{add=[54]} 0 0
   [junit4]   2> 2284279 INFO  (qtp736482640-21010) [    x:collection1] o.a.s.u.p.LogUpdateProcessorFactory [collection1]  webapp=/solr path=/update params={version=2&wt=javabin}{add=[55]} 0 0
   [junit4]   2> 2284281 INFO  (qtp736482640-21011) [    x:collection1] o.a.s.u.p.LogUpdateProcessorFactory [collection1]  webapp=/solr path=/update params={version=2&wt=javabin}{add=[56]} 0 0
   [junit4]   2> 2284282 INFO  (qtp736482640-21012) [    x:collection1] o.a.s.u.p.LogUpdateProcessorFactory [collection1]  webapp=/solr path=/update params={version=2&wt=javabin}{add=[57]} 0 0
   [junit4]   2> 2284284 INFO  (qtp736482640-21013) [    x:collection1] o.a.s.u.p.LogUpdateProcessorFactory [collection1]  webapp=/solr path=/update params={version=2&wt=javabin}{add=[58]} 0 0
   [junit4]   2> 2284285 INFO  (qtp736482640-21009) [    x:collection1] o.a.s.u.p.LogUpdateProcessorFactory [collection1]  webapp=/solr path=/update params={version=2&wt=javabin}{add=[59]} 0 0
   [junit4]   2> 2284287 INFO  (qtp736482640-21010) [    x:collection1] o.a.s.u.p.LogUpdateProcessorFactory [collection1]  webapp=/solr path=/update params={version=2&wt=javabin}{add=[60]} 0 0
   [junit4]   2> 2284289 INFO  (qtp736482640-21011) [    x:collection1] o.a.s.u.p.LogUpdateProcessorFactory [collection1]  webapp=/solr path=/update params={version=2&wt=javabin}{add=[61]} 0 0
   [junit4]   2> 2284290 INFO  (qtp736482640-21012) [    x:collection1] o.a.s.u.p.LogUpdateProcessorFactory [collection1]  webapp=/solr path=/update params={version=2&wt=javabin}{add=[62]} 0 0
   [junit4]   2> 2284292 INFO  (qtp736482640-21013) [    x:collection1] o.a.s.u.p.LogUpdateProcessorFactory [collection1]  webapp=/solr path=/update params={version=2&wt=javabin}{add=[63]} 0 0
   [junit4]   2> 2284293 INFO  (qtp736482640-21009) [    x:collection1] o.a.s.u.p.LogUpdateProcessorFactory [collection1]  webapp=/solr path=/update params={version=2&wt=javabin}{add=[64]} 0 0
   [junit4]   2> 2284295 INFO  (qtp736482640-21010) [    x:collection1] o.a.s.u.p.LogUpdateProcessorFactory [collection1]  webapp=/solr path=/update params={version=2&wt=javabin}{add=[65]} 0 0
   [junit4]   2> 2284296 INFO  (qtp736482640-21011) [    x:collection1] o.a.s.u.p.LogUpdateProcessorFactory [collection1]  webapp=/solr path=/update params={version=2&wt=javabin}{add=[66]} 0 0
   [junit4]   2> 2284298 INFO  (qtp736482640-21012) [    x:collection1] o.a.s.u.p.LogUpdateProcessorFactory [collection1]  webapp=/solr path=/update params={version=2&wt=javabin}{add=[67]} 0 0
   [junit4]   2> 2284299 INFO  (qtp736482640-21013) [    x:collection1] o.a.s.u.p.LogUpdateProcessorFactory [collection1]  webapp=/solr path=/update params={version=2&wt=javabin}{add=[68]} 0 0
   [junit4]   2> 2284301 INFO  (qtp736482640-21009) [    x:collection1] o.a.s.u.p.LogUpdateProcessorFactory [collection1]  webapp=/solr path=/update params={version=2&wt=javabin}{add=[69]} 0 0
   [junit4]   2> 2284303 INFO  (qtp736482640-21010) [    x:collection1] o.a.s.u.p.LogUpdateProcessorFactory [collection1]  webapp=/solr path=/update params={version=2&wt=javabin}{add=[70]} 0 0
   [junit4]   2> 2284304 INFO  (qtp736482640-21011) [    x:collection1] o.a.s.u.p.LogUpdateProcessorFactory [collection1]  webapp=/solr path=/update params={version=2&wt=javabin}{add=[71]} 0 0
   [junit4]   2> 2284306 INFO  (qtp736482640-21012) [    x:collection1] o.a.s.u.p.LogUpdateProcessorFactory [collection1]  webapp=/solr path=/update params={version=2&wt=javabin}{add=[72]} 0 0
   [junit4]   2> 2284307 INFO  (qtp736482640-21013) [    x:collection1] o.a.s.u.p.LogUpdateProcessorFactory [collection1]  webapp=/solr path=/update params={version=2&wt=javabin}{add=[73]} 0 0
   [junit4]   2> 2284309 INFO  (qtp736482640-21009) [    x:collection1] o.a.s.u.p.LogUpdateProcessorFactory [collection1]  webapp=/solr path=/update params={version=2&wt=javabin}{add=[74]} 0 0
   [junit4]   2> 2284311 INFO  (qtp736482640-21010) [    x:collection1] o.a.s.u.p.LogUpdateProcessorFactory [collection1]  webapp=/solr path=/update params={version=2&wt=javabin}{add=[75]} 0 0
   [junit4]   2> 2284312 INFO  (qtp736482640-21011) [    x:collection1] o.a.s.u.p.LogUpdateProcessorFactory [collection1]  webapp=/solr path=/update params={version=2&wt=javabin}{add=[76]} 0 0
   [junit4]   2> 2284314 INFO  (qtp736482640-21012) [    x:collection1] o.a.s.u.p.LogUpdateProcessorFactory [collection1]  webapp=/solr path=/update params={version=2&wt=javabin}{add=[77]} 0 0
   [junit4]   2> 2284315 INFO  (qtp736482640-21013) [    x:collection1] o.a.s.u.p.LogUpdateProcessorFactory [collection1]  webapp=/solr path=/update params={version=2&wt=javabin}{add=[78]} 0 0
   [junit4]   2> 2284317 INFO  (qtp736482640-21009) [    x:collection1] o.a.s.u.p.LogUpdateProcessorFactory [collection1]  webapp=/solr path=/update params={version=2&wt=javabin}{add=[79]} 0 0
   [junit4]   2> 2284318 INFO  (qtp736482640-21010) [    x:collection1] o.a.s.u.p.LogUpdateProcessorFactory [collection1]  webapp=/solr path=/update params={version=2&wt=javabin}{add=[80]} 0 0
   [junit4]   2> 2284320 INFO  (qtp736482640-21011) [    x:collection1] o.a.s.u.p.LogUpdateProcessorFactory [collection1]  webapp=/solr path=/update params={version=2&wt=javabin}{add=[81]} 0 0
   [junit4]   2> 2284321 INFO  (qtp736482640-21012) [    x:collection1] o.a.s.u.p.LogUpdateProcessorFactory [collection1]  webapp=/solr path=/update params={version=2&wt=javabin}{add=[82]} 0 0
   [junit4]   2> 2284323 INFO  (qtp736482640-21013) [    x:collection1] o.a.s.u.p.LogUpdateProcessorFactory [collection1]  webapp=/solr path=/update params={version=2&wt=javabin}{add=[83]} 0 0
   [junit4]   2> 2284325 INFO  (qtp736482640-21009) [    x:collection1] o.a.s.u.p.LogUpdateProcessorFactory [collection1]  webapp=/solr path=/update params={version=2&wt=javabin}{add=[84]} 0 0
   [junit4]   2> 2284326 INFO  (qtp736482640-21010) [    x:collection1] o.a.s.u.p.LogUpdateProcessorFactory [collection1]  webapp=/solr path=/update params={version=2&wt=javabin}{add=[85]} 0 0
   [junit4]   2> 2284328 INFO  (qtp736482640-21011) [    x:collection1] o.a.s.u.p.LogUpdateProcessorFactory [collection1]  webapp=/solr path=/update params={version=2&wt=javabin}{add=[86]} 0 0
   [junit4]   2> 2284329 INFO  (qtp736482640-21012) [    x:collection1] o.a.s.u.p.LogUpdateProcessorFactory [collection1]  webapp=/solr path=/update params={version=2&wt=javabin}{add=[87]} 0 0
   [junit4]   2> 2284331 INFO  (qtp736482640-21013) [    x:collection1] o.a.s.u.p.LogUpdateProcessorFactory [collection1]  webapp=/solr path=/update params={version=2&wt=javabin}{add=[88]} 0 0
   [junit4]   2> 2284332 INFO  (qtp736482640-21009) [    x:collection1] o.a.s.u.p.LogUpdateProcessorFactory [collection1]  webapp=/solr path=/update params={version=2&wt=javabin}{add=[89]} 0 0
   [junit4]   2> 2284334 INFO  (qtp736482640-21010) [    x:collection1] o.a.s.u.p.LogUpdateProcessorFactory [collection1]  webapp=/solr path=/update params={version=2&wt=javabin}{add=[90]} 0 0
   [junit4]   2> 2284335 INFO  (qtp736482640-21011) [    x:collection1] o.a.s.u.p.LogUpdateProcessorFactory [collection1]  webapp=/solr path=/update params={version=2&wt=javabin}{add=[91]} 0 0
   [junit4]   2> 2284337 INFO  (qtp736482640-21012) [    x:collection1] o.a.s.u.p.LogUpdateProcessorFactory [collection1]  webapp=/solr path=/update params={version=2&wt=javabin}{add=[92]} 0 0
   [junit4]   2> 2284338 INFO  (qtp736482640-21013) [    x:collection1] o.a.s.u.p.LogUpdateProcessorFactory [collection1]  webapp=/solr path=/update params={version=2&wt=javabin}{add=[93]} 0 0
   [junit4]   2> 2284340 INFO  (qtp736482640-21009) [    x:collection1] o.a.s.u.p.LogUpdateProcessorFactory [collection1]  webapp=/solr path=/update params={version=2&wt=javabin}{add=[94]} 0 0
   [junit4]   2> 2284342 INFO  (qtp736482640-21010) [    x:collection1] o.a.s.u.p.LogUpdateProcessorFactory [collection1]  webapp=/solr path=/update params={version=2&wt=javabin}{add=[95]} 0 0
   [junit4]   2> 2284343 INFO  (qtp736482640-21011) [    x:collection1] o.a.s.u.p.LogUpdateProcessorFactory [collection1]  webapp=/solr path=/update params={version=2&wt=javabin}{add=[96]} 0 0
   [junit4]   2> 2284345 INFO  (qtp736482640-21012) [    x:collection1] o.a.s.u.p.LogUpdateProcessorFactory [collection1]  webapp=/solr path=/update params={version=2&wt=javabin}{add=[97]} 0 0
   [junit4]   2> 2284346 INFO  (qtp736482640-21013) [    x:collection1] o.a.s.u.p.LogUpdateProcessorFactory [collection1]  webapp=/solr path=/update params={version=2&wt=javabin}{add=[98]} 0 0
   [junit4]   2> 2284348 INFO  (qtp736482640-21009) [    x:collection1] o.a.s.u.p.LogUpdateProcessorFactory [collection1]  webapp=/solr path=/update params={version=2&wt=javabin}{add=[99]} 0 0
   [junit4]   2> 2284349 INFO  (qtp736482640-21010) [    x:collection1] o.a.s.u.p.LogUpdateProcessorFactory [collection1]  webapp=/solr path=/update params={version=2&wt=javabin}{add=[100]} 0 0
   [junit4]   2> 2284351 INFO  (qtp736482640-21011) [    x:collection1] o.a.s.u.p.LogUpdateProcessorFactory [collection1]  webapp=/solr path=/update params={version=2&wt=javabin}{add=[101]} 0 0
   [junit4]   2> 2284355 INFO  (qtp736482640-21012) [    x:collection1] o.a.s.u.p.LogUpdateProcessorFactory [collection1]  webapp=/solr path=/update params={version=2&wt=javabin}{add=[102]} 0 0
   [junit4]   2> 2284357 INFO  (qtp736482640-21013) [    x:collection1] o.a.s.u.p.LogUpdateProcessorFactory [collection1]  webapp=/solr path=/update params={version=2&wt=javabin}{add=[103]} 0 0
   [junit4]   2> 2284360 INFO  (qtp736482640-21009) [    x:collection1] o.a.s.u.p.LogUpdateProcessorFactory [collection1]  webapp=/solr path=/update params={version=2&wt=javabin}{add=[104]} 0 0
   [junit4]   2> 2284362 INFO  (qtp736482640-21010) [    x:collection1] o.a.s.u.p.LogUpdateProcessorFactory [collection1]  webapp=/solr path=/update params={version=2&wt=javabin}{add=[105]} 0 0
   [junit4]   2> 2284363 INFO  (qtp736482640-21011) [    x:collection1] o.a.s.u.p.LogUpdateProcessorFactory [collection1]  webapp=/solr path=/update params={version=2&wt=javabin}{add=[106]} 0 0
   [junit4]   2> 2284365 INFO  (qtp736482640-21012) [    x:collection1] o.a.s.u.p.LogUpdateProcessorFactory [collection1]  webapp=/solr path=/update params={version=2&wt=javabin}{add=[107]} 0 0
   [junit4]   2> 2284366 INFO  (qtp736482640-21013) [    x:collection1] o.a.s.u.p.LogUpdateProcessorFactory [collection1]  webapp=/solr path=/update params={version=2&wt=javabin}{add=[108]} 0 0
   [junit4]   2> 2284368 INFO  (qtp736482640-21009) [    x:collection1] o.a.s.u.p.LogUpdateProcessorFactory [collection1]  webapp=/solr path=/update params={version=2&wt=javabin}{add=[109]} 0 0
   [junit4]   2> 2284369 INFO  (qtp736482640-21010) [    x:collection1] o.a.s.u.p.LogUpdateProcessorFactory [collection1]  webapp=/solr path=/update params={version=2&wt=javabin}{add=[110]} 0 0
   [junit4]   2> 2284371 INFO  (qtp736482640-21011) [    x:collection1] o.a.s.u.p.LogUpdateProcessorFactory [collection1]  webapp=/solr path=/update params={version=2&wt=javabin}{add=[111]} 0 0
   [junit4]   2> 2284372 INFO  (qtp736482640-21012) [    x:collection1] o.a.s.u.p.LogUpdateProcessorFactory [collection1]  webapp=/solr path=/update params={version=2&wt=javabin}{add=[112]} 0 0
   [junit4]   2> 2284374 INFO  (qtp736482640-21013) [    x:collection1] o.a.s.u.p.LogUpdateProcessorFactory [collection1]  webapp=/solr path=/update params={version=2&wt=javabin}{add=[113]} 0 0
   [junit4]   2> 2284376 INFO  (qtp736482640-21009) [    x:collection1] o.a.s.u.p.LogUpdateProcessorFactory [collection1]  webapp=/solr path=/update params={version=2&wt=javabin}{add=[114]} 0 0
   [junit4]   2> 2284377 INFO  (qtp736482640-21010) [    x:collection1] o.a.s.u.p.LogUpdateProcessorFactory [collection1]  webapp=/solr path=/update params={version=2&wt=javabin}{add=[115]} 0 0
   [junit4]   2> 2284379 INFO  (qtp736482640-21011) [    x:collection1] o.a.s.u.p.LogUpdateProcessorFactory [collection1]  webapp=/solr path=/update params={version=2&wt=javabin}{add=[116]} 0 0
   [junit4]   2> 2284380 INFO  (qtp736482640-21012) [    x:collection1] o.a.s.u.p.LogUpdateProcessorFactory [collection1] 

[...truncated too long message...]

/x1/jenkins/jenkins-slave/workspace/Lucene-Solr-NightlyTests-5.x/solr/core/test-lib/apacheds-interceptors-admin-2.0.0-M15.jar:/x1/jenkins/jenkins-slave/workspace/Lucene-Solr-NightlyTests-5.x/solr/core/test-lib/apacheds-interceptors-authn-2.0.0-M15.jar:/x1/jenkins/jenkins-slave/workspace/Lucene-Solr-NightlyTests-5.x/solr/core/test-lib/apacheds-interceptors-authz-2.0.0-M15.jar:/x1/jenkins/jenkins-slave/workspace/Lucene-Solr-NightlyTests-5.x/solr/core/test-lib/apacheds-interceptors-changelog-2.0.0-M15.jar:/x1/jenkins/jenkins-slave/workspace/Lucene-Solr-NightlyTests-5.x/solr/core/test-lib/apacheds-interceptors-collective-2.0.0-M15.jar:/x1/jenkins/jenkins-slave/workspace/Lucene-Solr-NightlyTests-5.x/solr/core/test-lib/apacheds-interceptors-event-2.0.0-M15.jar:/x1/jenkins/jenkins-slave/workspace/Lucene-Solr-NightlyTests-5.x/solr/core/test-lib/apacheds-interceptors-exception-2.0.0-M15.jar:/x1/jenkins/jenkins-slave/workspace/Lucene-Solr-NightlyTests-5.x/solr/core/test-lib/apacheds-interceptors-journal-2.0.0-M15.jar:/x1/jenkins/jenkins-slave/workspace/Lucene-Solr-NightlyTests-5.x/solr/core/test-lib/apacheds-interceptors-normalization-2.0.0-M15.jar:/x1/jenkins/jenkins-slave/workspace/Lucene-Solr-NightlyTests-5.x/solr/core/test-lib/apacheds-interceptors-operational-2.0.0-M15.jar:/x1/jenkins/jenkins-slave/workspace/Lucene-Solr-NightlyTests-5.x/solr/core/test-lib/apacheds-interceptors-referral-2.0.0-M15.jar:/x1/jenkins/jenkins-slave/workspace/Lucene-Solr-NightlyTests-5.x/solr/core/test-lib/apacheds-interceptors-schema-2.0.0-M15.jar:/x1/jenkins/jenkins-slave/workspace/Lucene-Solr-NightlyTests-5.x/solr/core/test-lib/apacheds-interceptors-subtree-2.0.0-M15.jar:/x1/jenkins/jenkins-slave/workspace/Lucene-Solr-NightlyTests-5.x/solr/core/test-lib/apacheds-interceptors-trigger-2.0.0-M15.jar:/x1/jenkins/jenkins-slave/workspace/Lucene-Solr-NightlyTests-5.x/solr/core/test-lib/apacheds-jdbm-partition-2.0.0-M15.jar:/x1/jenkins/jenkins-slave/workspace/Lucene-Solr-NightlyTests-5.x/solr/core/test-lib/apacheds-jdbm1-2.0.0-M2.jar:/x1/jenkins/jenkins-slave/workspace/Lucene-Solr-NightlyTests-5.x/solr/core/test-lib/apacheds-kerberos-codec-2.0.0-M15.jar:/x1/jenkins/jenkins-slave/workspace/Lucene-Solr-NightlyTests-5.x/solr/core/test-lib/apacheds-ldif-partition-2.0.0-M15.jar:/x1/jenkins/jenkins-slave/workspace/Lucene-Solr-NightlyTests-5.x/solr/core/test-lib/apacheds-mavibot-partition-2.0.0-M15.jar:/x1/jenkins/jenkins-slave/workspace/Lucene-Solr-NightlyTests-5.x/solr/core/test-lib/apacheds-protocol-kerberos-2.0.0-M15.jar:/x1/jenkins/jenkins-slave/workspace/Lucene-Solr-NightlyTests-5.x/solr/core/test-lib/apacheds-protocol-ldap-2.0.0-M15.jar:/x1/jenkins/jenkins-slave/workspace/Lucene-Solr-NightlyTests-5.x/solr/core/test-lib/apacheds-protocol-shared-2.0.0-M15.jar:/x1/jenkins/jenkins-slave/workspace/Lucene-Solr-NightlyTests-5.x/solr/core/test-lib/apacheds-xdbm-partition-2.0.0-M15.jar:/x1/jenkins/jenkins-slave/workspace/Lucene-Solr-NightlyTests-5.x/solr/core/test-lib/api-all-1.0.0-M20.jar:/x1/jenkins/jenkins-slave/workspace/Lucene-Solr-NightlyTests-5.x/solr/core/test-lib/bcprov-jdk15-1.45.jar:/x1/jenkins/jenkins-slave/workspace/Lucene-Solr-NightlyTests-5.x/solr/core/test-lib/cglib-nodep-2.2.jar:/x1/jenkins/jenkins-slave/workspace/Lucene-Solr-NightlyTests-5.x/solr/core/test-lib/commons-collections-3.2.2.jar:/x1/jenkins/jenkins-slave/workspace/Lucene-Solr-NightlyTests-5.x/solr/core/test-lib/commons-math3-3.4.1.jar:/x1/jenkins/jenkins-slave/workspace/Lucene-Solr-NightlyTests-5.x/solr/core/test-lib/easymock-3.0.jar:/x1/jenkins/jenkins-slave/workspace/Lucene-Solr-NightlyTests-5.x/solr/core/test-lib/ehcache-core-2.4.4.jar:/x1/jenkins/jenkins-slave/workspace/Lucene-Solr-NightlyTests-5.x/solr/core/test-lib/hadoop-common-2.6.0-tests.jar:/x1/jenkins/jenkins-slave/workspace/Lucene-Solr-NightlyTests-5.x/solr/core/test-lib/hadoop-hdfs-2.6.0-tests.jar:/x1/jenkins/jenkins-slave/workspace/Lucene-Solr-NightlyTests-5.x/solr/core/test-lib/hadoop-minikdc-2.6.0.jar:/x1/jenkins/jenkins-slave/workspace/Lucene-Solr-NightlyTests-5.x/solr/core/test-lib/jackson-annotations-2.5.4.jar:/x1/jenkins/jenkins-slave/workspace/Lucene-Solr-NightlyTests-5.x/solr/core/test-lib/jackson-databind-2.5.4.jar:/x1/jenkins/jenkins-slave/workspace/Lucene-Solr-NightlyTests-5.x/solr/core/test-lib/jersey-core-1.9.jar:/x1/jenkins/jenkins-slave/workspace/Lucene-Solr-NightlyTests-5.x/solr/core/test-lib/jersey-server-1.9.jar:/x1/jenkins/jenkins-slave/workspace/Lucene-Solr-NightlyTests-5.x/solr/core/test-lib/jetty-6.1.26.jar:/x1/jenkins/jenkins-slave/workspace/Lucene-Solr-NightlyTests-5.x/solr/core/test-lib/jetty-util-6.1.26.jar:/x1/jenkins/jenkins-slave/workspace/Lucene-Solr-NightlyTests-5.x/solr/core/test-lib/mina-core-2.0.0-M5.jar:/x1/jenkins/jenkins-slave/workspace/Lucene-Solr-NightlyTests-5.x/solr/core/test-lib/objenesis-1.2.jar:/x1/jenkins/jenkins-slave/workspace/Lucene-Solr-NightlyTests-5.x/lucene/build/analysis/icu/lucene-analyzers-icu-5.5.0-SNAPSHOT.jar:/x1/jenkins/jenkins-slave/workspace/Lucene-Solr-NightlyTests-5.x/solr/build/contrib/solr-analysis-extras/classes/java:/x1/jenkins/jenkins-slave/workspace/Lucene-Solr-NightlyTests-5.x/solr/contrib/analysis-extras/lib/icu4j-54.1.jar:/home/jenkins/jenkins-slave/tools/hudson.tasks.Ant_AntInstallation/ant-1.8.2/lib/ant-launcher.jar:/x1/jenkins/.ant/lib/ivy-2.3.0.jar:/home/jenkins/jenkins-slave/tools/hudson.tasks.Ant_AntInstallation/ant-1.8.2/lib/ant-antlr.jar:/home/jenkins/jenkins-slave/tools/hudson.tasks.Ant_AntInstallation/ant-1.8.2/lib/ant-apache-regexp.jar:/home/jenkins/jenkins-slave/tools/hudson.tasks.Ant_AntInstallation/ant-1.8.2/lib/ant-apache-resolver.jar:/home/jenkins/jenkins-slave/tools/hudson.tasks.Ant_AntInstallation/ant-1.8.2/lib/ant-commons-net.jar:/home/jenkins/jenkins-slave/tools/hudson.tasks.Ant_AntInstallation/ant-1.8.2/lib/ant-jmf.jar:/home/jenkins/jenkins-slave/tools/hudson.tasks.Ant_AntInstallation/ant-1.8.2/lib/ant-apache-oro.jar:/home/jenkins/jenkins-slave/tools/hudson.tasks.Ant_AntInstallation/ant-1.8.2/lib/ant-apache-xalan2.jar:/home/jenkins/jenkins-slave/tools/hudson.tasks.Ant_AntInstallation/ant-1.8.2/lib/ant-commons-logging.jar:/home/jenkins/jenkins-slave/tools/hudson.tasks.Ant_AntInstallation/ant-1.8.2/lib/ant-jsch.jar:/home/jenkins/jenkins-slave/tools/hudson.tasks.Ant_AntInstallation/ant-1.8.2/lib/ant-junit4.jar:/home/jenkins/jenkins-slave/tools/hudson.tasks.Ant_AntInstallation/ant-1.8.2/lib/ant-javamail.jar:/home/jenkins/jenkins-slave/tools/hudson.tasks.Ant_AntInstallation/ant-1.8.2/lib/ant-jai.jar:/home/jenkins/jenkins-slave/tools/hudson.tasks.Ant_AntInstallation/ant-1.8.2/lib/ant-jdepend.jar:/home/jenkins/jenkins-slave/tools/hudson.tasks.Ant_AntInstallation/ant-1.8.2/lib/ant-junit.jar:/home/jenkins/jenkins-slave/tools/hudson.tasks.Ant_AntInstallation/ant-1.8.2/lib/ant-apache-bsf.jar:/home/jenkins/jenkins-slave/tools/hudson.tasks.Ant_AntInstallation/ant-1.8.2/lib/ant-swing.jar:/home/jenkins/jenkins-slave/tools/hudson.tasks.Ant_AntInstallation/ant-1.8.2/lib/ant.jar:/home/jenkins/jenkins-slave/tools/hudson.tasks.Ant_AntInstallation/ant-1.8.2/lib/ant-netrexx.jar:/home/jenkins/jenkins-slave/tools/hudson.tasks.Ant_AntInstallation/ant-1.8.2/lib/ant-apache-bcel.jar:/home/jenkins/jenkins-slave/tools/hudson.tasks.Ant_AntInstallation/ant-1.8.2/lib/ant-testutil.jar:/home/jenkins/jenkins-slave/tools/hudson.tasks.Ant_AntInstallation/ant-1.8.2/lib/ant-apache-log4j.jar:/x1/jenkins/jenkins-slave/tools/hudson.model.JDK/latest1.7/lib/tools.jar:/x1/jenkins/.ivy2/cache/com.carrotsearch.randomizedtesting/junit4-ant/jars/junit4-ant-2.3.2.jar com.carrotsearch.ant.tasks.junit4.slave.SlaveMainSafe -eventsfile /x1/jenkins/jenkins-slave/workspace/Lucene-Solr-NightlyTests-5.x/solr/build/solr-core/test/temp/junit4-J0-20151217_233455_191.events @/x1/jenkins/jenkins-slave/workspace/Lucene-Solr-NightlyTests-5.x/solr/build/solr-core/test/temp/junit4-J0-20151217_233455_191.suites -stdin
   [junit4] ERROR: JVM J0 ended with an exception: Quit event not received from the forked process? This may indicate JVM crash or runner bugs.
   [junit4] 	at com.carrotsearch.ant.tasks.junit4.JUnit4.executeSlave(JUnit4.java:1501)
   [junit4] 	at com.carrotsearch.ant.tasks.junit4.JUnit4.access$000(JUnit4.java:121)
   [junit4] 	at com.carrotsearch.ant.tasks.junit4.JUnit4$2.call(JUnit4.java:955)
   [junit4] 	at com.carrotsearch.ant.tasks.junit4.JUnit4$2.call(JUnit4.java:952)
   [junit4] 	at java.util.concurrent.FutureTask.run(FutureTask.java:262)
   [junit4] 	at java.util.concurrent.ThreadPoolExecutor.runWorker(ThreadPoolExecutor.java:1145)
   [junit4] 	at java.util.concurrent.ThreadPoolExecutor$Worker.run(ThreadPoolExecutor.java:615)
   [junit4] 	at java.lang.Thread.run(Thread.java:745)

BUILD FAILED
/x1/jenkins/jenkins-slave/workspace/Lucene-Solr-NightlyTests-5.x/build.xml:801: The following error occurred while executing this line:
/x1/jenkins/jenkins-slave/workspace/Lucene-Solr-NightlyTests-5.x/build.xml:738: The following error occurred while executing this line:
/x1/jenkins/jenkins-slave/workspace/Lucene-Solr-NightlyTests-5.x/build.xml:59: The following error occurred while executing this line:
/x1/jenkins/jenkins-slave/workspace/Lucene-Solr-NightlyTests-5.x/solr/build.xml:233: The following error occurred while executing this line:
/x1/jenkins/jenkins-slave/workspace/Lucene-Solr-NightlyTests-5.x/solr/common-build.xml:526: The following error occurred while executing this line:
/x1/jenkins/jenkins-slave/workspace/Lucene-Solr-NightlyTests-5.x/lucene/common-build.xml:1456: The following error occurred while executing this line:
/x1/jenkins/jenkins-slave/workspace/Lucene-Solr-NightlyTests-5.x/lucene/common-build.xml:1010: At least one slave process threw an exception, first: Quit event not received from the forked process? This may indicate JVM crash or runner bugs.

Total time: 230 minutes 38 seconds
Build step 'Invoke Ant' marked build as failure
Archiving artifacts
Recording test results
Email was triggered for: Failure - Any
Sending email for trigger: Failure - Any



Mime
View raw message