lucene-dev mailing list archives

Site index · List index
Message view « Date » · « Thread »
Top « Date » · « Thread »
From Policeman Jenkins Server <jenk...@thetaphi.de>
Subject [JENKINS] Lucene-Solr-5.x-Linux (32bit/jdk1.7.0_80) - Build # 14971 - Failure!
Date Sun, 20 Dec 2015 21:46:56 GMT
Build: http://jenkins.thetaphi.de/job/Lucene-Solr-5.x-Linux/14971/
Java: 32bit/jdk1.7.0_80 -client -XX:+UseG1GC

1 tests failed.
FAILED:  org.apache.lucene.util.TestGeoUtils.testGeoRelations

Error Message:
1 incorrect hits (see above)

Stack Trace:
java.lang.AssertionError: 1 incorrect hits (see above)
	at __randomizedtesting.SeedInfo.seed([1C0CC6395084C3FA:DE2FD28C2473B544]:0)
	at org.junit.Assert.fail(Assert.java:93)
	at org.apache.lucene.util.TestGeoUtils.testGeoRelations(TestGeoUtils.java:533)
	at sun.reflect.NativeMethodAccessorImpl.invoke0(Native Method)
	at sun.reflect.NativeMethodAccessorImpl.invoke(NativeMethodAccessorImpl.java:57)
	at sun.reflect.DelegatingMethodAccessorImpl.invoke(DelegatingMethodAccessorImpl.java:43)
	at java.lang.reflect.Method.invoke(Method.java:606)
	at com.carrotsearch.randomizedtesting.RandomizedRunner.invoke(RandomizedRunner.java:1764)
	at com.carrotsearch.randomizedtesting.RandomizedRunner$8.evaluate(RandomizedRunner.java:871)
	at com.carrotsearch.randomizedtesting.RandomizedRunner$9.evaluate(RandomizedRunner.java:907)
	at com.carrotsearch.randomizedtesting.RandomizedRunner$10.evaluate(RandomizedRunner.java:921)
	at org.apache.lucene.util.TestRuleSetupTeardownChained$1.evaluate(TestRuleSetupTeardownChained.java:50)
	at org.apache.lucene.util.AbstractBeforeAfterRule$1.evaluate(AbstractBeforeAfterRule.java:46)
	at org.apache.lucene.util.TestRuleThreadAndTestName$1.evaluate(TestRuleThreadAndTestName.java:49)
	at org.apache.lucene.util.TestRuleIgnoreAfterMaxFailures$1.evaluate(TestRuleIgnoreAfterMaxFailures.java:65)
	at org.apache.lucene.util.TestRuleMarkFailure$1.evaluate(TestRuleMarkFailure.java:48)
	at com.carrotsearch.randomizedtesting.rules.StatementAdapter.evaluate(StatementAdapter.java:36)
	at com.carrotsearch.randomizedtesting.ThreadLeakControl$StatementRunner.run(ThreadLeakControl.java:367)
	at com.carrotsearch.randomizedtesting.ThreadLeakControl.forkTimeoutingTask(ThreadLeakControl.java:809)
	at com.carrotsearch.randomizedtesting.ThreadLeakControl$3.evaluate(ThreadLeakControl.java:460)
	at com.carrotsearch.randomizedtesting.RandomizedRunner.runSingleTest(RandomizedRunner.java:880)
	at com.carrotsearch.randomizedtesting.RandomizedRunner$5.evaluate(RandomizedRunner.java:781)
	at com.carrotsearch.randomizedtesting.RandomizedRunner$6.evaluate(RandomizedRunner.java:816)
	at com.carrotsearch.randomizedtesting.RandomizedRunner$7.evaluate(RandomizedRunner.java:827)
	at org.apache.lucene.util.AbstractBeforeAfterRule$1.evaluate(AbstractBeforeAfterRule.java:46)
	at com.carrotsearch.randomizedtesting.rules.StatementAdapter.evaluate(StatementAdapter.java:36)
	at org.apache.lucene.util.TestRuleStoreClassName$1.evaluate(TestRuleStoreClassName.java:42)
	at com.carrotsearch.randomizedtesting.rules.NoShadowingOrOverridesOnMethodsRule$1.evaluate(NoShadowingOrOverridesOnMethodsRule.java:40)
	at com.carrotsearch.randomizedtesting.rules.NoShadowingOrOverridesOnMethodsRule$1.evaluate(NoShadowingOrOverridesOnMethodsRule.java:40)
	at com.carrotsearch.randomizedtesting.rules.StatementAdapter.evaluate(StatementAdapter.java:36)
	at com.carrotsearch.randomizedtesting.rules.StatementAdapter.evaluate(StatementAdapter.java:36)
	at com.carrotsearch.randomizedtesting.rules.StatementAdapter.evaluate(StatementAdapter.java:36)
	at org.apache.lucene.util.TestRuleAssertionsRequired$1.evaluate(TestRuleAssertionsRequired.java:54)
	at org.apache.lucene.util.TestRuleMarkFailure$1.evaluate(TestRuleMarkFailure.java:48)
	at org.apache.lucene.util.TestRuleIgnoreAfterMaxFailures$1.evaluate(TestRuleIgnoreAfterMaxFailures.java:65)
	at org.apache.lucene.util.TestRuleIgnoreTestSuites$1.evaluate(TestRuleIgnoreTestSuites.java:55)
	at com.carrotsearch.randomizedtesting.rules.StatementAdapter.evaluate(StatementAdapter.java:36)
	at com.carrotsearch.randomizedtesting.ThreadLeakControl$StatementRunner.run(ThreadLeakControl.java:367)
	at java.lang.Thread.run(Thread.java:745)




Build Log:
[...truncated 8163 lines...]
   [junit4] Suite: org.apache.lucene.util.TestGeoUtils
   [junit4]   1> doc=1829 matched but should not on iteration 206
   [junit4]   1>   lon=-88.87036420404911 lat=88.29201523214579 distanceMeters=305135.1132022886
vs radiusMeters=304582.38143026375
   [junit4]   2> NOTE: reproduce with: ant test  -Dtestcase=TestGeoUtils -Dtests.method=testGeoRelations
-Dtests.seed=1C0CC6395084C3FA -Dtests.multiplier=3 -Dtests.slow=true -Dtests.locale=sl -Dtests.timezone=Navajo
-Dtests.asserts=true -Dtests.file.encoding=ISO-8859-1
   [junit4] FAILURE 2.27s J0 | TestGeoUtils.testGeoRelations <<<
   [junit4]    > Throwable #1: java.lang.AssertionError: 1 incorrect hits (see above)
   [junit4]    > 	at __randomizedtesting.SeedInfo.seed([1C0CC6395084C3FA:DE2FD28C2473B544]:0)
   [junit4]    > 	at org.apache.lucene.util.TestGeoUtils.testGeoRelations(TestGeoUtils.java:533)
   [junit4]    > 	at java.lang.Thread.run(Thread.java:745)
   [junit4]   2> NOTE: test params are: codec=Asserting(Lucene54): {}, docValues:{}, sim=RandomSimilarityProvider(queryNorm=true,coord=yes):
{}, locale=sl, timezone=Navajo
   [junit4]   2> NOTE: Linux 3.19.0-37-generic i386/Oracle Corporation 1.7.0_80 (32-bit)/cpus=12,threads=1,free=58529208,total=78643200
   [junit4]   2> NOTE: All tests run in this JVM: [FuzzyLikeThisQueryTest, TestBKDTree,
TestGeoUtils]
   [junit4] Completed [11/20 (1!)] on J0 in 2.30s, 8 tests, 1 failure <<< FAILURES!

[...truncated 50 lines...]
BUILD FAILED
/home/jenkins/workspace/Lucene-Solr-5.x-Linux/build.xml:794: The following error occurred
while executing this line:
/home/jenkins/workspace/Lucene-Solr-5.x-Linux/build.xml:738: The following error occurred
while executing this line:
/home/jenkins/workspace/Lucene-Solr-5.x-Linux/build.xml:59: The following error occurred while
executing this line:
/home/jenkins/workspace/Lucene-Solr-5.x-Linux/lucene/build.xml:472: The following error occurred
while executing this line:
/home/jenkins/workspace/Lucene-Solr-5.x-Linux/lucene/common-build.xml:2252: The following
error occurred while executing this line:
/home/jenkins/workspace/Lucene-Solr-5.x-Linux/lucene/module-build.xml:58: The following error
occurred while executing this line:
/home/jenkins/workspace/Lucene-Solr-5.x-Linux/lucene/common-build.xml:1456: The following
error occurred while executing this line:
/home/jenkins/workspace/Lucene-Solr-5.x-Linux/lucene/common-build.xml:1010: There were test
failures: 20 suites, 142 tests, 1 failure, 11 ignored (11 assumptions) [seed: 1C0CC6395084C3FA]

Total time: 20 minutes 48 seconds
Build step 'Invoke Ant' marked build as failure
Archiving artifacts
[WARNINGS] Skipping publisher since build result is FAILURE
Recording test results
Email was triggered for: Failure - Any
Sending email for trigger: Failure - Any



Mime
View raw message