lucene-dev mailing list archives

Site index · List index
Message view « Date » · « Thread »
Top « Date » · « Thread »
From Policeman Jenkins Server <jenk...@thetaphi.de>
Subject [JENKINS-EA] Lucene-Solr-trunk-Linux (64bit/jdk-9-ea+95) - Build # 15375 - Failure!
Date Wed, 30 Dec 2015 07:25:31 GMT
Build: http://jenkins.thetaphi.de/job/Lucene-Solr-trunk-Linux/15375/
Java: 64bit/jdk-9-ea+95 -XX:-UseCompressedOops -XX:+UseConcMarkSweepGC -XX:-CompactStrings

3 tests failed.
FAILED:  junit.framework.TestSuite.org.apache.solr.cloud.CollectionsAPIDistributedZkTest

Error Message:
6 threads leaked from SUITE scope at org.apache.solr.cloud.CollectionsAPIDistributedZkTest:     1) Thread[id=9406, name=TEST-CollectionsAPIDistributedZkTest.test-seed#[A0FFB43F75647302]-EventThread, state=WAITING, group=TGRP-CollectionsAPIDistributedZkTest]         at jdk.internal.misc.Unsafe.park(Native Method)         at java.util.concurrent.locks.LockSupport.park(LockSupport.java:178)         at java.util.concurrent.locks.AbstractQueuedSynchronizer$ConditionObject.await(AbstractQueuedSynchronizer.java:2061)         at java.util.concurrent.LinkedBlockingQueue.take(LinkedBlockingQueue.java:442)         at org.apache.zookeeper.ClientCnxn$EventThread.run(ClientCnxn.java:494)    2) Thread[id=9407, name=zkCallback-1770-thread-1, state=TIMED_WAITING, group=TGRP-CollectionsAPIDistributedZkTest]         at jdk.internal.misc.Unsafe.park(Native Method)         at java.util.concurrent.locks.LockSupport.parkNanos(LockSupport.java:218)         at java.util.concurrent.SynchronousQueue$TransferStack.awaitFulfill(SynchronousQueue.java:461)         at java.util.concurrent.SynchronousQueue$TransferStack.transfer(SynchronousQueue.java:362)         at java.util.concurrent.SynchronousQueue.poll(SynchronousQueue.java:937)         at java.util.concurrent.ThreadPoolExecutor.getTask(ThreadPoolExecutor.java:1082)         at java.util.concurrent.ThreadPoolExecutor.runWorker(ThreadPoolExecutor.java:1143)         at java.util.concurrent.ThreadPoolExecutor$Worker.run(ThreadPoolExecutor.java:632)         at java.lang.Thread.run(Thread.java:747)    3) Thread[id=9662, name=zkCallback-1770-thread-4, state=TIMED_WAITING, group=TGRP-CollectionsAPIDistributedZkTest]         at jdk.internal.misc.Unsafe.park(Native Method)         at java.util.concurrent.locks.LockSupport.parkNanos(LockSupport.java:218)         at java.util.concurrent.SynchronousQueue$TransferStack.awaitFulfill(SynchronousQueue.java:461)         at java.util.concurrent.SynchronousQueue$TransferStack.transfer(SynchronousQueue.java:362)         at java.util.concurrent.SynchronousQueue.poll(SynchronousQueue.java:937)         at java.util.concurrent.ThreadPoolExecutor.getTask(ThreadPoolExecutor.java:1082)         at java.util.concurrent.ThreadPoolExecutor.runWorker(ThreadPoolExecutor.java:1143)         at java.util.concurrent.ThreadPoolExecutor$Worker.run(ThreadPoolExecutor.java:632)         at java.lang.Thread.run(Thread.java:747)    4) Thread[id=9405, name=TEST-CollectionsAPIDistributedZkTest.test-seed#[A0FFB43F75647302]-SendThread(127.0.0.1:39012), state=TIMED_WAITING, group=TGRP-CollectionsAPIDistributedZkTest]         at java.lang.Thread.sleep(Native Method)         at org.apache.zookeeper.client.StaticHostProvider.next(StaticHostProvider.java:101)         at org.apache.zookeeper.ClientCnxn$SendThread.startConnect(ClientCnxn.java:940)         at org.apache.zookeeper.ClientCnxn$SendThread.run(ClientCnxn.java:1003)    5) Thread[id=9661, name=zkCallback-1770-thread-3, state=TIMED_WAITING, group=TGRP-CollectionsAPIDistributedZkTest]         at jdk.internal.misc.Unsafe.park(Native Method)         at java.util.concurrent.locks.LockSupport.parkNanos(LockSupport.java:218)         at java.util.concurrent.SynchronousQueue$TransferStack.awaitFulfill(SynchronousQueue.java:461)         at java.util.concurrent.SynchronousQueue$TransferStack.transfer(SynchronousQueue.java:362)         at java.util.concurrent.SynchronousQueue.poll(SynchronousQueue.java:937)         at java.util.concurrent.ThreadPoolExecutor.getTask(ThreadPoolExecutor.java:1082)         at java.util.concurrent.ThreadPoolExecutor.runWorker(ThreadPoolExecutor.java:1143)         at java.util.concurrent.ThreadPoolExecutor$Worker.run(ThreadPoolExecutor.java:632)         at java.lang.Thread.run(Thread.java:747)    6) Thread[id=9660, name=zkCallback-1770-thread-2, state=TIMED_WAITING, group=TGRP-CollectionsAPIDistributedZkTest]         at jdk.internal.misc.Unsafe.park(Native Method)         at java.util.concurrent.locks.LockSupport.parkNanos(LockSupport.java:218)         at java.util.concurrent.SynchronousQueue$TransferStack.awaitFulfill(SynchronousQueue.java:461)         at java.util.concurrent.SynchronousQueue$TransferStack.transfer(SynchronousQueue.java:362)         at java.util.concurrent.SynchronousQueue.poll(SynchronousQueue.java:937)         at java.util.concurrent.ThreadPoolExecutor.getTask(ThreadPoolExecutor.java:1082)         at java.util.concurrent.ThreadPoolExecutor.runWorker(ThreadPoolExecutor.java:1143)         at java.util.concurrent.ThreadPoolExecutor$Worker.run(ThreadPoolExecutor.java:632)         at java.lang.Thread.run(Thread.java:747)

Stack Trace:
com.carrotsearch.randomizedtesting.ThreadLeakError: 6 threads leaked from SUITE scope at org.apache.solr.cloud.CollectionsAPIDistributedZkTest: 
   1) Thread[id=9406, name=TEST-CollectionsAPIDistributedZkTest.test-seed#[A0FFB43F75647302]-EventThread, state=WAITING, group=TGRP-CollectionsAPIDistributedZkTest]
        at jdk.internal.misc.Unsafe.park(Native Method)
        at java.util.concurrent.locks.LockSupport.park(LockSupport.java:178)
        at java.util.concurrent.locks.AbstractQueuedSynchronizer$ConditionObject.await(AbstractQueuedSynchronizer.java:2061)
        at java.util.concurrent.LinkedBlockingQueue.take(LinkedBlockingQueue.java:442)
        at org.apache.zookeeper.ClientCnxn$EventThread.run(ClientCnxn.java:494)
   2) Thread[id=9407, name=zkCallback-1770-thread-1, state=TIMED_WAITING, group=TGRP-CollectionsAPIDistributedZkTest]
        at jdk.internal.misc.Unsafe.park(Native Method)
        at java.util.concurrent.locks.LockSupport.parkNanos(LockSupport.java:218)
        at java.util.concurrent.SynchronousQueue$TransferStack.awaitFulfill(SynchronousQueue.java:461)
        at java.util.concurrent.SynchronousQueue$TransferStack.transfer(SynchronousQueue.java:362)
        at java.util.concurrent.SynchronousQueue.poll(SynchronousQueue.java:937)
        at java.util.concurrent.ThreadPoolExecutor.getTask(ThreadPoolExecutor.java:1082)
        at java.util.concurrent.ThreadPoolExecutor.runWorker(ThreadPoolExecutor.java:1143)
        at java.util.concurrent.ThreadPoolExecutor$Worker.run(ThreadPoolExecutor.java:632)
        at java.lang.Thread.run(Thread.java:747)
   3) Thread[id=9662, name=zkCallback-1770-thread-4, state=TIMED_WAITING, group=TGRP-CollectionsAPIDistributedZkTest]
        at jdk.internal.misc.Unsafe.park(Native Method)
        at java.util.concurrent.locks.LockSupport.parkNanos(LockSupport.java:218)
        at java.util.concurrent.SynchronousQueue$TransferStack.awaitFulfill(SynchronousQueue.java:461)
        at java.util.concurrent.SynchronousQueue$TransferStack.transfer(SynchronousQueue.java:362)
        at java.util.concurrent.SynchronousQueue.poll(SynchronousQueue.java:937)
        at java.util.concurrent.ThreadPoolExecutor.getTask(ThreadPoolExecutor.java:1082)
        at java.util.concurrent.ThreadPoolExecutor.runWorker(ThreadPoolExecutor.java:1143)
        at java.util.concurrent.ThreadPoolExecutor$Worker.run(ThreadPoolExecutor.java:632)
        at java.lang.Thread.run(Thread.java:747)
   4) Thread[id=9405, name=TEST-CollectionsAPIDistributedZkTest.test-seed#[A0FFB43F75647302]-SendThread(127.0.0.1:39012), state=TIMED_WAITING, group=TGRP-CollectionsAPIDistributedZkTest]
        at java.lang.Thread.sleep(Native Method)
        at org.apache.zookeeper.client.StaticHostProvider.next(StaticHostProvider.java:101)
        at org.apache.zookeeper.ClientCnxn$SendThread.startConnect(ClientCnxn.java:940)
        at org.apache.zookeeper.ClientCnxn$SendThread.run(ClientCnxn.java:1003)
   5) Thread[id=9661, name=zkCallback-1770-thread-3, state=TIMED_WAITING, group=TGRP-CollectionsAPIDistributedZkTest]
        at jdk.internal.misc.Unsafe.park(Native Method)
        at java.util.concurrent.locks.LockSupport.parkNanos(LockSupport.java:218)
        at java.util.concurrent.SynchronousQueue$TransferStack.awaitFulfill(SynchronousQueue.java:461)
        at java.util.concurrent.SynchronousQueue$TransferStack.transfer(SynchronousQueue.java:362)
        at java.util.concurrent.SynchronousQueue.poll(SynchronousQueue.java:937)
        at java.util.concurrent.ThreadPoolExecutor.getTask(ThreadPoolExecutor.java:1082)
        at java.util.concurrent.ThreadPoolExecutor.runWorker(ThreadPoolExecutor.java:1143)
        at java.util.concurrent.ThreadPoolExecutor$Worker.run(ThreadPoolExecutor.java:632)
        at java.lang.Thread.run(Thread.java:747)
   6) Thread[id=9660, name=zkCallback-1770-thread-2, state=TIMED_WAITING, group=TGRP-CollectionsAPIDistributedZkTest]
        at jdk.internal.misc.Unsafe.park(Native Method)
        at java.util.concurrent.locks.LockSupport.parkNanos(LockSupport.java:218)
        at java.util.concurrent.SynchronousQueue$TransferStack.awaitFulfill(SynchronousQueue.java:461)
        at java.util.concurrent.SynchronousQueue$TransferStack.transfer(SynchronousQueue.java:362)
        at java.util.concurrent.SynchronousQueue.poll(SynchronousQueue.java:937)
        at java.util.concurrent.ThreadPoolExecutor.getTask(ThreadPoolExecutor.java:1082)
        at java.util.concurrent.ThreadPoolExecutor.runWorker(ThreadPoolExecutor.java:1143)
        at java.util.concurrent.ThreadPoolExecutor$Worker.run(ThreadPoolExecutor.java:632)
        at java.lang.Thread.run(Thread.java:747)
	at __randomizedtesting.SeedInfo.seed([A0FFB43F75647302]:0)


FAILED:  junit.framework.TestSuite.org.apache.solr.cloud.CollectionsAPIDistributedZkTest

Error Message:
There are still zombie threads that couldn't be terminated:    1) Thread[id=9407, name=zkCallback-1770-thread-1, state=TIMED_WAITING, group=TGRP-CollectionsAPIDistributedZkTest]         at jdk.internal.misc.Unsafe.park(Native Method)         at java.util.concurrent.locks.LockSupport.parkNanos(LockSupport.java:218)         at java.util.concurrent.SynchronousQueue$TransferStack.awaitFulfill(SynchronousQueue.java:461)         at java.util.concurrent.SynchronousQueue$TransferStack.transfer(SynchronousQueue.java:362)         at java.util.concurrent.SynchronousQueue.poll(SynchronousQueue.java:937)         at java.util.concurrent.ThreadPoolExecutor.getTask(ThreadPoolExecutor.java:1082)         at java.util.concurrent.ThreadPoolExecutor.runWorker(ThreadPoolExecutor.java:1143)         at java.util.concurrent.ThreadPoolExecutor$Worker.run(ThreadPoolExecutor.java:632)         at java.lang.Thread.run(Thread.java:747)    2) Thread[id=9662, name=zkCallback-1770-thread-4, state=TIMED_WAITING, group=TGRP-CollectionsAPIDistributedZkTest]         at jdk.internal.misc.Unsafe.park(Native Method)         at java.util.concurrent.locks.LockSupport.parkNanos(LockSupport.java:218)         at java.util.concurrent.SynchronousQueue$TransferStack.awaitFulfill(SynchronousQueue.java:461)         at java.util.concurrent.SynchronousQueue$TransferStack.transfer(SynchronousQueue.java:362)         at java.util.concurrent.SynchronousQueue.poll(SynchronousQueue.java:937)         at java.util.concurrent.ThreadPoolExecutor.getTask(ThreadPoolExecutor.java:1082)         at java.util.concurrent.ThreadPoolExecutor.runWorker(ThreadPoolExecutor.java:1143)         at java.util.concurrent.ThreadPoolExecutor$Worker.run(ThreadPoolExecutor.java:632)         at java.lang.Thread.run(Thread.java:747)    3) Thread[id=9405, name=TEST-CollectionsAPIDistributedZkTest.test-seed#[A0FFB43F75647302]-SendThread(127.0.0.1:39012), state=TIMED_WAITING, group=TGRP-CollectionsAPIDistributedZkTest]         at java.lang.Thread.sleep(Native Method)         at org.apache.zookeeper.client.StaticHostProvider.next(StaticHostProvider.java:101)         at org.apache.zookeeper.ClientCnxn$SendThread.startConnect(ClientCnxn.java:940)         at org.apache.zookeeper.ClientCnxn$SendThread.run(ClientCnxn.java:1003)    4) Thread[id=9661, name=zkCallback-1770-thread-3, state=TIMED_WAITING, group=TGRP-CollectionsAPIDistributedZkTest]         at jdk.internal.misc.Unsafe.park(Native Method)         at java.util.concurrent.locks.LockSupport.parkNanos(LockSupport.java:218)         at java.util.concurrent.SynchronousQueue$TransferStack.awaitFulfill(SynchronousQueue.java:461)         at java.util.concurrent.SynchronousQueue$TransferStack.transfer(SynchronousQueue.java:362)         at java.util.concurrent.SynchronousQueue.poll(SynchronousQueue.java:937)         at java.util.concurrent.ThreadPoolExecutor.getTask(ThreadPoolExecutor.java:1082)         at java.util.concurrent.ThreadPoolExecutor.runWorker(ThreadPoolExecutor.java:1143)         at java.util.concurrent.ThreadPoolExecutor$Worker.run(ThreadPoolExecutor.java:632)         at java.lang.Thread.run(Thread.java:747)    5) Thread[id=9660, name=zkCallback-1770-thread-2, state=TIMED_WAITING, group=TGRP-CollectionsAPIDistributedZkTest]         at jdk.internal.misc.Unsafe.park(Native Method)         at java.util.concurrent.locks.LockSupport.parkNanos(LockSupport.java:218)         at java.util.concurrent.SynchronousQueue$TransferStack.awaitFulfill(SynchronousQueue.java:461)         at java.util.concurrent.SynchronousQueue$TransferStack.transfer(SynchronousQueue.java:362)         at java.util.concurrent.SynchronousQueue.poll(SynchronousQueue.java:937)         at java.util.concurrent.ThreadPoolExecutor.getTask(ThreadPoolExecutor.java:1082)         at java.util.concurrent.ThreadPoolExecutor.runWorker(ThreadPoolExecutor.java:1143)         at java.util.concurrent.ThreadPoolExecutor$Worker.run(ThreadPoolExecutor.java:632)         at java.lang.Thread.run(Thread.java:747)

Stack Trace:
com.carrotsearch.randomizedtesting.ThreadLeakError: There are still zombie threads that couldn't be terminated:
   1) Thread[id=9407, name=zkCallback-1770-thread-1, state=TIMED_WAITING, group=TGRP-CollectionsAPIDistributedZkTest]
        at jdk.internal.misc.Unsafe.park(Native Method)
        at java.util.concurrent.locks.LockSupport.parkNanos(LockSupport.java:218)
        at java.util.concurrent.SynchronousQueue$TransferStack.awaitFulfill(SynchronousQueue.java:461)
        at java.util.concurrent.SynchronousQueue$TransferStack.transfer(SynchronousQueue.java:362)
        at java.util.concurrent.SynchronousQueue.poll(SynchronousQueue.java:937)
        at java.util.concurrent.ThreadPoolExecutor.getTask(ThreadPoolExecutor.java:1082)
        at java.util.concurrent.ThreadPoolExecutor.runWorker(ThreadPoolExecutor.java:1143)
        at java.util.concurrent.ThreadPoolExecutor$Worker.run(ThreadPoolExecutor.java:632)
        at java.lang.Thread.run(Thread.java:747)
   2) Thread[id=9662, name=zkCallback-1770-thread-4, state=TIMED_WAITING, group=TGRP-CollectionsAPIDistributedZkTest]
        at jdk.internal.misc.Unsafe.park(Native Method)
        at java.util.concurrent.locks.LockSupport.parkNanos(LockSupport.java:218)
        at java.util.concurrent.SynchronousQueue$TransferStack.awaitFulfill(SynchronousQueue.java:461)
        at java.util.concurrent.SynchronousQueue$TransferStack.transfer(SynchronousQueue.java:362)
        at java.util.concurrent.SynchronousQueue.poll(SynchronousQueue.java:937)
        at java.util.concurrent.ThreadPoolExecutor.getTask(ThreadPoolExecutor.java:1082)
        at java.util.concurrent.ThreadPoolExecutor.runWorker(ThreadPoolExecutor.java:1143)
        at java.util.concurrent.ThreadPoolExecutor$Worker.run(ThreadPoolExecutor.java:632)
        at java.lang.Thread.run(Thread.java:747)
   3) Thread[id=9405, name=TEST-CollectionsAPIDistributedZkTest.test-seed#[A0FFB43F75647302]-SendThread(127.0.0.1:39012), state=TIMED_WAITING, group=TGRP-CollectionsAPIDistributedZkTest]
        at java.lang.Thread.sleep(Native Method)
        at org.apache.zookeeper.client.StaticHostProvider.next(StaticHostProvider.java:101)
        at org.apache.zookeeper.ClientCnxn$SendThread.startConnect(ClientCnxn.java:940)
        at org.apache.zookeeper.ClientCnxn$SendThread.run(ClientCnxn.java:1003)
   4) Thread[id=9661, name=zkCallback-1770-thread-3, state=TIMED_WAITING, group=TGRP-CollectionsAPIDistributedZkTest]
        at jdk.internal.misc.Unsafe.park(Native Method)
        at java.util.concurrent.locks.LockSupport.parkNanos(LockSupport.java:218)
        at java.util.concurrent.SynchronousQueue$TransferStack.awaitFulfill(SynchronousQueue.java:461)
        at java.util.concurrent.SynchronousQueue$TransferStack.transfer(SynchronousQueue.java:362)
        at java.util.concurrent.SynchronousQueue.poll(SynchronousQueue.java:937)
        at java.util.concurrent.ThreadPoolExecutor.getTask(ThreadPoolExecutor.java:1082)
        at java.util.concurrent.ThreadPoolExecutor.runWorker(ThreadPoolExecutor.java:1143)
        at java.util.concurrent.ThreadPoolExecutor$Worker.run(ThreadPoolExecutor.java:632)
        at java.lang.Thread.run(Thread.java:747)
   5) Thread[id=9660, name=zkCallback-1770-thread-2, state=TIMED_WAITING, group=TGRP-CollectionsAPIDistributedZkTest]
        at jdk.internal.misc.Unsafe.park(Native Method)
        at java.util.concurrent.locks.LockSupport.parkNanos(LockSupport.java:218)
        at java.util.concurrent.SynchronousQueue$TransferStack.awaitFulfill(SynchronousQueue.java:461)
        at java.util.concurrent.SynchronousQueue$TransferStack.transfer(SynchronousQueue.java:362)
        at java.util.concurrent.SynchronousQueue.poll(SynchronousQueue.java:937)
        at java.util.concurrent.ThreadPoolExecutor.getTask(ThreadPoolExecutor.java:1082)
        at java.util.concurrent.ThreadPoolExecutor.runWorker(ThreadPoolExecutor.java:1143)
        at java.util.concurrent.ThreadPoolExecutor$Worker.run(ThreadPoolExecutor.java:632)
        at java.lang.Thread.run(Thread.java:747)
	at __randomizedtesting.SeedInfo.seed([A0FFB43F75647302]:0)


FAILED:  org.apache.solr.cloud.CollectionsAPIDistributedZkTest.test

Error Message:
Error from server at http://127.0.0.1:35656/p_y/cv/awholynewcollection_0: non ok status: 500, message:Server Error

Stack Trace:
org.apache.solr.client.solrj.impl.HttpSolrClient$RemoteSolrException: Error from server at http://127.0.0.1:35656/p_y/cv/awholynewcollection_0: non ok status: 500, message:Server Error
	at __randomizedtesting.SeedInfo.seed([A0FFB43F75647302:28AB8BE5DB981EFA]:0)
	at org.apache.solr.client.solrj.impl.HttpSolrClient.executeMethod(HttpSolrClient.java:509)
	at org.apache.solr.client.solrj.impl.HttpSolrClient.request(HttpSolrClient.java:241)
	at org.apache.solr.client.solrj.impl.HttpSolrClient.request(HttpSolrClient.java:230)
	at org.apache.solr.client.solrj.SolrRequest.process(SolrRequest.java:150)
	at org.apache.solr.client.solrj.SolrClient.query(SolrClient.java:943)
	at org.apache.solr.client.solrj.SolrClient.query(SolrClient.java:958)
	at org.apache.solr.cloud.AbstractFullDistribZkTestBase.waitForNon403or404or503(AbstractFullDistribZkTestBase.java:1754)
	at org.apache.solr.cloud.CollectionsAPIDistributedZkTest.testCollectionsAPI(CollectionsAPIDistributedZkTest.java:638)
	at org.apache.solr.cloud.CollectionsAPIDistributedZkTest.test(CollectionsAPIDistributedZkTest.java:160)
	at sun.reflect.NativeMethodAccessorImpl.invoke0(Native Method)
	at sun.reflect.NativeMethodAccessorImpl.invoke(NativeMethodAccessorImpl.java:62)
	at sun.reflect.DelegatingMethodAccessorImpl.invoke(DelegatingMethodAccessorImpl.java:43)
	at java.lang.reflect.Method.invoke(Method.java:520)
	at com.carrotsearch.randomizedtesting.RandomizedRunner.invoke(RandomizedRunner.java:1764)
	at com.carrotsearch.randomizedtesting.RandomizedRunner$8.evaluate(RandomizedRunner.java:871)
	at com.carrotsearch.randomizedtesting.RandomizedRunner$9.evaluate(RandomizedRunner.java:907)
	at com.carrotsearch.randomizedtesting.RandomizedRunner$10.evaluate(RandomizedRunner.java:921)
	at org.apache.solr.BaseDistributedSearchTestCase$ShardsRepeatRule$ShardsFixedStatement.callStatement(BaseDistributedSearchTestCase.java:965)
	at org.apache.solr.BaseDistributedSearchTestCase$ShardsRepeatRule$ShardsStatement.evaluate(BaseDistributedSearchTestCase.java:940)
	at com.carrotsearch.randomizedtesting.rules.SystemPropertiesRestoreRule$1.evaluate(SystemPropertiesRestoreRule.java:57)
	at org.apache.lucene.util.TestRuleSetupTeardownChained$1.evaluate(TestRuleSetupTeardownChained.java:50)
	at org.apache.lucene.util.AbstractBeforeAfterRule$1.evaluate(AbstractBeforeAfterRule.java:46)
	at org.apache.lucene.util.TestRuleThreadAndTestName$1.evaluate(TestRuleThreadAndTestName.java:49)
	at org.apache.lucene.util.TestRuleIgnoreAfterMaxFailures$1.evaluate(TestRuleIgnoreAfterMaxFailures.java:65)
	at org.apache.lucene.util.TestRuleMarkFailure$1.evaluate(TestRuleMarkFailure.java:48)
	at com.carrotsearch.randomizedtesting.rules.StatementAdapter.evaluate(StatementAdapter.java:36)
	at com.carrotsearch.randomizedtesting.ThreadLeakControl$StatementRunner.run(ThreadLeakControl.java:367)
	at com.carrotsearch.randomizedtesting.ThreadLeakControl.forkTimeoutingTask(ThreadLeakControl.java:809)
	at com.carrotsearch.randomizedtesting.ThreadLeakControl$3.evaluate(ThreadLeakControl.java:460)
	at com.carrotsearch.randomizedtesting.RandomizedRunner.runSingleTest(RandomizedRunner.java:880)
	at com.carrotsearch.randomizedtesting.RandomizedRunner$5.evaluate(RandomizedRunner.java:781)
	at com.carrotsearch.randomizedtesting.RandomizedRunner$6.evaluate(RandomizedRunner.java:816)
	at com.carrotsearch.randomizedtesting.RandomizedRunner$7.evaluate(RandomizedRunner.java:827)
	at com.carrotsearch.randomizedtesting.rules.StatementAdapter.evaluate(StatementAdapter.java:36)
	at com.carrotsearch.randomizedtesting.rules.SystemPropertiesRestoreRule$1.evaluate(SystemPropertiesRestoreRule.java:57)
	at org.apache.lucene.util.AbstractBeforeAfterRule$1.evaluate(AbstractBeforeAfterRule.java:46)
	at com.carrotsearch.randomizedtesting.rules.StatementAdapter.evaluate(StatementAdapter.java:36)
	at org.apache.lucene.util.TestRuleStoreClassName$1.evaluate(TestRuleStoreClassName.java:42)
	at com.carrotsearch.randomizedtesting.rules.NoShadowingOrOverridesOnMethodsRule$1.evaluate(NoShadowingOrOverridesOnMethodsRule.java:40)
	at com.carrotsearch.randomizedtesting.rules.NoShadowingOrOverridesOnMethodsRule$1.evaluate(NoShadowingOrOverridesOnMethodsRule.java:40)
	at com.carrotsearch.randomizedtesting.rules.StatementAdapter.evaluate(StatementAdapter.java:36)
	at com.carrotsearch.randomizedtesting.rules.StatementAdapter.evaluate(StatementAdapter.java:36)
	at com.carrotsearch.randomizedtesting.rules.StatementAdapter.evaluate(StatementAdapter.java:36)
	at org.apache.lucene.util.TestRuleAssertionsRequired$1.evaluate(TestRuleAssertionsRequired.java:54)
	at org.apache.lucene.util.TestRuleMarkFailure$1.evaluate(TestRuleMarkFailure.java:48)
	at org.apache.lucene.util.TestRuleIgnoreAfterMaxFailures$1.evaluate(TestRuleIgnoreAfterMaxFailures.java:65)
	at org.apache.lucene.util.TestRuleIgnoreTestSuites$1.evaluate(TestRuleIgnoreTestSuites.java:55)
	at com.carrotsearch.randomizedtesting.rules.StatementAdapter.evaluate(StatementAdapter.java:36)
	at com.carrotsearch.randomizedtesting.ThreadLeakControl$StatementRunner.run(ThreadLeakControl.java:367)
	at java.lang.Thread.run(Thread.java:747)




Build Log:
[...truncated 10460 lines...]
   [junit4] Suite: org.apache.solr.cloud.CollectionsAPIDistributedZkTest
   [junit4]   2> Creating dataDir: /home/jenkins/workspace/Lucene-Solr-trunk-Linux/solr/build/solr-core/test/J2/temp/solr.cloud.CollectionsAPIDistributedZkTest_A0FFB43F75647302-001/init-core-data-001
   [junit4]   2> 890301 INFO  (SUITE-CollectionsAPIDistributedZkTest-seed#[A0FFB43F75647302]-worker) [    ] o.a.s.SolrTestCaseJ4 Randomized ssl (false) and clientAuth (false)
   [junit4]   2> 890301 INFO  (SUITE-CollectionsAPIDistributedZkTest-seed#[A0FFB43F75647302]-worker) [    ] o.a.s.BaseDistributedSearchTestCase Setting hostContext system property: /p_y/cv
   [junit4]   2> 890303 INFO  (TEST-CollectionsAPIDistributedZkTest.test-seed#[A0FFB43F75647302]) [    ] o.a.s.c.ZkTestServer STARTING ZK TEST SERVER
   [junit4]   2> 890303 INFO  (Thread-3202) [    ] o.a.s.c.ZkTestServer client port:0.0.0.0/0.0.0.0:0
   [junit4]   2> 890303 INFO  (Thread-3202) [    ] o.a.s.c.ZkTestServer Starting server
   [junit4]   2> 890403 INFO  (TEST-CollectionsAPIDistributedZkTest.test-seed#[A0FFB43F75647302]) [    ] o.a.s.c.ZkTestServer start zk server on port:39012
   [junit4]   2> 890404 INFO  (TEST-CollectionsAPIDistributedZkTest.test-seed#[A0FFB43F75647302]) [    ] o.a.s.c.c.SolrZkClient Using default ZkCredentialsProvider
   [junit4]   2> 890404 INFO  (TEST-CollectionsAPIDistributedZkTest.test-seed#[A0FFB43F75647302]) [    ] o.a.s.c.c.ConnectionManager Waiting for client to connect to ZooKeeper
   [junit4]   2> 890406 INFO  (zkCallback-1732-thread-1) [    ] o.a.s.c.c.ConnectionManager Watcher org.apache.solr.common.cloud.ConnectionManager@2aa0d8a9 name:ZooKeeperConnection Watcher:127.0.0.1:39012 got event WatchedEvent state:SyncConnected type:None path:null path:null type:None
   [junit4]   2> 890406 INFO  (TEST-CollectionsAPIDistributedZkTest.test-seed#[A0FFB43F75647302]) [    ] o.a.s.c.c.ConnectionManager Client is connected to ZooKeeper
   [junit4]   2> 890406 INFO  (TEST-CollectionsAPIDistributedZkTest.test-seed#[A0FFB43F75647302]) [    ] o.a.s.c.c.SolrZkClient Using default ZkACLProvider
   [junit4]   2> 890406 INFO  (TEST-CollectionsAPIDistributedZkTest.test-seed#[A0FFB43F75647302]) [    ] o.a.s.c.c.SolrZkClient makePath: /solr
   [junit4]   2> 890408 INFO  (TEST-CollectionsAPIDistributedZkTest.test-seed#[A0FFB43F75647302]) [    ] o.a.s.c.c.SolrZkClient Using default ZkCredentialsProvider
   [junit4]   2> 890408 INFO  (TEST-CollectionsAPIDistributedZkTest.test-seed#[A0FFB43F75647302]) [    ] o.a.s.c.c.ConnectionManager Waiting for client to connect to ZooKeeper
   [junit4]   2> 890409 INFO  (zkCallback-1733-thread-1) [    ] o.a.s.c.c.ConnectionManager Watcher org.apache.solr.common.cloud.ConnectionManager@54aa20ef name:ZooKeeperConnection Watcher:127.0.0.1:39012/solr got event WatchedEvent state:SyncConnected type:None path:null path:null type:None
   [junit4]   2> 890409 INFO  (TEST-CollectionsAPIDistributedZkTest.test-seed#[A0FFB43F75647302]) [    ] o.a.s.c.c.ConnectionManager Client is connected to ZooKeeper
   [junit4]   2> 890409 INFO  (TEST-CollectionsAPIDistributedZkTest.test-seed#[A0FFB43F75647302]) [    ] o.a.s.c.c.SolrZkClient Using default ZkACLProvider
   [junit4]   2> 890409 INFO  (TEST-CollectionsAPIDistributedZkTest.test-seed#[A0FFB43F75647302]) [    ] o.a.s.c.c.SolrZkClient makePath: /collections/collection1
   [junit4]   2> 890410 INFO  (TEST-CollectionsAPIDistributedZkTest.test-seed#[A0FFB43F75647302]) [    ] o.a.s.c.c.SolrZkClient makePath: /collections/collection1/shards
   [junit4]   2> 890410 INFO  (TEST-CollectionsAPIDistributedZkTest.test-seed#[A0FFB43F75647302]) [    ] o.a.s.c.c.SolrZkClient makePath: /collections/control_collection
   [junit4]   2> 890410 INFO  (TEST-CollectionsAPIDistributedZkTest.test-seed#[A0FFB43F75647302]) [    ] o.a.s.c.c.SolrZkClient makePath: /collections/control_collection/shards
   [junit4]   2> 890411 INFO  (TEST-CollectionsAPIDistributedZkTest.test-seed#[A0FFB43F75647302]) [    ] o.a.s.c.AbstractZkTestCase put /home/jenkins/workspace/Lucene-Solr-trunk-Linux/solr/core/src/test-files/solr/collection1/conf/solrconfig-tlog.xml to /configs/conf1/solrconfig.xml
   [junit4]   2> 890411 INFO  (TEST-CollectionsAPIDistributedZkTest.test-seed#[A0FFB43F75647302]) [    ] o.a.s.c.c.SolrZkClient makePath: /configs/conf1/solrconfig.xml
   [junit4]   2> 890412 INFO  (TEST-CollectionsAPIDistributedZkTest.test-seed#[A0FFB43F75647302]) [    ] o.a.s.c.AbstractZkTestCase put /home/jenkins/workspace/Lucene-Solr-trunk-Linux/solr/core/src/test-files/solr/collection1/conf/schema.xml to /configs/conf1/schema.xml
   [junit4]   2> 890412 INFO  (TEST-CollectionsAPIDistributedZkTest.test-seed#[A0FFB43F75647302]) [    ] o.a.s.c.c.SolrZkClient makePath: /configs/conf1/schema.xml
   [junit4]   2> 890413 INFO  (TEST-CollectionsAPIDistributedZkTest.test-seed#[A0FFB43F75647302]) [    ] o.a.s.c.AbstractZkTestCase put /home/jenkins/workspace/Lucene-Solr-trunk-Linux/solr/core/src/test-files/solr/collection1/conf/solrconfig.snippet.randomindexconfig.xml to /configs/conf1/solrconfig.snippet.randomindexconfig.xml
   [junit4]   2> 890413 INFO  (TEST-CollectionsAPIDistributedZkTest.test-seed#[A0FFB43F75647302]) [    ] o.a.s.c.c.SolrZkClient makePath: /configs/conf1/solrconfig.snippet.randomindexconfig.xml
   [junit4]   2> 890413 INFO  (TEST-CollectionsAPIDistributedZkTest.test-seed#[A0FFB43F75647302]) [    ] o.a.s.c.AbstractZkTestCase put /home/jenkins/workspace/Lucene-Solr-trunk-Linux/solr/core/src/test-files/solr/collection1/conf/stopwords.txt to /configs/conf1/stopwords.txt
   [junit4]   2> 890414 INFO  (TEST-CollectionsAPIDistributedZkTest.test-seed#[A0FFB43F75647302]) [    ] o.a.s.c.c.SolrZkClient makePath: /configs/conf1/stopwords.txt
   [junit4]   2> 890414 INFO  (TEST-CollectionsAPIDistributedZkTest.test-seed#[A0FFB43F75647302]) [    ] o.a.s.c.AbstractZkTestCase put /home/jenkins/workspace/Lucene-Solr-trunk-Linux/solr/core/src/test-files/solr/collection1/conf/protwords.txt to /configs/conf1/protwords.txt
   [junit4]   2> 890414 INFO  (TEST-CollectionsAPIDistributedZkTest.test-seed#[A0FFB43F75647302]) [    ] o.a.s.c.c.SolrZkClient makePath: /configs/conf1/protwords.txt
   [junit4]   2> 890415 INFO  (TEST-CollectionsAPIDistributedZkTest.test-seed#[A0FFB43F75647302]) [    ] o.a.s.c.AbstractZkTestCase put /home/jenkins/workspace/Lucene-Solr-trunk-Linux/solr/core/src/test-files/solr/collection1/conf/currency.xml to /configs/conf1/currency.xml
   [junit4]   2> 890415 INFO  (TEST-CollectionsAPIDistributedZkTest.test-seed#[A0FFB43F75647302]) [    ] o.a.s.c.c.SolrZkClient makePath: /configs/conf1/currency.xml
   [junit4]   2> 890416 INFO  (TEST-CollectionsAPIDistributedZkTest.test-seed#[A0FFB43F75647302]) [    ] o.a.s.c.AbstractZkTestCase put /home/jenkins/workspace/Lucene-Solr-trunk-Linux/solr/core/src/test-files/solr/collection1/conf/enumsConfig.xml to /configs/conf1/enumsConfig.xml
   [junit4]   2> 890416 INFO  (TEST-CollectionsAPIDistributedZkTest.test-seed#[A0FFB43F75647302]) [    ] o.a.s.c.c.SolrZkClient makePath: /configs/conf1/enumsConfig.xml
   [junit4]   2> 890416 INFO  (TEST-CollectionsAPIDistributedZkTest.test-seed#[A0FFB43F75647302]) [    ] o.a.s.c.AbstractZkTestCase put /home/jenkins/workspace/Lucene-Solr-trunk-Linux/solr/core/src/test-files/solr/collection1/conf/open-exchange-rates.json to /configs/conf1/open-exchange-rates.json
   [junit4]   2> 890416 INFO  (TEST-CollectionsAPIDistributedZkTest.test-seed#[A0FFB43F75647302]) [    ] o.a.s.c.c.SolrZkClient makePath: /configs/conf1/open-exchange-rates.json
   [junit4]   2> 890417 INFO  (TEST-CollectionsAPIDistributedZkTest.test-seed#[A0FFB43F75647302]) [    ] o.a.s.c.AbstractZkTestCase put /home/jenkins/workspace/Lucene-Solr-trunk-Linux/solr/core/src/test-files/solr/collection1/conf/mapping-ISOLatin1Accent.txt to /configs/conf1/mapping-ISOLatin1Accent.txt
   [junit4]   2> 890417 INFO  (TEST-CollectionsAPIDistributedZkTest.test-seed#[A0FFB43F75647302]) [    ] o.a.s.c.c.SolrZkClient makePath: /configs/conf1/mapping-ISOLatin1Accent.txt
   [junit4]   2> 890418 INFO  (TEST-CollectionsAPIDistributedZkTest.test-seed#[A0FFB43F75647302]) [    ] o.a.s.c.AbstractZkTestCase put /home/jenkins/workspace/Lucene-Solr-trunk-Linux/solr/core/src/test-files/solr/collection1/conf/old_synonyms.txt to /configs/conf1/old_synonyms.txt
   [junit4]   2> 890418 INFO  (TEST-CollectionsAPIDistributedZkTest.test-seed#[A0FFB43F75647302]) [    ] o.a.s.c.c.SolrZkClient makePath: /configs/conf1/old_synonyms.txt
   [junit4]   2> 890418 INFO  (TEST-CollectionsAPIDistributedZkTest.test-seed#[A0FFB43F75647302]) [    ] o.a.s.c.AbstractZkTestCase put /home/jenkins/workspace/Lucene-Solr-trunk-Linux/solr/core/src/test-files/solr/collection1/conf/synonyms.txt to /configs/conf1/synonyms.txt
   [junit4]   2> 890418 INFO  (TEST-CollectionsAPIDistributedZkTest.test-seed#[A0FFB43F75647302]) [    ] o.a.s.c.c.SolrZkClient makePath: /configs/conf1/synonyms.txt
   [junit4]   2> 890419 INFO  (TEST-CollectionsAPIDistributedZkTest.test-seed#[A0FFB43F75647302]) [    ] o.a.s.c.c.SolrZkClient Using default ZkCredentialsProvider
   [junit4]   2> 890419 INFO  (TEST-CollectionsAPIDistributedZkTest.test-seed#[A0FFB43F75647302]) [    ] o.a.s.c.c.ConnectionManager Waiting for client to connect to ZooKeeper
   [junit4]   2> 890420 INFO  (zkCallback-1734-thread-1) [    ] o.a.s.c.c.ConnectionManager Watcher org.apache.solr.common.cloud.ConnectionManager@78e99947 name:ZooKeeperConnection Watcher:127.0.0.1:39012 got event WatchedEvent state:SyncConnected type:None path:null path:null type:None
   [junit4]   2> 890420 INFO  (TEST-CollectionsAPIDistributedZkTest.test-seed#[A0FFB43F75647302]) [    ] o.a.s.c.c.ConnectionManager Client is connected to ZooKeeper
   [junit4]   2> 890420 INFO  (TEST-CollectionsAPIDistributedZkTest.test-seed#[A0FFB43F75647302]) [    ] o.a.s.c.c.SolrZkClient Using default ZkACLProvider
   [junit4]   2> 890420 INFO  (TEST-CollectionsAPIDistributedZkTest.test-seed#[A0FFB43F75647302]) [    ] o.a.s.c.c.SolrZkClient makePath: /solr
   [junit4]   2> 890421 INFO  (TEST-CollectionsAPIDistributedZkTest.test-seed#[A0FFB43F75647302]) [    ] o.a.s.c.c.SolrZkClient Using default ZkCredentialsProvider
   [junit4]   2> 890421 INFO  (TEST-CollectionsAPIDistributedZkTest.test-seed#[A0FFB43F75647302]) [    ] o.a.s.c.c.ConnectionManager Waiting for client to connect to ZooKeeper
   [junit4]   2> 890421 INFO  (zkCallback-1735-thread-1) [    ] o.a.s.c.c.ConnectionManager Watcher org.apache.solr.common.cloud.ConnectionManager@115204ad name:ZooKeeperConnection Watcher:127.0.0.1:39012/solr got event WatchedEvent state:SyncConnected type:None path:null path:null type:None
   [junit4]   2> 890421 INFO  (TEST-CollectionsAPIDistributedZkTest.test-seed#[A0FFB43F75647302]) [    ] o.a.s.c.c.ConnectionManager Client is connected to ZooKeeper
   [junit4]   2> 890422 INFO  (TEST-CollectionsAPIDistributedZkTest.test-seed#[A0FFB43F75647302]) [    ] o.a.s.c.c.SolrZkClient Using default ZkACLProvider
   [junit4]   2> 890422 INFO  (TEST-CollectionsAPIDistributedZkTest.test-seed#[A0FFB43F75647302]) [    ] o.a.s.c.AbstractZkTestCase put /home/jenkins/workspace/Lucene-Solr-trunk-Linux/solr/core/src/test-files/solr/collection1/conf/solrconfig-tlog.xml to /configs/conf2/solrconfig.xml
   [junit4]   2> 890422 INFO  (TEST-CollectionsAPIDistributedZkTest.test-seed#[A0FFB43F75647302]) [    ] o.a.s.c.c.SolrZkClient makePath: /configs/conf2/solrconfig.xml
   [junit4]   2> 890423 INFO  (TEST-CollectionsAPIDistributedZkTest.test-seed#[A0FFB43F75647302]) [    ] o.a.s.c.AbstractZkTestCase put /home/jenkins/workspace/Lucene-Solr-trunk-Linux/solr/core/src/test-files/solr/collection1/conf/schema.xml to /configs/conf2/schema.xml
   [junit4]   2> 890423 INFO  (TEST-CollectionsAPIDistributedZkTest.test-seed#[A0FFB43F75647302]) [    ] o.a.s.c.c.SolrZkClient makePath: /configs/conf2/schema.xml
   [junit4]   2> 890424 INFO  (TEST-CollectionsAPIDistributedZkTest.test-seed#[A0FFB43F75647302]) [    ] o.a.s.c.AbstractZkTestCase put /home/jenkins/workspace/Lucene-Solr-trunk-Linux/solr/core/src/test-files/solr/collection1/conf/enumsConfig.xml to /configs/conf2/enumsConfig.xml
   [junit4]   2> 890424 INFO  (TEST-CollectionsAPIDistributedZkTest.test-seed#[A0FFB43F75647302]) [    ] o.a.s.c.c.SolrZkClient makePath: /configs/conf2/enumsConfig.xml
   [junit4]   2> 890425 INFO  (TEST-CollectionsAPIDistributedZkTest.test-seed#[A0FFB43F75647302]) [    ] o.a.s.c.AbstractZkTestCase put /home/jenkins/workspace/Lucene-Solr-trunk-Linux/solr/core/src/test-files/solr/collection1/conf/solrconfig.snippet.randomindexconfig.xml to /configs/conf2/solrconfig.snippet.randomindexconfig.xml
   [junit4]   2> 890425 INFO  (TEST-CollectionsAPIDistributedZkTest.test-seed#[A0FFB43F75647302]) [    ] o.a.s.c.c.SolrZkClient makePath: /configs/conf2/solrconfig.snippet.randomindexconfig.xml
   [junit4]   2> 890425 INFO  (TEST-CollectionsAPIDistributedZkTest.test-seed#[A0FFB43F75647302]) [    ] o.a.s.c.AbstractZkTestCase put /home/jenkins/workspace/Lucene-Solr-trunk-Linux/solr/core/src/test-files/solr/collection1/conf/stopwords.txt to /configs/conf2/stopwords.txt
   [junit4]   2> 890425 INFO  (TEST-CollectionsAPIDistributedZkTest.test-seed#[A0FFB43F75647302]) [    ] o.a.s.c.c.SolrZkClient makePath: /configs/conf2/stopwords.txt
   [junit4]   2> 890426 INFO  (TEST-CollectionsAPIDistributedZkTest.test-seed#[A0FFB43F75647302]) [    ] o.a.s.c.AbstractZkTestCase put /home/jenkins/workspace/Lucene-Solr-trunk-Linux/solr/core/src/test-files/solr/collection1/conf/protwords.txt to /configs/conf2/protwords.txt
   [junit4]   2> 890426 INFO  (TEST-CollectionsAPIDistributedZkTest.test-seed#[A0FFB43F75647302]) [    ] o.a.s.c.c.SolrZkClient makePath: /configs/conf2/protwords.txt
   [junit4]   2> 890426 INFO  (TEST-CollectionsAPIDistributedZkTest.test-seed#[A0FFB43F75647302]) [    ] o.a.s.c.AbstractZkTestCase put /home/jenkins/workspace/Lucene-Solr-trunk-Linux/solr/core/src/test-files/solr/collection1/conf/currency.xml to /configs/conf2/currency.xml
   [junit4]   2> 890426 INFO  (TEST-CollectionsAPIDistributedZkTest.test-seed#[A0FFB43F75647302]) [    ] o.a.s.c.c.SolrZkClient makePath: /configs/conf2/currency.xml
   [junit4]   2> 890427 INFO  (TEST-CollectionsAPIDistributedZkTest.test-seed#[A0FFB43F75647302]) [    ] o.a.s.c.AbstractZkTestCase put /home/jenkins/workspace/Lucene-Solr-trunk-Linux/solr/core/src/test-files/solr/collection1/conf/open-exchange-rates.json to /configs/conf2/open-exchange-rates.json
   [junit4]   2> 890427 INFO  (TEST-CollectionsAPIDistributedZkTest.test-seed#[A0FFB43F75647302]) [    ] o.a.s.c.c.SolrZkClient makePath: /configs/conf2/open-exchange-rates.json
   [junit4]   2> 890428 INFO  (TEST-CollectionsAPIDistributedZkTest.test-seed#[A0FFB43F75647302]) [    ] o.a.s.c.AbstractZkTestCase put /home/jenkins/workspace/Lucene-Solr-trunk-Linux/solr/core/src/test-files/solr/collection1/conf/mapping-ISOLatin1Accent.txt to /configs/conf2/mapping-ISOLatin1Accent.txt
   [junit4]   2> 890428 INFO  (TEST-CollectionsAPIDistributedZkTest.test-seed#[A0FFB43F75647302]) [    ] o.a.s.c.c.SolrZkClient makePath: /configs/conf2/mapping-ISOLatin1Accent.txt
   [junit4]   2> 890429 INFO  (TEST-CollectionsAPIDistributedZkTest.test-seed#[A0FFB43F75647302]) [    ] o.a.s.c.AbstractZkTestCase put /home/jenkins/workspace/Lucene-Solr-trunk-Linux/solr/core/src/test-files/solr/collection1/conf/old_synonyms.txt to /configs/conf2/old_synonyms.txt
   [junit4]   2> 890429 INFO  (TEST-CollectionsAPIDistributedZkTest.test-seed#[A0FFB43F75647302]) [    ] o.a.s.c.c.SolrZkClient makePath: /configs/conf2/old_synonyms.txt
   [junit4]   2> 890429 INFO  (TEST-CollectionsAPIDistributedZkTest.test-seed#[A0FFB43F75647302]) [    ] o.a.s.c.AbstractZkTestCase put /home/jenkins/workspace/Lucene-Solr-trunk-Linux/solr/core/src/test-files/solr/collection1/conf/synonyms.txt to /configs/conf2/synonyms.txt
   [junit4]   2> 890429 INFO  (TEST-CollectionsAPIDistributedZkTest.test-seed#[A0FFB43F75647302]) [    ] o.a.s.c.c.SolrZkClient makePath: /configs/conf2/synonyms.txt
   [junit4]   2> 890430 INFO  (TEST-CollectionsAPIDistributedZkTest.test-seed#[A0FFB43F75647302]) [    ] o.a.s.c.AbstractZkTestCase put /home/jenkins/workspace/Lucene-Solr-trunk-Linux/solr/core/src/test-files/solr/collection1/conf/elevate.xml to /configs/conf2/elevate.xml
   [junit4]   2> 890430 INFO  (TEST-CollectionsAPIDistributedZkTest.test-seed#[A0FFB43F75647302]) [    ] o.a.s.c.c.SolrZkClient makePath: /configs/conf2/elevate.xml
   [junit4]   2> 890492 INFO  (TEST-CollectionsAPIDistributedZkTest.test-seed#[A0FFB43F75647302]) [    ] o.a.s.SolrTestCaseJ4 Writing core.properties file to /home/jenkins/workspace/Lucene-Solr-trunk-Linux/solr/build/solr-core/test/J2/temp/solr.cloud.CollectionsAPIDistributedZkTest_A0FFB43F75647302-001/control-001/cores/collection1
   [junit4]   2> 890493 INFO  (TEST-CollectionsAPIDistributedZkTest.test-seed#[A0FFB43F75647302]) [    ] o.e.j.s.Server jetty-9.3.6.v20151106
   [junit4]   2> 890507 INFO  (TEST-CollectionsAPIDistributedZkTest.test-seed#[A0FFB43F75647302]) [    ] o.e.j.s.h.ContextHandler Started o.e.j.s.ServletContextHandler@186a4c79{/p_y/cv,null,AVAILABLE}
   [junit4]   2> 890509 INFO  (TEST-CollectionsAPIDistributedZkTest.test-seed#[A0FFB43F75647302]) [    ] o.e.j.s.ServerConnector Started ServerConnector@13230a18{HTTP/1.1,[http/1.1]}{127.0.0.1:41814}
   [junit4]   2> 890509 INFO  (TEST-CollectionsAPIDistributedZkTest.test-seed#[A0FFB43F75647302]) [    ] o.e.j.s.Server Started @892202ms
   [junit4]   2> 890509 INFO  (TEST-CollectionsAPIDistributedZkTest.test-seed#[A0FFB43F75647302]) [    ] o.a.s.c.s.e.JettySolrRunner Jetty properties: {solr.data.dir=/home/jenkins/workspace/Lucene-Solr-trunk-Linux/solr/build/solr-core/test/J2/temp/solr.cloud.CollectionsAPIDistributedZkTest_A0FFB43F75647302-001/tempDir-001/control/data, hostContext=/p_y/cv, hostPort=41814, coreRootDirectory=/home/jenkins/workspace/Lucene-Solr-trunk-Linux/solr/build/solr-core/test/J2/../../../../../../../../../home/jenkins/workspace/Lucene-Solr-trunk-Linux/solr/build/solr-core/test/J2/temp/solr.cloud.CollectionsAPIDistributedZkTest_A0FFB43F75647302-001/control-001/cores}
   [junit4]   2> 890509 INFO  (TEST-CollectionsAPIDistributedZkTest.test-seed#[A0FFB43F75647302]) [    ] o.a.s.s.SolrDispatchFilter SolrDispatchFilter.init(): sun.misc.Launcher$AppClassLoader@deb6432
   [junit4]   2> 890509 INFO  (TEST-CollectionsAPIDistributedZkTest.test-seed#[A0FFB43F75647302]) [    ] o.a.s.c.SolrResourceLoader new SolrResourceLoader for directory: '/home/jenkins/workspace/Lucene-Solr-trunk-Linux/solr/build/solr-core/test/J2/temp/solr.cloud.CollectionsAPIDistributedZkTest_A0FFB43F75647302-001/control-001'
   [junit4]   2> 890510 INFO  (TEST-CollectionsAPIDistributedZkTest.test-seed#[A0FFB43F75647302]) [    ] o.a.s.c.SolrResourceLoader JNDI not configured for solr (NoInitialContextEx)
   [junit4]   2> 890510 INFO  (TEST-CollectionsAPIDistributedZkTest.test-seed#[A0FFB43F75647302]) [    ] o.a.s.c.SolrResourceLoader solr home defaulted to 'solr/' (could not find system property or JNDI)
   [junit4]   2> 890510 INFO  (TEST-CollectionsAPIDistributedZkTest.test-seed#[A0FFB43F75647302]) [    ] o.a.s.c.c.SolrZkClient Using default ZkCredentialsProvider
   [junit4]   2> 890510 INFO  (TEST-CollectionsAPIDistributedZkTest.test-seed#[A0FFB43F75647302]) [    ] o.a.s.c.c.ConnectionManager Waiting for client to connect to ZooKeeper
   [junit4]   2> 890511 INFO  (zkCallback-1736-thread-1) [    ] o.a.s.c.c.ConnectionManager Watcher org.apache.solr.common.cloud.ConnectionManager@37279b2e name:ZooKeeperConnection Watcher:127.0.0.1:39012/solr got event WatchedEvent state:SyncConnected type:None path:null path:null type:None
   [junit4]   2> 890511 INFO  (TEST-CollectionsAPIDistributedZkTest.test-seed#[A0FFB43F75647302]) [    ] o.a.s.c.c.ConnectionManager Client is connected to ZooKeeper
   [junit4]   2> 890512 INFO  (TEST-CollectionsAPIDistributedZkTest.test-seed#[A0FFB43F75647302]) [    ] o.a.s.c.c.SolrZkClient Using default ZkACLProvider
   [junit4]   2> 890512 INFO  (TEST-CollectionsAPIDistributedZkTest.test-seed#[A0FFB43F75647302]) [    ] o.a.s.s.SolrDispatchFilter Loading solr.xml from SolrHome (not found in ZooKeeper)
   [junit4]   2> 890512 INFO  (TEST-CollectionsAPIDistributedZkTest.test-seed#[A0FFB43F75647302]) [    ] o.a.s.c.SolrXmlConfig Loading container configuration from /home/jenkins/workspace/Lucene-Solr-trunk-Linux/solr/build/solr-core/test/J2/temp/solr.cloud.CollectionsAPIDistributedZkTest_A0FFB43F75647302-001/control-001/solr.xml
   [junit4]   2> 890516 INFO  (TEST-CollectionsAPIDistributedZkTest.test-seed#[A0FFB43F75647302]) [    ] o.a.s.c.CorePropertiesLocator Config-defined core root directory: /home/jenkins/workspace/Lucene-Solr-trunk-Linux/solr/build/solr-core/test/J2/../../../../../../../../../home/jenkins/workspace/Lucene-Solr-trunk-Linux/solr/build/solr-core/test/J2/temp/solr.cloud.CollectionsAPIDistributedZkTest_A0FFB43F75647302-001/control-001/cores
   [junit4]   2> 890516 INFO  (TEST-CollectionsAPIDistributedZkTest.test-seed#[A0FFB43F75647302]) [    ] o.a.s.c.CoreContainer New CoreContainer 604352829
   [junit4]   2> 890516 INFO  (TEST-CollectionsAPIDistributedZkTest.test-seed#[A0FFB43F75647302]) [    ] o.a.s.c.CoreContainer Loading cores into CoreContainer [instanceDir=/home/jenkins/workspace/Lucene-Solr-trunk-Linux/solr/build/solr-core/test/J2/temp/solr.cloud.CollectionsAPIDistributedZkTest_A0FFB43F75647302-001/control-001]
   [junit4]   2> 890516 WARN  (TEST-CollectionsAPIDistributedZkTest.test-seed#[A0FFB43F75647302]) [    ] o.a.s.c.CoreContainer Couldn't add files from /home/jenkins/workspace/Lucene-Solr-trunk-Linux/solr/build/solr-core/test/J2/temp/solr.cloud.CollectionsAPIDistributedZkTest_A0FFB43F75647302-001/control-001/lib to classpath: /home/jenkins/workspace/Lucene-Solr-trunk-Linux/solr/build/solr-core/test/J2/temp/solr.cloud.CollectionsAPIDistributedZkTest_A0FFB43F75647302-001/control-001/lib
   [junit4]   2> 890516 INFO  (TEST-CollectionsAPIDistributedZkTest.test-seed#[A0FFB43F75647302]) [    ] o.a.s.h.c.HttpShardHandlerFactory created with socketTimeout : 90000,urlScheme : ,connTimeout : 15000,maxConnectionsPerHost : 20,maxConnections : 10000,corePoolSize : 0,maximumPoolSize : 2147483647,maxThreadIdleTime : 5,sizeOfQueue : -1,fairnessPolicy : false,useRetries : false,
   [junit4]   2> 890517 INFO  (TEST-CollectionsAPIDistributedZkTest.test-seed#[A0FFB43F75647302]) [    ] o.a.s.u.UpdateShardHandler Creating UpdateShardHandler HTTP client with params: socketTimeout=340000&connTimeout=45000&retry=true
   [junit4]   2> 890517 INFO  (TEST-CollectionsAPIDistributedZkTest.test-seed#[A0FFB43F75647302]) [    ] o.a.s.l.LogWatcher SLF4J impl is org.slf4j.impl.Log4jLoggerFactory
   [junit4]   2> 890517 INFO  (TEST-CollectionsAPIDistributedZkTest.test-seed#[A0FFB43F75647302]) [    ] o.a.s.l.LogWatcher Registering Log Listener [Log4j (org.slf4j.impl.Log4jLoggerFactory)]
   [junit4]   2> 890517 INFO  (TEST-CollectionsAPIDistributedZkTest.test-seed#[A0FFB43F75647302]) [    ] o.a.s.c.ZkContainer Zookeeper client=127.0.0.1:39012/solr
   [junit4]   2> 890517 INFO  (TEST-CollectionsAPIDistributedZkTest.test-seed#[A0FFB43F75647302]) [    ] o.a.s.c.ZkController zkHost includes chroot
   [junit4]   2> 890517 INFO  (TEST-CollectionsAPIDistributedZkTest.test-seed#[A0FFB43F75647302]) [    ] o.a.s.c.c.SolrZkClient Using default ZkCredentialsProvider
   [junit4]   2> 890517 INFO  (TEST-CollectionsAPIDistributedZkTest.test-seed#[A0FFB43F75647302]) [    ] o.a.s.c.c.ConnectionManager Waiting for client to connect to ZooKeeper
   [junit4]   2> 890518 INFO  (zkCallback-1739-thread-1) [    ] o.a.s.c.c.ConnectionManager Watcher org.apache.solr.common.cloud.ConnectionManager@23e440c1 name:ZooKeeperConnection Watcher:127.0.0.1:39012 got event WatchedEvent state:SyncConnected type:None path:null path:null type:None
   [junit4]   2> 890518 INFO  (TEST-CollectionsAPIDistributedZkTest.test-seed#[A0FFB43F75647302]) [    ] o.a.s.c.c.ConnectionManager Client is connected to ZooKeeper
   [junit4]   2> 890519 INFO  (TEST-CollectionsAPIDistributedZkTest.test-seed#[A0FFB43F75647302]) [    ] o.a.s.c.c.SolrZkClient Using default ZkACLProvider
   [junit4]   2> 890519 INFO  (TEST-CollectionsAPIDistributedZkTest.test-seed#[A0FFB43F75647302]) [    ] o.a.s.c.c.ConnectionManager Waiting for client to connect to ZooKeeper
   [junit4]   2> 890521 INFO  (zkCallback-1740-thread-1) [    ] o.a.s.c.c.ConnectionManager Watcher org.apache.solr.common.cloud.ConnectionManager@26477674 name:ZooKeeperConnection Watcher:127.0.0.1:39012/solr got event WatchedEvent state:SyncConnected type:None path:null path:null type:None
   [junit4]   2> 890521 INFO  (TEST-CollectionsAPIDistributedZkTest.test-seed#[A0FFB43F75647302]) [    ] o.a.s.c.c.ConnectionManager Client is connected to ZooKeeper
   [junit4]   2> 890522 INFO  (TEST-CollectionsAPIDistributedZkTest.test-seed#[A0FFB43F75647302]) [    ] o.a.s.c.c.SolrZkClient makePath: /overseer/queue
   [junit4]   2> 890522 INFO  (TEST-CollectionsAPIDistributedZkTest.test-seed#[A0FFB43F75647302]) [    ] o.a.s.c.c.SolrZkClient makePath: /overseer/collection-queue-work
   [junit4]   2> 890524 INFO  (TEST-CollectionsAPIDistributedZkTest.test-seed#[A0FFB43F75647302]) [    ] o.a.s.c.c.SolrZkClient makePath: /overseer/collection-map-running
   [junit4]   2> 890525 INFO  (TEST-CollectionsAPIDistributedZkTest.test-seed#[A0FFB43F75647302]) [    ] o.a.s.c.c.SolrZkClient makePath: /overseer/collection-map-completed
   [junit4]   2> 890526 INFO  (TEST-CollectionsAPIDistributedZkTest.test-seed#[A0FFB43F75647302]) [    ] o.a.s.c.c.SolrZkClient makePath: /overseer/collection-map-failure
   [junit4]   2> 890527 INFO  (TEST-CollectionsAPIDistributedZkTest.test-seed#[A0FFB43F75647302]) [    ] o.a.s.c.c.SolrZkClient makePath: /live_nodes
   [junit4]   2> 890527 INFO  (TEST-CollectionsAPIDistributedZkTest.test-seed#[A0FFB43F75647302]) [    ] o.a.s.c.c.SolrZkClient makePath: /aliases.json
   [junit4]   2> 890528 INFO  (TEST-CollectionsAPIDistributedZkTest.test-seed#[A0FFB43F75647302]) [    ] o.a.s.c.c.SolrZkClient makePath: /clusterstate.json
   [junit4]   2> 890530 INFO  (TEST-CollectionsAPIDistributedZkTest.test-seed#[A0FFB43F75647302]) [    ] o.a.s.c.c.SolrZkClient makePath: /security.json
   [junit4]   2> 890530 INFO  (TEST-CollectionsAPIDistributedZkTest.test-seed#[A0FFB43F75647302]) [    ] o.a.s.c.ZkController Register node as live in ZooKeeper:/live_nodes/127.0.0.1:41814_p_y%2Fcv
   [junit4]   2> 890530 INFO  (TEST-CollectionsAPIDistributedZkTest.test-seed#[A0FFB43F75647302]) [    ] o.a.s.c.c.SolrZkClient makePath: /live_nodes/127.0.0.1:41814_p_y%2Fcv
   [junit4]   2> 890531 INFO  (TEST-CollectionsAPIDistributedZkTest.test-seed#[A0FFB43F75647302]) [    ] o.a.s.c.c.SolrZkClient makePath: /overseer_elect
   [junit4]   2> 890532 INFO  (TEST-CollectionsAPIDistributedZkTest.test-seed#[A0FFB43F75647302]) [    ] o.a.s.c.c.SolrZkClient makePath: /overseer_elect/election
   [junit4]   2> 890532 INFO  (TEST-CollectionsAPIDistributedZkTest.test-seed#[A0FFB43F75647302]) [    ] o.a.s.c.Overseer Overseer (id=null) closing
   [junit4]   2> 890532 INFO  (TEST-CollectionsAPIDistributedZkTest.test-seed#[A0FFB43F75647302]) [    ] o.a.s.c.LeaderElector Joined leadership election with path: /overseer_elect/election/95122892536414214-127.0.0.1:41814_p_y%2Fcv-n_0000000000
   [junit4]   2> 890532 INFO  (TEST-CollectionsAPIDistributedZkTest.test-seed#[A0FFB43F75647302]) [    ] o.a.s.c.OverseerElectionContext I am going to be the leader 127.0.0.1:41814_p_y%2Fcv
   [junit4]   2> 890532 INFO  (TEST-CollectionsAPIDistributedZkTest.test-seed#[A0FFB43F75647302]) [    ] o.a.s.c.c.SolrZkClient makePath: /overseer_elect/leader
   [junit4]   2> 890533 INFO  (TEST-CollectionsAPIDistributedZkTest.test-seed#[A0FFB43F75647302]) [    ] o.a.s.c.Overseer Overseer (id=95122892536414214-127.0.0.1:41814_p_y%2Fcv-n_0000000000) starting
   [junit4]   2> 890534 INFO  (TEST-CollectionsAPIDistributedZkTest.test-seed#[A0FFB43F75647302]) [    ] o.a.s.c.c.SolrZkClient makePath: /overseer/queue-work
   [junit4]   2> 890555 INFO  (TEST-CollectionsAPIDistributedZkTest.test-seed#[A0FFB43F75647302]) [    ] o.a.s.c.OverseerAutoReplicaFailoverThread Starting OverseerAutoReplicaFailoverThread autoReplicaFailoverWorkLoopDelay=10000 autoReplicaFailoverWaitAfterExpiration=10000 autoReplicaFailoverBadNodeExpiration=60000
   [junit4]   2> 890555 INFO  (TEST-CollectionsAPIDistributedZkTest.test-seed#[A0FFB43F75647302]) [    ] o.a.s.c.c.ZkStateReader Updating cluster state from ZooKeeper... 
   [junit4]   2> 890555 INFO  (OverseerCollectionConfigSetProcessor-95122892536414214-127.0.0.1:41814_p_y%2Fcv-n_0000000000) [    ] o.a.s.c.OverseerTaskProcessor Process current queue of overseer operations
   [junit4]   2> 890556 INFO  (OverseerStateUpdate-95122892536414214-127.0.0.1:41814_p_y%2Fcv-n_0000000000) [    ] o.a.s.c.Overseer Starting to work on the main queue
   [junit4]   2> 890562 INFO  (TEST-CollectionsAPIDistributedZkTest.test-seed#[A0FFB43F75647302]) [    ] o.a.s.c.CoreContainer Security conf doesn't exist. Skipping setup for authorization module.
   [junit4]   2> 890562 INFO  (TEST-CollectionsAPIDistributedZkTest.test-seed#[A0FFB43F75647302]) [    ] o.a.s.c.CoreContainer No authentication plugin used.
   [junit4]   2> 890562 INFO  (TEST-CollectionsAPIDistributedZkTest.test-seed#[A0FFB43F75647302]) [    ] o.a.s.c.CorePropertiesLocator Looking for core definitions underneath /home/jenkins/workspace/Lucene-Solr-trunk-Linux/solr/build/solr-core/test/J2/../../../../../../../../../home/jenkins/workspace/Lucene-Solr-trunk-Linux/solr/build/solr-core/test/J2/temp/solr.cloud.CollectionsAPIDistributedZkTest_A0FFB43F75647302-001/control-001/cores
   [junit4]   2> 890570 INFO  (TEST-CollectionsAPIDistributedZkTest.test-seed#[A0FFB43F75647302]) [    ] o.a.s.c.CoreDescriptor Created CoreDescriptor: {name=collection1, config=solrconfig.xml, transient=false, schema=schema.xml, loadOnStartup=true, configSetProperties=configsetprops.json, collection=control_collection, coreNodeName=, dataDir=data/, shard=}
   [junit4]   2> 890570 INFO  (TEST-CollectionsAPIDistributedZkTest.test-seed#[A0FFB43F75647302]) [    ] o.a.s.c.CorePropertiesLocator Found core collection1 in /home/jenkins/workspace/Lucene-Solr-trunk-Linux/solr/build/solr-core/test/J2/../../../../../../../../../home/jenkins/workspace/Lucene-Solr-trunk-Linux/solr/build/solr-core/test/J2/temp/solr.cloud.CollectionsAPIDistributedZkTest_A0FFB43F75647302-001/control-001/cores/collection1
   [junit4]   2> 890570 INFO  (TEST-CollectionsAPIDistributedZkTest.test-seed#[A0FFB43F75647302]) [    ] o.a.s.c.CorePropertiesLocator Found 1 core definitions
   [junit4]   2> 890571 INFO  (TEST-CollectionsAPIDistributedZkTest.test-seed#[A0FFB43F75647302]) [    ] o.a.s.s.SolrDispatchFilter user.dir=/home/jenkins/workspace/Lucene-Solr-trunk-Linux/solr/build/solr-core/test/J2
   [junit4]   2> 890571 INFO  (TEST-CollectionsAPIDistributedZkTest.test-seed#[A0FFB43F75647302]) [    ] o.a.s.s.SolrDispatchFilter SolrDispatchFilter.init() done
   [junit4]   2> 890571 INFO  (coreLoadExecutor-3972-thread-1) [    ] o.a.s.c.ZkController publishing state=down
   [junit4]   2> 890571 INFO  (coreLoadExecutor-3972-thread-1) [    ] o.a.s.c.ZkController numShards not found on descriptor - reading it from system property
   [junit4]   2> 890572 INFO  (OverseerStateUpdate-95122892536414214-127.0.0.1:41814_p_y%2Fcv-n_0000000000) [    ] o.a.s.c.Overseer processMessage: queueSize: 1, message = {
   [junit4]   2>   "core":"collection1",
   [junit4]   2>   "roles":null,
   [junit4]   2>   "base_url":"http://127.0.0.1:41814/p_y/cv",
   [junit4]   2>   "node_name":"127.0.0.1:41814_p_y%2Fcv",
   [junit4]   2>   "numShards":"1",
   [junit4]   2>   "state":"down",
   [junit4]   2>   "shard":null,
   [junit4]   2>   "collection":"control_collection",
   [junit4]   2>   "operation":"state"} current state version: 0
   [junit4]   2> 890572 INFO  (coreLoadExecutor-3972-thread-1) [    ] o.a.s.c.ZkController look for our core node name
   [junit4]   2> 890572 INFO  (OverseerStateUpdate-95122892536414214-127.0.0.1:41814_p_y%2Fcv-n_0000000000) [    ] o.a.s.c.o.ReplicaMutator Update state numShards=1 message={
   [junit4]   2>   "core":"collection1",
   [junit4]   2>   "roles":null,
   [junit4]   2>   "base_url":"http://127.0.0.1:41814/p_y/cv",
   [junit4]   2>   "node_name":"127.0.0.1:41814_p_y%2Fcv",
   [junit4]   2>   "numShards":"1",
   [junit4]   2>   "state":"down",
   [junit4]   2>   "shard":null,
   [junit4]   2>   "collection":"control_collection",
   [junit4]   2>   "operation":"state"}
   [junit4]   2> 890572 INFO  (OverseerStateUpdate-95122892536414214-127.0.0.1:41814_p_y%2Fcv-n_0000000000) [    ] o.a.s.c.o.ClusterStateMutator building a new cName: control_collection
   [junit4]   2> 890573 INFO  (OverseerStateUpdate-95122892536414214-127.0.0.1:41814_p_y%2Fcv-n_0000000000) [    ] o.a.s.c.o.ReplicaMutator Assigning new node to shard shard=shard1
   [junit4]   2> 890573 INFO  (zkCallback-1740-thread-1) [    ] o.a.s.c.c.ZkStateReader A cluster state change: [WatchedEvent state:SyncConnected type:NodeDataChanged path:/clusterstate.json], has occurred - updating... (live nodes size: [1])
   [junit4]   2> 891572 INFO  (coreLoadExecutor-3972-thread-1) [    ] o.a.s.c.ZkController waiting to find shard id in clusterstate for collection1
   [junit4]   2> 891572 INFO  (coreLoadExecutor-3972-thread-1) [    ] o.a.s.c.ZkController Check for collection zkNode:control_collection
   [junit4]   2> 891573 INFO  (coreLoadExecutor-3972-thread-1) [    ] o.a.s.c.ZkController Collection zkNode exists
   [junit4]   2> 891573 INFO  (coreLoadExecutor-3972-thread-1) [    ] o.a.s.c.c.ZkStateReader Load collection config from: [/collections/control_collection]
   [junit4]   2> 891573 INFO  (coreLoadExecutor-3972-thread-1) [    ] o.a.s.c.c.ZkStateReader path=[/collections/control_collection] [configName]=[conf1] specified config exists in ZooKeeper
   [junit4]   2> 891573 INFO  (coreLoadExecutor-3972-thread-1) [    ] o.a.s.c.SolrResourceLoader new SolrResourceLoader for directory: '/home/jenkins/workspace/Lucene-Solr-trunk-Linux/solr/build/solr-core/test/J2/temp/solr.cloud.CollectionsAPIDistributedZkTest_A0FFB43F75647302-001/control-001/cores/collection1'
   [junit4]   2> 891573 INFO  (coreLoadExecutor-3972-thread-1) [    ] o.a.s.c.SolrResourceLoader JNDI not configured for solr (NoInitialContextEx)
   [junit4]   2> 891573 INFO  (coreLoadExecutor-3972-thread-1) [    ] o.a.s.c.SolrResourceLoader solr home defaulted to 'solr/' (could not find system property or JNDI)
   [junit4]   2> 891574 INFO  (coreLoadExecutor-3972-thread-1) [    ] o.a.s.c.Config loaded config solrconfig.xml with version 0 
   [junit4]   2> 891579 INFO  (coreLoadExecutor-3972-thread-1) [    ] o.a.s.c.SolrConfig current version of requestparams : -1
   [junit4]   2> 891583 INFO  (coreLoadExecutor-3972-thread-1) [    ] o.a.s.c.SolrConfig Using Lucene MatchVersion: 6.0.0
   [junit4]   2> 891598 INFO  (coreLoadExecutor-3972-thread-1) [    ] o.a.s.c.SolrConfig Loaded SolrConfig: solrconfig.xml
   [junit4]   2> 891605 INFO  (coreLoadExecutor-3972-thread-1) [    ] o.a.s.s.IndexSchema [collection1] Schema name=test
   [junit4]   2> 891698 INFO  (coreLoadExecutor-3972-thread-1) [    ] o.a.s.s.OpenExchangeRatesOrgProvider Initialized with rates=open-exchange-rates.json, refreshInterval=1440.
   [junit4]   2> 891704 INFO  (coreLoadExecutor-3972-thread-1) [    ] o.a.s.s.IndexSchema default search field in schema is text
   [junit4]   2> 891705 INFO  (coreLoadExecutor-3972-thread-1) [    ] o.a.s.s.IndexSchema unique key field: id
   [junit4]   2> 891709 INFO  (coreLoadExecutor-3972-thread-1) [    ] o.a.s.s.FileExchangeRateProvider Reloading exchange rates from file currency.xml
   [junit4]   2> 891711 INFO  (coreLoadExecutor-3972-thread-1) [    ] o.a.s.s.FileExchangeRateProvider Reloading exchange rates from file currency.xml
   [junit4]   2> 891712 INFO  (coreLoadExecutor-3972-thread-1) [    ] o.a.s.s.OpenExchangeRatesOrgProvider Reloading exchange rates from open-exchange-rates.json
   [junit4]   2> 891713 WARN  (coreLoadExecutor-3972-thread-1) [    ] o.a.s.s.OpenExchangeRatesOrgProvider Unknown key IMPORTANT NOTE
   [junit4]   2> 891713 WARN  (coreLoadExecutor-3972-thread-1) [    ] o.a.s.s.OpenExchangeRatesOrgProvider Expected key, got STRING
   [junit4]   2> 891713 INFO  (coreLoadExecutor-3972-thread-1) [    ] o.a.s.s.OpenExchangeRatesOrgProvider Reloading exchange rates from open-exchange-rates.json
   [junit4]   2> 891713 WARN  (coreLoadExecutor-3972-thread-1) [    ] o.a.s.s.OpenExchangeRatesOrgProvider Unknown key IMPORTANT NOTE
   [junit4]   2> 891713 WARN  (coreLoadExecutor-3972-thread-1) [    ] o.a.s.s.OpenExchangeRatesOrgProvider Expected key, got STRING
   [junit4]   2> 891714 INFO  (coreLoadExecutor-3972-thread-1) [    ] o.a.s.c.ConfigSetProperties Did not find ConfigSet properties, assuming default properties: Can't find resource 'configsetprops.json' in classpath or '/configs/conf1', cwd=/home/jenkins/workspace/Lucene-Solr-trunk-Linux/solr/build/solr-core/test/J2
   [junit4]   2> 891714 INFO  (coreLoadExecutor-3972-thread-1) [    ] o.a.s.c.CoreContainer Creating SolrCore 'collection1' using configuration from collection control_collection
   [junit4]   2> 891714 INFO  (coreLoadExecutor-3972-thread-1) [    ] o.a.s.c.SolrCore org.apache.solr.core.MockDirectoryFactory
   [junit4]   2> 891714 INFO  (coreLoadExecutor-3972-thread-1) [    ] o.a.s.c.SolrCore [[collection1] ] Opening new SolrCore at [/home/jenkins/workspace/Lucene-Solr-trunk-Linux/solr/build/solr-core/test/J2/temp/solr.cloud.CollectionsAPIDistributedZkTest_A0FFB43F75647302-001/control-001/cores/collection1], dataDir=[/home/jenkins/workspace/Lucene-Solr-trunk-Linux/solr/build/solr-core/test/J2/../../../../../../../../../home/jenkins/workspace/Lucene-Solr-trunk-Linux/solr/build/solr-core/test/J2/temp/solr.cloud.CollectionsAPIDistributedZkTest_A0FFB43F75647302-001/control-001/cores/collection1/data/]
   [junit4]   2> 891715 INFO  (coreLoadExecutor-3972-thread-1) [    ] o.a.s.c.JmxMonitoredMap JMX monitoring is enabled. Adding Solr mbeans to JMX Server: com.sun.jmx.mbeanserver.JmxMBeanServer@1f910424
   [junit4]   2> 891715 INFO  (coreLoadExecutor-3972-thread-1) [    ] o.a.s.c.CachingDirectoryFactory return new directory for /home/jenkins/workspace/Lucene-Solr-trunk-Linux/solr/build/solr-core/test/J2/../../../../../../../../../home/jenkins/workspace/Lucene-Solr-trunk-Linux/solr/build/solr-core/test/J2/temp/solr.cloud.CollectionsAPIDistributedZkTest_A0FFB43F75647302-001/control-001/cores/collection1/data
   [junit4]   2> 891715 INFO  (coreLoadExecutor-3972-thread-1) [    ] o.a.s.c.SolrCore New index directory detected: old=null new=/home/jenkins/workspace/Lucene-Solr-trunk-Linux/solr/build/solr-core/test/J2/../../../../../../../../../home/jenkins/workspace/Lucene-Solr-trunk-Linux/solr/build/solr-core/test/J2/temp/solr.cloud.CollectionsAPIDistributedZkTest_A0FFB43F75647302-001/control-001/cores/collection1/data/index/
   [junit4]   2> 891715 WARN  (coreLoadExecutor-3972-thread-1) [    ] o.a.s.c.SolrCore [collection1] Solr index directory '/home/jenkins/workspace/Lucene-Solr-trunk-Linux/solr/build/solr-core/test/J2/../../../../../../../../../home/jenkins/workspace/Lucene-Solr-trunk-Linux/solr/build/solr-core/test/J2/temp/solr.cloud.CollectionsAPIDistributedZkTest_A0FFB43F75647302-001/control-001/cores/collection1/data/index' doesn't exist. Creating new index...
   [junit4]   2> 891715 INFO  (coreLoadExecutor-3972-thread-1) [    ] o.a.s.c.CachingDirectoryFactory return new directory for /home/jenkins/workspace/Lucene-Solr-trunk-Linux/solr/build/solr-core/test/J2/../../../../../../../../../home/jenkins/workspace/Lucene-Solr-trunk-Linux/solr/build/solr-core/test/J2/temp/solr.cloud.CollectionsAPIDistributedZkTest_A0FFB43F75647302-001/control-001/cores/collection1/data/index
   [junit4]   2> 891715 INFO  (coreLoadExecutor-3972-thread-1) [    ] o.a.s.u.RandomMergePolicy RandomMergePolicy wrapping class org.apache.lucene.index.TieredMergePolicy: [TieredMergePolicy: maxMergeAtOnce=6, maxMergeAtOnceExplicit=2, maxMergedSegmentMB=45.7763671875, floorSegmentMB=1.201171875, forceMergeDeletesPctAllowed=1.5810918677270946, segmentsPerTier=41.0, maxCFSSegmentSizeMB=8.796093022207999E12, noCFSRatio=1.0
   [junit4]   2> 891716 INFO  (coreLoadExecutor-3972-thread-1) [    ] o.a.s.c.SolrDeletionPolicy SolrDeletionPolicy.onCommit: commits: num=1
   [junit4]   2> 	commit{dir=MockDirectoryWrapper(RAMDirectory@3b62eed4 lockFactory=org.apache.lucene.store.SingleInstanceLockFactory@1ef41570),segFN=segments_1,generation=1}
   [junit4]   2> 891716 INFO  (coreLoadExecutor-3972-thread-1) [    ] o.a.s.c.SolrDeletionPolicy newest commit generation = 1
   [junit4]   2> 891716 INFO  (OldIndexDirectoryCleanupThreadForCore-collection1) [    ] o.a.s.c.SolrCore Looking for old index directories to cleanup for core collection1 in /home/jenkins/workspace/Lucene-Solr-trunk-Linux/solr/build/solr-core/test/J2/../../../../../../../../../home/jenkins/workspace/Lucene-Solr-trunk-Linux/solr/build/solr-core/test/J2/temp/solr.cloud.CollectionsAPIDistributedZkTest_A0FFB43F75647302-001/control-001/cores/collection1/data/
   [junit4]   2> 891716 WARN  (OldIndexDirectoryCleanupThreadForCore-collection1) [    ] o.a.s.c.DirectoryFactory /home/jenkins/workspace/Lucene-Solr-trunk-Linux/solr/build/solr-core/test/J2/../../../../../../../../../home/jenkins/workspace/Lucene-Solr-trunk-Linux/solr/build/solr-core/test/J2/temp/solr.cloud.CollectionsAPIDistributedZkTest_A0FFB43F75647302-001/control-001/cores/collection1/data/ does not point to a valid data directory; skipping clean-up of old index directories.
   [junit4]   2> 891718 INFO  (coreLoadExecutor-3972-thread-1) [    ] o.a.s.u.p.UpdateRequestProcessorChain creating updateRequestProcessorChain "nodistrib"
   [junit4]   2> 891718 INFO  (coreLoadExecutor-3972-thread-1) [    ] o.a.s.u.p.UpdateRequestProcessorChain creating updateRequestProcessorChain "dedupe"
   [junit4]   2> 891719 INFO  (coreLoadExecutor-3972-thread-1) [    ] o.a.s.u.p.UpdateRequestProcessorChain inserting DistributedUpdateProcessorFactory into updateRequestProcessorChain "dedupe"
   [junit4]   2> 891719 INFO  (coreLoadExecutor-3972-thread-1) [    ] o.a.s.u.p.UpdateRequestProcessorChain creating updateRequestProcessorChain "stored_sig"
   [junit4]   2> 891719 INFO  (coreLoadExecutor-3972-thread-1) [    ] o.a.s.u.p.UpdateRequestProcessorChain inserting DistributedUpdateProcessorFactory into updateRequestProcessorChain "stored_sig"
   [junit4]   2> 891719 INFO  (coreLoadExecutor-3972-thread-1) [    ] o.a.s.u.p.UpdateRequestProcessorChain creating updateRequestProcessorChain "distrib-dup-test-chain-explicit"
   [junit4]   2> 891719 INFO  (coreLoadExecutor-3972-thread-1) [    ] o.a.s.u.p.UpdateRequestProcessorChain creating updateRequestProcessorChain "distrib-dup-test-chain-implicit"
   [junit4]   2> 891719 INFO  (coreLoadExecutor-3972-thread-1) [    ] o.a.s.u.p.UpdateRequestProcessorChain inserting DistributedUpdateProcessorFactory into updateRequestProcessorChain "distrib-dup-test-chain-implicit"
   [junit4]   2> 891719 INFO  (coreLoadExecutor-3972-thread-1) [    ] o.a.s.c.SolrCore no updateRequestProcessorChain defined as default, creating implicit default
   [junit4]   2> 891719 WARN  (coreLoadExecutor-3972-thread-1) [    ] o.a.s.c.RequestHandlers INVALID paramSet a in requestHandler {type = requestHandler,name = /dump,class = DumpRequestHandler,args = {defaults={a=A,b=B}}}
   [junit4]   2> 891721 INFO  (coreLoadExecutor-3972-thread-1) [    ] o.a.s.h.l.XMLLoader xsltCacheLifetimeSeconds=60
   [junit4]   2> 891722 INFO  (coreLoadExecutor-3972-thread-1) [    ] o.a.s.h.l.XMLLoader xsltCacheLifetimeSeconds=60
   [junit4]   2> 891722 INFO  (coreLoadExecutor-3972-thread-1) [    ] o.a.s.h.l.XMLLoader xsltCacheLifetimeSeconds=60
   [junit4]   2> 891723 INFO  (coreLoadExecutor-3972-thread-1) [    ] o.a.s.h.l.XMLLoader xsltCacheLifetimeSeconds=60
   [junit4]   2> 891725 INFO  (coreLoadExecutor-3972-thread-1) [    ] o.a.s.c.RequestHandlers Registered paths: /admin/mbeans,standard,/dump,/update/csv,/sql,/update/json/docs,/admin/luke,/export,/admin/segments,/get,/admin/system,/replication,/admin/properties,/config,/stream,/schema,/admin/plugins,/admin/logging,/update/json,/admin/threads,/admin/ping,/update,/admin/file
   [junit4]   2> 891726 INFO  (coreLoadExecutor-3972-thread-1) [    ] o.a.s.c.SolrCore Using default statsCache cache: org.apache.solr.search.stats.LocalStatsCache
   [junit4]   2> 891726 INFO  (coreLoadExecutor-3972-thread-1) [    ] o.a.s.u.UpdateHandler Using UpdateLog implementation: org.apache.solr.update.UpdateLog
   [junit4]   2> 891726 INFO  (coreLoadExecutor-3972-thread-1) [    ] o.a.s.u.UpdateLog Initializing UpdateLog: dataDir= defaultSyncLevel=FLUSH numRecordsToKeep=100 maxNumLogsToKeep=10 numVersionBuckets=65536
   [junit4]   2> 891727 INFO  (coreLoadExecutor-3972-thread-1) [    ] o.a.s.u.CommitTracker Hard AutoCommit: disabled
   [junit4]   2> 891727 INFO  (coreLoadExecutor-3972-thread-1) [    ] o.a.s.u.CommitTracker Soft AutoCommit: disabled
   [junit4]   2> 891728 INFO  (coreLoadExecutor-3972-thread-1) [    ] o.a.s.u.RandomMergePolicy RandomMergePolicy wrapping class org.apache.lucene.index.TieredMergePolicy: [TieredMergePolicy: maxMergeAtOnce=33, maxMergeAtOnceExplicit=25, maxMergedSegmentMB=69.6484375, floorSegmentMB=1.326171875, forceMergeDeletesPctAllowed=22.82121966044305, segmentsPerTier=17.0, maxCFSSegmentSizeMB=8.796093022207999E12, noCFSRatio=0.774018077415385
   [junit4]   2> 891728 INFO  (coreLoadExecutor-3972-thread-1) [    ] o.a.s.c.SolrDeletionPolicy SolrDeletionPolicy.onInit: commits: num=1
   [junit4]   2> 	commit{dir=MockDirectoryWrapper(RAMDirectory@3b62eed4 lockFactory=org.apache.lucene.store.SingleInstanceLockFactory@1ef41570),segFN=segments_1,generation=1}
   [junit4]   2> 891728 INFO  (coreLoadExecutor-3972-thread-1) [    ] o.a.s.c.SolrDeletionPolicy newest commit generation = 1
   [junit4]   2> 891728 INFO  (coreLoadExecutor-3972-thread-1) [    ] o.a.s.s.SolrIndexSearcher Opening Searcher@34db16e1[collection1] main
   [junit4]   2> 891728 INFO  (coreLoadExecutor-3972-thread-1) [    ] o.a.s.c.c.ZkStateReader Load collection config from: [/collections/control_collection]
   [junit4]   2> 891729 INFO  (coreLoadExecutor-3972-thread-1) [    ] o.a.s.c.c.ZkStateReader path=[/collections/control_collection] [configName]=[conf1] specified config exists in ZooKeeper
   [junit4]   2> 891729 INFO  (coreLoadExecutor-3972-thread-1) [    ] o.a.s.r.ManagedResourceStorage Setting up ZooKeeper-based storage for the RestManager with znodeBase: /configs/conf1
   [junit4]   2> 891729 INFO  (coreLoadExecutor-3972-thread-1) [    ] o.a.s.r.ManagedResourceStorage Configured ZooKeeperStorageIO with znodeBase: /configs/conf1
   [junit4]   2> 891729 INFO  (coreLoadExecutor-3972-thread-1) [    ] o.a.s.r.RestManager Initializing RestManager with initArgs: {}
   [junit4]   2> 891729 INFO  (coreLoadExecutor-3972-thread-1) [    ] o.a.s.r.ManagedResourceStorage Reading _rest_managed.json using ZooKeeperStorageIO:path=/configs/conf1
   [junit4]   2> 891729 INFO  (coreLoadExecutor-3972-thread-1) [    ] o.a.s.r.ManagedResourceStorage No data found for znode /configs/conf1/_rest_managed.json
   [junit4]   2> 891729 INFO  (coreLoadExecutor-3972-thread-1) [    ] o.a.s.r.ManagedResourceStorage Loaded null at path _rest_managed.json using ZooKeeperStorageIO:path=/configs/conf1
   [junit4]   2> 891729 INFO  (coreLoadExecutor-3972-thread-1) [    ] o.a.s.r.RestManager Initializing 0 registered ManagedResources
   [junit4]   2> 891729 INFO  (coreLoadExecutor-3972-thread-1) [    ] o.a.s.h.ReplicationHandler Commits will be reserved for  10000
   [junit4]   2> 891730 INFO  (searcherExecutor-3973-thread-1) [    ] o.a.s.c.SolrCore [collection1] Registered new searcher Searcher@34db16e1[collection1] main{ExitableDirectoryReader(UninvertingDirectoryReader())}
   [junit4]   2> 891730 INFO  (coreLoadExecutor-3972-thread-1) [    ] o.a.s.u.UpdateLog Looking up max value of version field to seed version buckets
   [junit4]   2> 891730 INFO  (coreLoadExecutor-3972-thread-1) [    ] o.a.s.u.VersionInfo Refreshing highest value of _version_ for 65536 version buckets from index
   [junit4]   2> 891730 INFO  (coreLoadExecutor-3972-thread-1) [    ] o.a.s.u.VersionInfo No terms found for _version_, cannot seed version bucket highest value from index
   [junit4]   2> 891730 INFO  (coreLoadExecutor-3972-thread-1) [    ] o.a.s.u.UpdateLog Could not find max version in index or recent updates, using new clock 1521966282077896704
   [junit4]   2> 891732 INFO  (coreLoadExecutor-3972-thread-1) [    ] o.a.s.u.UpdateLog Took 2.0ms to seed version buckets with highest version 1521966282077896704
   [junit4]   2> 891732 INFO  (coreLoadExecutor-3972-thread-1) [    ] o.a.s.c.ZkController watch zkdir /configs/conf1
   [junit4]   2> 891732 INFO  (coreLoadExecutor-3972-thread-1) [    ] o.a.s.c.CoreContainer registering core: collection1
   [junit4]   2> 891732 INFO  (coreZkRegister-3966-thread-1) [    ] o.a.s.c.ZkController Register replica - core:collection1 address:http://127.0.0.1:41814/p_y/cv collection:control_collection shard:shard1
   [junit4]   2> 891733 INFO  (coreZkRegister-3966-thread-1) [    ] o.a.s.c.c.SolrZkClient makePath: /collections/control_collection/leader_elect/shard1/election
   [junit4]   2> 891734 INFO  (coreZkRegister-3966-thread-1) [    ] o.a.s.c.LeaderElector Joined leadership election with path: /collections/control_collection/leader_elect/shard1/election/95122892536414214-core_node1-n_0000000000
   [junit4]   2> 891734 INFO  (coreZkRegister-3966-thread-1) [    ] o.a.s.c.ShardLeaderElectionContext Running the leader process for shard=shard1 and weAreReplacement=false and leaderVoteWait=180000
   [junit4]   2> 891736 INFO  (coreZkRegister-3966-thread-1) [    ] o.a.s.c.ShardLeaderElectionContext Enough replicas found to continue.
   [junit4]   2> 891736 INFO  (coreZkRegister-3966-thread-1) [    ] o.a.s.c.ShardLeaderElectionContext I may be the new leader - try and sync
   [junit4]   2> 891736 INFO  (coreZkRegister-3966-thread-1) [    ] o.a.s.c.SyncStrategy Sync replicas to http://127.0.0.1:41814/p_y/cv/collection1/
   [junit4]   2> 891736 INFO  (coreZkRegister-3966-thread-1) [    ] o.a.s.c.SyncStrategy Sync Success - now sync replicas to me
   [junit4]   2> 891736 INFO  (OverseerStateUpdate-95122892536414214-127.0.0.1:41814_p_y%2Fcv-n_0000000000) [    ] o.a.s.c.Overseer processMessage: queueSize: 1, message = {
   [junit4]   2>   "operation":"leader",
   [junit4]   2>   "shard":"shard1",
   [junit4]   2>   "collection":"control_collection"} current state version: 1
   [junit4]   2> 891736 INFO  (coreZkRegister-3966-thread-1) [    ] o.a.s.c.SyncStrategy http://127.0.0.1:41814/p_y/cv/collection1/ has no replicas
   [junit4]   2> 891737 INFO  (coreZkRegister-3966-thread-1) [    ] o.a.s.c.c.SolrZkClient makePath: /collections/control_collection/leaders/shard1
   [junit4]   2> 891737 INFO  (coreZkRegister-3966-thread-1) [    ] o.a.s.c.ShardLeaderElectionContextBase Creating leader registration node
   [junit4]   2> 891738 INFO  (coreZkRegister-3966-thread-1) [    ] o.a.s.c.ShardLeaderElectionContext I am the new leader: http://127.0.0.1:41814/p_y/cv/collection1/ shard1
   [junit4]   2> 891739 INFO  (OverseerStateUpdate-95122892536414214-127.0.0.1:41814_p_y%2Fcv-n_0000000000) [    ] o.a.s.c.Overseer processMessage: queueSize: 1, message = {
   [junit4]   2>   "operation":"leader",
   [junit4]   2>   "shard":"shard1",
   [junit4]   2>   "collection":"control_collection",
   [junit4]   2>   "base_url":"http://127.0.0.1:41814/p_y/cv",
   [junit4]   2>   "core":"collection1",
   [junit4]   2>   "state":"active"} current state version: 1
   [junit4]   2> 891840 INFO  (zkCallback-1740-thread-1) [    ] o.a.s.c.c.ZkStateReader A cluster state change: [WatchedEvent state:SyncConnected type:NodeDataChanged path:/clusterstate.json], has occurred - updating... (live nodes size: [1])
   [junit4]   2> 891889 INFO  (coreZkRegister-3966-thread-1) [    ] o.a.s.c.ZkController We are http://127.0.0.1:41814/p_y/cv/collection1/ and leader is http://127.0.0.1:41814/p_y/cv/collection1/
   [junit4]   2> 891890 INFO  (coreZkRegister-3966-thread-1) [    ] o.a.s.c.ZkController No LogReplay needed for core=collection1 baseURL=http://127.0.0.1:41814/p_y/cv
   [junit4]   2> 891890 INFO  (coreZkRegister-3966-thread-1) [    ] o.a.s.c.ZkController I am the leader, no recovery necessary
   [junit4]   2> 891890 INFO  (coreZkRegister-3966-thread-1) [    ] o.a.s.c.ZkController publishing state=active
   [junit4]   2> 891890 INFO  (coreZkRegister-3966-thread-1) [    ] o.a.s.c.ZkController numShards not found on descriptor - reading it from system property
   [junit4]   2> 891890 INFO  (OverseerStateUpdate-95122892536414214-127.0.0.1:41814_p_y%2Fcv-n_0000000000) [    ] o.a.s.c.Overseer processMessage: queueSize: 1, message = {
   [junit4]   2>   "core":"collection1",
   [junit4]   2>   "core_node_name":"core_node1",
   [junit4]   2>   "roles":null,
   [junit4]   2>   "base_url":"http://127.0.0.1:41814/p_y/cv",
   [junit4]   2>   "node_name":"127.0.0.1:41814_p_y%2Fcv",
   [junit4]   2>   "numShards":"1",
   [junit4]   2>   "state":"active",
   [junit4]   2>   "shard":"shard1",
   [junit4]   2>   "collection":"control_collection",
   [junit4]   2>   "operation":"state"} current state version: 2
   [junit4]   2> 891891 INFO  (OverseerStateUpdate-95122892536414214-127.0.0.1:41814_p_y%2Fcv-n_0000000000) [    ] o.a.s.c.o.ReplicaMutator Update state numShards=1 message={
   [junit4]   2>   "core":"collection1",
   [junit4]   2>   "core_node_name":"core_node1",
   [junit4]   2>   "roles":null,
   [junit4]   2>   "base_url":"http://127.0.0.1:41814/p_y/cv",
   [junit4]   2>   "node_name":"127.0.0.1:41814_p_y%2Fcv",
   [junit4]   2>   "numShards":"1",
   [junit4]   2>   "state":"active",
   [junit4]   2>   "shard":"shard1",
   [junit4]   2>   "collection":"control_collection",
   [junit4]   2>   "operation":"state"}
   [junit4]   2> 891992 INFO  (zkCallback-1740-thread-2) [    ] o.a.s.c.c.ZkStateReader A cluster state change: [WatchedEvent state:SyncConnected type:NodeDataChanged path:/clusterstate.json], has occurred - updating... (live nodes size: [1])
   [junit4]   2> 892072 INFO  (TEST-CollectionsAPIDistributedZkTest.test-seed#[A0FFB43F75647302]) [    ] o.a.s.c.c.SolrZkClient Using default ZkCredentialsProvider
   [junit4]   2> 892073 INFO  (TEST-CollectionsAPIDistributedZkTest.test-seed#[A0FFB43F75647302]) [    ] o.a.s.c.c.ConnectionManager Waiting for client to connect to ZooKeeper
   [junit4]   2> 892073 INFO  (zkCallback-1742-thread-1) [    ] o.a.s.c.c.ConnectionManager Watcher org.apache.solr.common.cloud.ConnectionManager@55300be8 name:ZooKeeperConnection Watcher:127.0.0.1:39012/solr got event WatchedEvent state:SyncConnected type:None path:null path:null type:None
   [junit4]   2> 892073 INFO  (TEST-CollectionsAPIDistributedZkTest.test-seed#[A0FFB43F75647302]) [    ] o.a.s.c.c.ConnectionManager Client is connected to ZooKeeper
   [junit4]   2> 892074 INFO  (TEST-CollectionsAPIDistributedZkTest.test-seed#[A0FFB43F75647302]) [    ] o.a.s.c.c.SolrZkClient Using default ZkACLProvider
   [junit4]   2> 892074 INFO  (TEST-CollectionsAPIDistributedZkTest.test-seed#[A0FFB43F75647302]) [    ] o.a.s.c.c.ZkStateReader Updating cluster state from ZooKeeper... 
   [junit4]   2> 892074 INFO  (TEST-CollectionsAPIDistributedZkTest.test-seed#[A0FFB43F75647302]) [    ] o.a.s.c.ChaosMonkey monkey: init - expire sessions:false cause connection loss:false
   [junit4]   2> 892159 INFO  (TEST-CollectionsAPIDistributedZkTest.test-seed#[A0FFB43F75647302]) [    ] o.a.s.SolrTestCaseJ4 Writing core.properties file to /home/jenkins/workspace/Lucene-Solr-trunk-Linux/solr/build/solr-core/test/J2/temp/solr.cloud.CollectionsAPIDistributedZkTest_A0FFB43F75647302-001/shard-1-001/cores/collection1
   [junit4]   2> 892160 INFO  (TEST-CollectionsAPIDistributedZkTest.test-seed#[A0FFB43F75647302]) [    ] o.a.s.c.AbstractFullDistribZkTestBase create jetty 1 in directory /home/jenkins/workspace/Lucene-Solr-trunk-Linux/solr/build/solr-core/test/J2/temp/solr.cloud.CollectionsAPIDistributedZkTest_A0FFB43F75647302-001/shard-1-001
   [junit4]   2> 892161 INFO  (TEST-CollectionsAPIDistributedZkTest.test-seed#[A0FFB43F75647302]) [    ] o.e.j.s.Server jetty-9.3.6.v20151106
   [junit4]   2> 892162 INFO  (TEST-CollectionsAPIDistributedZkTest.test-seed#[A0FFB43F75647302]) [    ] o.e.j.s.h.ContextHandler Started o.e.j.s.ServletContextHandler@6f9892c1{/p_y/cv,null,AVAILABLE}
   [junit4]   2> 892162 INFO  (TEST-CollectionsAPIDistributedZkTest.test-seed#[A0FFB43F75647302]) [    ] o.e.j.s.ServerConnector Started ServerConnector@3a8fa156{HTTP/1.1,[http/1.1]}{127.0.0.1:35656}
   [junit4]   2> 892163 INFO  (TEST-CollectionsAPIDistributedZkTest.test-seed#[A0FFB43F75647302]) [    ] o.e.j.s.Server Started @893856ms
   [junit4]   2> 892163 INFO  (TEST-CollectionsAPIDistributedZkTest.test-seed#[A0FFB43F75647302]) [    ] o.a.s.c.s.e.JettySolrRunner Jetty properties: {solr.data.dir=/home/jenkins/workspace/Lucene-Solr-trunk-Linux/solr/build/solr-core/test/J2/temp/solr.cloud.CollectionsAPIDistributedZkTest_A0FFB43F75647302-001/tempDir-001/jetty1, solrconfig=solrconfig.xml, hostContext=/p_y/cv, hostPort=35656, coreRootDirectory=/home/jenkins/workspace/Lucene-Solr-trunk-Linux/solr/build/solr-core/test/J2/../../../../../../../../../home/jenkins/workspace/Lucene-Solr-trunk-Linux/solr/build/solr-core/test/J2/temp/solr.cloud.CollectionsAPIDistributedZkTest_A0FFB43F75647302-001/shard-1-001/cores}
   [junit4]   2> 892163 INFO  (TEST-CollectionsAPIDistributedZkTest.test-seed#[A0FFB43F75647302]) [    ] o.a.s.s.SolrDispatchFilter SolrDispatchFilter.init(): sun.misc.Launcher$AppClassLoader@deb6432
   [junit4]   2> 892163 INFO  (TEST-CollectionsAPIDistributedZkTest.test-seed#[A0FFB43F75647302]) [    ] o.a.s.c.SolrResourceLoader new SolrResourceLoader for directory: '/home/jenkins/workspace/Lucene-Solr-trunk-Linux/solr/build/solr-core/test/J2/temp/solr.cloud.CollectionsAPIDistributedZkTest_A0FFB43F75647302-001/shard-1-001'
   [junit4]   2> 892164 INFO  (TEST-CollectionsAPIDistributedZkTest.test-seed#[A0FFB43F75647302]) [    ] o.a.s.c.SolrResourceLoader JNDI not configured for solr (NoInitialContextEx)
   [junit4]   2> 892164 INFO  (TEST-CollectionsAPIDistributedZkTest.test-seed#[A0FFB43F75647302]) [    ] o.a.s.c.SolrResourceLoader solr home defaulted to 'solr/' (could not find system property or JNDI)
   [junit4]   2> 892164 INFO  (TEST-CollectionsAPIDistributedZkTest.test-seed#[A0FFB43F75647302]) [    ] o.a.s.c.c.SolrZkClient Using default ZkCredentialsProvider
   [junit4]   2> 892164 INFO  (TEST-CollectionsAPIDistributedZkTest.test-seed#[A0FFB43F75647302]) [    ] o.a.s.c.c.ConnectionManager Waiting for client to connect to ZooKeeper
   [junit4]   2> 892165 INFO  (zkCallback-1743-thread-1) [    ] o.a.s.c.c.ConnectionManager Watcher org.apache.solr.common.cloud.ConnectionManager@80da937 name:ZooKeeperConnection Watcher:127.0.0.1:39012/solr got event WatchedEvent state:SyncConnected type:None path:null path:null type:None
   [junit4]   2> 892165 INFO  (TEST-CollectionsAPIDistributedZkTest.test-seed#[A0FFB43F75647302]) [    ] o.a.s.c.c.ConnectionManager Client is connected to ZooKeeper
   [junit4]   2> 892166 INFO  (TEST-CollectionsAPIDistributedZkTest.test-seed#[A0FFB43F75647302]) [    ] o.a.s.c.c.SolrZkClient Using default ZkACLProvider
   [junit4]   2> 892166 INFO  (TEST-CollectionsAPIDistributedZkTest.test-seed#[A0FFB43F75647302]) [    ] o.a.s.s.SolrDispatchFilter Loading solr.xml from SolrHome (not found in ZooKeeper)
   [junit4]   2> 892166 INFO  (TEST-CollectionsAPIDistributedZkTest.test-seed#[A0FFB43F75647302]) [    ] o.a.s.c.SolrXmlConfig Loading container configuration from /home/jenkins/workspace/Lucene-Solr-trunk-Linux/solr/build/solr-core/test/J2/temp/solr.cloud.CollectionsAPIDistributedZkTest_A0FFB43F75647302-001/shard-1-001/solr.xml
   [junit4]   2> 892170 INFO  (TEST-CollectionsAPIDistributedZkTest.test-seed#[A0FFB43F75647302]) [    ] o.a.s.c.CorePropertiesLocator Config-defined core root directory: /home/jenkins/workspace/Lucene-Solr-trunk-Linux/solr/build/solr-core/test/J2/../../../../../../../../../home/jenkins/workspace/Lucene-Solr-trunk-Linux/solr/build/solr-core/test/J2/temp/solr.cloud.CollectionsAPIDistributedZkTest_A0FFB43F75647302-001/shard-1-001/cores
   [junit4]   2> 892171 INFO  (TEST-CollectionsAPIDistributedZkTest.test-seed#[A0FFB43F75647302]) [    ] o.a.s.c.CoreContainer New CoreContainer 248076000
   [junit4]   2> 892171 INFO  (TEST-CollectionsAPIDistributedZkTest.test-seed#[A0FFB43F75647302]) [    ] o.a.s.c.CoreContainer Loading cores into CoreContainer [instanceDir=/home/jenkins/workspace/Lucene-Solr-trunk-Linux/solr/build/solr-core/test/J2/temp/solr.cloud.CollectionsAPIDistributedZkTest_A0FFB43F75647302-001/shard-1-001]
   [junit4]   2> 892171 WARN  (TEST-CollectionsAPIDistributedZkTest.test-seed#[A0FFB43F75647302]) [    ] o.a.s.c.CoreContainer Couldn't add files from /home/jenkins/workspace/Lucene-Solr-trunk-Linux/solr/build/solr-core/test/J2/temp/solr.cloud.CollectionsAPIDistributedZkTest_A0FFB43F75647302-001/shard-1-001/lib to classpath: /home/jenkins/workspace/Lucene-Solr-trunk-Linux/solr/build/solr-core/test/J2/temp/solr.cloud.CollectionsAPIDistributedZkTest_A0FFB43F75647302-001/shard-1-001/lib
   [junit4]   2> 892171 INFO  (TEST-CollectionsAPIDistributedZkTest.test-seed#[A0FFB43F75647302]) [    ] o.a.s.h.c.HttpShardHandlerFactory created with socketTimeout : 90000,urlScheme : ,connTimeout : 15000,maxConnectionsPerHost : 20,maxConnections : 10000,corePoolSize : 0,maximumPoolSize : 2147483647,maxThreadIdleTime : 5,sizeOfQueue : -1,fairnessPolicy : false,useRetries : false,
   [junit4]   2> 892172 INFO  (TEST-CollectionsAPIDistributedZkTest.test-seed#[A0FFB43F75647302]) [    ] o.a.s.u.UpdateShardHandler Creating UpdateShardHandler HTTP client with params: socketTimeout=340000&connTimeout=45000&retry=true
   [junit4]   2> 892172 INFO  (TEST-CollectionsAPIDistributedZkTest.test-seed#[A0FFB43F75647302]) [    ] o.a.s.l.LogWatcher SLF4J impl is org.slf4j.impl.Log4jLoggerFactory
   [junit4]   2> 892172 INFO  (TEST-CollectionsAPIDistributedZkTest.test-seed#[A0FFB43F75647302]) [    ] o.a.s.l.LogWatcher Registering Log Listener [Log4j (org.slf4j.impl.Log4jLoggerFactory)]
   [junit4]   2> 892172 INFO  (TEST-CollectionsAPIDistributedZkTest.test-seed#[A0FFB43F75647302]) [    ] o.a.s.c.ZkContainer Zookeeper client=127.0.0.1:39012/solr
   [junit4]   2> 892173 INFO  (TEST-CollectionsAPIDistributedZkTest.test-seed#[A0FFB43F75647302]) [    ] o.a.s.c.ZkController zkHost includes chroot
   [junit4]   2> 892173 INFO  (TEST-CollectionsAPIDistributedZkTest.test-seed#[A0FFB43F75647302]) [    ] o.a.s.c.c.SolrZkClient Using default ZkCredentialsProvider
   [junit4]   2> 892173 INFO  (TEST-CollectionsAPIDistributedZkTest.test-seed#[A0FFB43F75647302]) [    ] o.a.s.c.c.ConnectionManager Waiting for client to connect to ZooKeeper
   [junit4]   2> 892174 INFO  (zkCallback-1746-thread-1) [    ] o.a.s.c.c.ConnectionManager Watcher org.apache.solr.common.cloud.ConnectionManager@c50f49c name:ZooKeeperConnection Watcher:127.0.0.1:39012 got event WatchedEvent state:SyncConnected type:None path:null path:null type:None
   [junit4]   2> 892174 INFO  (TEST-CollectionsAPIDistributedZkTest.test-seed#[A0FFB43F75647302]) [    ] o.a.s.c.c.ConnectionManager Client is connected to ZooKeeper
   [junit4]   2> 892174 INFO  (TEST-CollectionsAPIDistributedZkTest.test-seed#[A0FFB43F75647302]) [    ] o.a.s.c.c.SolrZkClient Using default ZkACLProvider
   [junit4]   2> 892174 INFO  (TEST-CollectionsAPIDistributedZkTest.test-seed#[A0FFB43F75647302]) [    ] o.a.s.c.c.ConnectionManager Waiting for client to connect to ZooKeeper
   [junit4]   2> 892179 INFO  (zkCallback-1747-thread-1) [    ] o.a.s.c.c.ConnectionManager Watcher org.apache.solr.common.cloud.ConnectionManager@4d8a1a04 name:ZooKeeperConnection Watcher:127.0.0.1:39012/solr got event WatchedEvent state:SyncConnected type:None path:null path:null type:None
   [junit4]   2> 892179 INFO  (TEST-CollectionsAPIDistributedZkTest.test-seed#[A0FFB43F75647302]) [    ] o.a.s.c.c.ConnectionManager Client is connected to ZooKeeper
   [junit4]   2> 892181 INFO  (TEST-CollectionsAPIDistributedZkTest.test-seed#[A0FFB43F75647302]) [    ] o.a.s.c.c.ZkStateReader Updating cluster state from ZooKeeper... 
   [junit4]   2> 893184 INFO  (TEST-CollectionsAPIDistributedZkTest.test-seed#[A0FFB43F75647302]) [    ] o.a.s.c.ZkController Register node as live in ZooKeeper:/live_nodes/127.0.0.1:35656_p_y%2Fcv
   [junit4]   2> 893184 INFO  (TEST-CollectionsAPIDistributedZkTest.test-seed#[A0FFB43F75647302]) [    ] o.a.s.c.c.SolrZkClient makePath: /live_nodes/127.0.0.1:35656_p_y%2Fcv
   [junit4]   2> 893185 INFO  (zkCallback-1742-thread-1) [    ] o.a.s.c.c.ZkStateReader A live node change: [WatchedEvent state:SyncConnected type:NodeChildrenChanged path:/live_nodes], has occurred - updating... (live nodes size: [1])
   [junit4]   2> 893185 INFO  (zkCallback-1740-thread-2) [    ] o.a.s.c.c.ZkStateReader A live node change: [WatchedEvent state:SyncConnected type:NodeChildrenChanged path:/live_nodes], has occurred - updating... (live nodes size: [1])
   [junit4]   2> 893185 INFO  (zkCallback-1747-thread-1) [    ] o.a.s.c.c.ZkStateReader A live node change: [WatchedEvent state:SyncConnected type:NodeChildrenChanged path:/live_nodes], has occurred - updating... (live nodes size: [1])
   [junit4]   2> 893185 INFO  (TEST-CollectionsAPIDistributedZkTest.test-seed#[A0FFB43F75647302]) [    ] o.a.s.c.Overseer Overseer (id=null) closing
   [junit4]   2> 893185 INFO  (TEST-CollectionsAPIDistributedZkTest.test-seed#[A0FFB43F75647302]) [    ] o.a.s.c.LeaderElector Joined leadership election with path: /overseer_elect/election/95122892536414218-127.0.0.1:35656_p_y%2Fcv-n_0000000001
   [junit4]   2> 893186 INFO  (TEST-CollectionsAPIDistributedZkTest.test-seed#[A0FFB43F75647302]) [    ] o.a.s.c.LeaderElector Watching path /overseer_elect/election/95122892536414214-127.0.0.1:41814_p_y%2Fcv-n_0000000000 to know if I could be the leader
   [junit4]   2> 893194 INFO  (TEST-CollectionsAPIDistributedZkTest.test-seed#[A0FFB43F75647302]) [    ] o.a.s.c.CoreContainer Security conf doesn't exist. Skipping setup for authorization module.
   [junit4]   2> 893194 INFO  (TEST-CollectionsAPIDistributedZkTest.test-seed#[A0FFB43F75647302]) [    ] o.a.s.c.CoreContainer No authentication plugin used.
   [junit4]   2> 893195 INFO  (TEST-CollectionsAPIDistributedZkTest.test-seed#[A0F

[...truncated too long message...]

it4]    >    3) Thread[id=9662, name=zkCallback-1770-thread-4, state=TIMED_WAITING, group=TGRP-CollectionsAPIDistributedZkTest]
   [junit4]    >         at jdk.internal.misc.Unsafe.park(Native Method)
   [junit4]    >         at java.util.concurrent.locks.LockSupport.parkNanos(LockSupport.java:218)
   [junit4]    >         at java.util.concurrent.SynchronousQueue$TransferStack.awaitFulfill(SynchronousQueue.java:461)
   [junit4]    >         at java.util.concurrent.SynchronousQueue$TransferStack.transfer(SynchronousQueue.java:362)
   [junit4]    >         at java.util.concurrent.SynchronousQueue.poll(SynchronousQueue.java:937)
   [junit4]    >         at java.util.concurrent.ThreadPoolExecutor.getTask(ThreadPoolExecutor.java:1082)
   [junit4]    >         at java.util.concurrent.ThreadPoolExecutor.runWorker(ThreadPoolExecutor.java:1143)
   [junit4]    >         at java.util.concurrent.ThreadPoolExecutor$Worker.run(ThreadPoolExecutor.java:632)
   [junit4]    >         at java.lang.Thread.run(Thread.java:747)
   [junit4]    >    4) Thread[id=9405, name=TEST-CollectionsAPIDistributedZkTest.test-seed#[A0FFB43F75647302]-SendThread(127.0.0.1:39012), state=TIMED_WAITING, group=TGRP-CollectionsAPIDistributedZkTest]
   [junit4]    >         at java.lang.Thread.sleep(Native Method)
   [junit4]    >         at org.apache.zookeeper.client.StaticHostProvider.next(StaticHostProvider.java:101)
   [junit4]    >         at org.apache.zookeeper.ClientCnxn$SendThread.startConnect(ClientCnxn.java:940)
   [junit4]    >         at org.apache.zookeeper.ClientCnxn$SendThread.run(ClientCnxn.java:1003)
   [junit4]    >    5) Thread[id=9661, name=zkCallback-1770-thread-3, state=TIMED_WAITING, group=TGRP-CollectionsAPIDistributedZkTest]
   [junit4]    >         at jdk.internal.misc.Unsafe.park(Native Method)
   [junit4]    >         at java.util.concurrent.locks.LockSupport.parkNanos(LockSupport.java:218)
   [junit4]    >         at java.util.concurrent.SynchronousQueue$TransferStack.awaitFulfill(SynchronousQueue.java:461)
   [junit4]    >         at java.util.concurrent.SynchronousQueue$TransferStack.transfer(SynchronousQueue.java:362)
   [junit4]    >         at java.util.concurrent.SynchronousQueue.poll(SynchronousQueue.java:937)
   [junit4]    >         at java.util.concurrent.ThreadPoolExecutor.getTask(ThreadPoolExecutor.java:1082)
   [junit4]    >         at java.util.concurrent.ThreadPoolExecutor.runWorker(ThreadPoolExecutor.java:1143)
   [junit4]    >         at java.util.concurrent.ThreadPoolExecutor$Worker.run(ThreadPoolExecutor.java:632)
   [junit4]    >         at java.lang.Thread.run(Thread.java:747)
   [junit4]    >    6) Thread[id=9660, name=zkCallback-1770-thread-2, state=TIMED_WAITING, group=TGRP-CollectionsAPIDistributedZkTest]
   [junit4]    >         at jdk.internal.misc.Unsafe.park(Native Method)
   [junit4]    >         at java.util.concurrent.locks.LockSupport.parkNanos(LockSupport.java:218)
   [junit4]    >         at java.util.concurrent.SynchronousQueue$TransferStack.awaitFulfill(SynchronousQueue.java:461)
   [junit4]    >         at java.util.concurrent.SynchronousQueue$TransferStack.transfer(SynchronousQueue.java:362)
   [junit4]    >         at java.util.concurrent.SynchronousQueue.poll(SynchronousQueue.java:937)
   [junit4]    >         at java.util.concurrent.ThreadPoolExecutor.getTask(ThreadPoolExecutor.java:1082)
   [junit4]    >         at java.util.concurrent.ThreadPoolExecutor.runWorker(ThreadPoolExecutor.java:1143)
   [junit4]    >         at java.util.concurrent.ThreadPoolExecutor$Worker.run(ThreadPoolExecutor.java:632)
   [junit4]    >         at java.lang.Thread.run(Thread.java:747)
   [junit4]    > 	at __randomizedtesting.SeedInfo.seed([A0FFB43F75647302]:0)Throwable #2: com.carrotsearch.randomizedtesting.ThreadLeakError: There are still zombie threads that couldn't be terminated:
   [junit4]    >    1) Thread[id=9407, name=zkCallback-1770-thread-1, state=TIMED_WAITING, group=TGRP-CollectionsAPIDistributedZkTest]
   [junit4]    >         at jdk.internal.misc.Unsafe.park(Native Method)
   [junit4]    >         at java.util.concurrent.locks.LockSupport.parkNanos(LockSupport.java:218)
   [junit4]    >         at java.util.concurrent.SynchronousQueue$TransferStack.awaitFulfill(SynchronousQueue.java:461)
   [junit4]    >         at java.util.concurrent.SynchronousQueue$TransferStack.transfer(SynchronousQueue.java:362)
   [junit4]    >         at java.util.concurrent.SynchronousQueue.poll(SynchronousQueue.java:937)
   [junit4]    >         at java.util.concurrent.ThreadPoolExecutor.getTask(ThreadPoolExecutor.java:1082)
   [junit4]    >         at java.util.concurrent.ThreadPoolExecutor.runWorker(ThreadPoolExecutor.java:1143)
   [junit4]    >         at java.util.concurrent.ThreadPoolExecutor$Worker.run(ThreadPoolExecutor.java:632)
   [junit4]    >         at java.lang.Thread.run(Thread.java:747)
   [junit4]    >    2) Thread[id=9662, name=zkCallback-1770-thread-4, state=TIMED_WAITING, group=TGRP-CollectionsAPIDistributedZkTest]
   [junit4]    >         at jdk.internal.misc.Unsafe.park(Native Method)
   [junit4]    >         at java.util.concurrent.locks.LockSupport.parkNanos(LockSupport.java:218)
   [junit4]    >         at java.util.concurrent.SynchronousQueue$TransferStack.awaitFulfill(SynchronousQueue.java:461)
   [junit4]    >         at java.util.concurrent.SynchronousQueue$TransferStack.transfer(SynchronousQueue.java:362)
   [junit4]    >         at java.util.concurrent.SynchronousQueue.poll(SynchronousQueue.java:937)
   [junit4]    >         at java.util.concurrent.ThreadPoolExecutor.getTask(ThreadPoolExecutor.java:1082)
   [junit4]    >         at java.util.concurrent.ThreadPoolExecutor.runWorker(ThreadPoolExecutor.java:1143)
   [junit4]    >         at java.util.concurrent.ThreadPoolExecutor$Worker.run(ThreadPoolExecutor.java:632)
   [junit4]    >         at java.lang.Thread.run(Thread.java:747)
   [junit4]    >    3) Thread[id=9405, name=TEST-CollectionsAPIDistributedZkTest.test-seed#[A0FFB43F75647302]-SendThread(127.0.0.1:39012), state=TIMED_WAITING, group=TGRP-CollectionsAPIDistributedZkTest]
   [junit4]    >         at java.lang.Thread.sleep(Native Method)
   [junit4]    >         at org.apache.zookeeper.client.StaticHostProvider.next(StaticHostProvider.java:101)
   [junit4]    >         at org.apache.zookeeper.ClientCnxn$SendThread.startConnect(ClientCnxn.java:940)
   [junit4]    >         at org.apache.zookeeper.ClientCnxn$SendThread.run(ClientCnxn.java:1003)
   [junit4]    >    4) Thread[id=9661, name=zkCallback-1770-thread-3, state=TIMED_WAITING, group=TGRP-CollectionsAPIDistributedZkTest]
   [junit4]    >         at jdk.internal.misc.Unsafe.park(Native Method)
   [junit4]    >         at java.util.concurrent.locks.LockSupport.parkNanos(LockSupport.java:218)
   [junit4]    >         at java.util.concurrent.SynchronousQueue$TransferStack.awaitFulfill(SynchronousQueue.java:461)
   [junit4]    >         at java.util.concurrent.SynchronousQueue$TransferStack.transfer(SynchronousQueue.java:362)
   [junit4]    >         at java.util.concurrent.SynchronousQueue.poll(SynchronousQueue.java:937)
   [junit4]    >         at java.util.concurrent.ThreadPoolExecutor.getTask(ThreadPoolExecutor.java:1082)
   [junit4]    >         at java.util.concurrent.ThreadPoolExecutor.runWorker(ThreadPoolExecutor.java:1143)
   [junit4]    >         at java.util.concurrent.ThreadPoolExecutor$Worker.run(ThreadPoolExecutor.java:632)
   [junit4]    >         at java.lang.Thread.run(Thread.java:747)
   [junit4]    >    5) Thread[id=9660, name=zkCallback-1770-thread-2, state=TIMED_WAITING, group=TGRP-CollectionsAPIDistributedZkTest]
   [junit4]    >         at jdk.internal.misc.Unsafe.park(Native Method)
   [junit4]    >         at java.util.concurrent.locks.LockSupport.parkNanos(LockSupport.java:218)
   [junit4]    >         at java.util.concurrent.SynchronousQueue$TransferStack.awaitFulfill(SynchronousQueue.java:461)
   [junit4]    >         at java.util.concurrent.SynchronousQueue$TransferStack.transfer(SynchronousQueue.java:362)
   [junit4]    >         at java.util.concurrent.SynchronousQueue.poll(SynchronousQueue.java:937)
   [junit4]    >         at java.util.concurrent.ThreadPoolExecutor.getTask(ThreadPoolExecutor.java:1082)
   [junit4]    >         at java.util.concurrent.ThreadPoolExecutor.runWorker(ThreadPoolExecutor.java:1143)
   [junit4]    >         at java.util.concurrent.ThreadPoolExecutor$Worker.run(ThreadPoolExecutor.java:632)
   [junit4]    >         at java.lang.Thread.run(Thread.java:747)
   [junit4]    > 	at __randomizedtesting.SeedInfo.seed([A0FFB43F75647302]:0)
   [junit4] Completed [288/573 (1!)] on J2 in 52.91s, 1 test, 3 errors <<< FAILURES!

[...truncated 894 lines...]
BUILD FAILED
/home/jenkins/workspace/Lucene-Solr-trunk-Linux/build.xml:784: The following error occurred while executing this line:
/home/jenkins/workspace/Lucene-Solr-trunk-Linux/build.xml:728: The following error occurred while executing this line:
/home/jenkins/workspace/Lucene-Solr-trunk-Linux/build.xml:59: The following error occurred while executing this line:
/home/jenkins/workspace/Lucene-Solr-trunk-Linux/solr/build.xml:233: The following error occurred while executing this line:
/home/jenkins/workspace/Lucene-Solr-trunk-Linux/solr/common-build.xml:516: The following error occurred while executing this line:
/home/jenkins/workspace/Lucene-Solr-trunk-Linux/lucene/common-build.xml:1424: The following error occurred while executing this line:
/home/jenkins/workspace/Lucene-Solr-trunk-Linux/lucene/common-build.xml:981: There were test failures: 573 suites (8 ignored), 2284 tests, 2 suite-level errors, 1 error, 908 ignored (67 assumptions) [seed: A0FFB43F75647302]

Total time: 36 minutes 48 seconds
Build step 'Invoke Ant' marked build as failure
Archiving artifacts
[WARNINGS] Skipping publisher since build result is FAILURE
Recording test results
Email was triggered for: Failure - Any
Sending email for trigger: Failure - Any



Mime
View raw message