lucene-dev mailing list archives

Site index · List index
Message view « Date » · « Thread »
Top « Date » · « Thread »
From Policeman Jenkins Server <jenk...@thetaphi.de>
Subject [JENKINS] Lucene-Solr-5.x-Solaris (multiarch/jdk1.7.0) - Build # 292 - Failure!
Date Wed, 30 Dec 2015 09:54:23 GMT
Build: http://jenkins.thetaphi.de/job/Lucene-Solr-5.x-Solaris/292/
Java: multiarch/jdk1.7.0 -d64 -XX:+UseCompressedOops -XX:+UseParallelGC

12 tests failed.
FAILED:  org.apache.solr.cloud.BasicDistributedZk2Test.test

Error Message:
Doc Counts do not add up expected:<67> but was:<36>

Stack Trace:
java.lang.AssertionError: Doc Counts do not add up expected:<67> but was:<36>
	at __randomizedtesting.SeedInfo.seed([794764EE032C08CC:F1135B34ADD06534]:0)
	at org.junit.Assert.fail(Assert.java:93)
	at org.junit.Assert.failNotEquals(Assert.java:647)
	at org.junit.Assert.assertEquals(Assert.java:128)
	at org.junit.Assert.assertEquals(Assert.java:472)
	at org.apache.solr.cloud.AbstractFullDistribZkTestBase.assertDocCounts(AbstractFullDistribZkTestBase.java:1368)
	at org.apache.solr.cloud.BasicDistributedZk2Test.test(BasicDistributedZk2Test.java:91)
	at sun.reflect.NativeMethodAccessorImpl.invoke0(Native Method)
	at sun.reflect.NativeMethodAccessorImpl.invoke(NativeMethodAccessorImpl.java:57)
	at sun.reflect.DelegatingMethodAccessorImpl.invoke(DelegatingMethodAccessorImpl.java:43)
	at java.lang.reflect.Method.invoke(Method.java:606)
	at com.carrotsearch.randomizedtesting.RandomizedRunner.invoke(RandomizedRunner.java:1764)
	at com.carrotsearch.randomizedtesting.RandomizedRunner$8.evaluate(RandomizedRunner.java:871)
	at com.carrotsearch.randomizedtesting.RandomizedRunner$9.evaluate(RandomizedRunner.java:907)
	at com.carrotsearch.randomizedtesting.RandomizedRunner$10.evaluate(RandomizedRunner.java:921)
	at org.apache.solr.BaseDistributedSearchTestCase$ShardsRepeatRule$ShardsFixedStatement.callStatement(BaseDistributedSearchTestCase.java:965)
	at org.apache.solr.BaseDistributedSearchTestCase$ShardsRepeatRule$ShardsStatement.evaluate(BaseDistributedSearchTestCase.java:940)
	at com.carrotsearch.randomizedtesting.rules.SystemPropertiesRestoreRule$1.evaluate(SystemPropertiesRestoreRule.java:57)
	at org.apache.lucene.util.TestRuleSetupTeardownChained$1.evaluate(TestRuleSetupTeardownChained.java:50)
	at org.apache.lucene.util.AbstractBeforeAfterRule$1.evaluate(AbstractBeforeAfterRule.java:46)
	at org.apache.lucene.util.TestRuleThreadAndTestName$1.evaluate(TestRuleThreadAndTestName.java:49)
	at org.apache.lucene.util.TestRuleIgnoreAfterMaxFailures$1.evaluate(TestRuleIgnoreAfterMaxFailures.java:65)
	at org.apache.lucene.util.TestRuleMarkFailure$1.evaluate(TestRuleMarkFailure.java:48)
	at com.carrotsearch.randomizedtesting.rules.StatementAdapter.evaluate(StatementAdapter.java:36)
	at com.carrotsearch.randomizedtesting.ThreadLeakControl$StatementRunner.run(ThreadLeakControl.java:367)
	at com.carrotsearch.randomizedtesting.ThreadLeakControl.forkTimeoutingTask(ThreadLeakControl.java:809)
	at com.carrotsearch.randomizedtesting.ThreadLeakControl$3.evaluate(ThreadLeakControl.java:460)
	at com.carrotsearch.randomizedtesting.RandomizedRunner.runSingleTest(RandomizedRunner.java:880)
	at com.carrotsearch.randomizedtesting.RandomizedRunner$5.evaluate(RandomizedRunner.java:781)
	at com.carrotsearch.randomizedtesting.RandomizedRunner$6.evaluate(RandomizedRunner.java:816)
	at com.carrotsearch.randomizedtesting.RandomizedRunner$7.evaluate(RandomizedRunner.java:827)
	at com.carrotsearch.randomizedtesting.rules.StatementAdapter.evaluate(StatementAdapter.java:36)
	at com.carrotsearch.randomizedtesting.rules.SystemPropertiesRestoreRule$1.evaluate(SystemPropertiesRestoreRule.java:57)
	at org.apache.lucene.util.AbstractBeforeAfterRule$1.evaluate(AbstractBeforeAfterRule.java:46)
	at com.carrotsearch.randomizedtesting.rules.StatementAdapter.evaluate(StatementAdapter.java:36)
	at org.apache.lucene.util.TestRuleStoreClassName$1.evaluate(TestRuleStoreClassName.java:42)
	at com.carrotsearch.randomizedtesting.rules.NoShadowingOrOverridesOnMethodsRule$1.evaluate(NoShadowingOrOverridesOnMethodsRule.java:40)
	at com.carrotsearch.randomizedtesting.rules.NoShadowingOrOverridesOnMethodsRule$1.evaluate(NoShadowingOrOverridesOnMethodsRule.java:40)
	at com.carrotsearch.randomizedtesting.rules.StatementAdapter.evaluate(StatementAdapter.java:36)
	at com.carrotsearch.randomizedtesting.rules.StatementAdapter.evaluate(StatementAdapter.java:36)
	at com.carrotsearch.randomizedtesting.rules.StatementAdapter.evaluate(StatementAdapter.java:36)
	at org.apache.lucene.util.TestRuleAssertionsRequired$1.evaluate(TestRuleAssertionsRequired.java:54)
	at org.apache.lucene.util.TestRuleMarkFailure$1.evaluate(TestRuleMarkFailure.java:48)
	at org.apache.lucene.util.TestRuleIgnoreAfterMaxFailures$1.evaluate(TestRuleIgnoreAfterMaxFailures.java:65)
	at org.apache.lucene.util.TestRuleIgnoreTestSuites$1.evaluate(TestRuleIgnoreTestSuites.java:55)
	at com.carrotsearch.randomizedtesting.rules.StatementAdapter.evaluate(StatementAdapter.java:36)
	at com.carrotsearch.randomizedtesting.ThreadLeakControl$StatementRunner.run(ThreadLeakControl.java:367)
	at java.lang.Thread.run(Thread.java:745)


FAILED:  org.apache.solr.cloud.BasicDistributedZkTest.test

Error Message:
.response.numFound:1!=0

Stack Trace:
junit.framework.AssertionFailedError: .response.numFound:1!=0
	at __randomizedtesting.SeedInfo.seed([794764EE032C08CC:F1135B34ADD06534]:0)
	at junit.framework.Assert.fail(Assert.java:50)
	at org.apache.solr.BaseDistributedSearchTestCase.compareSolrResponses(BaseDistributedSearchTestCase.java:893)
	at org.apache.solr.BaseDistributedSearchTestCase.compareResponses(BaseDistributedSearchTestCase.java:912)
	at org.apache.solr.BaseDistributedSearchTestCase.queryAndCompare(BaseDistributedSearchTestCase.java:655)
	at org.apache.solr.cloud.AbstractFullDistribZkTestBase.queryAndCompareReplicas(AbstractFullDistribZkTestBase.java:1042)
	at org.apache.solr.cloud.AbstractFullDistribZkTestBase.queryAndCompareShards(AbstractFullDistribZkTestBase.java:1059)
	at org.apache.solr.cloud.BasicDistributedZkTest.test(BasicDistributedZkTest.java:165)
	at sun.reflect.NativeMethodAccessorImpl.invoke0(Native Method)
	at sun.reflect.NativeMethodAccessorImpl.invoke(NativeMethodAccessorImpl.java:57)
	at sun.reflect.DelegatingMethodAccessorImpl.invoke(DelegatingMethodAccessorImpl.java:43)
	at java.lang.reflect.Method.invoke(Method.java:606)
	at com.carrotsearch.randomizedtesting.RandomizedRunner.invoke(RandomizedRunner.java:1764)
	at com.carrotsearch.randomizedtesting.RandomizedRunner$8.evaluate(RandomizedRunner.java:871)
	at com.carrotsearch.randomizedtesting.RandomizedRunner$9.evaluate(RandomizedRunner.java:907)
	at com.carrotsearch.randomizedtesting.RandomizedRunner$10.evaluate(RandomizedRunner.java:921)
	at org.apache.solr.BaseDistributedSearchTestCase$ShardsRepeatRule$ShardsFixedStatement.callStatement(BaseDistributedSearchTestCase.java:965)
	at org.apache.solr.BaseDistributedSearchTestCase$ShardsRepeatRule$ShardsStatement.evaluate(BaseDistributedSearchTestCase.java:940)
	at com.carrotsearch.randomizedtesting.rules.SystemPropertiesRestoreRule$1.evaluate(SystemPropertiesRestoreRule.java:57)
	at org.apache.lucene.util.TestRuleSetupTeardownChained$1.evaluate(TestRuleSetupTeardownChained.java:50)
	at org.apache.lucene.util.AbstractBeforeAfterRule$1.evaluate(AbstractBeforeAfterRule.java:46)
	at org.apache.lucene.util.TestRuleThreadAndTestName$1.evaluate(TestRuleThreadAndTestName.java:49)
	at org.apache.lucene.util.TestRuleIgnoreAfterMaxFailures$1.evaluate(TestRuleIgnoreAfterMaxFailures.java:65)
	at org.apache.lucene.util.TestRuleMarkFailure$1.evaluate(TestRuleMarkFailure.java:48)
	at com.carrotsearch.randomizedtesting.rules.StatementAdapter.evaluate(StatementAdapter.java:36)
	at com.carrotsearch.randomizedtesting.ThreadLeakControl$StatementRunner.run(ThreadLeakControl.java:367)
	at com.carrotsearch.randomizedtesting.ThreadLeakControl.forkTimeoutingTask(ThreadLeakControl.java:809)
	at com.carrotsearch.randomizedtesting.ThreadLeakControl$3.evaluate(ThreadLeakControl.java:460)
	at com.carrotsearch.randomizedtesting.RandomizedRunner.runSingleTest(RandomizedRunner.java:880)
	at com.carrotsearch.randomizedtesting.RandomizedRunner$5.evaluate(RandomizedRunner.java:781)
	at com.carrotsearch.randomizedtesting.RandomizedRunner$6.evaluate(RandomizedRunner.java:816)
	at com.carrotsearch.randomizedtesting.RandomizedRunner$7.evaluate(RandomizedRunner.java:827)
	at com.carrotsearch.randomizedtesting.rules.StatementAdapter.evaluate(StatementAdapter.java:36)
	at com.carrotsearch.randomizedtesting.rules.SystemPropertiesRestoreRule$1.evaluate(SystemPropertiesRestoreRule.java:57)
	at org.apache.lucene.util.AbstractBeforeAfterRule$1.evaluate(AbstractBeforeAfterRule.java:46)
	at com.carrotsearch.randomizedtesting.rules.StatementAdapter.evaluate(StatementAdapter.java:36)
	at org.apache.lucene.util.TestRuleStoreClassName$1.evaluate(TestRuleStoreClassName.java:42)
	at com.carrotsearch.randomizedtesting.rules.NoShadowingOrOverridesOnMethodsRule$1.evaluate(NoShadowingOrOverridesOnMethodsRule.java:40)
	at com.carrotsearch.randomizedtesting.rules.NoShadowingOrOverridesOnMethodsRule$1.evaluate(NoShadowingOrOverridesOnMethodsRule.java:40)
	at com.carrotsearch.randomizedtesting.rules.StatementAdapter.evaluate(StatementAdapter.java:36)
	at com.carrotsearch.randomizedtesting.rules.StatementAdapter.evaluate(StatementAdapter.java:36)
	at com.carrotsearch.randomizedtesting.rules.StatementAdapter.evaluate(StatementAdapter.java:36)
	at org.apache.lucene.util.TestRuleAssertionsRequired$1.evaluate(TestRuleAssertionsRequired.java:54)
	at org.apache.lucene.util.TestRuleMarkFailure$1.evaluate(TestRuleMarkFailure.java:48)
	at org.apache.lucene.util.TestRuleIgnoreAfterMaxFailures$1.evaluate(TestRuleIgnoreAfterMaxFailures.java:65)
	at org.apache.lucene.util.TestRuleIgnoreTestSuites$1.evaluate(TestRuleIgnoreTestSuites.java:55)
	at com.carrotsearch.randomizedtesting.rules.StatementAdapter.evaluate(StatementAdapter.java:36)
	at com.carrotsearch.randomizedtesting.ThreadLeakControl$StatementRunner.run(ThreadLeakControl.java:367)
	at java.lang.Thread.run(Thread.java:745)


FAILED:  org.apache.solr.cloud.CustomCollectionTest.test

Error Message:
expected:<3> but was:<0>

Stack Trace:
java.lang.AssertionError: expected:<3> but was:<0>
	at __randomizedtesting.SeedInfo.seed([794764EE032C08CC:F1135B34ADD06534]:0)
	at org.junit.Assert.fail(Assert.java:93)
	at org.junit.Assert.failNotEquals(Assert.java:647)
	at org.junit.Assert.assertEquals(Assert.java:128)
	at org.junit.Assert.assertEquals(Assert.java:472)
	at org.junit.Assert.assertEquals(Assert.java:456)
	at org.apache.solr.cloud.CustomCollectionTest.testCustomCollectionsAPI(CustomCollectionTest.java:214)
	at org.apache.solr.cloud.CustomCollectionTest.test(CustomCollectionTest.java:100)
	at sun.reflect.NativeMethodAccessorImpl.invoke0(Native Method)
	at sun.reflect.NativeMethodAccessorImpl.invoke(NativeMethodAccessorImpl.java:57)
	at sun.reflect.DelegatingMethodAccessorImpl.invoke(DelegatingMethodAccessorImpl.java:43)
	at java.lang.reflect.Method.invoke(Method.java:606)
	at com.carrotsearch.randomizedtesting.RandomizedRunner.invoke(RandomizedRunner.java:1764)
	at com.carrotsearch.randomizedtesting.RandomizedRunner$8.evaluate(RandomizedRunner.java:871)
	at com.carrotsearch.randomizedtesting.RandomizedRunner$9.evaluate(RandomizedRunner.java:907)
	at com.carrotsearch.randomizedtesting.RandomizedRunner$10.evaluate(RandomizedRunner.java:921)
	at org.apache.solr.BaseDistributedSearchTestCase$ShardsRepeatRule$ShardsFixedStatement.callStatement(BaseDistributedSearchTestCase.java:965)
	at org.apache.solr.BaseDistributedSearchTestCase$ShardsRepeatRule$ShardsStatement.evaluate(BaseDistributedSearchTestCase.java:940)
	at com.carrotsearch.randomizedtesting.rules.SystemPropertiesRestoreRule$1.evaluate(SystemPropertiesRestoreRule.java:57)
	at org.apache.lucene.util.TestRuleSetupTeardownChained$1.evaluate(TestRuleSetupTeardownChained.java:50)
	at org.apache.lucene.util.AbstractBeforeAfterRule$1.evaluate(AbstractBeforeAfterRule.java:46)
	at org.apache.lucene.util.TestRuleThreadAndTestName$1.evaluate(TestRuleThreadAndTestName.java:49)
	at org.apache.lucene.util.TestRuleIgnoreAfterMaxFailures$1.evaluate(TestRuleIgnoreAfterMaxFailures.java:65)
	at org.apache.lucene.util.TestRuleMarkFailure$1.evaluate(TestRuleMarkFailure.java:48)
	at com.carrotsearch.randomizedtesting.rules.StatementAdapter.evaluate(StatementAdapter.java:36)
	at com.carrotsearch.randomizedtesting.ThreadLeakControl$StatementRunner.run(ThreadLeakControl.java:367)
	at com.carrotsearch.randomizedtesting.ThreadLeakControl.forkTimeoutingTask(ThreadLeakControl.java:809)
	at com.carrotsearch.randomizedtesting.ThreadLeakControl$3.evaluate(ThreadLeakControl.java:460)
	at com.carrotsearch.randomizedtesting.RandomizedRunner.runSingleTest(RandomizedRunner.java:880)
	at com.carrotsearch.randomizedtesting.RandomizedRunner$5.evaluate(RandomizedRunner.java:781)
	at com.carrotsearch.randomizedtesting.RandomizedRunner$6.evaluate(RandomizedRunner.java:816)
	at com.carrotsearch.randomizedtesting.RandomizedRunner$7.evaluate(RandomizedRunner.java:827)
	at com.carrotsearch.randomizedtesting.rules.StatementAdapter.evaluate(StatementAdapter.java:36)
	at com.carrotsearch.randomizedtesting.rules.SystemPropertiesRestoreRule$1.evaluate(SystemPropertiesRestoreRule.java:57)
	at org.apache.lucene.util.AbstractBeforeAfterRule$1.evaluate(AbstractBeforeAfterRule.java:46)
	at com.carrotsearch.randomizedtesting.rules.StatementAdapter.evaluate(StatementAdapter.java:36)
	at org.apache.lucene.util.TestRuleStoreClassName$1.evaluate(TestRuleStoreClassName.java:42)
	at com.carrotsearch.randomizedtesting.rules.NoShadowingOrOverridesOnMethodsRule$1.evaluate(NoShadowingOrOverridesOnMethodsRule.java:40)
	at com.carrotsearch.randomizedtesting.rules.NoShadowingOrOverridesOnMethodsRule$1.evaluate(NoShadowingOrOverridesOnMethodsRule.java:40)
	at com.carrotsearch.randomizedtesting.rules.StatementAdapter.evaluate(StatementAdapter.java:36)
	at com.carrotsearch.randomizedtesting.rules.StatementAdapter.evaluate(StatementAdapter.java:36)
	at com.carrotsearch.randomizedtesting.rules.StatementAdapter.evaluate(StatementAdapter.java:36)
	at org.apache.lucene.util.TestRuleAssertionsRequired$1.evaluate(TestRuleAssertionsRequired.java:54)
	at org.apache.lucene.util.TestRuleMarkFailure$1.evaluate(TestRuleMarkFailure.java:48)
	at org.apache.lucene.util.TestRuleIgnoreAfterMaxFailures$1.evaluate(TestRuleIgnoreAfterMaxFailures.java:65)
	at org.apache.lucene.util.TestRuleIgnoreTestSuites$1.evaluate(TestRuleIgnoreTestSuites.java:55)
	at com.carrotsearch.randomizedtesting.rules.StatementAdapter.evaluate(StatementAdapter.java:36)
	at com.carrotsearch.randomizedtesting.ThreadLeakControl$StatementRunner.run(ThreadLeakControl.java:367)
	at java.lang.Thread.run(Thread.java:745)


FAILED:  org.apache.solr.cloud.DistribDocExpirationUpdateProcessorTest.test

Error Message:
There are still nodes recoverying - waited for 30 seconds

Stack Trace:
java.lang.AssertionError: There are still nodes recoverying - waited for 30 seconds
	at __randomizedtesting.SeedInfo.seed([794764EE032C08CC:F1135B34ADD06534]:0)
	at org.junit.Assert.fail(Assert.java:93)
	at org.apache.solr.cloud.AbstractDistribZkTestBase.waitForRecoveriesToFinish(AbstractDistribZkTestBase.java:175)
	at org.apache.solr.cloud.AbstractFullDistribZkTestBase.waitForRecoveriesToFinish(AbstractFullDistribZkTestBase.java:837)
	at org.apache.solr.cloud.AbstractFullDistribZkTestBase.waitForThingsToLevelOut(AbstractFullDistribZkTestBase.java:1393)
	at org.apache.solr.cloud.DistribDocExpirationUpdateProcessorTest.test(DistribDocExpirationUpdateProcessorTest.java:73)
	at sun.reflect.NativeMethodAccessorImpl.invoke0(Native Method)
	at sun.reflect.NativeMethodAccessorImpl.invoke(NativeMethodAccessorImpl.java:57)
	at sun.reflect.DelegatingMethodAccessorImpl.invoke(DelegatingMethodAccessorImpl.java:43)
	at java.lang.reflect.Method.invoke(Method.java:606)
	at com.carrotsearch.randomizedtesting.RandomizedRunner.invoke(RandomizedRunner.java:1764)
	at com.carrotsearch.randomizedtesting.RandomizedRunner$8.evaluate(RandomizedRunner.java:871)
	at com.carrotsearch.randomizedtesting.RandomizedRunner$9.evaluate(RandomizedRunner.java:907)
	at com.carrotsearch.randomizedtesting.RandomizedRunner$10.evaluate(RandomizedRunner.java:921)
	at org.apache.solr.BaseDistributedSearchTestCase$ShardsRepeatRule$ShardsFixedStatement.callStatement(BaseDistributedSearchTestCase.java:965)
	at org.apache.solr.BaseDistributedSearchTestCase$ShardsRepeatRule$ShardsStatement.evaluate(BaseDistributedSearchTestCase.java:940)
	at com.carrotsearch.randomizedtesting.rules.SystemPropertiesRestoreRule$1.evaluate(SystemPropertiesRestoreRule.java:57)
	at org.apache.lucene.util.TestRuleSetupTeardownChained$1.evaluate(TestRuleSetupTeardownChained.java:50)
	at org.apache.lucene.util.AbstractBeforeAfterRule$1.evaluate(AbstractBeforeAfterRule.java:46)
	at org.apache.lucene.util.TestRuleThreadAndTestName$1.evaluate(TestRuleThreadAndTestName.java:49)
	at org.apache.lucene.util.TestRuleIgnoreAfterMaxFailures$1.evaluate(TestRuleIgnoreAfterMaxFailures.java:65)
	at org.apache.lucene.util.TestRuleMarkFailure$1.evaluate(TestRuleMarkFailure.java:48)
	at com.carrotsearch.randomizedtesting.rules.StatementAdapter.evaluate(StatementAdapter.java:36)
	at com.carrotsearch.randomizedtesting.ThreadLeakControl$StatementRunner.run(ThreadLeakControl.java:367)
	at com.carrotsearch.randomizedtesting.ThreadLeakControl.forkTimeoutingTask(ThreadLeakControl.java:809)
	at com.carrotsearch.randomizedtesting.ThreadLeakControl$3.evaluate(ThreadLeakControl.java:460)
	at com.carrotsearch.randomizedtesting.RandomizedRunner.runSingleTest(RandomizedRunner.java:880)
	at com.carrotsearch.randomizedtesting.RandomizedRunner$5.evaluate(RandomizedRunner.java:781)
	at com.carrotsearch.randomizedtesting.RandomizedRunner$6.evaluate(RandomizedRunner.java:816)
	at com.carrotsearch.randomizedtesting.RandomizedRunner$7.evaluate(RandomizedRunner.java:827)
	at com.carrotsearch.randomizedtesting.rules.StatementAdapter.evaluate(StatementAdapter.java:36)
	at com.carrotsearch.randomizedtesting.rules.SystemPropertiesRestoreRule$1.evaluate(SystemPropertiesRestoreRule.java:57)
	at org.apache.lucene.util.AbstractBeforeAfterRule$1.evaluate(AbstractBeforeAfterRule.java:46)
	at com.carrotsearch.randomizedtesting.rules.StatementAdapter.evaluate(StatementAdapter.java:36)
	at org.apache.lucene.util.TestRuleStoreClassName$1.evaluate(TestRuleStoreClassName.java:42)
	at com.carrotsearch.randomizedtesting.rules.NoShadowingOrOverridesOnMethodsRule$1.evaluate(NoShadowingOrOverridesOnMethodsRule.java:40)
	at com.carrotsearch.randomizedtesting.rules.NoShadowingOrOverridesOnMethodsRule$1.evaluate(NoShadowingOrOverridesOnMethodsRule.java:40)
	at com.carrotsearch.randomizedtesting.rules.StatementAdapter.evaluate(StatementAdapter.java:36)
	at com.carrotsearch.randomizedtesting.rules.StatementAdapter.evaluate(StatementAdapter.java:36)
	at com.carrotsearch.randomizedtesting.rules.StatementAdapter.evaluate(StatementAdapter.java:36)
	at org.apache.lucene.util.TestRuleAssertionsRequired$1.evaluate(TestRuleAssertionsRequired.java:54)
	at org.apache.lucene.util.TestRuleMarkFailure$1.evaluate(TestRuleMarkFailure.java:48)
	at org.apache.lucene.util.TestRuleIgnoreAfterMaxFailures$1.evaluate(TestRuleIgnoreAfterMaxFailures.java:65)
	at org.apache.lucene.util.TestRuleIgnoreTestSuites$1.evaluate(TestRuleIgnoreTestSuites.java:55)
	at com.carrotsearch.randomizedtesting.rules.StatementAdapter.evaluate(StatementAdapter.java:36)
	at com.carrotsearch.randomizedtesting.ThreadLeakControl$StatementRunner.run(ThreadLeakControl.java:367)
	at java.lang.Thread.run(Thread.java:745)


FAILED:  org.apache.solr.cloud.DistributedVersionInfoTest.test

Error Message:
Doc with id=1 not found in http://127.0.0.1:61329/c8n_vers_1x3_shard1_replica1 due to: Path not found: /id; rsp={doc=null}

Stack Trace:
java.lang.AssertionError: Doc with id=1 not found in http://127.0.0.1:61329/c8n_vers_1x3_shard1_replica1 due to: Path not found: /id; rsp={doc=null}
	at __randomizedtesting.SeedInfo.seed([794764EE032C08CC:F1135B34ADD06534]:0)
	at org.junit.Assert.fail(Assert.java:93)
	at org.junit.Assert.assertTrue(Assert.java:43)
	at org.apache.solr.cloud.DistributedVersionInfoTest.assertDocExists(DistributedVersionInfoTest.java:367)
	at org.apache.solr.cloud.DistributedVersionInfoTest.assertDocsExistInAllReplicas(DistributedVersionInfoTest.java:334)
	at org.apache.solr.cloud.DistributedVersionInfoTest.testReplicaVersionHandling(DistributedVersionInfoTest.java:100)
	at org.apache.solr.cloud.DistributedVersionInfoTest.test(DistributedVersionInfoTest.java:75)
	at sun.reflect.NativeMethodAccessorImpl.invoke0(Native Method)
	at sun.reflect.NativeMethodAccessorImpl.invoke(NativeMethodAccessorImpl.java:57)
	at sun.reflect.DelegatingMethodAccessorImpl.invoke(DelegatingMethodAccessorImpl.java:43)
	at java.lang.reflect.Method.invoke(Method.java:606)
	at com.carrotsearch.randomizedtesting.RandomizedRunner.invoke(RandomizedRunner.java:1764)
	at com.carrotsearch.randomizedtesting.RandomizedRunner$8.evaluate(RandomizedRunner.java:871)
	at com.carrotsearch.randomizedtesting.RandomizedRunner$9.evaluate(RandomizedRunner.java:907)
	at com.carrotsearch.randomizedtesting.RandomizedRunner$10.evaluate(RandomizedRunner.java:921)
	at org.apache.solr.BaseDistributedSearchTestCase$ShardsRepeatRule$ShardsFixedStatement.callStatement(BaseDistributedSearchTestCase.java:965)
	at org.apache.solr.BaseDistributedSearchTestCase$ShardsRepeatRule$ShardsStatement.evaluate(BaseDistributedSearchTestCase.java:940)
	at com.carrotsearch.randomizedtesting.rules.SystemPropertiesRestoreRule$1.evaluate(SystemPropertiesRestoreRule.java:57)
	at org.apache.lucene.util.TestRuleSetupTeardownChained$1.evaluate(TestRuleSetupTeardownChained.java:50)
	at org.apache.lucene.util.AbstractBeforeAfterRule$1.evaluate(AbstractBeforeAfterRule.java:46)
	at org.apache.lucene.util.TestRuleThreadAndTestName$1.evaluate(TestRuleThreadAndTestName.java:49)
	at org.apache.lucene.util.TestRuleIgnoreAfterMaxFailures$1.evaluate(TestRuleIgnoreAfterMaxFailures.java:65)
	at org.apache.lucene.util.TestRuleMarkFailure$1.evaluate(TestRuleMarkFailure.java:48)
	at com.carrotsearch.randomizedtesting.rules.StatementAdapter.evaluate(StatementAdapter.java:36)
	at com.carrotsearch.randomizedtesting.ThreadLeakControl$StatementRunner.run(ThreadLeakControl.java:367)
	at com.carrotsearch.randomizedtesting.ThreadLeakControl.forkTimeoutingTask(ThreadLeakControl.java:809)
	at com.carrotsearch.randomizedtesting.ThreadLeakControl$3.evaluate(ThreadLeakControl.java:460)
	at com.carrotsearch.randomizedtesting.RandomizedRunner.runSingleTest(RandomizedRunner.java:880)
	at com.carrotsearch.randomizedtesting.RandomizedRunner$5.evaluate(RandomizedRunner.java:781)
	at com.carrotsearch.randomizedtesting.RandomizedRunner$6.evaluate(RandomizedRunner.java:816)
	at com.carrotsearch.randomizedtesting.RandomizedRunner$7.evaluate(RandomizedRunner.java:827)
	at com.carrotsearch.randomizedtesting.rules.StatementAdapter.evaluate(StatementAdapter.java:36)
	at com.carrotsearch.randomizedtesting.rules.SystemPropertiesRestoreRule$1.evaluate(SystemPropertiesRestoreRule.java:57)
	at org.apache.lucene.util.AbstractBeforeAfterRule$1.evaluate(AbstractBeforeAfterRule.java:46)
	at com.carrotsearch.randomizedtesting.rules.StatementAdapter.evaluate(StatementAdapter.java:36)
	at org.apache.lucene.util.TestRuleStoreClassName$1.evaluate(TestRuleStoreClassName.java:42)
	at com.carrotsearch.randomizedtesting.rules.NoShadowingOrOverridesOnMethodsRule$1.evaluate(NoShadowingOrOverridesOnMethodsRule.java:40)
	at com.carrotsearch.randomizedtesting.rules.NoShadowingOrOverridesOnMethodsRule$1.evaluate(NoShadowingOrOverridesOnMethodsRule.java:40)
	at com.carrotsearch.randomizedtesting.rules.StatementAdapter.evaluate(StatementAdapter.java:36)
	at com.carrotsearch.randomizedtesting.rules.StatementAdapter.evaluate(StatementAdapter.java:36)
	at com.carrotsearch.randomizedtesting.rules.StatementAdapter.evaluate(StatementAdapter.java:36)
	at org.apache.lucene.util.TestRuleAssertionsRequired$1.evaluate(TestRuleAssertionsRequired.java:54)
	at org.apache.lucene.util.TestRuleMarkFailure$1.evaluate(TestRuleMarkFailure.java:48)
	at org.apache.lucene.util.TestRuleIgnoreAfterMaxFailures$1.evaluate(TestRuleIgnoreAfterMaxFailures.java:65)
	at org.apache.lucene.util.TestRuleIgnoreTestSuites$1.evaluate(TestRuleIgnoreTestSuites.java:55)
	at com.carrotsearch.randomizedtesting.rules.StatementAdapter.evaluate(StatementAdapter.java:36)
	at com.carrotsearch.randomizedtesting.ThreadLeakControl$StatementRunner.run(ThreadLeakControl.java:367)
	at java.lang.Thread.run(Thread.java:745)


FAILED:  org.apache.solr.cloud.ForceLeaderTest.testReplicasInLIRNoLeader

Error Message:
Doc with id=1 not found in http://127.0.0.1:48397/m/j/forceleader_test_collection due to: Path not found: /id; rsp={doc=null}

Stack Trace:
java.lang.AssertionError: Doc with id=1 not found in http://127.0.0.1:48397/m/j/forceleader_test_collection due to: Path not found: /id; rsp={doc=null}
	at __randomizedtesting.SeedInfo.seed([794764EE032C08CC:9FD0502E3AAEF1AD]:0)
	at org.junit.Assert.fail(Assert.java:93)
	at org.junit.Assert.assertTrue(Assert.java:43)
	at org.apache.solr.cloud.HttpPartitionTest.assertDocExists(HttpPartitionTest.java:620)
	at org.apache.solr.cloud.HttpPartitionTest.assertDocsExistInAllReplicas(HttpPartitionTest.java:573)
	at org.apache.solr.cloud.ForceLeaderTest.testReplicasInLIRNoLeader(ForceLeaderTest.java:137)
	at sun.reflect.NativeMethodAccessorImpl.invoke0(Native Method)
	at sun.reflect.NativeMethodAccessorImpl.invoke(NativeMethodAccessorImpl.java:57)
	at sun.reflect.DelegatingMethodAccessorImpl.invoke(DelegatingMethodAccessorImpl.java:43)
	at java.lang.reflect.Method.invoke(Method.java:606)
	at com.carrotsearch.randomizedtesting.RandomizedRunner.invoke(RandomizedRunner.java:1764)
	at com.carrotsearch.randomizedtesting.RandomizedRunner$8.evaluate(RandomizedRunner.java:871)
	at com.carrotsearch.randomizedtesting.RandomizedRunner$9.evaluate(RandomizedRunner.java:907)
	at com.carrotsearch.randomizedtesting.RandomizedRunner$10.evaluate(RandomizedRunner.java:921)
	at org.apache.solr.BaseDistributedSearchTestCase$ShardsRepeatRule$ShardsFixedStatement.callStatement(BaseDistributedSearchTestCase.java:965)
	at org.apache.solr.BaseDistributedSearchTestCase$ShardsRepeatRule$ShardsStatement.evaluate(BaseDistributedSearchTestCase.java:940)
	at com.carrotsearch.randomizedtesting.rules.SystemPropertiesRestoreRule$1.evaluate(SystemPropertiesRestoreRule.java:57)
	at org.apache.lucene.util.TestRuleSetupTeardownChained$1.evaluate(TestRuleSetupTeardownChained.java:50)
	at org.apache.lucene.util.AbstractBeforeAfterRule$1.evaluate(AbstractBeforeAfterRule.java:46)
	at org.apache.lucene.util.TestRuleThreadAndTestName$1.evaluate(TestRuleThreadAndTestName.java:49)
	at org.apache.lucene.util.TestRuleIgnoreAfterMaxFailures$1.evaluate(TestRuleIgnoreAfterMaxFailures.java:65)
	at org.apache.lucene.util.TestRuleMarkFailure$1.evaluate(TestRuleMarkFailure.java:48)
	at com.carrotsearch.randomizedtesting.rules.StatementAdapter.evaluate(StatementAdapter.java:36)
	at com.carrotsearch.randomizedtesting.ThreadLeakControl$StatementRunner.run(ThreadLeakControl.java:367)
	at com.carrotsearch.randomizedtesting.ThreadLeakControl.forkTimeoutingTask(ThreadLeakControl.java:809)
	at com.carrotsearch.randomizedtesting.ThreadLeakControl$3.evaluate(ThreadLeakControl.java:460)
	at com.carrotsearch.randomizedtesting.RandomizedRunner.runSingleTest(RandomizedRunner.java:880)
	at com.carrotsearch.randomizedtesting.RandomizedRunner$5.evaluate(RandomizedRunner.java:781)
	at com.carrotsearch.randomizedtesting.RandomizedRunner$6.evaluate(RandomizedRunner.java:816)
	at com.carrotsearch.randomizedtesting.RandomizedRunner$7.evaluate(RandomizedRunner.java:827)
	at com.carrotsearch.randomizedtesting.rules.StatementAdapter.evaluate(StatementAdapter.java:36)
	at com.carrotsearch.randomizedtesting.rules.SystemPropertiesRestoreRule$1.evaluate(SystemPropertiesRestoreRule.java:57)
	at org.apache.lucene.util.AbstractBeforeAfterRule$1.evaluate(AbstractBeforeAfterRule.java:46)
	at com.carrotsearch.randomizedtesting.rules.StatementAdapter.evaluate(StatementAdapter.java:36)
	at org.apache.lucene.util.TestRuleStoreClassName$1.evaluate(TestRuleStoreClassName.java:42)
	at com.carrotsearch.randomizedtesting.rules.NoShadowingOrOverridesOnMethodsRule$1.evaluate(NoShadowingOrOverridesOnMethodsRule.java:40)
	at com.carrotsearch.randomizedtesting.rules.NoShadowingOrOverridesOnMethodsRule$1.evaluate(NoShadowingOrOverridesOnMethodsRule.java:40)
	at com.carrotsearch.randomizedtesting.rules.StatementAdapter.evaluate(StatementAdapter.java:36)
	at com.carrotsearch.randomizedtesting.rules.StatementAdapter.evaluate(StatementAdapter.java:36)
	at com.carrotsearch.randomizedtesting.rules.StatementAdapter.evaluate(StatementAdapter.java:36)
	at org.apache.lucene.util.TestRuleAssertionsRequired$1.evaluate(TestRuleAssertionsRequired.java:54)
	at org.apache.lucene.util.TestRuleMarkFailure$1.evaluate(TestRuleMarkFailure.java:48)
	at org.apache.lucene.util.TestRuleIgnoreAfterMaxFailures$1.evaluate(TestRuleIgnoreAfterMaxFailures.java:65)
	at org.apache.lucene.util.TestRuleIgnoreTestSuites$1.evaluate(TestRuleIgnoreTestSuites.java:55)
	at com.carrotsearch.randomizedtesting.rules.StatementAdapter.evaluate(StatementAdapter.java:36)
	at com.carrotsearch.randomizedtesting.ThreadLeakControl$StatementRunner.run(ThreadLeakControl.java:367)
	at java.lang.Thread.run(Thread.java:745)


FAILED:  org.apache.solr.cloud.LeaderFailoverAfterPartitionTest.test

Error Message:
Doc with id=4 not found in http://127.0.0.1:45755/_zad/lg/c8n_1x3_lf due to: Path not found: /id; rsp={doc=null}

Stack Trace:
java.lang.AssertionError: Doc with id=4 not found in http://127.0.0.1:45755/_zad/lg/c8n_1x3_lf due to: Path not found: /id; rsp={doc=null}
	at __randomizedtesting.SeedInfo.seed([794764EE032C08CC:F1135B34ADD06534]:0)
	at org.junit.Assert.fail(Assert.java:93)
	at org.junit.Assert.assertTrue(Assert.java:43)
	at org.apache.solr.cloud.HttpPartitionTest.assertDocExists(HttpPartitionTest.java:620)
	at org.apache.solr.cloud.HttpPartitionTest.assertDocsExistInAllReplicas(HttpPartitionTest.java:575)
	at org.apache.solr.cloud.LeaderFailoverAfterPartitionTest.testRf3WithLeaderFailover(LeaderFailoverAfterPartitionTest.java:103)
	at org.apache.solr.cloud.LeaderFailoverAfterPartitionTest.test(LeaderFailoverAfterPartitionTest.java:56)
	at sun.reflect.NativeMethodAccessorImpl.invoke0(Native Method)
	at sun.reflect.NativeMethodAccessorImpl.invoke(NativeMethodAccessorImpl.java:57)
	at sun.reflect.DelegatingMethodAccessorImpl.invoke(DelegatingMethodAccessorImpl.java:43)
	at java.lang.reflect.Method.invoke(Method.java:606)
	at com.carrotsearch.randomizedtesting.RandomizedRunner.invoke(RandomizedRunner.java:1764)
	at com.carrotsearch.randomizedtesting.RandomizedRunner$8.evaluate(RandomizedRunner.java:871)
	at com.carrotsearch.randomizedtesting.RandomizedRunner$9.evaluate(RandomizedRunner.java:907)
	at com.carrotsearch.randomizedtesting.RandomizedRunner$10.evaluate(RandomizedRunner.java:921)
	at org.apache.solr.BaseDistributedSearchTestCase$ShardsRepeatRule$ShardsFixedStatement.callStatement(BaseDistributedSearchTestCase.java:965)
	at org.apache.solr.BaseDistributedSearchTestCase$ShardsRepeatRule$ShardsStatement.evaluate(BaseDistributedSearchTestCase.java:940)
	at com.carrotsearch.randomizedtesting.rules.SystemPropertiesRestoreRule$1.evaluate(SystemPropertiesRestoreRule.java:57)
	at org.apache.lucene.util.TestRuleSetupTeardownChained$1.evaluate(TestRuleSetupTeardownChained.java:50)
	at org.apache.lucene.util.AbstractBeforeAfterRule$1.evaluate(AbstractBeforeAfterRule.java:46)
	at org.apache.lucene.util.TestRuleThreadAndTestName$1.evaluate(TestRuleThreadAndTestName.java:49)
	at org.apache.lucene.util.TestRuleIgnoreAfterMaxFailures$1.evaluate(TestRuleIgnoreAfterMaxFailures.java:65)
	at org.apache.lucene.util.TestRuleMarkFailure$1.evaluate(TestRuleMarkFailure.java:48)
	at com.carrotsearch.randomizedtesting.rules.StatementAdapter.evaluate(StatementAdapter.java:36)
	at com.carrotsearch.randomizedtesting.ThreadLeakControl$StatementRunner.run(ThreadLeakControl.java:367)
	at com.carrotsearch.randomizedtesting.ThreadLeakControl.forkTimeoutingTask(ThreadLeakControl.java:809)
	at com.carrotsearch.randomizedtesting.ThreadLeakControl$3.evaluate(ThreadLeakControl.java:460)
	at com.carrotsearch.randomizedtesting.RandomizedRunner.runSingleTest(RandomizedRunner.java:880)
	at com.carrotsearch.randomizedtesting.RandomizedRunner$5.evaluate(RandomizedRunner.java:781)
	at com.carrotsearch.randomizedtesting.RandomizedRunner$6.evaluate(RandomizedRunner.java:816)
	at com.carrotsearch.randomizedtesting.RandomizedRunner$7.evaluate(RandomizedRunner.java:827)
	at com.carrotsearch.randomizedtesting.rules.StatementAdapter.evaluate(StatementAdapter.java:36)
	at com.carrotsearch.randomizedtesting.rules.SystemPropertiesRestoreRule$1.evaluate(SystemPropertiesRestoreRule.java:57)
	at org.apache.lucene.util.AbstractBeforeAfterRule$1.evaluate(AbstractBeforeAfterRule.java:46)
	at com.carrotsearch.randomizedtesting.rules.StatementAdapter.evaluate(StatementAdapter.java:36)
	at org.apache.lucene.util.TestRuleStoreClassName$1.evaluate(TestRuleStoreClassName.java:42)
	at com.carrotsearch.randomizedtesting.rules.NoShadowingOrOverridesOnMethodsRule$1.evaluate(NoShadowingOrOverridesOnMethodsRule.java:40)
	at com.carrotsearch.randomizedtesting.rules.NoShadowingOrOverridesOnMethodsRule$1.evaluate(NoShadowingOrOverridesOnMethodsRule.java:40)
	at com.carrotsearch.randomizedtesting.rules.StatementAdapter.evaluate(StatementAdapter.java:36)
	at com.carrotsearch.randomizedtesting.rules.StatementAdapter.evaluate(StatementAdapter.java:36)
	at com.carrotsearch.randomizedtesting.rules.StatementAdapter.evaluate(StatementAdapter.java:36)
	at org.apache.lucene.util.TestRuleAssertionsRequired$1.evaluate(TestRuleAssertionsRequired.java:54)
	at org.apache.lucene.util.TestRuleMarkFailure$1.evaluate(TestRuleMarkFailure.java:48)
	at org.apache.lucene.util.TestRuleIgnoreAfterMaxFailures$1.evaluate(TestRuleIgnoreAfterMaxFailures.java:65)
	at org.apache.lucene.util.TestRuleIgnoreTestSuites$1.evaluate(TestRuleIgnoreTestSuites.java:55)
	at com.carrotsearch.randomizedtesting.rules.StatementAdapter.evaluate(StatementAdapter.java:36)
	at com.carrotsearch.randomizedtesting.ThreadLeakControl$StatementRunner.run(ThreadLeakControl.java:367)
	at java.lang.Thread.run(Thread.java:745)


FAILED:  org.apache.solr.cloud.SyncSliceTest.test

Error Message:


Stack Trace:
java.lang.AssertionError
	at __randomizedtesting.SeedInfo.seed([794764EE032C08CC:F1135B34ADD06534]:0)
	at org.junit.Assert.fail(Assert.java:92)
	at org.junit.Assert.assertTrue(Assert.java:43)
	at org.junit.Assert.assertNotNull(Assert.java:526)
	at org.junit.Assert.assertNotNull(Assert.java:537)
	at org.apache.solr.cloud.SyncSliceTest.test(SyncSliceTest.java:101)
	at sun.reflect.NativeMethodAccessorImpl.invoke0(Native Method)
	at sun.reflect.NativeMethodAccessorImpl.invoke(NativeMethodAccessorImpl.java:57)
	at sun.reflect.DelegatingMethodAccessorImpl.invoke(DelegatingMethodAccessorImpl.java:43)
	at java.lang.reflect.Method.invoke(Method.java:606)
	at com.carrotsearch.randomizedtesting.RandomizedRunner.invoke(RandomizedRunner.java:1764)
	at com.carrotsearch.randomizedtesting.RandomizedRunner$8.evaluate(RandomizedRunner.java:871)
	at com.carrotsearch.randomizedtesting.RandomizedRunner$9.evaluate(RandomizedRunner.java:907)
	at com.carrotsearch.randomizedtesting.RandomizedRunner$10.evaluate(RandomizedRunner.java:921)
	at org.apache.solr.BaseDistributedSearchTestCase$ShardsRepeatRule$ShardsFixedStatement.callStatement(BaseDistributedSearchTestCase.java:965)
	at org.apache.solr.BaseDistributedSearchTestCase$ShardsRepeatRule$ShardsStatement.evaluate(BaseDistributedSearchTestCase.java:940)
	at com.carrotsearch.randomizedtesting.rules.SystemPropertiesRestoreRule$1.evaluate(SystemPropertiesRestoreRule.java:57)
	at org.apache.lucene.util.TestRuleSetupTeardownChained$1.evaluate(TestRuleSetupTeardownChained.java:50)
	at org.apache.lucene.util.AbstractBeforeAfterRule$1.evaluate(AbstractBeforeAfterRule.java:46)
	at org.apache.lucene.util.TestRuleThreadAndTestName$1.evaluate(TestRuleThreadAndTestName.java:49)
	at org.apache.lucene.util.TestRuleIgnoreAfterMaxFailures$1.evaluate(TestRuleIgnoreAfterMaxFailures.java:65)
	at org.apache.lucene.util.TestRuleMarkFailure$1.evaluate(TestRuleMarkFailure.java:48)
	at com.carrotsearch.randomizedtesting.rules.StatementAdapter.evaluate(StatementAdapter.java:36)
	at com.carrotsearch.randomizedtesting.ThreadLeakControl$StatementRunner.run(ThreadLeakControl.java:367)
	at com.carrotsearch.randomizedtesting.ThreadLeakControl.forkTimeoutingTask(ThreadLeakControl.java:809)
	at com.carrotsearch.randomizedtesting.ThreadLeakControl$3.evaluate(ThreadLeakControl.java:460)
	at com.carrotsearch.randomizedtesting.RandomizedRunner.runSingleTest(RandomizedRunner.java:880)
	at com.carrotsearch.randomizedtesting.RandomizedRunner$5.evaluate(RandomizedRunner.java:781)
	at com.carrotsearch.randomizedtesting.RandomizedRunner$6.evaluate(RandomizedRunner.java:816)
	at com.carrotsearch.randomizedtesting.RandomizedRunner$7.evaluate(RandomizedRunner.java:827)
	at com.carrotsearch.randomizedtesting.rules.StatementAdapter.evaluate(StatementAdapter.java:36)
	at com.carrotsearch.randomizedtesting.rules.SystemPropertiesRestoreRule$1.evaluate(SystemPropertiesRestoreRule.java:57)
	at org.apache.lucene.util.AbstractBeforeAfterRule$1.evaluate(AbstractBeforeAfterRule.java:46)
	at com.carrotsearch.randomizedtesting.rules.StatementAdapter.evaluate(StatementAdapter.java:36)
	at org.apache.lucene.util.TestRuleStoreClassName$1.evaluate(TestRuleStoreClassName.java:42)
	at com.carrotsearch.randomizedtesting.rules.NoShadowingOrOverridesOnMethodsRule$1.evaluate(NoShadowingOrOverridesOnMethodsRule.java:40)
	at com.carrotsearch.randomizedtesting.rules.NoShadowingOrOverridesOnMethodsRule$1.evaluate(NoShadowingOrOverridesOnMethodsRule.java:40)
	at com.carrotsearch.randomizedtesting.rules.StatementAdapter.evaluate(StatementAdapter.java:36)
	at com.carrotsearch.randomizedtesting.rules.StatementAdapter.evaluate(StatementAdapter.java:36)
	at com.carrotsearch.randomizedtesting.rules.StatementAdapter.evaluate(StatementAdapter.java:36)
	at org.apache.lucene.util.TestRuleAssertionsRequired$1.evaluate(TestRuleAssertionsRequired.java:54)
	at org.apache.lucene.util.TestRuleMarkFailure$1.evaluate(TestRuleMarkFailure.java:48)
	at org.apache.lucene.util.TestRuleIgnoreAfterMaxFailures$1.evaluate(TestRuleIgnoreAfterMaxFailures.java:65)
	at org.apache.lucene.util.TestRuleIgnoreTestSuites$1.evaluate(TestRuleIgnoreTestSuites.java:55)
	at com.carrotsearch.randomizedtesting.rules.StatementAdapter.evaluate(StatementAdapter.java:36)
	at com.carrotsearch.randomizedtesting.ThreadLeakControl$StatementRunner.run(ThreadLeakControl.java:367)
	at java.lang.Thread.run(Thread.java:745)


FAILED:  org.apache.solr.cloud.TestDistribDocBasedVersion.test

Error Message:
expected:<{c!doc2=11, b!doc1=10, e!doc4=11, d!doc3=10}> but was:<{c!doc2=11, b!doc1=10}>

Stack Trace:
java.lang.AssertionError: expected:<{c!doc2=11, b!doc1=10, e!doc4=11, d!doc3=10}> but was:<{c!doc2=11, b!doc1=10}>
	at __randomizedtesting.SeedInfo.seed([794764EE032C08CC:F1135B34ADD06534]:0)
	at org.junit.Assert.fail(Assert.java:93)
	at org.junit.Assert.failNotEquals(Assert.java:647)
	at org.junit.Assert.assertEquals(Assert.java:128)
	at org.junit.Assert.assertEquals(Assert.java:147)
	at org.apache.solr.cloud.TestDistribDocBasedVersion.doRTG(TestDistribDocBasedVersion.java:329)
	at org.apache.solr.cloud.TestDistribDocBasedVersion.doTestDocVersions(TestDistribDocBasedVersion.java:152)
	at org.apache.solr.cloud.TestDistribDocBasedVersion.test(TestDistribDocBasedVersion.java:105)
	at sun.reflect.NativeMethodAccessorImpl.invoke0(Native Method)
	at sun.reflect.NativeMethodAccessorImpl.invoke(NativeMethodAccessorImpl.java:57)
	at sun.reflect.DelegatingMethodAccessorImpl.invoke(DelegatingMethodAccessorImpl.java:43)
	at java.lang.reflect.Method.invoke(Method.java:606)
	at com.carrotsearch.randomizedtesting.RandomizedRunner.invoke(RandomizedRunner.java:1764)
	at com.carrotsearch.randomizedtesting.RandomizedRunner$8.evaluate(RandomizedRunner.java:871)
	at com.carrotsearch.randomizedtesting.RandomizedRunner$9.evaluate(RandomizedRunner.java:907)
	at com.carrotsearch.randomizedtesting.RandomizedRunner$10.evaluate(RandomizedRunner.java:921)
	at org.apache.solr.BaseDistributedSearchTestCase$ShardsRepeatRule$ShardsFixedStatement.callStatement(BaseDistributedSearchTestCase.java:965)
	at org.apache.solr.BaseDistributedSearchTestCase$ShardsRepeatRule$ShardsStatement.evaluate(BaseDistributedSearchTestCase.java:940)
	at com.carrotsearch.randomizedtesting.rules.SystemPropertiesRestoreRule$1.evaluate(SystemPropertiesRestoreRule.java:57)
	at org.apache.lucene.util.TestRuleSetupTeardownChained$1.evaluate(TestRuleSetupTeardownChained.java:50)
	at org.apache.lucene.util.AbstractBeforeAfterRule$1.evaluate(AbstractBeforeAfterRule.java:46)
	at org.apache.lucene.util.TestRuleThreadAndTestName$1.evaluate(TestRuleThreadAndTestName.java:49)
	at org.apache.lucene.util.TestRuleIgnoreAfterMaxFailures$1.evaluate(TestRuleIgnoreAfterMaxFailures.java:65)
	at org.apache.lucene.util.TestRuleMarkFailure$1.evaluate(TestRuleMarkFailure.java:48)
	at com.carrotsearch.randomizedtesting.rules.StatementAdapter.evaluate(StatementAdapter.java:36)
	at com.carrotsearch.randomizedtesting.ThreadLeakControl$StatementRunner.run(ThreadLeakControl.java:367)
	at com.carrotsearch.randomizedtesting.ThreadLeakControl.forkTimeoutingTask(ThreadLeakControl.java:809)
	at com.carrotsearch.randomizedtesting.ThreadLeakControl$3.evaluate(ThreadLeakControl.java:460)
	at com.carrotsearch.randomizedtesting.RandomizedRunner.runSingleTest(RandomizedRunner.java:880)
	at com.carrotsearch.randomizedtesting.RandomizedRunner$5.evaluate(RandomizedRunner.java:781)
	at com.carrotsearch.randomizedtesting.RandomizedRunner$6.evaluate(RandomizedRunner.java:816)
	at com.carrotsearch.randomizedtesting.RandomizedRunner$7.evaluate(RandomizedRunner.java:827)
	at com.carrotsearch.randomizedtesting.rules.StatementAdapter.evaluate(StatementAdapter.java:36)
	at com.carrotsearch.randomizedtesting.rules.SystemPropertiesRestoreRule$1.evaluate(SystemPropertiesRestoreRule.java:57)
	at org.apache.lucene.util.AbstractBeforeAfterRule$1.evaluate(AbstractBeforeAfterRule.java:46)
	at com.carrotsearch.randomizedtesting.rules.StatementAdapter.evaluate(StatementAdapter.java:36)
	at org.apache.lucene.util.TestRuleStoreClassName$1.evaluate(TestRuleStoreClassName.java:42)
	at com.carrotsearch.randomizedtesting.rules.NoShadowingOrOverridesOnMethodsRule$1.evaluate(NoShadowingOrOverridesOnMethodsRule.java:40)
	at com.carrotsearch.randomizedtesting.rules.NoShadowingOrOverridesOnMethodsRule$1.evaluate(NoShadowingOrOverridesOnMethodsRule.java:40)
	at com.carrotsearch.randomizedtesting.rules.StatementAdapter.evaluate(StatementAdapter.java:36)
	at com.carrotsearch.randomizedtesting.rules.StatementAdapter.evaluate(StatementAdapter.java:36)
	at com.carrotsearch.randomizedtesting.rules.StatementAdapter.evaluate(StatementAdapter.java:36)
	at org.apache.lucene.util.TestRuleAssertionsRequired$1.evaluate(TestRuleAssertionsRequired.java:54)
	at org.apache.lucene.util.TestRuleMarkFailure$1.evaluate(TestRuleMarkFailure.java:48)
	at org.apache.lucene.util.TestRuleIgnoreAfterMaxFailures$1.evaluate(TestRuleIgnoreAfterMaxFailures.java:65)
	at org.apache.lucene.util.TestRuleIgnoreTestSuites$1.evaluate(TestRuleIgnoreTestSuites.java:55)
	at com.carrotsearch.randomizedtesting.rules.StatementAdapter.evaluate(StatementAdapter.java:36)
	at com.carrotsearch.randomizedtesting.ThreadLeakControl$StatementRunner.run(ThreadLeakControl.java:367)
	at java.lang.Thread.run(Thread.java:745)


FAILED:  org.apache.solr.cloud.UnloadDistributedZkTest.test

Error Message:
No registered leader was found after waiting for 15000ms , collection: unloadcollection slice: shard1

Stack Trace:
org.apache.solr.common.SolrException: No registered leader was found after waiting for 15000ms , collection: unloadcollection slice: shard1
	at __randomizedtesting.SeedInfo.seed([794764EE032C08CC:F1135B34ADD06534]:0)
	at org.apache.solr.common.cloud.ZkStateReader.getLeaderRetry(ZkStateReader.java:608)
	at org.apache.solr.common.cloud.ZkStateReader.getLeaderUrl(ZkStateReader.java:576)
	at org.apache.solr.cloud.UnloadDistributedZkTest.testCoreUnloadAndLeaders(UnloadDistributedZkTest.java:287)
	at org.apache.solr.cloud.UnloadDistributedZkTest.test(UnloadDistributedZkTest.java:68)
	at sun.reflect.NativeMethodAccessorImpl.invoke0(Native Method)
	at sun.reflect.NativeMethodAccessorImpl.invoke(NativeMethodAccessorImpl.java:57)
	at sun.reflect.DelegatingMethodAccessorImpl.invoke(DelegatingMethodAccessorImpl.java:43)
	at java.lang.reflect.Method.invoke(Method.java:606)
	at com.carrotsearch.randomizedtesting.RandomizedRunner.invoke(RandomizedRunner.java:1764)
	at com.carrotsearch.randomizedtesting.RandomizedRunner$8.evaluate(RandomizedRunner.java:871)
	at com.carrotsearch.randomizedtesting.RandomizedRunner$9.evaluate(RandomizedRunner.java:907)
	at com.carrotsearch.randomizedtesting.RandomizedRunner$10.evaluate(RandomizedRunner.java:921)
	at org.apache.solr.BaseDistributedSearchTestCase$ShardsRepeatRule$ShardsFixedStatement.callStatement(BaseDistributedSearchTestCase.java:965)
	at org.apache.solr.BaseDistributedSearchTestCase$ShardsRepeatRule$ShardsStatement.evaluate(BaseDistributedSearchTestCase.java:940)
	at com.carrotsearch.randomizedtesting.rules.SystemPropertiesRestoreRule$1.evaluate(SystemPropertiesRestoreRule.java:57)
	at org.apache.lucene.util.TestRuleSetupTeardownChained$1.evaluate(TestRuleSetupTeardownChained.java:50)
	at org.apache.lucene.util.AbstractBeforeAfterRule$1.evaluate(AbstractBeforeAfterRule.java:46)
	at org.apache.lucene.util.TestRuleThreadAndTestName$1.evaluate(TestRuleThreadAndTestName.java:49)
	at org.apache.lucene.util.TestRuleIgnoreAfterMaxFailures$1.evaluate(TestRuleIgnoreAfterMaxFailures.java:65)
	at org.apache.lucene.util.TestRuleMarkFailure$1.evaluate(TestRuleMarkFailure.java:48)
	at com.carrotsearch.randomizedtesting.rules.StatementAdapter.evaluate(StatementAdapter.java:36)
	at com.carrotsearch.randomizedtesting.ThreadLeakControl$StatementRunner.run(ThreadLeakControl.java:367)
	at com.carrotsearch.randomizedtesting.ThreadLeakControl.forkTimeoutingTask(ThreadLeakControl.java:809)
	at com.carrotsearch.randomizedtesting.ThreadLeakControl$3.evaluate(ThreadLeakControl.java:460)
	at com.carrotsearch.randomizedtesting.RandomizedRunner.runSingleTest(RandomizedRunner.java:880)
	at com.carrotsearch.randomizedtesting.RandomizedRunner$5.evaluate(RandomizedRunner.java:781)
	at com.carrotsearch.randomizedtesting.RandomizedRunner$6.evaluate(RandomizedRunner.java:816)
	at com.carrotsearch.randomizedtesting.RandomizedRunner$7.evaluate(RandomizedRunner.java:827)
	at com.carrotsearch.randomizedtesting.rules.StatementAdapter.evaluate(StatementAdapter.java:36)
	at com.carrotsearch.randomizedtesting.rules.SystemPropertiesRestoreRule$1.evaluate(SystemPropertiesRestoreRule.java:57)
	at org.apache.lucene.util.AbstractBeforeAfterRule$1.evaluate(AbstractBeforeAfterRule.java:46)
	at com.carrotsearch.randomizedtesting.rules.StatementAdapter.evaluate(StatementAdapter.java:36)
	at org.apache.lucene.util.TestRuleStoreClassName$1.evaluate(TestRuleStoreClassName.java:42)
	at com.carrotsearch.randomizedtesting.rules.NoShadowingOrOverridesOnMethodsRule$1.evaluate(NoShadowingOrOverridesOnMethodsRule.java:40)
	at com.carrotsearch.randomizedtesting.rules.NoShadowingOrOverridesOnMethodsRule$1.evaluate(NoShadowingOrOverridesOnMethodsRule.java:40)
	at com.carrotsearch.randomizedtesting.rules.StatementAdapter.evaluate(StatementAdapter.java:36)
	at com.carrotsearch.randomizedtesting.rules.StatementAdapter.evaluate(StatementAdapter.java:36)
	at com.carrotsearch.randomizedtesting.rules.StatementAdapter.evaluate(StatementAdapter.java:36)
	at org.apache.lucene.util.TestRuleAssertionsRequired$1.evaluate(TestRuleAssertionsRequired.java:54)
	at org.apache.lucene.util.TestRuleMarkFailure$1.evaluate(TestRuleMarkFailure.java:48)
	at org.apache.lucene.util.TestRuleIgnoreAfterMaxFailures$1.evaluate(TestRuleIgnoreAfterMaxFailures.java:65)
	at org.apache.lucene.util.TestRuleIgnoreTestSuites$1.evaluate(TestRuleIgnoreTestSuites.java:55)
	at com.carrotsearch.randomizedtesting.rules.StatementAdapter.evaluate(StatementAdapter.java:36)
	at com.carrotsearch.randomizedtesting.ThreadLeakControl$StatementRunner.run(ThreadLeakControl.java:367)
	at java.lang.Thread.run(Thread.java:745)


FAILED:  org.apache.solr.security.BasicAuthIntegrationTest.testBasics

Error Message:
expected:<1> but was:<0>

Stack Trace:
java.lang.AssertionError: expected:<1> but was:<0>
	at __randomizedtesting.SeedInfo.seed([794764EE032C08CC:449FCAC23BC256BC]:0)
	at org.junit.Assert.fail(Assert.java:93)
	at org.junit.Assert.failNotEquals(Assert.java:647)
	at org.junit.Assert.assertEquals(Assert.java:128)
	at org.junit.Assert.assertEquals(Assert.java:472)
	at org.junit.Assert.assertEquals(Assert.java:456)
	at org.apache.solr.cloud.TestMiniSolrCloudClusterBase.testCollectionCreateSearchDelete(TestMiniSolrCloudClusterBase.java:149)
	at org.apache.solr.cloud.TestMiniSolrCloudClusterBase.testBasics(TestMiniSolrCloudClusterBase.java:78)
	at sun.reflect.NativeMethodAccessorImpl.invoke0(Native Method)
	at sun.reflect.NativeMethodAccessorImpl.invoke(NativeMethodAccessorImpl.java:57)
	at sun.reflect.DelegatingMethodAccessorImpl.invoke(DelegatingMethodAccessorImpl.java:43)
	at java.lang.reflect.Method.invoke(Method.java:606)
	at com.carrotsearch.randomizedtesting.RandomizedRunner.invoke(RandomizedRunner.java:1764)
	at com.carrotsearch.randomizedtesting.RandomizedRunner$8.evaluate(RandomizedRunner.java:871)
	at com.carrotsearch.randomizedtesting.RandomizedRunner$9.evaluate(RandomizedRunner.java:907)
	at com.carrotsearch.randomizedtesting.RandomizedRunner$10.evaluate(RandomizedRunner.java:921)
	at com.carrotsearch.randomizedtesting.rules.SystemPropertiesRestoreRule$1.evaluate(SystemPropertiesRestoreRule.java:57)
	at org.apache.lucene.util.TestRuleSetupTeardownChained$1.evaluate(TestRuleSetupTeardownChained.java:50)
	at org.apache.lucene.util.AbstractBeforeAfterRule$1.evaluate(AbstractBeforeAfterRule.java:46)
	at org.apache.lucene.util.TestRuleThreadAndTestName$1.evaluate(TestRuleThreadAndTestName.java:49)
	at org.apache.lucene.util.TestRuleIgnoreAfterMaxFailures$1.evaluate(TestRuleIgnoreAfterMaxFailures.java:65)
	at org.apache.lucene.util.TestRuleMarkFailure$1.evaluate(TestRuleMarkFailure.java:48)
	at com.carrotsearch.randomizedtesting.rules.StatementAdapter.evaluate(StatementAdapter.java:36)
	at com.carrotsearch.randomizedtesting.ThreadLeakControl$StatementRunner.run(ThreadLeakControl.java:367)
	at com.carrotsearch.randomizedtesting.ThreadLeakControl.forkTimeoutingTask(ThreadLeakControl.java:809)
	at com.carrotsearch.randomizedtesting.ThreadLeakControl$3.evaluate(ThreadLeakControl.java:460)
	at com.carrotsearch.randomizedtesting.RandomizedRunner.runSingleTest(RandomizedRunner.java:880)
	at com.carrotsearch.randomizedtesting.RandomizedRunner$5.evaluate(RandomizedRunner.java:781)
	at com.carrotsearch.randomizedtesting.RandomizedRunner$6.evaluate(RandomizedRunner.java:816)
	at com.carrotsearch.randomizedtesting.RandomizedRunner$7.evaluate(RandomizedRunner.java:827)
	at com.carrotsearch.randomizedtesting.rules.StatementAdapter.evaluate(StatementAdapter.java:36)
	at com.carrotsearch.randomizedtesting.rules.SystemPropertiesRestoreRule$1.evaluate(SystemPropertiesRestoreRule.java:57)
	at org.apache.lucene.util.AbstractBeforeAfterRule$1.evaluate(AbstractBeforeAfterRule.java:46)
	at com.carrotsearch.randomizedtesting.rules.StatementAdapter.evaluate(StatementAdapter.java:36)
	at org.apache.lucene.util.TestRuleStoreClassName$1.evaluate(TestRuleStoreClassName.java:42)
	at com.carrotsearch.randomizedtesting.rules.NoShadowingOrOverridesOnMethodsRule$1.evaluate(NoShadowingOrOverridesOnMethodsRule.java:40)
	at com.carrotsearch.randomizedtesting.rules.NoShadowingOrOverridesOnMethodsRule$1.evaluate(NoShadowingOrOverridesOnMethodsRule.java:40)
	at com.carrotsearch.randomizedtesting.rules.StatementAdapter.evaluate(StatementAdapter.java:36)
	at com.carrotsearch.randomizedtesting.rules.StatementAdapter.evaluate(StatementAdapter.java:36)
	at com.carrotsearch.randomizedtesting.rules.StatementAdapter.evaluate(StatementAdapter.java:36)
	at org.apache.lucene.util.TestRuleAssertionsRequired$1.evaluate(TestRuleAssertionsRequired.java:54)
	at org.apache.lucene.util.TestRuleMarkFailure$1.evaluate(TestRuleMarkFailure.java:48)
	at org.apache.lucene.util.TestRuleIgnoreAfterMaxFailures$1.evaluate(TestRuleIgnoreAfterMaxFailures.java:65)
	at org.apache.lucene.util.TestRuleIgnoreTestSuites$1.evaluate(TestRuleIgnoreTestSuites.java:55)
	at com.carrotsearch.randomizedtesting.rules.StatementAdapter.evaluate(StatementAdapter.java:36)
	at com.carrotsearch.randomizedtesting.ThreadLeakControl$StatementRunner.run(ThreadLeakControl.java:367)
	at java.lang.Thread.run(Thread.java:745)


FAILED:  org.apache.solr.update.processor.TestNamedUpdateProcessors.test

Error Message:
Index: 0, Size: 0

Stack Trace:
java.lang.IndexOutOfBoundsException: Index: 0, Size: 0
	at __randomizedtesting.SeedInfo.seed([794764EE032C08CC:F1135B34ADD06534]:0)
	at java.util.ArrayList.rangeCheck(ArrayList.java:635)
	at java.util.ArrayList.get(ArrayList.java:411)
	at org.apache.solr.update.processor.TestNamedUpdateProcessors.test(TestNamedUpdateProcessors.java:124)
	at sun.reflect.NativeMethodAccessorImpl.invoke0(Native Method)
	at sun.reflect.NativeMethodAccessorImpl.invoke(NativeMethodAccessorImpl.java:57)
	at sun.reflect.DelegatingMethodAccessorImpl.invoke(DelegatingMethodAccessorImpl.java:43)
	at java.lang.reflect.Method.invoke(Method.java:606)
	at com.carrotsearch.randomizedtesting.RandomizedRunner.invoke(RandomizedRunner.java:1764)
	at com.carrotsearch.randomizedtesting.RandomizedRunner$8.evaluate(RandomizedRunner.java:871)
	at com.carrotsearch.randomizedtesting.RandomizedRunner$9.evaluate(RandomizedRunner.java:907)
	at com.carrotsearch.randomizedtesting.RandomizedRunner$10.evaluate(RandomizedRunner.java:921)
	at org.apache.solr.BaseDistributedSearchTestCase$ShardsRepeatRule$ShardsFixedStatement.callStatement(BaseDistributedSearchTestCase.java:965)
	at org.apache.solr.BaseDistributedSearchTestCase$ShardsRepeatRule$ShardsStatement.evaluate(BaseDistributedSearchTestCase.java:940)
	at com.carrotsearch.randomizedtesting.rules.SystemPropertiesRestoreRule$1.evaluate(SystemPropertiesRestoreRule.java:57)
	at org.apache.lucene.util.TestRuleSetupTeardownChained$1.evaluate(TestRuleSetupTeardownChained.java:50)
	at org.apache.lucene.util.AbstractBeforeAfterRule$1.evaluate(AbstractBeforeAfterRule.java:46)
	at org.apache.lucene.util.TestRuleThreadAndTestName$1.evaluate(TestRuleThreadAndTestName.java:49)
	at org.apache.lucene.util.TestRuleIgnoreAfterMaxFailures$1.evaluate(TestRuleIgnoreAfterMaxFailures.java:65)
	at org.apache.lucene.util.TestRuleMarkFailure$1.evaluate(TestRuleMarkFailure.java:48)
	at com.carrotsearch.randomizedtesting.rules.StatementAdapter.evaluate(StatementAdapter.java:36)
	at com.carrotsearch.randomizedtesting.ThreadLeakControl$StatementRunner.run(ThreadLeakControl.java:367)
	at com.carrotsearch.randomizedtesting.ThreadLeakControl.forkTimeoutingTask(ThreadLeakControl.java:809)
	at com.carrotsearch.randomizedtesting.ThreadLeakControl$3.evaluate(ThreadLeakControl.java:460)
	at com.carrotsearch.randomizedtesting.RandomizedRunner.runSingleTest(RandomizedRunner.java:880)
	at com.carrotsearch.randomizedtesting.RandomizedRunner$5.evaluate(RandomizedRunner.java:781)
	at com.carrotsearch.randomizedtesting.RandomizedRunner$6.evaluate(RandomizedRunner.java:816)
	at com.carrotsearch.randomizedtesting.RandomizedRunner$7.evaluate(RandomizedRunner.java:827)
	at com.carrotsearch.randomizedtesting.rules.StatementAdapter.evaluate(StatementAdapter.java:36)
	at com.carrotsearch.randomizedtesting.rules.SystemPropertiesRestoreRule$1.evaluate(SystemPropertiesRestoreRule.java:57)
	at org.apache.lucene.util.AbstractBeforeAfterRule$1.evaluate(AbstractBeforeAfterRule.java:46)
	at com.carrotsearch.randomizedtesting.rules.StatementAdapter.evaluate(StatementAdapter.java:36)
	at org.apache.lucene.util.TestRuleStoreClassName$1.evaluate(TestRuleStoreClassName.java:42)
	at com.carrotsearch.randomizedtesting.rules.NoShadowingOrOverridesOnMethodsRule$1.evaluate(NoShadowingOrOverridesOnMethodsRule.java:40)
	at com.carrotsearch.randomizedtesting.rules.NoShadowingOrOverridesOnMethodsRule$1.evaluate(NoShadowingOrOverridesOnMethodsRule.java:40)
	at com.carrotsearch.randomizedtesting.rules.StatementAdapter.evaluate(StatementAdapter.java:36)
	at com.carrotsearch.randomizedtesting.rules.StatementAdapter.evaluate(StatementAdapter.java:36)
	at com.carrotsearch.randomizedtesting.rules.StatementAdapter.evaluate(StatementAdapter.java:36)
	at org.apache.lucene.util.TestRuleAssertionsRequired$1.evaluate(TestRuleAssertionsRequired.java:54)
	at org.apache.lucene.util.TestRuleMarkFailure$1.evaluate(TestRuleMarkFailure.java:48)
	at org.apache.lucene.util.TestRuleIgnoreAfterMaxFailures$1.evaluate(TestRuleIgnoreAfterMaxFailures.java:65)
	at org.apache.lucene.util.TestRuleIgnoreTestSuites$1.evaluate(TestRuleIgnoreTestSuites.java:55)
	at com.carrotsearch.randomizedtesting.rules.StatementAdapter.evaluate(StatementAdapter.java:36)
	at com.carrotsearch.randomizedtesting.ThreadLeakControl$StatementRunner.run(ThreadLeakControl.java:367)
	at java.lang.Thread.run(Thread.java:745)




Build Log:
[...truncated 9929 lines...]
   [junit4] Suite: org.apache.solr.cloud.DistribDocExpirationUpdateProcessorTest
   [junit4]   2> Creating dataDir: /export/home/jenkins/workspace/Lucene-Solr-5.x-Solaris/solr/build/solr-core/test/J0/temp/solr.cloud.DistribDocExpirationUpdateProcessorTest_794764EE032C08CC-001/init-core-data-001
   [junit4]   2> 291896 INFO  (SUITE-DistribDocExpirationUpdateProcessorTest-seed#[794764EE032C08CC]-worker) [    ] o.a.s.SolrTestCaseJ4 Randomized ssl (true) and clientAuth (true)
   [junit4]   2> 291896 INFO  (SUITE-DistribDocExpirationUpdateProcessorTest-seed#[794764EE032C08CC]-worker) [    ] o.a.s.BaseDistributedSearchTestCase Setting hostContext system property: /oe_b/so
   [junit4]   2> 291899 INFO  (TEST-DistribDocExpirationUpdateProcessorTest.test-seed#[794764EE032C08CC]) [    ] o.a.s.c.ZkTestServer STARTING ZK TEST SERVER
   [junit4]   2> 291899 INFO  (Thread-870) [    ] o.a.s.c.ZkTestServer client port:0.0.0.0/0.0.0.0:0
   [junit4]   2> 291899 INFO  (Thread-870) [    ] o.a.s.c.ZkTestServer Starting server
   [junit4]   2> 291999 INFO  (TEST-DistribDocExpirationUpdateProcessorTest.test-seed#[794764EE032C08CC]) [    ] o.a.s.c.ZkTestServer start zk server on port:55374
   [junit4]   2> 291999 INFO  (TEST-DistribDocExpirationUpdateProcessorTest.test-seed#[794764EE032C08CC]) [    ] o.a.s.c.c.SolrZkClient Using default ZkCredentialsProvider
   [junit4]   2> 292000 INFO  (TEST-DistribDocExpirationUpdateProcessorTest.test-seed#[794764EE032C08CC]) [    ] o.a.s.c.c.ConnectionManager Waiting for client to connect to ZooKeeper
   [junit4]   2> 292003 INFO  (zkCallback-146-thread-1) [    ] o.a.s.c.c.ConnectionManager Watcher org.apache.solr.common.cloud.ConnectionManager@77087957 name:ZooKeeperConnection Watcher:127.0.0.1:55374 got event WatchedEvent state:SyncConnected type:None path:null path:null type:None
   [junit4]   2> 292003 INFO  (TEST-DistribDocExpirationUpdateProcessorTest.test-seed#[794764EE032C08CC]) [    ] o.a.s.c.c.ConnectionManager Client is connected to ZooKeeper
   [junit4]   2> 292003 INFO  (TEST-DistribDocExpirationUpdateProcessorTest.test-seed#[794764EE032C08CC]) [    ] o.a.s.c.c.SolrZkClient Using default ZkACLProvider
   [junit4]   2> 292003 INFO  (TEST-DistribDocExpirationUpdateProcessorTest.test-seed#[794764EE032C08CC]) [    ] o.a.s.c.c.SolrZkClient makePath: /solr
   [junit4]   2> 292007 INFO  (TEST-DistribDocExpirationUpdateProcessorTest.test-seed#[794764EE032C08CC]) [    ] o.a.s.c.c.SolrZkClient Using default ZkCredentialsProvider
   [junit4]   2> 292008 INFO  (TEST-DistribDocExpirationUpdateProcessorTest.test-seed#[794764EE032C08CC]) [    ] o.a.s.c.c.ConnectionManager Waiting for client to connect to ZooKeeper
   [junit4]   2> 292010 INFO  (zkCallback-147-thread-1) [    ] o.a.s.c.c.ConnectionManager Watcher org.apache.solr.common.cloud.ConnectionManager@778df041 name:ZooKeeperConnection Watcher:127.0.0.1:55374/solr got event WatchedEvent state:SyncConnected type:None path:null path:null type:None
   [junit4]   2> 292010 INFO  (TEST-DistribDocExpirationUpdateProcessorTest.test-seed#[794764EE032C08CC]) [    ] o.a.s.c.c.ConnectionManager Client is connected to ZooKeeper
   [junit4]   2> 292010 INFO  (TEST-DistribDocExpirationUpdateProcessorTest.test-seed#[794764EE032C08CC]) [    ] o.a.s.c.c.SolrZkClient Using default ZkACLProvider
   [junit4]   2> 292010 INFO  (TEST-DistribDocExpirationUpdateProcessorTest.test-seed#[794764EE032C08CC]) [    ] o.a.s.c.c.SolrZkClient makePath: /collections/collection1
   [junit4]   2> 292014 INFO  (TEST-DistribDocExpirationUpdateProcessorTest.test-seed#[794764EE032C08CC]) [    ] o.a.s.c.c.SolrZkClient makePath: /collections/collection1/shards
   [junit4]   2> 292016 INFO  (TEST-DistribDocExpirationUpdateProcessorTest.test-seed#[794764EE032C08CC]) [    ] o.a.s.c.c.SolrZkClient makePath: /collections/control_collection
   [junit4]   2> 292018 INFO  (TEST-DistribDocExpirationUpdateProcessorTest.test-seed#[794764EE032C08CC]) [    ] o.a.s.c.c.SolrZkClient makePath: /collections/control_collection/shards
   [junit4]   2> 292022 INFO  (TEST-DistribDocExpirationUpdateProcessorTest.test-seed#[794764EE032C08CC]) [    ] o.a.s.c.AbstractZkTestCase put /export/home/jenkins/workspace/Lucene-Solr-5.x-Solaris/solr/core/src/test-files/solr/collection1/conf/solrconfig-doc-expire-update-processor.xml to /configs/conf1/solrconfig.xml
   [junit4]   2> 292022 INFO  (TEST-DistribDocExpirationUpdateProcessorTest.test-seed#[794764EE032C08CC]) [    ] o.a.s.c.c.SolrZkClient makePath: /configs/conf1/solrconfig.xml
   [junit4]   2> 292027 INFO  (TEST-DistribDocExpirationUpdateProcessorTest.test-seed#[794764EE032C08CC]) [    ] o.a.s.c.AbstractZkTestCase put /export/home/jenkins/workspace/Lucene-Solr-5.x-Solaris/solr/core/src/test-files/solr/collection1/conf/schema15.xml to /configs/conf1/schema.xml
   [junit4]   2> 292028 INFO  (TEST-DistribDocExpirationUpdateProcessorTest.test-seed#[794764EE032C08CC]) [    ] o.a.s.c.c.SolrZkClient makePath: /configs/conf1/schema.xml
   [junit4]   2> 292032 INFO  (TEST-DistribDocExpirationUpdateProcessorTest.test-seed#[794764EE032C08CC]) [    ] o.a.s.c.AbstractZkTestCase put /export/home/jenkins/workspace/Lucene-Solr-5.x-Solaris/solr/core/src/test-files/solr/collection1/conf/solrconfig.snippet.randomindexconfig.xml to /configs/conf1/solrconfig.snippet.randomindexconfig.xml
   [junit4]   2> 292032 INFO  (TEST-DistribDocExpirationUpdateProcessorTest.test-seed#[794764EE032C08CC]) [    ] o.a.s.c.c.SolrZkClient makePath: /configs/conf1/solrconfig.snippet.randomindexconfig.xml
   [junit4]   2> 292036 INFO  (TEST-DistribDocExpirationUpdateProcessorTest.test-seed#[794764EE032C08CC]) [    ] o.a.s.c.AbstractZkTestCase put /export/home/jenkins/workspace/Lucene-Solr-5.x-Solaris/solr/core/src/test-files/solr/collection1/conf/stopwords.txt to /configs/conf1/stopwords.txt
   [junit4]   2> 292036 INFO  (TEST-DistribDocExpirationUpdateProcessorTest.test-seed#[794764EE032C08CC]) [    ] o.a.s.c.c.SolrZkClient makePath: /configs/conf1/stopwords.txt
   [junit4]   2> 292039 INFO  (TEST-DistribDocExpirationUpdateProcessorTest.test-seed#[794764EE032C08CC]) [    ] o.a.s.c.AbstractZkTestCase put /export/home/jenkins/workspace/Lucene-Solr-5.x-Solaris/solr/core/src/test-files/solr/collection1/conf/protwords.txt to /configs/conf1/protwords.txt
   [junit4]   2> 292039 INFO  (TEST-DistribDocExpirationUpdateProcessorTest.test-seed#[794764EE032C08CC]) [    ] o.a.s.c.c.SolrZkClient makePath: /configs/conf1/protwords.txt
   [junit4]   2> 292043 INFO  (TEST-DistribDocExpirationUpdateProcessorTest.test-seed#[794764EE032C08CC]) [    ] o.a.s.c.AbstractZkTestCase put /export/home/jenkins/workspace/Lucene-Solr-5.x-Solaris/solr/core/src/test-files/solr/collection1/conf/currency.xml to /configs/conf1/currency.xml
   [junit4]   2> 292043 INFO  (TEST-DistribDocExpirationUpdateProcessorTest.test-seed#[794764EE032C08CC]) [    ] o.a.s.c.c.SolrZkClient makePath: /configs/conf1/currency.xml
   [junit4]   2> 292046 INFO  (TEST-DistribDocExpirationUpdateProcessorTest.test-seed#[794764EE032C08CC]) [    ] o.a.s.c.AbstractZkTestCase put /export/home/jenkins/workspace/Lucene-Solr-5.x-Solaris/solr/core/src/test-files/solr/collection1/conf/enumsConfig.xml to /configs/conf1/enumsConfig.xml
   [junit4]   2> 292046 INFO  (TEST-DistribDocExpirationUpdateProcessorTest.test-seed#[794764EE032C08CC]) [    ] o.a.s.c.c.SolrZkClient makePath: /configs/conf1/enumsConfig.xml
   [junit4]   2> 292049 INFO  (TEST-DistribDocExpirationUpdateProcessorTest.test-seed#[794764EE032C08CC]) [    ] o.a.s.c.AbstractZkTestCase put /export/home/jenkins/workspace/Lucene-Solr-5.x-Solaris/solr/core/src/test-files/solr/collection1/conf/open-exchange-rates.json to /configs/conf1/open-exchange-rates.json
   [junit4]   2> 292049 INFO  (TEST-DistribDocExpirationUpdateProcessorTest.test-seed#[794764EE032C08CC]) [    ] o.a.s.c.c.SolrZkClient makePath: /configs/conf1/open-exchange-rates.json
   [junit4]   2> 292052 INFO  (TEST-DistribDocExpirationUpdateProcessorTest.test-seed#[794764EE032C08CC]) [    ] o.a.s.c.AbstractZkTestCase put /export/home/jenkins/workspace/Lucene-Solr-5.x-Solaris/solr/core/src/test-files/solr/collection1/conf/mapping-ISOLatin1Accent.txt to /configs/conf1/mapping-ISOLatin1Accent.txt
   [junit4]   2> 292053 INFO  (TEST-DistribDocExpirationUpdateProcessorTest.test-seed#[794764EE032C08CC]) [    ] o.a.s.c.c.SolrZkClient makePath: /configs/conf1/mapping-ISOLatin1Accent.txt
   [junit4]   2> 292056 INFO  (TEST-DistribDocExpirationUpdateProcessorTest.test-seed#[794764EE032C08CC]) [    ] o.a.s.c.AbstractZkTestCase put /export/home/jenkins/workspace/Lucene-Solr-5.x-Solaris/solr/core/src/test-files/solr/collection1/conf/old_synonyms.txt to /configs/conf1/old_synonyms.txt
   [junit4]   2> 292057 INFO  (TEST-DistribDocExpirationUpdateProcessorTest.test-seed#[794764EE032C08CC]) [    ] o.a.s.c.c.SolrZkClient makePath: /configs/conf1/old_synonyms.txt
   [junit4]   2> 292059 INFO  (TEST-DistribDocExpirationUpdateProcessorTest.test-seed#[794764EE032C08CC]) [    ] o.a.s.c.AbstractZkTestCase put /export/home/jenkins/workspace/Lucene-Solr-5.x-Solaris/solr/core/src/test-files/solr/collection1/conf/synonyms.txt to /configs/conf1/synonyms.txt
   [junit4]   2> 292060 INFO  (TEST-DistribDocExpirationUpdateProcessorTest.test-seed#[794764EE032C08CC]) [    ] o.a.s.c.c.SolrZkClient makePath: /configs/conf1/synonyms.txt
   [junit4]   2> 292064 INFO  (TEST-DistribDocExpirationUpdateProcessorTest.test-seed#[794764EE032C08CC]) [    ] o.a.s.c.c.SolrZkClient Using default ZkCredentialsProvider
   [junit4]   2> 292064 INFO  (TEST-DistribDocExpirationUpdateProcessorTest.test-seed#[794764EE032C08CC]) [    ] o.a.s.c.c.ConnectionManager Waiting for client to connect to ZooKeeper
   [junit4]   2> 292067 INFO  (zkCallback-148-thread-1) [    ] o.a.s.c.c.ConnectionManager Watcher org.apache.solr.common.cloud.ConnectionManager@76300fc9 name:ZooKeeperConnection Watcher:127.0.0.1:55374/solr got event WatchedEvent state:SyncConnected type:None path:null path:null type:None
   [junit4]   2> 292067 INFO  (TEST-DistribDocExpirationUpdateProcessorTest.test-seed#[794764EE032C08CC]) [    ] o.a.s.c.c.ConnectionManager Client is connected to ZooKeeper
   [junit4]   2> 292067 INFO  (TEST-DistribDocExpirationUpdateProcessorTest.test-seed#[794764EE032C08CC]) [    ] o.a.s.c.c.SolrZkClient Using default ZkACLProvider
   [junit4]   2> 292224 INFO  (TEST-DistribDocExpirationUpdateProcessorTest.test-seed#[794764EE032C08CC]) [    ] o.a.s.SolrTestCaseJ4 Writing core.properties file to /export/home/jenkins/workspace/Lucene-Solr-5.x-Solaris/solr/build/solr-core/test/J0/temp/solr.cloud.DistribDocExpirationUpdateProcessorTest_794764EE032C08CC-001/control-001/cores/collection1
   [junit4]   2> 292225 INFO  (TEST-DistribDocExpirationUpdateProcessorTest.test-seed#[794764EE032C08CC]) [    ] o.e.j.s.Server jetty-9.2.13.v20150730
   [junit4]   2> 292228 INFO  (TEST-DistribDocExpirationUpdateProcessorTest.test-seed#[794764EE032C08CC]) [    ] o.e.j.s.h.ContextHandler Started o.e.j.s.ServletContextHandler@1be7ac43{/oe_b/so,null,AVAILABLE}
   [junit4]   2> 292239 INFO  (TEST-DistribDocExpirationUpdateProcessorTest.test-seed#[794764EE032C08CC]) [    ] o.e.j.s.ServerConnector Started ServerConnector@1b7a493b{SSL-http/1.1}{127.0.0.1:60180}
   [junit4]   2> 292239 INFO  (TEST-DistribDocExpirationUpdateProcessorTest.test-seed#[794764EE032C08CC]) [    ] o.e.j.s.Server Started @295926ms
   [junit4]   2> 292239 INFO  (TEST-DistribDocExpirationUpdateProcessorTest.test-seed#[794764EE032C08CC]) [    ] o.a.s.c.s.e.JettySolrRunner Jetty properties: {solr.data.dir=/export/home/jenkins/workspace/Lucene-Solr-5.x-Solaris/solr/build/solr-core/test/J0/temp/solr.cloud.DistribDocExpirationUpdateProcessorTest_794764EE032C08CC-001/tempDir-001/control/data, hostContext=/oe_b/so, coreRootDirectory=/export/home/jenkins/workspace/Lucene-Solr-5.x-Solaris/solr/build/solr-core/test/J0/temp/solr.cloud.DistribDocExpirationUpdateProcessorTest_794764EE032C08CC-001/control-001/cores, hostPort=60180}
   [junit4]   2> 292239 INFO  (TEST-DistribDocExpirationUpdateProcessorTest.test-seed#[794764EE032C08CC]) [    ] o.a.s.s.SolrDispatchFilter SolrDispatchFilter.init(): sun.misc.Launcher$AppClassLoader@6f5e0eab
   [junit4]   2> 292239 INFO  (TEST-DistribDocExpirationUpdateProcessorTest.test-seed#[794764EE032C08CC]) [    ] o.a.s.c.SolrResourceLoader new SolrResourceLoader for directory: '/export/home/jenkins/workspace/Lucene-Solr-5.x-Solaris/solr/build/solr-core/test/J0/temp/solr.cloud.DistribDocExpirationUpdateProcessorTest_794764EE032C08CC-001/control-001'
   [junit4]   2> 292240 INFO  (TEST-DistribDocExpirationUpdateProcessorTest.test-seed#[794764EE032C08CC]) [    ] o.a.s.c.SolrResourceLoader JNDI not configured for solr (NoInitialContextEx)
   [junit4]   2> 292240 INFO  (TEST-DistribDocExpirationUpdateProcessorTest.test-seed#[794764EE032C08CC]) [    ] o.a.s.c.SolrResourceLoader solr home defaulted to 'solr/' (could not find system property or JNDI)
   [junit4]   2> 292240 INFO  (TEST-DistribDocExpirationUpdateProcessorTest.test-seed#[794764EE032C08CC]) [    ] o.a.s.c.c.SolrZkClient Using default ZkCredentialsProvider
   [junit4]   2> 292240 INFO  (TEST-DistribDocExpirationUpdateProcessorTest.test-seed#[794764EE032C08CC]) [    ] o.a.s.c.c.ConnectionManager Waiting for client to connect to ZooKeeper
   [junit4]   2> 292243 INFO  (zkCallback-149-thread-1) [    ] o.a.s.c.c.ConnectionManager Watcher org.apache.solr.common.cloud.ConnectionManager@34d55e7c name:ZooKeeperConnection Watcher:127.0.0.1:55374/solr got event WatchedEvent state:SyncConnected type:None path:null path:null type:None
   [junit4]   2> 292243 INFO  (TEST-DistribDocExpirationUpdateProcessorTest.test-seed#[794764EE032C08CC]) [    ] o.a.s.c.c.ConnectionManager Client is connected to ZooKeeper
   [junit4]   2> 292243 INFO  (TEST-DistribDocExpirationUpdateProcessorTest.test-seed#[794764EE032C08CC]) [    ] o.a.s.c.c.SolrZkClient Using default ZkACLProvider
   [junit4]   2> 292246 INFO  (TEST-DistribDocExpirationUpdateProcessorTest.test-seed#[794764EE032C08CC]) [    ] o.a.s.s.SolrDispatchFilter Loading solr.xml from SolrHome (not found in ZooKeeper)
   [junit4]   2> 292246 INFO  (TEST-DistribDocExpirationUpdateProcessorTest.test-seed#[794764EE032C08CC]) [    ] o.a.s.c.SolrXmlConfig Loading container configuration from /export/home/jenkins/workspace/Lucene-Solr-5.x-Solaris/solr/build/solr-core/test/J0/temp/solr.cloud.DistribDocExpirationUpdateProcessorTest_794764EE032C08CC-001/control-001/solr.xml
   [junit4]   2> 292267 INFO  (TEST-DistribDocExpirationUpdateProcessorTest.test-seed#[794764EE032C08CC]) [    ] o.a.s.c.CorePropertiesLocator Config-defined core root directory: /export/home/jenkins/workspace/Lucene-Solr-5.x-Solaris/solr/build/solr-core/test/J0/temp/solr.cloud.DistribDocExpirationUpdateProcessorTest_794764EE032C08CC-001/control-001/cores
   [junit4]   2> 292268 INFO  (TEST-DistribDocExpirationUpdateProcessorTest.test-seed#[794764EE032C08CC]) [    ] o.a.s.c.CoreContainer New CoreContainer 935476323
   [junit4]   2> 292268 INFO  (TEST-DistribDocExpirationUpdateProcessorTest.test-seed#[794764EE032C08CC]) [    ] o.a.s.c.CoreContainer Loading cores into CoreContainer [instanceDir=/export/home/jenkins/workspace/Lucene-Solr-5.x-Solaris/solr/build/solr-core/test/J0/temp/solr.cloud.DistribDocExpirationUpdateProcessorTest_794764EE032C08CC-001/control-001]
   [junit4]   2> 292268 WARN  (TEST-DistribDocExpirationUpdateProcessorTest.test-seed#[794764EE032C08CC]) [    ] o.a.s.c.CoreContainer Couldn't add files from /export/home/jenkins/workspace/Lucene-Solr-5.x-Solaris/solr/build/solr-core/test/J0/temp/solr.cloud.DistribDocExpirationUpdateProcessorTest_794764EE032C08CC-001/control-001/lib to classpath: /export/home/jenkins/workspace/Lucene-Solr-5.x-Solaris/solr/build/solr-core/test/J0/temp/solr.cloud.DistribDocExpirationUpdateProcessorTest_794764EE032C08CC-001/control-001/lib
   [junit4]   2> 292268 INFO  (TEST-DistribDocExpirationUpdateProcessorTest.test-seed#[794764EE032C08CC]) [    ] o.a.s.h.c.HttpShardHandlerFactory created with socketTimeout : 90000,urlScheme : ,connTimeout : 15000,maxConnectionsPerHost : 20,maxConnections : 10000,corePoolSize : 0,maximumPoolSize : 2147483647,maxThreadIdleTime : 5,sizeOfQueue : -1,fairnessPolicy : false,useRetries : false,
   [junit4]   2> 292273 INFO  (TEST-DistribDocExpirationUpdateProcessorTest.test-seed#[794764EE032C08CC]) [    ] o.a.s.u.UpdateShardHandler Creating UpdateShardHandler HTTP client with params: socketTimeout=340000&connTimeout=45000&retry=true
   [junit4]   2> 292276 INFO  (TEST-DistribDocExpirationUpdateProcessorTest.test-seed#[794764EE032C08CC]) [    ] o.a.s.l.LogWatcher SLF4J impl is org.slf4j.impl.Log4jLoggerFactory
   [junit4]   2> 292276 INFO  (TEST-DistribDocExpirationUpdateProcessorTest.test-seed#[794764EE032C08CC]) [    ] o.a.s.l.LogWatcher Registering Log Listener [Log4j (org.slf4j.impl.Log4jLoggerFactory)]
   [junit4]   2> 292276 INFO  (TEST-DistribDocExpirationUpdateProcessorTest.test-seed#[794764EE032C08CC]) [    ] o.a.s.c.ZkContainer Zookeeper client=127.0.0.1:55374/solr
   [junit4]   2> 292276 INFO  (TEST-DistribDocExpirationUpdateProcessorTest.test-seed#[794764EE032C08CC]) [    ] o.a.s.c.ZkController zkHost includes chroot
   [junit4]   2> 292276 INFO  (TEST-DistribDocExpirationUpdateProcessorTest.test-seed#[794764EE032C08CC]) [    ] o.a.s.c.c.SolrZkClient Using default ZkCredentialsProvider
   [junit4]   2> 292277 INFO  (TEST-DistribDocExpirationUpdateProcessorTest.test-seed#[794764EE032C08CC]) [    ] o.a.s.c.c.ConnectionManager Waiting for client to connect to ZooKeeper
   [junit4]   2> 292279 INFO  (zkCallback-151-thread-1) [    ] o.a.s.c.c.ConnectionManager Watcher org.apache.solr.common.cloud.ConnectionManager@49982aae name:ZooKeeperConnection Watcher:127.0.0.1:55374 got event WatchedEvent state:SyncConnected type:None path:null path:null type:None
   [junit4]   2> 292281 INFO  (TEST-DistribDocExpirationUpdateProcessorTest.test-seed#[794764EE032C08CC]) [    ] o.a.s.c.c.ConnectionManager Client is connected to ZooKeeper
   [junit4]   2> 292282 INFO  (TEST-DistribDocExpirationUpdateProcessorTest.test-seed#[794764EE032C08CC]) [    ] o.a.s.c.c.SolrZkClient Using default ZkACLProvider
   [junit4]   2> 292286 INFO  (TEST-DistribDocExpirationUpdateProcessorTest.test-seed#[794764EE032C08CC]) [n:127.0.0.1:60180_oe_b%2Fso    ] o.a.s.c.c.ConnectionManager Waiting for client to connect to ZooKeeper
   [junit4]   2> 292290 INFO  (zkCallback-152-thread-1-processing-n:127.0.0.1:60180_oe_b%2Fso) [n:127.0.0.1:60180_oe_b%2Fso    ] o.a.s.c.c.ConnectionManager Watcher org.apache.solr.common.cloud.ConnectionManager@78b0dc15 name:ZooKeeperConnection Watcher:127.0.0.1:55374/solr got event WatchedEvent state:SyncConnected type:None path:null path:null type:None
   [junit4]   2> 292290 INFO  (TEST-DistribDocExpirationUpdateProcessorTest.test-seed#[794764EE032C08CC]) [n:127.0.0.1:60180_oe_b%2Fso    ] o.a.s.c.c.ConnectionManager Client is connected to ZooKeeper
   [junit4]   2> 292295 INFO  (TEST-DistribDocExpirationUpdateProcessorTest.test-seed#[794764EE032C08CC]) [n:127.0.0.1:60180_oe_b%2Fso    ] o.a.s.c.c.SolrZkClient makePath: /overseer/queue
   [junit4]   2> 292299 INFO  (TEST-DistribDocExpirationUpdateProcessorTest.test-seed#[794764EE032C08CC]) [n:127.0.0.1:60180_oe_b%2Fso    ] o.a.s.c.c.SolrZkClient makePath: /overseer/collection-queue-work
   [junit4]   2> 292304 INFO  (TEST-DistribDocExpirationUpdateProcessorTest.test-seed#[794764EE032C08CC]) [n:127.0.0.1:60180_oe_b%2Fso    ] o.a.s.c.c.SolrZkClient makePath: /overseer/collection-map-running
   [junit4]   2> 292309 INFO  (TEST-DistribDocExpirationUpdateProcessorTest.test-seed#[794764EE032C08CC]) [n:127.0.0.1:60180_oe_b%2Fso    ] o.a.s.c.c.SolrZkClient makePath: /overseer/collection-map-completed
   [junit4]   2> 292312 INFO  (TEST-DistribDocExpirationUpdateProcessorTest.test-seed#[794764EE032C08CC]) [n:127.0.0.1:60180_oe_b%2Fso    ] o.a.s.c.c.SolrZkClient makePath: /overseer/collection-map-failure
   [junit4]   2> 292318 INFO  (TEST-DistribDocExpirationUpdateProcessorTest.test-seed#[794764EE032C08CC]) [n:127.0.0.1:60180_oe_b%2Fso    ] o.a.s.c.c.SolrZkClient makePath: /live_nodes
   [junit4]   2> 292321 INFO  (TEST-DistribDocExpirationUpdateProcessorTest.test-seed#[794764EE032C08CC]) [n:127.0.0.1:60180_oe_b%2Fso    ] o.a.s.c.c.SolrZkClient makePath: /aliases.json
   [junit4]   2> 292324 INFO  (TEST-DistribDocExpirationUpdateProcessorTest.test-seed#[794764EE032C08CC]) [n:127.0.0.1:60180_oe_b%2Fso    ] o.a.s.c.c.SolrZkClient makePath: /clusterstate.json
   [junit4]   2> 292326 INFO  (TEST-DistribDocExpirationUpdateProcessorTest.test-seed#[794764EE032C08CC]) [n:127.0.0.1:60180_oe_b%2Fso    ] o.a.s.c.c.SolrZkClient makePath: /security.json
   [junit4]   2> 292329 INFO  (TEST-DistribDocExpirationUpdateProcessorTest.test-seed#[794764EE032C08CC]) [n:127.0.0.1:60180_oe_b%2Fso    ] o.a.s.c.ZkController Register node as live in ZooKeeper:/live_nodes/127.0.0.1:60180_oe_b%2Fso
   [junit4]   2> 292330 INFO  (TEST-DistribDocExpirationUpdateProcessorTest.test-seed#[794764EE032C08CC]) [n:127.0.0.1:60180_oe_b%2Fso    ] o.a.s.c.c.SolrZkClient makePath: /live_nodes/127.0.0.1:60180_oe_b%2Fso
   [junit4]   2> 292334 INFO  (TEST-DistribDocExpirationUpdateProcessorTest.test-seed#[794764EE032C08CC]) [n:127.0.0.1:60180_oe_b%2Fso    ] o.a.s.c.c.SolrZkClient makePath: /overseer_elect
   [junit4]   2> 292336 INFO  (TEST-DistribDocExpirationUpdateProcessorTest.test-seed#[794764EE032C08CC]) [n:127.0.0.1:60180_oe_b%2Fso    ] o.a.s.c.c.SolrZkClient makePath: /overseer_elect/election
   [junit4]   2> 292338 INFO  (TEST-DistribDocExpirationUpdateProcessorTest.test-seed#[794764EE032C08CC]) [n:127.0.0.1:60180_oe_b%2Fso    ] o.a.s.c.Overseer Overseer (id=null) closing
   [junit4]   2> 292339 INFO  (TEST-DistribDocExpirationUpdateProcessorTest.test-seed#[794764EE032C08CC]) [n:127.0.0.1:60180_oe_b%2Fso    ] o.a.s.c.LeaderElector Joined leadership election with path: /overseer_elect/election/95123275118936069-127.0.0.1:60180_oe_b%2Fso-n_0000000000
   [junit4]   2> 292342 INFO  (TEST-DistribDocExpirationUpdateProcessorTest.test-seed#[794764EE032C08CC]) [n:127.0.0.1:60180_oe_b%2Fso    ] o.a.s.c.OverseerElectionContext I am going to be the leader 127.0.0.1:60180_oe_b%2Fso
   [junit4]   2> 292342 INFO  (TEST-DistribDocExpirationUpdateProcessorTest.test-seed#[794764EE032C08CC]) [n:127.0.0.1:60180_oe_b%2Fso    ] o.a.s.c.c.SolrZkClient makePath: /overseer_elect/leader
   [junit4]   2> 292344 INFO  (TEST-DistribDocExpirationUpdateProcessorTest.test-seed#[794764EE032C08CC]) [n:127.0.0.1:60180_oe_b%2Fso    ] o.a.s.c.Overseer Overseer (id=95123275118936069-127.0.0.1:60180_oe_b%2Fso-n_0000000000) starting
   [junit4]   2> 292348 INFO  (TEST-DistribDocExpirationUpdateProcessorTest.test-seed#[794764EE032C08CC]) [n:127.0.0.1:60180_oe_b%2Fso    ] o.a.s.c.c.SolrZkClient makePath: /overseer/queue-work
   [junit4]   2> 292359 INFO  (TEST-DistribDocExpirationUpdateProcessorTest.test-seed#[794764EE032C08CC]) [n:127.0.0.1:60180_oe_b%2Fso    ] o.a.s.c.OverseerAutoReplicaFailoverThread Starting OverseerAutoReplicaFailoverThread autoReplicaFailoverWorkLoopDelay=10000 autoReplicaFailoverWaitAfterExpiration=30000 autoReplicaFailoverBadNodeExpiration=60000
   [junit4]   2> 292359 INFO  (TEST-DistribDocExpirationUpdateProcessorTest.test-seed#[794764EE032C08CC]) [n:127.0.0.1:60180_oe_b%2Fso    ] o.a.s.c.c.ZkStateReader Updating cluster state from ZooKeeper... 
   [junit4]   2> 292360 INFO  (OverseerCollectionConfigSetProcessor-95123275118936069-127.0.0.1:60180_oe_b%2Fso-n_0000000000) [n:127.0.0.1:60180_oe_b%2Fso    ] o.a.s.c.OverseerTaskProcessor Process current queue of overseer operations
   [junit4]   2> 292360 INFO  (OverseerStateUpdate-95123275118936069-127.0.0.1:60180_oe_b%2Fso-n_0000000000) [n:127.0.0.1:60180_oe_b%2Fso    ] o.a.s.c.Overseer Starting to work on the main queue
   [junit4]   2> 292374 INFO  (TEST-DistribDocExpirationUpdateProcessorTest.test-seed#[794764EE032C08CC]) [n:127.0.0.1:60180_oe_b%2Fso    ] o.a.s.c.CoreContainer Security conf doesn't exist. Skipping setup for authorization module.
   [junit4]   2> 292374 INFO  (TEST-DistribDocExpirationUpdateProcessorTest.test-seed#[794764EE032C08CC]) [n:127.0.0.1:60180_oe_b%2Fso    ] o.a.s.c.CoreContainer No authentication plugin used.
   [junit4]   2> 292375 INFO  (TEST-DistribDocExpirationUpdateProcessorTest.test-seed#[794764EE032C08CC]) [n:127.0.0.1:60180_oe_b%2Fso    ] o.a.s.c.CorePropertiesLocator Looking for core definitions underneath /export/home/jenkins/workspace/Lucene-Solr-5.x-Solaris/solr/build/solr-core/test/J0/temp/solr.cloud.DistribDocExpirationUpdateProcessorTest_794764EE032C08CC-001/control-001/cores
   [junit4]   2> 292376 INFO  (TEST-DistribDocExpirationUpdateProcessorTest.test-seed#[794764EE032C08CC]) [n:127.0.0.1:60180_oe_b%2Fso    ] o.a.s.c.CoreDescriptor Created CoreDescriptor: {transient=false, shard=, dataDir=data/, configSetProperties=configsetprops.json, collection=control_collection, schema=schema.xml, config=solrconfig.xml, name=collection1, coreNodeName=, loadOnStartup=true}
   [junit4]   2> 292376 INFO  (TEST-DistribDocExpirationUpdateProcessorTest.test-seed#[794764EE032C08CC]) [n:127.0.0.1:60180_oe_b%2Fso    ] o.a.s.c.CorePropertiesLocator Found core collection1 in /export/home/jenkins/workspace/Lucene-Solr-5.x-Solaris/solr/build/solr-core/test/J0/temp/solr.cloud.DistribDocExpirationUpdateProcessorTest_794764EE032C08CC-001/control-001/cores/collection1
   [junit4]   2> 292376 INFO  (TEST-DistribDocExpirationUpdateProcessorTest.test-seed#[794764EE032C08CC]) [n:127.0.0.1:60180_oe_b%2Fso    ] o.a.s.c.CorePropertiesLocator Found 1 core definitions
   [junit4]   2> 292378 INFO  (TEST-DistribDocExpirationUpdateProcessorTest.test-seed#[794764EE032C08CC]) [n:127.0.0.1:60180_oe_b%2Fso    ] o.a.s.s.SolrDispatchFilter user.dir=/export/home/jenkins/workspace/Lucene-Solr-5.x-Solaris/solr/build/solr-core/test/J0
   [junit4]   2> 292379 INFO  (TEST-DistribDocExpirationUpdateProcessorTest.test-seed#[794764EE032C08CC]) [n:127.0.0.1:60180_oe_b%2Fso    ] o.a.s.s.SolrDispatchFilter SolrDispatchFilter.init() done
   [junit4]   2> 292380 INFO  (coreLoadExecutor-856-thread-1-processing-n:127.0.0.1:60180_oe_b%2Fso) [n:127.0.0.1:60180_oe_b%2Fso c:control_collection   x:collection1] o.a.s.c.ZkController publishing state=down
   [junit4]   2> 292380 INFO  (coreLoadExecutor-856-thread-1-processing-n:127.0.0.1:60180_oe_b%2Fso) [n:127.0.0.1:60180_oe_b%2Fso c:control_collection   x:collection1] o.a.s.c.ZkController numShards not found on descriptor - reading it from system property
   [junit4]   2> 292383 INFO  (OverseerStateUpdate-95123275118936069-127.0.0.1:60180_oe_b%2Fso-n_0000000000) [n:127.0.0.1:60180_oe_b%2Fso    ] o.a.s.c.Overseer processMessage: queueSize: 1, message = {
   [junit4]   2>   "shard":null,
   [junit4]   2>   "node_name":"127.0.0.1:60180_oe_b%2Fso",
   [junit4]   2>   "collection":"control_collection",
   [junit4]   2>   "roles":null,
   [junit4]   2>   "numShards":"1",
   [junit4]   2>   "operation":"state",
   [junit4]   2>   "state":"down",
   [junit4]   2>   "core":"collection1",
   [junit4]   2>   "base_url":"https://127.0.0.1:60180/oe_b/so"} current state version: 0
   [junit4]   2> 292384 INFO  (coreLoadExecutor-856-thread-1-processing-n:127.0.0.1:60180_oe_b%2Fso) [n:127.0.0.1:60180_oe_b%2Fso c:control_collection   x:collection1] o.a.s.c.ZkController look for our core node name
   [junit4]   2> 292386 INFO  (OverseerStateUpdate-95123275118936069-127.0.0.1:60180_oe_b%2Fso-n_0000000000) [n:127.0.0.1:60180_oe_b%2Fso    ] o.a.s.c.o.ReplicaMutator Update state numShards=1 message={
   [junit4]   2>   "shard":null,
   [junit4]   2>   "node_name":"127.0.0.1:60180_oe_b%2Fso",
   [junit4]   2>   "collection":"control_collection",
   [junit4]   2>   "roles":null,
   [junit4]   2>   "numShards":"1",
   [junit4]   2>   "operation":"state",
   [junit4]   2>   "state":"down",
   [junit4]   2>   "core":"collection1",
   [junit4]   2>   "base_url":"https://127.0.0.1:60180/oe_b/so"}
   [junit4]   2> 292386 INFO  (OverseerStateUpdate-95123275118936069-127.0.0.1:60180_oe_b%2Fso-n_0000000000) [n:127.0.0.1:60180_oe_b%2Fso    ] o.a.s.c.o.ClusterStateMutator building a new cName: control_collection
   [junit4]   2> 292387 INFO  (OverseerStateUpdate-95123275118936069-127.0.0.1:60180_oe_b%2Fso-n_0000000000) [n:127.0.0.1:60180_oe_b%2Fso    ] o.a.s.c.o.ReplicaMutator Assigning new node to shard shard=shard1
   [junit4]   2> 292390 INFO  (zkCallback-152-thread-1-processing-n:127.0.0.1:60180_oe_b%2Fso) [n:127.0.0.1:60180_oe_b%2Fso    ] o.a.s.c.c.ZkStateReader A cluster state change: [WatchedEvent state:SyncConnected type:NodeDataChanged path:/clusterstate.json], has occurred - updating... (live nodes size: [1])
   [junit4]   2> 293386 INFO  (coreLoadExecutor-856-thread-1-processing-n:127.0.0.1:60180_oe_b%2Fso) [n:127.0.0.1:60180_oe_b%2Fso c:control_collection   x:collection1] o.a.s.c.ZkController waiting to find shard id in clusterstate for collection1
   [junit4]   2> 293386 INFO  (coreLoadExecutor-856-thread-1-processing-n:127.0.0.1:60180_oe_b%2Fso) [n:127.0.0.1:60180_oe_b%2Fso c:control_collection   x:collection1] o.a.s.c.ZkController Check for collection zkNode:control_collection
   [junit4]   2> 293387 INFO  (coreLoadExecutor-856-thread-1-processing-n:127.0.0.1:60180_oe_b%2Fso) [n:127.0.0.1:60180_oe_b%2Fso c:control_collection   x:collection1] o.a.s.c.ZkController Collection zkNode exists
   [junit4]   2> 293387 INFO  (coreLoadExecutor-856-thread-1-processing-n:127.0.0.1:60180_oe_b%2Fso) [n:127.0.0.1:60180_oe_b%2Fso c:control_collection   x:collection1] o.a.s.c.c.ZkStateReader Load collection config from: [/collections/control_collection]
   [junit4]   2> 293389 INFO  (coreLoadExecutor-856-thread-1-processing-n:127.0.0.1:60180_oe_b%2Fso) [n:127.0.0.1:60180_oe_b%2Fso c:control_collection   x:collection1] o.a.s.c.c.ZkStateReader path=[/collections/control_collection] [configName]=[conf1] specified config exists in ZooKeeper
   [junit4]   2> 293389 INFO  (coreLoadExecutor-856-thread-1-processing-n:127.0.0.1:60180_oe_b%2Fso) [n:127.0.0.1:60180_oe_b%2Fso c:control_collection   x:collection1] o.a.s.c.SolrResourceLoader new SolrResourceLoader for directory: '/export/home/jenkins/workspace/Lucene-Solr-5.x-Solaris/solr/build/solr-core/test/J0/temp/solr.cloud.DistribDocExpirationUpdateProcessorTest_794764EE032C08CC-001/control-001/cores/collection1'
   [junit4]   2> 293389 INFO  (coreLoadExecutor-856-thread-1-processing-n:127.0.0.1:60180_oe_b%2Fso) [n:127.0.0.1:60180_oe_b%2Fso c:control_collection   x:collection1] o.a.s.c.SolrResourceLoader JNDI not configured for solr (NoInitialContextEx)
   [junit4]   2> 293389 INFO  (coreLoadExecutor-856-thread-1-processing-n:127.0.0.1:60180_oe_b%2Fso) [n:127.0.0.1:60180_oe_b%2Fso c:control_collection   x:collection1] o.a.s.c.SolrResourceLoader solr home defaulted to 'solr/' (could not find system property or JNDI)
   [junit4]   2> 293392 INFO  (coreLoadExecutor-856-thread-1-processing-n:127.0.0.1:60180_oe_b%2Fso) [n:127.0.0.1:60180_oe_b%2Fso c:control_collection   x:collection1] o.a.s.c.Config loaded config solrconfig.xml with version 0 
   [junit4]   2> 293401 INFO  (coreLoadExecutor-856-thread-1-processing-n:127.0.0.1:60180_oe_b%2Fso) [n:127.0.0.1:60180_oe_b%2Fso c:control_collection   x:collection1] o.a.s.c.SolrConfig current version of requestparams : -1
   [junit4]   2> 293458 INFO  (coreLoadExecutor-856-thread-1-processing-n:127.0.0.1:60180_oe_b%2Fso) [n:127.0.0.1:60180_oe_b%2Fso c:control_collection   x:collection1] o.a.s.c.SolrConfig Using Lucene MatchVersion: 5.5.0
   [junit4]   2> 293515 INFO  (coreLoadExecutor-856-thread-1-processing-n:127.0.0.1:60180_oe_b%2Fso) [n:127.0.0.1:60180_oe_b%2Fso c:control_collection   x:collection1] o.a.s.c.SolrConfig Loaded SolrConfig: solrconfig.xml
   [junit4]   2> 293529 INFO  (coreLoadExecutor-856-thread-1-processing-n:127.0.0.1:60180_oe_b%2Fso) [n:127.0.0.1:60180_oe_b%2Fso c:control_collection   x:collection1] o.a.s.s.IndexSchema [collection1] Schema name=test
   [junit4]   2> 293785 INFO  (coreLoadExecutor-856-thread-1-processing-n:127.0.0.1:60180_oe_b%2Fso) [n:127.0.0.1:60180_oe_b%2Fso c:control_collection   x:collection1] o.a.s.s.IndexSchema default search field in schema is text
   [junit4]   2> 293786 INFO  (coreLoadExecutor-856-thread-1-processing-n:127.0.

[...truncated too long message...]

32C08CC]) [    ] o.e.j.s.ServerConnector Stopped ServerConnector@5435f5b7{HTTP/1.1}{127.0.0.1:0}
   [junit4]   2> 3014078 INFO  (TEST-TestDistribDocBasedVersion.test-seed#[794764EE032C08CC]) [    ] o.e.j.s.h.ContextHandler Stopped o.e.j.s.ServletContextHandler@7aecdb5d{/_wk/n,null,UNAVAILABLE}
   [junit4]   2> 3014081 INFO  (TEST-TestDistribDocBasedVersion.test-seed#[794764EE032C08CC]) [n:127.0.0.1:53235__wk%2Fn c:collection1 s:shard2 r:core_node4 x:collection1] o.a.s.c.ZkTestServer connecting to 127.0.0.1:46138 46138
   [junit4]   2> 3014095 INFO  (Thread-6561) [    ] o.a.s.c.ZkTestServer connecting to 127.0.0.1:46138 46138
   [junit4]   2> 3014096 WARN  (Thread-6561) [    ] o.a.s.c.ZkTestServer Watch limit violations: 
   [junit4]   2> Maximum concurrent create/delete watches above limit:
   [junit4]   2> 
   [junit4]   2> 	6	/solr/aliases.json
   [junit4]   2> 	5	/solr/security.json
   [junit4]   2> 	5	/solr/configs/conf1
   [junit4]   2> 
   [junit4]   2> Maximum concurrent data watches above limit:
   [junit4]   2> 
   [junit4]   2> 	6	/solr/clusterstate.json
   [junit4]   2> 	4	/solr/collections/collection1/state.json
   [junit4]   2> 
   [junit4]   2> Maximum concurrent children watches above limit:
   [junit4]   2> 
   [junit4]   2> 	6	/solr/collections
   [junit4]   2> 	6	/solr/live_nodes
   [junit4]   2> 	4	/solr/overseer/queue
   [junit4]   2> 	4	/solr/overseer/collection-queue-work
   [junit4]   2> 	2	/solr/overseer/queue-work
   [junit4]   2> 
   [junit4]   2> NOTE: reproduce with: ant test  -Dtestcase=TestDistribDocBasedVersion -Dtests.method=test -Dtests.seed=794764EE032C08CC -Dtests.slow=true -Dtests.locale=sk_SK -Dtests.timezone=Asia/Saigon -Dtests.asserts=true -Dtests.file.encoding=UTF-8
   [junit4] FAILURE 33.0s J0 | TestDistribDocBasedVersion.test <<<
   [junit4]    > Throwable #1: java.lang.AssertionError: expected:<{c!doc2=11, b!doc1=10, e!doc4=11, d!doc3=10}> but was:<{c!doc2=11, b!doc1=10}>
   [junit4]    > 	at __randomizedtesting.SeedInfo.seed([794764EE032C08CC:F1135B34ADD06534]:0)
   [junit4]    > 	at org.apache.solr.cloud.TestDistribDocBasedVersion.doRTG(TestDistribDocBasedVersion.java:329)
   [junit4]    > 	at org.apache.solr.cloud.TestDistribDocBasedVersion.doTestDocVersions(TestDistribDocBasedVersion.java:152)
   [junit4]    > 	at org.apache.solr.cloud.TestDistribDocBasedVersion.test(TestDistribDocBasedVersion.java:105)
   [junit4]    > 	at org.apache.solr.BaseDistributedSearchTestCase$ShardsRepeatRule$ShardsFixedStatement.callStatement(BaseDistributedSearchTestCase.java:965)
   [junit4]    > 	at org.apache.solr.BaseDistributedSearchTestCase$ShardsRepeatRule$ShardsStatement.evaluate(BaseDistributedSearchTestCase.java:940)
   [junit4]    > 	at java.lang.Thread.run(Thread.java:745)
   [junit4]   2> 3014098 INFO  (SUITE-TestDistribDocBasedVersion-seed#[794764EE032C08CC]-worker) [n:127.0.0.1:53235__wk%2Fn c:collection1 s:shard2 r:core_node4 x:collection1] o.a.s.SolrTestCaseJ4 ###deleteCore
   [junit4]   2> NOTE: leaving temporary files on disk at: /export/home/jenkins/workspace/Lucene-Solr-5.x-Solaris/solr/build/solr-core/test/J0/temp/solr.cloud.TestDistribDocBasedVersion_794764EE032C08CC-001
   [junit4]   2> Dec 30, 2015 9:45:12 AM com.carrotsearch.randomizedtesting.ThreadLeakControl checkThreadLeaks
   [junit4]   2> WARNING: Will linger awaiting termination of 2 leaked thread(s).
   [junit4]   2> NOTE: test params are: codec=Asserting(Lucene54): {}, docValues:{}, sim=RandomSimilarityProvider(queryNorm=true,coord=no): {}, locale=sk_SK, timezone=Asia/Saigon
   [junit4]   2> NOTE: SunOS 5.11 amd64/Oracle Corporation 1.7.0_91 (64-bit)/cpus=3,threads=1,free=191817616,total=431489024
   [junit4]   2> NOTE: All tests run in this JVM: [DeleteShardTest, PeerSyncTest, SpatialFilterTest, SpatialRPTFieldTypeTest, HdfsRecoverLeaseTest, TestLeaderInitiatedRecoveryThread, TestExtendedDismaxParser, HdfsDirectoryTest, PingRequestHandlerTest, QueryEqualityTest, DocumentAnalysisRequestHandlerTest, BlockDirectoryTest, DisMaxRequestHandlerTest, TestScoreJoinQPNoScore, SolrCloudExampleTest, TestPseudoReturnFields, TestCloudManagedSchema, TestJmxMonitoredMap, SampleTest, TestFieldResource, HdfsCollectionsAPIDistributedZkTest, TestTestInjection, DistributedQueueTest, TestLazyCores, SparseHLLTest, TestHashPartitioner, ParsingFieldUpdateProcessorsTest, TestQuerySenderNoQuery, JsonLoaderTest, PathHierarchyTokenizerFactoryTest, XsltUpdateRequestHandlerTest, DistribDocExpirationUpdateProcessorTest, QueryElevationComponentTest, CurrencyFieldXmlFileTest, TestMergePolicyConfig, TestRandomDVFaceting, TestIntervalFaceting, TestUpdate, TestWordDelimiterFilterFactory, HighlighterTest, TestStressReorder, ZkStateWriterTest, TestCustomSort, TestCSVLoader, HighlighterMaxOffsetTest, TestRestoreCore, TestMaxScoreQueryParser, BasicAuthIntegrationTest, HdfsRestartWhileUpdatingTest, DOMUtilTest, OverseerRolesTest, TestAnalyzeInfixSuggestions, TestSolrDeletionPolicy1, PolyFieldTest, TestArbitraryIndexDir, TestSurroundQueryParser, BlockJoinFacetRandomTest, TestRemoveLastDynamicCopyField, TestDynamicFieldResource, TestConfigSetsAPIZkFailure, TestRebalanceLeaders, TestDocumentBuilder, TestSolrConfigHandler, TestElisionMultitermQuery, TestManagedSynonymFilterFactory, JSONWriterTest, IndexBasedSpellCheckerTest, ExternalFileFieldSortTest, TestJmxIntegration, TestDFRSimilarityFactory, DistributedExpandComponentTest, SpatialHeatmapFacetsTest, SuggesterFSTTest, UUIDFieldTest, AddBlockUpdateTest, TestTolerantSearch, ZkControllerTest, TestSolrQueryParserDefaultOperatorResource, TestBlobHandler, DistributedFacetPivotLongTailTest, TestCodecSupport, TestExceedMaxTermLength, BigEndianAscendingWordSerializerTest, TestLFUCache, TestSchemaVersionResource, CustomCollectionTest, TestReplicationHandlerBackup, TestNamedUpdateProcessors, IndexSchemaTest, SolrIndexConfigTest, TestFaceting, SolrRequestParserTest, AliasIntegrationTest, BJQParserTest, TestConfigSets, CoreAdminRequestStatusTest, SoftAutoCommitTest, MoreLikeThisHandlerTest, TermsComponentTest, TestTrackingShardHandlerFactory, TestFunctionQuery, SliceStateTest, HLLSerializationTest, AnalyticsMergeStrategyTest, PreAnalyzedFieldTest, SOLR749Test, TestIBSimilarityFactory, StatelessScriptUpdateProcessorFactoryTest, TestSort, TestRTimerTree, ReturnFieldsTest, TestRandomCollapseQParserPlugin, TestRestManager, TestLMDirichletSimilarityFactory, TestDistributedSearch, DocValuesTest, SegmentsInfoRequestHandlerTest, AnalysisAfterCoreReloadTest, OverriddenZkACLAndCredentialsProvidersTest, SharedFSAutoReplicaFailoverUtilsTest, PrimUtilsTest, LeaderElectionTest, TestSchemaResource, TestReRankQParserPlugin, TestNoOpRegenerator, SimpleFacetsTest, TestJsonFacets, TestFastLRUCache, RulesTest, SyncSliceTest, ClusterStateUpdateTest, TestLRUCache, CircularListTest, TestClusterStateMutator, TestHashQParserPlugin, DistanceUnitsTest, BasicDistributedZkTest, BasicDistributedZk2Test, UnloadDistributedZkTest, BasicZkTest, RecoveryZkTest, TestReplicationHandler, TestZkChroot, AutoCommitTest, DistributedSpellCheckComponentTest, TermVectorComponentDistributedTest, TestCoreContainer, SolrCoreTest, TestGroupingSearch, SolrCmdDistributorTest, ConvertedLegacyTest, DirectUpdateHandlerTest, DistributedQueryElevationComponentTest, SimplePostToolTest, SignatureUpdateProcessorFactoryTest, SpellCheckCollatorTest, TestFoldingMultitermQuery, TestStressLucene, NoCacheHeaderTest, SchemaVersionSpecificBehaviorTest, FieldMutatingUpdateProcessorTest, DefaultValueUpdateProcessorTest, DocValuesMultiTest, DistanceFunctionTest, StandardRequestHandlerTest, DirectSolrSpellCheckerTest, TestQueryTypes, TestOmitPositions, XmlUpdateRequestHandlerTest, TestValueSourceCache, RequiredFieldsTest, RegexBoostProcessorTest, MBeansHandlerTest, BinaryUpdateRequestHandlerTest, TestPartialUpdateDeduplication, TestBinaryResponseWriter, AlternateDirectoryTest, ResponseLogComponentTest, TestStressRecovery, TestSuggestSpellingConverter, RAMDirectoryFactoryTest, ClusterStateTest, TestUtils, ZkNodePropsTest, SystemInfoHandlerTest, DistributedMLTComponentTest, TestRTGBase, CursorPagingTest, SolrTestCaseJ4Test, TestCursorMarkWithoutUniqueKey, TestDistributedMissingSort, TestHighlightDedupGrouping, CleanupOldIndexTest, CollectionReloadTest, CollectionsAPIAsyncDistributedZkTest, ConcurrentDeleteAndCreateCollectionTest, ConfigSetsAPITest, DeleteLastCustomShardedReplicaTest, DistributedVersionInfoTest, ForceLeaderTest, LeaderFailoverAfterPartitionTest, TestCloudInspectUtil, TestCloudPivotFacet, TestCollectionAPI, TestConfigSetsAPI, TestConfigSetsAPIExclusivity, TestDistribDocBasedVersion]
   [junit4] Completed [436/562 (12!)] on J0 in 34.02s, 1 test, 1 failure <<< FAILURES!

[...truncated 414 lines...]
BUILD FAILED
/export/home/jenkins/workspace/Lucene-Solr-5.x-Solaris/build.xml:794: The following error occurred while executing this line:
/export/home/jenkins/workspace/Lucene-Solr-5.x-Solaris/build.xml:738: The following error occurred while executing this line:
/export/home/jenkins/workspace/Lucene-Solr-5.x-Solaris/build.xml:59: The following error occurred while executing this line:
/export/home/jenkins/workspace/Lucene-Solr-5.x-Solaris/solr/build.xml:233: The following error occurred while executing this line:
/export/home/jenkins/workspace/Lucene-Solr-5.x-Solaris/solr/common-build.xml:526: The following error occurred while executing this line:
/export/home/jenkins/workspace/Lucene-Solr-5.x-Solaris/lucene/common-build.xml:1444: The following error occurred while executing this line:
/export/home/jenkins/workspace/Lucene-Solr-5.x-Solaris/lucene/common-build.xml:1000: There were test failures: 562 suites (7 ignored), 2231 tests, 2 errors, 10 failures, 54 ignored (39 assumptions) [seed: 794764EE032C08CC]

Total time: 84 minutes 29 seconds
Build step 'Invoke Ant' marked build as failure
Archiving artifacts
[WARNINGS] Skipping publisher since build result is FAILURE
Recording test results
Email was triggered for: Failure - Any
Sending email for trigger: Failure - Any



Mime
View raw message