lucene-dev mailing list archives

Site index · List index
Message view « Date » · « Thread »
Top « Date » · « Thread »
From Policeman Jenkins Server <jenk...@thetaphi.de>
Subject [JENKINS] Lucene-Solr-trunk-Linux (64bit/jdk1.8.0_66) - Build # 15152 - Failure!
Date Wed, 09 Dec 2015 11:08:34 GMT
Build: http://jenkins.thetaphi.de/job/Lucene-Solr-trunk-Linux/15152/
Java: 64bit/jdk1.8.0_66 -XX:-UseCompressedOops -XX:+UseG1GC

3 tests failed.
FAILED:  junit.framework.TestSuite.org.apache.solr.util.TestSolrCLIRunExample

Error Message:
10 threads leaked from SUITE scope at org.apache.solr.util.TestSolrCLIRunExample:     1) Thread[id=3179, name=qtp1440684073-3179, state=TIMED_WAITING, group=TGRP-TestSolrCLIRunExample]         at sun.misc.Unsafe.park(Native Method)         at java.util.concurrent.locks.LockSupport.parkNanos(LockSupport.java:215)         at java.util.concurrent.locks.AbstractQueuedSynchronizer$ConditionObject.awaitNanos(AbstractQueuedSynchronizer.java:2078)         at org.eclipse.jetty.util.BlockingArrayQueue.poll(BlockingArrayQueue.java:392)         at org.eclipse.jetty.util.thread.QueuedThreadPool.idleJobPoll(QueuedThreadPool.java:546)         at org.eclipse.jetty.util.thread.QueuedThreadPool.access$800(QueuedThreadPool.java:47)         at org.eclipse.jetty.util.thread.QueuedThreadPool$3.run(QueuedThreadPool.java:609)         at java.lang.Thread.run(Thread.java:745)    2) Thread[id=3183, name=Scheduler-1197058453, state=TIMED_WAITING, group=TGRP-TestSolrCLIRunExample]         at sun.misc.Unsafe.park(Native Method)         at java.util.concurrent.locks.LockSupport.parkNanos(LockSupport.java:215)         at java.util.concurrent.locks.AbstractQueuedSynchronizer$ConditionObject.awaitNanos(AbstractQueuedSynchronizer.java:2078)         at java.util.concurrent.ScheduledThreadPoolExecutor$DelayedWorkQueue.take(ScheduledThreadPoolExecutor.java:1093)         at java.util.concurrent.ScheduledThreadPoolExecutor$DelayedWorkQueue.take(ScheduledThreadPoolExecutor.java:809)         at java.util.concurrent.ThreadPoolExecutor.getTask(ThreadPoolExecutor.java:1067)         at java.util.concurrent.ThreadPoolExecutor.runWorker(ThreadPoolExecutor.java:1127)         at java.util.concurrent.ThreadPoolExecutor$Worker.run(ThreadPoolExecutor.java:617)         at java.lang.Thread.run(Thread.java:745)    3) Thread[id=3176, name=qtp1440684073-3176, state=TIMED_WAITING, group=TGRP-TestSolrCLIRunExample]         at sun.misc.Unsafe.park(Native Method)         at java.util.concurrent.locks.LockSupport.parkNanos(LockSupport.java:215)         at java.util.concurrent.locks.AbstractQueuedSynchronizer$ConditionObject.awaitNanos(AbstractQueuedSynchronizer.java:2078)         at org.eclipse.jetty.util.BlockingArrayQueue.poll(BlockingArrayQueue.java:392)         at org.eclipse.jetty.util.thread.QueuedThreadPool.idleJobPoll(QueuedThreadPool.java:546)         at org.eclipse.jetty.util.thread.QueuedThreadPool.access$800(QueuedThreadPool.java:47)         at org.eclipse.jetty.util.thread.QueuedThreadPool$3.run(QueuedThreadPool.java:609)         at java.lang.Thread.run(Thread.java:745)    4) Thread[id=3178, name=qtp1440684073-3178, state=TIMED_WAITING, group=TGRP-TestSolrCLIRunExample]         at sun.misc.Unsafe.park(Native Method)         at java.util.concurrent.locks.LockSupport.parkNanos(LockSupport.java:215)         at java.util.concurrent.locks.AbstractQueuedSynchronizer$ConditionObject.awaitNanos(AbstractQueuedSynchronizer.java:2078)         at org.eclipse.jetty.util.BlockingArrayQueue.poll(BlockingArrayQueue.java:392)         at org.eclipse.jetty.util.thread.QueuedThreadPool.idleJobPoll(QueuedThreadPool.java:546)         at org.eclipse.jetty.util.thread.QueuedThreadPool.access$800(QueuedThreadPool.java:47)         at org.eclipse.jetty.util.thread.QueuedThreadPool$3.run(QueuedThreadPool.java:609)         at java.lang.Thread.run(Thread.java:745)    5) Thread[id=3181, name=qtp1440684073-3181, state=TIMED_WAITING, group=TGRP-TestSolrCLIRunExample]         at sun.misc.Unsafe.park(Native Method)         at java.util.concurrent.locks.LockSupport.parkNanos(LockSupport.java:215)         at java.util.concurrent.locks.AbstractQueuedSynchronizer$ConditionObject.awaitNanos(AbstractQueuedSynchronizer.java:2078)         at org.eclipse.jetty.util.BlockingArrayQueue.poll(BlockingArrayQueue.java:392)         at org.eclipse.jetty.util.thread.QueuedThreadPool.idleJobPoll(QueuedThreadPool.java:546)         at org.eclipse.jetty.util.thread.QueuedThreadPool.access$800(QueuedThreadPool.java:47)         at org.eclipse.jetty.util.thread.QueuedThreadPool$3.run(QueuedThreadPool.java:609)         at java.lang.Thread.run(Thread.java:745)    6) Thread[id=3177, name=qtp1440684073-3177, state=TIMED_WAITING, group=TGRP-TestSolrCLIRunExample]         at sun.misc.Unsafe.park(Native Method)         at java.util.concurrent.locks.LockSupport.parkNanos(LockSupport.java:215)         at java.util.concurrent.locks.AbstractQueuedSynchronizer$ConditionObject.awaitNanos(AbstractQueuedSynchronizer.java:2078)         at org.eclipse.jetty.util.BlockingArrayQueue.poll(BlockingArrayQueue.java:392)         at org.eclipse.jetty.util.thread.QueuedThreadPool.idleJobPoll(QueuedThreadPool.java:546)         at org.eclipse.jetty.util.thread.QueuedThreadPool.access$800(QueuedThreadPool.java:47)         at org.eclipse.jetty.util.thread.QueuedThreadPool$3.run(QueuedThreadPool.java:609)         at java.lang.Thread.run(Thread.java:745)    7) Thread[id=3184, name=org.eclipse.jetty.server.session.HashSessionManager@357a7edcTimer, state=TIMED_WAITING, group=TGRP-TestSolrCLIRunExample]         at sun.misc.Unsafe.park(Native Method)         at java.util.concurrent.locks.LockSupport.parkNanos(LockSupport.java:215)         at java.util.concurrent.locks.AbstractQueuedSynchronizer$ConditionObject.awaitNanos(AbstractQueuedSynchronizer.java:2078)         at java.util.concurrent.ScheduledThreadPoolExecutor$DelayedWorkQueue.take(ScheduledThreadPoolExecutor.java:1093)         at java.util.concurrent.ScheduledThreadPoolExecutor$DelayedWorkQueue.take(ScheduledThreadPoolExecutor.java:809)         at java.util.concurrent.ThreadPoolExecutor.getTask(ThreadPoolExecutor.java:1067)         at java.util.concurrent.ThreadPoolExecutor.runWorker(ThreadPoolExecutor.java:1127)         at java.util.concurrent.ThreadPoolExecutor$Worker.run(ThreadPoolExecutor.java:617)         at java.lang.Thread.run(Thread.java:745)    8) Thread[id=3175, name=qtp1440684073-3175, state=TIMED_WAITING, group=TGRP-TestSolrCLIRunExample]         at sun.misc.Unsafe.park(Native Method)         at java.util.concurrent.locks.LockSupport.parkNanos(LockSupport.java:215)         at java.util.concurrent.locks.AbstractQueuedSynchronizer$ConditionObject.awaitNanos(AbstractQueuedSynchronizer.java:2078)         at org.eclipse.jetty.util.BlockingArrayQueue.poll(BlockingArrayQueue.java:392)         at org.eclipse.jetty.util.thread.QueuedThreadPool.idleJobPoll(QueuedThreadPool.java:546)         at org.eclipse.jetty.util.thread.QueuedThreadPool.access$800(QueuedThreadPool.java:47)         at org.eclipse.jetty.util.thread.QueuedThreadPool$3.run(QueuedThreadPool.java:609)         at java.lang.Thread.run(Thread.java:745)    9) Thread[id=3180, name=qtp1440684073-3180, state=TIMED_WAITING, group=TGRP-TestSolrCLIRunExample]         at sun.misc.Unsafe.park(Native Method)         at java.util.concurrent.locks.LockSupport.parkNanos(LockSupport.java:215)         at java.util.concurrent.locks.AbstractQueuedSynchronizer$ConditionObject.awaitNanos(AbstractQueuedSynchronizer.java:2078)         at org.eclipse.jetty.util.BlockingArrayQueue.poll(BlockingArrayQueue.java:392)         at org.eclipse.jetty.util.thread.QueuedThreadPool.idleJobPoll(QueuedThreadPool.java:546)         at org.eclipse.jetty.util.thread.QueuedThreadPool.access$800(QueuedThreadPool.java:47)         at org.eclipse.jetty.util.thread.QueuedThreadPool$3.run(QueuedThreadPool.java:609)         at java.lang.Thread.run(Thread.java:745)   10) Thread[id=3182, name=qtp1440684073-3182, state=TIMED_WAITING, group=TGRP-TestSolrCLIRunExample]         at sun.misc.Unsafe.park(Native Method)         at java.util.concurrent.locks.LockSupport.parkNanos(LockSupport.java:215)         at java.util.concurrent.locks.AbstractQueuedSynchronizer$ConditionObject.awaitNanos(AbstractQueuedSynchronizer.java:2078)         at org.eclipse.jetty.util.BlockingArrayQueue.poll(BlockingArrayQueue.java:392)         at org.eclipse.jetty.util.thread.QueuedThreadPool.idleJobPoll(QueuedThreadPool.java:546)         at org.eclipse.jetty.util.thread.QueuedThreadPool.access$800(QueuedThreadPool.java:47)         at org.eclipse.jetty.util.thread.QueuedThreadPool$3.run(QueuedThreadPool.java:609)         at java.lang.Thread.run(Thread.java:745)

Stack Trace:
com.carrotsearch.randomizedtesting.ThreadLeakError: 10 threads leaked from SUITE scope at org.apache.solr.util.TestSolrCLIRunExample: 
   1) Thread[id=3179, name=qtp1440684073-3179, state=TIMED_WAITING, group=TGRP-TestSolrCLIRunExample]
        at sun.misc.Unsafe.park(Native Method)
        at java.util.concurrent.locks.LockSupport.parkNanos(LockSupport.java:215)
        at java.util.concurrent.locks.AbstractQueuedSynchronizer$ConditionObject.awaitNanos(AbstractQueuedSynchronizer.java:2078)
        at org.eclipse.jetty.util.BlockingArrayQueue.poll(BlockingArrayQueue.java:392)
        at org.eclipse.jetty.util.thread.QueuedThreadPool.idleJobPoll(QueuedThreadPool.java:546)
        at org.eclipse.jetty.util.thread.QueuedThreadPool.access$800(QueuedThreadPool.java:47)
        at org.eclipse.jetty.util.thread.QueuedThreadPool$3.run(QueuedThreadPool.java:609)
        at java.lang.Thread.run(Thread.java:745)
   2) Thread[id=3183, name=Scheduler-1197058453, state=TIMED_WAITING, group=TGRP-TestSolrCLIRunExample]
        at sun.misc.Unsafe.park(Native Method)
        at java.util.concurrent.locks.LockSupport.parkNanos(LockSupport.java:215)
        at java.util.concurrent.locks.AbstractQueuedSynchronizer$ConditionObject.awaitNanos(AbstractQueuedSynchronizer.java:2078)
        at java.util.concurrent.ScheduledThreadPoolExecutor$DelayedWorkQueue.take(ScheduledThreadPoolExecutor.java:1093)
        at java.util.concurrent.ScheduledThreadPoolExecutor$DelayedWorkQueue.take(ScheduledThreadPoolExecutor.java:809)
        at java.util.concurrent.ThreadPoolExecutor.getTask(ThreadPoolExecutor.java:1067)
        at java.util.concurrent.ThreadPoolExecutor.runWorker(ThreadPoolExecutor.java:1127)
        at java.util.concurrent.ThreadPoolExecutor$Worker.run(ThreadPoolExecutor.java:617)
        at java.lang.Thread.run(Thread.java:745)
   3) Thread[id=3176, name=qtp1440684073-3176, state=TIMED_WAITING, group=TGRP-TestSolrCLIRunExample]
        at sun.misc.Unsafe.park(Native Method)
        at java.util.concurrent.locks.LockSupport.parkNanos(LockSupport.java:215)
        at java.util.concurrent.locks.AbstractQueuedSynchronizer$ConditionObject.awaitNanos(AbstractQueuedSynchronizer.java:2078)
        at org.eclipse.jetty.util.BlockingArrayQueue.poll(BlockingArrayQueue.java:392)
        at org.eclipse.jetty.util.thread.QueuedThreadPool.idleJobPoll(QueuedThreadPool.java:546)
        at org.eclipse.jetty.util.thread.QueuedThreadPool.access$800(QueuedThreadPool.java:47)
        at org.eclipse.jetty.util.thread.QueuedThreadPool$3.run(QueuedThreadPool.java:609)
        at java.lang.Thread.run(Thread.java:745)
   4) Thread[id=3178, name=qtp1440684073-3178, state=TIMED_WAITING, group=TGRP-TestSolrCLIRunExample]
        at sun.misc.Unsafe.park(Native Method)
        at java.util.concurrent.locks.LockSupport.parkNanos(LockSupport.java:215)
        at java.util.concurrent.locks.AbstractQueuedSynchronizer$ConditionObject.awaitNanos(AbstractQueuedSynchronizer.java:2078)
        at org.eclipse.jetty.util.BlockingArrayQueue.poll(BlockingArrayQueue.java:392)
        at org.eclipse.jetty.util.thread.QueuedThreadPool.idleJobPoll(QueuedThreadPool.java:546)
        at org.eclipse.jetty.util.thread.QueuedThreadPool.access$800(QueuedThreadPool.java:47)
        at org.eclipse.jetty.util.thread.QueuedThreadPool$3.run(QueuedThreadPool.java:609)
        at java.lang.Thread.run(Thread.java:745)
   5) Thread[id=3181, name=qtp1440684073-3181, state=TIMED_WAITING, group=TGRP-TestSolrCLIRunExample]
        at sun.misc.Unsafe.park(Native Method)
        at java.util.concurrent.locks.LockSupport.parkNanos(LockSupport.java:215)
        at java.util.concurrent.locks.AbstractQueuedSynchronizer$ConditionObject.awaitNanos(AbstractQueuedSynchronizer.java:2078)
        at org.eclipse.jetty.util.BlockingArrayQueue.poll(BlockingArrayQueue.java:392)
        at org.eclipse.jetty.util.thread.QueuedThreadPool.idleJobPoll(QueuedThreadPool.java:546)
        at org.eclipse.jetty.util.thread.QueuedThreadPool.access$800(QueuedThreadPool.java:47)
        at org.eclipse.jetty.util.thread.QueuedThreadPool$3.run(QueuedThreadPool.java:609)
        at java.lang.Thread.run(Thread.java:745)
   6) Thread[id=3177, name=qtp1440684073-3177, state=TIMED_WAITING, group=TGRP-TestSolrCLIRunExample]
        at sun.misc.Unsafe.park(Native Method)
        at java.util.concurrent.locks.LockSupport.parkNanos(LockSupport.java:215)
        at java.util.concurrent.locks.AbstractQueuedSynchronizer$ConditionObject.awaitNanos(AbstractQueuedSynchronizer.java:2078)
        at org.eclipse.jetty.util.BlockingArrayQueue.poll(BlockingArrayQueue.java:392)
        at org.eclipse.jetty.util.thread.QueuedThreadPool.idleJobPoll(QueuedThreadPool.java:546)
        at org.eclipse.jetty.util.thread.QueuedThreadPool.access$800(QueuedThreadPool.java:47)
        at org.eclipse.jetty.util.thread.QueuedThreadPool$3.run(QueuedThreadPool.java:609)
        at java.lang.Thread.run(Thread.java:745)
   7) Thread[id=3184, name=org.eclipse.jetty.server.session.HashSessionManager@357a7edcTimer, state=TIMED_WAITING, group=TGRP-TestSolrCLIRunExample]
        at sun.misc.Unsafe.park(Native Method)
        at java.util.concurrent.locks.LockSupport.parkNanos(LockSupport.java:215)
        at java.util.concurrent.locks.AbstractQueuedSynchronizer$ConditionObject.awaitNanos(AbstractQueuedSynchronizer.java:2078)
        at java.util.concurrent.ScheduledThreadPoolExecutor$DelayedWorkQueue.take(ScheduledThreadPoolExecutor.java:1093)
        at java.util.concurrent.ScheduledThreadPoolExecutor$DelayedWorkQueue.take(ScheduledThreadPoolExecutor.java:809)
        at java.util.concurrent.ThreadPoolExecutor.getTask(ThreadPoolExecutor.java:1067)
        at java.util.concurrent.ThreadPoolExecutor.runWorker(ThreadPoolExecutor.java:1127)
        at java.util.concurrent.ThreadPoolExecutor$Worker.run(ThreadPoolExecutor.java:617)
        at java.lang.Thread.run(Thread.java:745)
   8) Thread[id=3175, name=qtp1440684073-3175, state=TIMED_WAITING, group=TGRP-TestSolrCLIRunExample]
        at sun.misc.Unsafe.park(Native Method)
        at java.util.concurrent.locks.LockSupport.parkNanos(LockSupport.java:215)
        at java.util.concurrent.locks.AbstractQueuedSynchronizer$ConditionObject.awaitNanos(AbstractQueuedSynchronizer.java:2078)
        at org.eclipse.jetty.util.BlockingArrayQueue.poll(BlockingArrayQueue.java:392)
        at org.eclipse.jetty.util.thread.QueuedThreadPool.idleJobPoll(QueuedThreadPool.java:546)
        at org.eclipse.jetty.util.thread.QueuedThreadPool.access$800(QueuedThreadPool.java:47)
        at org.eclipse.jetty.util.thread.QueuedThreadPool$3.run(QueuedThreadPool.java:609)
        at java.lang.Thread.run(Thread.java:745)
   9) Thread[id=3180, name=qtp1440684073-3180, state=TIMED_WAITING, group=TGRP-TestSolrCLIRunExample]
        at sun.misc.Unsafe.park(Native Method)
        at java.util.concurrent.locks.LockSupport.parkNanos(LockSupport.java:215)
        at java.util.concurrent.locks.AbstractQueuedSynchronizer$ConditionObject.awaitNanos(AbstractQueuedSynchronizer.java:2078)
        at org.eclipse.jetty.util.BlockingArrayQueue.poll(BlockingArrayQueue.java:392)
        at org.eclipse.jetty.util.thread.QueuedThreadPool.idleJobPoll(QueuedThreadPool.java:546)
        at org.eclipse.jetty.util.thread.QueuedThreadPool.access$800(QueuedThreadPool.java:47)
        at org.eclipse.jetty.util.thread.QueuedThreadPool$3.run(QueuedThreadPool.java:609)
        at java.lang.Thread.run(Thread.java:745)
  10) Thread[id=3182, name=qtp1440684073-3182, state=TIMED_WAITING, group=TGRP-TestSolrCLIRunExample]
        at sun.misc.Unsafe.park(Native Method)
        at java.util.concurrent.locks.LockSupport.parkNanos(LockSupport.java:215)
        at java.util.concurrent.locks.AbstractQueuedSynchronizer$ConditionObject.awaitNanos(AbstractQueuedSynchronizer.java:2078)
        at org.eclipse.jetty.util.BlockingArrayQueue.poll(BlockingArrayQueue.java:392)
        at org.eclipse.jetty.util.thread.QueuedThreadPool.idleJobPoll(QueuedThreadPool.java:546)
        at org.eclipse.jetty.util.thread.QueuedThreadPool.access$800(QueuedThreadPool.java:47)
        at org.eclipse.jetty.util.thread.QueuedThreadPool$3.run(QueuedThreadPool.java:609)
        at java.lang.Thread.run(Thread.java:745)
	at __randomizedtesting.SeedInfo.seed([66F19CD8A5CFBAA5]:0)


FAILED:  junit.framework.TestSuite.org.apache.solr.util.TestSolrCLIRunExample

Error Message:
There are still zombie threads that couldn't be terminated:    1) Thread[id=3183, name=Scheduler-1197058453, state=TIMED_WAITING, group=TGRP-TestSolrCLIRunExample]         at sun.misc.Unsafe.park(Native Method)         at java.util.concurrent.locks.LockSupport.parkNanos(LockSupport.java:215)         at java.util.concurrent.locks.AbstractQueuedSynchronizer$ConditionObject.awaitNanos(AbstractQueuedSynchronizer.java:2078)         at java.util.concurrent.ScheduledThreadPoolExecutor$DelayedWorkQueue.take(ScheduledThreadPoolExecutor.java:1093)         at java.util.concurrent.ScheduledThreadPoolExecutor$DelayedWorkQueue.take(ScheduledThreadPoolExecutor.java:809)         at java.util.concurrent.ThreadPoolExecutor.getTask(ThreadPoolExecutor.java:1067)         at java.util.concurrent.ThreadPoolExecutor.runWorker(ThreadPoolExecutor.java:1127)         at java.util.concurrent.ThreadPoolExecutor$Worker.run(ThreadPoolExecutor.java:617)         at java.lang.Thread.run(Thread.java:745)    2) Thread[id=3184, name=org.eclipse.jetty.server.session.HashSessionManager@357a7edcTimer, state=TIMED_WAITING, group=TGRP-TestSolrCLIRunExample]         at sun.misc.Unsafe.park(Native Method)         at java.util.concurrent.locks.LockSupport.parkNanos(LockSupport.java:215)         at java.util.concurrent.locks.AbstractQueuedSynchronizer$ConditionObject.awaitNanos(AbstractQueuedSynchronizer.java:2078)         at java.util.concurrent.ScheduledThreadPoolExecutor$DelayedWorkQueue.take(ScheduledThreadPoolExecutor.java:1093)         at java.util.concurrent.ScheduledThreadPoolExecutor$DelayedWorkQueue.take(ScheduledThreadPoolExecutor.java:809)         at java.util.concurrent.ThreadPoolExecutor.getTask(ThreadPoolExecutor.java:1067)         at java.util.concurrent.ThreadPoolExecutor.runWorker(ThreadPoolExecutor.java:1127)         at java.util.concurrent.ThreadPoolExecutor$Worker.run(ThreadPoolExecutor.java:617)         at java.lang.Thread.run(Thread.java:745)

Stack Trace:
com.carrotsearch.randomizedtesting.ThreadLeakError: There are still zombie threads that couldn't be terminated:
   1) Thread[id=3183, name=Scheduler-1197058453, state=TIMED_WAITING, group=TGRP-TestSolrCLIRunExample]
        at sun.misc.Unsafe.park(Native Method)
        at java.util.concurrent.locks.LockSupport.parkNanos(LockSupport.java:215)
        at java.util.concurrent.locks.AbstractQueuedSynchronizer$ConditionObject.awaitNanos(AbstractQueuedSynchronizer.java:2078)
        at java.util.concurrent.ScheduledThreadPoolExecutor$DelayedWorkQueue.take(ScheduledThreadPoolExecutor.java:1093)
        at java.util.concurrent.ScheduledThreadPoolExecutor$DelayedWorkQueue.take(ScheduledThreadPoolExecutor.java:809)
        at java.util.concurrent.ThreadPoolExecutor.getTask(ThreadPoolExecutor.java:1067)
        at java.util.concurrent.ThreadPoolExecutor.runWorker(ThreadPoolExecutor.java:1127)
        at java.util.concurrent.ThreadPoolExecutor$Worker.run(ThreadPoolExecutor.java:617)
        at java.lang.Thread.run(Thread.java:745)
   2) Thread[id=3184, name=org.eclipse.jetty.server.session.HashSessionManager@357a7edcTimer, state=TIMED_WAITING, group=TGRP-TestSolrCLIRunExample]
        at sun.misc.Unsafe.park(Native Method)
        at java.util.concurrent.locks.LockSupport.parkNanos(LockSupport.java:215)
        at java.util.concurrent.locks.AbstractQueuedSynchronizer$ConditionObject.awaitNanos(AbstractQueuedSynchronizer.java:2078)
        at java.util.concurrent.ScheduledThreadPoolExecutor$DelayedWorkQueue.take(ScheduledThreadPoolExecutor.java:1093)
        at java.util.concurrent.ScheduledThreadPoolExecutor$DelayedWorkQueue.take(ScheduledThreadPoolExecutor.java:809)
        at java.util.concurrent.ThreadPoolExecutor.getTask(ThreadPoolExecutor.java:1067)
        at java.util.concurrent.ThreadPoolExecutor.runWorker(ThreadPoolExecutor.java:1127)
        at java.util.concurrent.ThreadPoolExecutor$Worker.run(ThreadPoolExecutor.java:617)
        at java.lang.Thread.run(Thread.java:745)
	at __randomizedtesting.SeedInfo.seed([66F19CD8A5CFBAA5]:0)


FAILED:  org.apache.solr.util.TestSolrCLIRunExample.testInteractiveSolrCloudExample

Error Message:
After running Solr cloud example, test collection 'testCloudExamplePrompt' not found in Solr at: http://localhost:42986/solr; tool output:  Welcome to the SolrCloud example!  This interactive session will help you launch a SolrCloud cluster on your local workstation. To begin, how many Solr nodes would you like to run in your local cluster? (specify 1-4 nodes) [2]:  Ok, let's start up 1 Solr nodes for your example SolrCloud cluster. Please enter the port for node1 [8983]:  Creating Solr home directory /home/jenkins/workspace/Lucene-Solr-trunk-Linux/solr/build/solr-core/test/J0/temp/solr.util.TestSolrCLIRunExample_66F19CD8A5CFBAA5-001/tempDir-002/cloud/node1/solr  Starting up Solr on port 42986 using command: /home/jenkins/workspace/Lucene-Solr-trunk-Linux/solr/bin/solr start -cloud -p 42986 -s "temp/solr.util.TestSolrCLIRunExample_66F19CD8A5CFBAA5-001/tempDir-002/cloud/node1/solr"  

Stack Trace:
java.lang.AssertionError: After running Solr cloud example, test collection 'testCloudExamplePrompt' not found in Solr at: http://localhost:42986/solr; tool output: 
Welcome to the SolrCloud example!

This interactive session will help you launch a SolrCloud cluster on your local workstation.
To begin, how many Solr nodes would you like to run in your local cluster? (specify 1-4 nodes) [2]: 
Ok, let's start up 1 Solr nodes for your example SolrCloud cluster.
Please enter the port for node1 [8983]: 
Creating Solr home directory /home/jenkins/workspace/Lucene-Solr-trunk-Linux/solr/build/solr-core/test/J0/temp/solr.util.TestSolrCLIRunExample_66F19CD8A5CFBAA5-001/tempDir-002/cloud/node1/solr

Starting up Solr on port 42986 using command:
/home/jenkins/workspace/Lucene-Solr-trunk-Linux/solr/bin/solr start -cloud -p 42986 -s "temp/solr.util.TestSolrCLIRunExample_66F19CD8A5CFBAA5-001/tempDir-002/cloud/node1/solr"


	at __randomizedtesting.SeedInfo.seed([66F19CD8A5CFBAA5:BD807C1292BA7FC3]:0)
	at org.junit.Assert.fail(Assert.java:93)
	at org.apache.solr.util.TestSolrCLIRunExample.testInteractiveSolrCloudExample(TestSolrCLIRunExample.java:428)
	at sun.reflect.NativeMethodAccessorImpl.invoke0(Native Method)
	at sun.reflect.NativeMethodAccessorImpl.invoke(NativeMethodAccessorImpl.java:62)
	at sun.reflect.DelegatingMethodAccessorImpl.invoke(DelegatingMethodAccessorImpl.java:43)
	at java.lang.reflect.Method.invoke(Method.java:497)
	at com.carrotsearch.randomizedtesting.RandomizedRunner.invoke(RandomizedRunner.java:1764)
	at com.carrotsearch.randomizedtesting.RandomizedRunner$8.evaluate(RandomizedRunner.java:871)
	at com.carrotsearch.randomizedtesting.RandomizedRunner$9.evaluate(RandomizedRunner.java:907)
	at com.carrotsearch.randomizedtesting.RandomizedRunner$10.evaluate(RandomizedRunner.java:921)
	at com.carrotsearch.randomizedtesting.rules.SystemPropertiesRestoreRule$1.evaluate(SystemPropertiesRestoreRule.java:57)
	at org.apache.lucene.util.TestRuleSetupTeardownChained$1.evaluate(TestRuleSetupTeardownChained.java:50)
	at org.apache.lucene.util.AbstractBeforeAfterRule$1.evaluate(AbstractBeforeAfterRule.java:46)
	at org.apache.lucene.util.TestRuleThreadAndTestName$1.evaluate(TestRuleThreadAndTestName.java:49)
	at org.apache.lucene.util.TestRuleIgnoreAfterMaxFailures$1.evaluate(TestRuleIgnoreAfterMaxFailures.java:65)
	at org.apache.lucene.util.TestRuleMarkFailure$1.evaluate(TestRuleMarkFailure.java:48)
	at com.carrotsearch.randomizedtesting.rules.StatementAdapter.evaluate(StatementAdapter.java:36)
	at com.carrotsearch.randomizedtesting.ThreadLeakControl$StatementRunner.run(ThreadLeakControl.java:367)
	at com.carrotsearch.randomizedtesting.ThreadLeakControl.forkTimeoutingTask(ThreadLeakControl.java:809)
	at com.carrotsearch.randomizedtesting.ThreadLeakControl$3.evaluate(ThreadLeakControl.java:460)
	at com.carrotsearch.randomizedtesting.RandomizedRunner.runSingleTest(RandomizedRunner.java:880)
	at com.carrotsearch.randomizedtesting.RandomizedRunner$5.evaluate(RandomizedRunner.java:781)
	at com.carrotsearch.randomizedtesting.RandomizedRunner$6.evaluate(RandomizedRunner.java:816)
	at com.carrotsearch.randomizedtesting.RandomizedRunner$7.evaluate(RandomizedRunner.java:827)
	at com.carrotsearch.randomizedtesting.rules.StatementAdapter.evaluate(StatementAdapter.java:36)
	at com.carrotsearch.randomizedtesting.rules.SystemPropertiesRestoreRule$1.evaluate(SystemPropertiesRestoreRule.java:57)
	at org.apache.lucene.util.AbstractBeforeAfterRule$1.evaluate(AbstractBeforeAfterRule.java:46)
	at com.carrotsearch.randomizedtesting.rules.StatementAdapter.evaluate(StatementAdapter.java:36)
	at org.apache.lucene.util.TestRuleStoreClassName$1.evaluate(TestRuleStoreClassName.java:42)
	at com.carrotsearch.randomizedtesting.rules.NoShadowingOrOverridesOnMethodsRule$1.evaluate(NoShadowingOrOverridesOnMethodsRule.java:40)
	at com.carrotsearch.randomizedtesting.rules.NoShadowingOrOverridesOnMethodsRule$1.evaluate(NoShadowingOrOverridesOnMethodsRule.java:40)
	at com.carrotsearch.randomizedtesting.rules.StatementAdapter.evaluate(StatementAdapter.java:36)
	at com.carrotsearch.randomizedtesting.rules.StatementAdapter.evaluate(StatementAdapter.java:36)
	at com.carrotsearch.randomizedtesting.rules.StatementAdapter.evaluate(StatementAdapter.java:36)
	at org.apache.lucene.util.TestRuleAssertionsRequired$1.evaluate(TestRuleAssertionsRequired.java:54)
	at org.apache.lucene.util.TestRuleMarkFailure$1.evaluate(TestRuleMarkFailure.java:48)
	at org.apache.lucene.util.TestRuleIgnoreAfterMaxFailures$1.evaluate(TestRuleIgnoreAfterMaxFailures.java:65)
	at org.apache.lucene.util.TestRuleIgnoreTestSuites$1.evaluate(TestRuleIgnoreTestSuites.java:55)
	at com.carrotsearch.randomizedtesting.rules.StatementAdapter.evaluate(StatementAdapter.java:36)
	at com.carrotsearch.randomizedtesting.ThreadLeakControl$StatementRunner.run(ThreadLeakControl.java:367)
	at java.lang.Thread.run(Thread.java:745)




Build Log:
[...truncated 9808 lines...]
   [junit4] Suite: org.apache.solr.util.TestSolrCLIRunExample
   [junit4]   2> Creating dataDir: /home/jenkins/workspace/Lucene-Solr-trunk-Linux/solr/build/solr-core/test/J0/temp/solr.util.TestSolrCLIRunExample_66F19CD8A5CFBAA5-001/init-core-data-001
   [junit4]   2> 357473 INFO  (TEST-TestSolrCLIRunExample.testSchemalessExample-seed#[66F19CD8A5CFBAA5]) [    ] o.a.s.SolrTestCaseJ4 ###Starting testSchemalessExample
   [junit4]   2> 357474 INFO  (TEST-TestSolrCLIRunExample.testSchemalessExample-seed#[66F19CD8A5CFBAA5]) [    ] o.a.s.u.TestSolrCLIRunExample Selected port 54826 to start schemaless example Solr instance on ...
   [junit4]   2> 357511 INFO  (Thread-1382) [    ] o.e.j.s.Server jetty-9.3.6.v20151106
   [junit4]   2> 357513 INFO  (Thread-1382) [    ] o.e.j.s.h.ContextHandler Started o.e.j.s.ServletContextHandler@3a0a0696{/solr,null,AVAILABLE}
   [junit4]   2> 357514 INFO  (Thread-1382) [    ] o.e.j.s.ServerConnector Started ServerConnector@17728463{HTTP/1.1,[http/1.1]}{127.0.0.1:54826}
   [junit4]   2> 357515 INFO  (Thread-1382) [    ] o.e.j.s.Server Started @359055ms
   [junit4]   2> 357515 INFO  (Thread-1382) [    ] o.a.s.c.s.e.JettySolrRunner Jetty properties: {hostContext=/solr, hostPort=54826}
   [junit4]   2> 357515 INFO  (Thread-1382) [    ] o.a.s.s.SolrDispatchFilter SolrDispatchFilter.init(): sun.misc.Launcher$AppClassLoader@4e0e2f2a
   [junit4]   2> 357515 INFO  (Thread-1382) [    ] o.a.s.c.SolrResourceLoader new SolrResourceLoader for directory: '/home/jenkins/workspace/Lucene-Solr-trunk-Linux/solr/build/solr-core/test/J0/temp/solr.util.TestSolrCLIRunExample_66F19CD8A5CFBAA5-001/tempDir-001/schemaless/solr'
   [junit4]   2> 357515 INFO  (Thread-1382) [    ] o.a.s.c.SolrResourceLoader JNDI not configured for solr (NoInitialContextEx)
   [junit4]   2> 357515 INFO  (Thread-1382) [    ] o.a.s.c.SolrResourceLoader solr home defaulted to 'solr/' (could not find system property or JNDI)
   [junit4]   2> 357516 INFO  (Thread-1382) [    ] o.a.s.c.SolrXmlConfig Loading container configuration from /home/jenkins/workspace/Lucene-Solr-trunk-Linux/solr/build/solr-core/test/J0/temp/solr.util.TestSolrCLIRunExample_66F19CD8A5CFBAA5-001/tempDir-001/schemaless/solr/solr.xml
   [junit4]   2> 357519 ERROR (qtp1322725678-3152) [    ] o.a.s.s.SolrDispatchFilter Error processing the request. CoreContainer is either not initialized or shutting down.
   [junit4]   2> 357520 WARN  (qtp1322725678-3152) [    ] o.e.j.s.ServletHandler /solr/admin/info/system
   [junit4]   2> org.apache.solr.common.SolrException: Error processing the request. CoreContainer is either not initialized or shutting down.
   [junit4]   2> 	at org.apache.solr.servlet.SolrDispatchFilter.doFilter(SolrDispatchFilter.java:189)
   [junit4]   2> 	at org.apache.solr.servlet.SolrDispatchFilter.doFilter(SolrDispatchFilter.java:181)
   [junit4]   2> 	at org.eclipse.jetty.servlet.ServletHandler$CachedChain.doFilter(ServletHandler.java:1668)
   [junit4]   2> 	at org.apache.solr.client.solrj.embedded.JettySolrRunner$DebugFilter.doFilter(JettySolrRunner.java:111)
   [junit4]   2> 	at org.eclipse.jetty.servlet.ServletHandler$CachedChain.doFilter(ServletHandler.java:1668)
   [junit4]   2> 	at org.eclipse.jetty.servlets.GzipFilter.doFilter(GzipFilter.java:45)
   [junit4]   2> 	at org.eclipse.jetty.servlet.ServletHandler$CachedChain.doFilter(ServletHandler.java:1668)
   [junit4]   2> 	at org.eclipse.jetty.servlet.ServletHandler.doHandle(ServletHandler.java:581)
   [junit4]   2> 	at org.eclipse.jetty.server.session.SessionHandler.doHandle(SessionHandler.java:224)
   [junit4]   2> 	at org.eclipse.jetty.server.handler.ContextHandler.doHandle(ContextHandler.java:1158)
   [junit4]   2> 	at org.eclipse.jetty.servlet.ServletHandler.doScope(ServletHandler.java:511)
   [junit4]   2> 	at org.eclipse.jetty.server.session.SessionHandler.doScope(SessionHandler.java:185)
   [junit4]   2> 	at org.eclipse.jetty.server.handler.ContextHandler.doScope(ContextHandler.java:1090)
   [junit4]   2> 	at org.eclipse.jetty.server.handler.ScopedHandler.handle(ScopedHandler.java:141)
   [junit4]   2> 	at org.eclipse.jetty.server.handler.gzip.GzipHandler.handle(GzipHandler.java:437)
   [junit4]   2> 	at org.eclipse.jetty.server.handler.HandlerWrapper.handle(HandlerWrapper.java:119)
   [junit4]   2> 	at org.eclipse.jetty.server.Server.handle(Server.java:517)
   [junit4]   2> 	at org.eclipse.jetty.server.HttpChannel.handle(HttpChannel.java:308)
   [junit4]   2> 	at org.eclipse.jetty.server.HttpConnection.onFillable(HttpConnection.java:242)
   [junit4]   2> 	at org.eclipse.jetty.io.AbstractConnection$ReadCallback.succeeded(AbstractConnection.java:261)
   [junit4]   2> 	at org.eclipse.jetty.io.FillInterest.fillable(FillInterest.java:95)
   [junit4]   2> 	at org.eclipse.jetty.io.SelectChannelEndPoint$2.run(SelectChannelEndPoint.java:75)
   [junit4]   2> 	at org.eclipse.jetty.util.thread.strategy.ExecuteProduceConsume.produceAndRun(ExecuteProduceConsume.java:213)
   [junit4]   2> 	at org.eclipse.jetty.util.thread.strategy.ExecuteProduceConsume.run(ExecuteProduceConsume.java:147)
   [junit4]   2> 	at org.eclipse.jetty.util.thread.QueuedThreadPool.runJob(QueuedThreadPool.java:654)
   [junit4]   2> 	at org.eclipse.jetty.util.thread.QueuedThreadPool$3.run(QueuedThreadPool.java:572)
   [junit4]   2> 	at java.lang.Thread.run(Thread.java:745)
   [junit4]   2> 357521 INFO  (Thread-1382) [    ] o.a.s.c.CorePropertiesLocator Config-defined core root directory: /home/jenkins/workspace/Lucene-Solr-trunk-Linux/solr/build/solr-core/test/J0/temp/solr.util.TestSolrCLIRunExample_66F19CD8A5CFBAA5-001/tempDir-001/schemaless/solr
   [junit4]   2> 357521 INFO  (Thread-1382) [    ] o.a.s.c.CoreContainer New CoreContainer 283823806
   [junit4]   2> 357521 INFO  (Thread-1382) [    ] o.a.s.c.CoreContainer Loading cores into CoreContainer [instanceDir=/home/jenkins/workspace/Lucene-Solr-trunk-Linux/solr/build/solr-core/test/J0/temp/solr.util.TestSolrCLIRunExample_66F19CD8A5CFBAA5-001/tempDir-001/schemaless/solr]
   [junit4]   2> 357521 WARN  (Thread-1382) [    ] o.a.s.c.CoreContainer Couldn't add files from /home/jenkins/workspace/Lucene-Solr-trunk-Linux/solr/build/solr-core/test/J0/temp/solr.util.TestSolrCLIRunExample_66F19CD8A5CFBAA5-001/tempDir-001/schemaless/solr/lib to classpath: /home/jenkins/workspace/Lucene-Solr-trunk-Linux/solr/build/solr-core/test/J0/temp/solr.util.TestSolrCLIRunExample_66F19CD8A5CFBAA5-001/tempDir-001/schemaless/solr/lib
   [junit4]   2> 357521 INFO  (Thread-1382) [    ] o.a.s.h.c.HttpShardHandlerFactory created with socketTimeout : 600000,connTimeout : 60000,maxConnectionsPerHost : 20,maxConnections : 10000,corePoolSize : 0,maximumPoolSize : 2147483647,maxThreadIdleTime : 5,sizeOfQueue : -1,fairnessPolicy : false,useRetries : false,
   [junit4]   2> 357522 INFO  (Thread-1382) [    ] o.a.s.u.UpdateShardHandler Creating UpdateShardHandler HTTP client with params: socketTimeout=600000&connTimeout=60000&retry=true
   [junit4]   2> 357522 INFO  (Thread-1382) [    ] o.a.s.l.LogWatcher SLF4J impl is org.slf4j.impl.Log4jLoggerFactory
   [junit4]   2> 357522 INFO  (Thread-1382) [    ] o.a.s.l.LogWatcher Registering Log Listener [Log4j (org.slf4j.impl.Log4jLoggerFactory)]
   [junit4]   2> 357522 INFO  (Thread-1382) [    ] o.a.s.c.CoreContainer Security conf doesn't exist. Skipping setup for authorization module.
   [junit4]   2> 357522 INFO  (Thread-1382) [    ] o.a.s.c.CoreContainer No authentication plugin used.
   [junit4]   2> 357523 INFO  (Thread-1382) [    ] o.a.s.c.CorePropertiesLocator Looking for core definitions underneath /home/jenkins/workspace/Lucene-Solr-trunk-Linux/solr/build/solr-core/test/J0/temp/solr.util.TestSolrCLIRunExample_66F19CD8A5CFBAA5-001/tempDir-001/schemaless/solr
   [junit4]   2> 357523 INFO  (Thread-1382) [    ] o.a.s.c.CorePropertiesLocator Found 0 core definitions
   [junit4]   2> 357524 INFO  (Thread-1382) [    ] o.a.s.s.SolrDispatchFilter user.dir=/home/jenkins/workspace/Lucene-Solr-trunk-Linux/solr/build/solr-core/test/J0
   [junit4]   2> 357524 INFO  (Thread-1382) [    ] o.a.s.s.SolrDispatchFilter SolrDispatchFilter.init() done
   [junit4]   2> 359548 INFO  (qtp1322725678-3147) [    ] o.a.s.s.HttpSolrCall [admin] webapp=null path=/admin/info/system params={wt=json} status=0 QTime=21 
   [junit4]   2> 359552 INFO  (qtp1322725678-3147) [    ] o.a.s.s.HttpSolrCall [admin] webapp=null path=/admin/cores params={core=gettingstarted&action=STATUS&wt=json} status=0 QTime=0 
   [junit4]   2> 359560 INFO  (qtp1322725678-3147) [    ] o.a.s.s.HttpSolrCall [admin] webapp=null path=/admin/info/system params={wt=json} status=0 QTime=4 
   [junit4]   2> 359569 INFO  (qtp1322725678-3153) [    ] o.a.s.s.HttpSolrCall [admin] webapp=null path=/admin/info/system params={wt=json} status=0 QTime=5 
   [junit4]   2> 359572 INFO  (qtp1322725678-3153) [    ] o.a.s.s.HttpSolrCall [admin] webapp=null path=/admin/cores params={core=gettingstarted&action=STATUS&wt=json} status=0 QTime=0 
   [junit4]   2> 359590 INFO  (qtp1322725678-3153) [    ] o.a.s.h.a.CoreAdminHandler core create command name=gettingstarted&action=CREATE&instanceDir=gettingstarted&wt=json
   [junit4]   2> 359590 INFO  (qtp1322725678-3153) [    ] o.a.s.c.CoreDescriptor Created CoreDescriptor: {name=gettingstarted, config=solrconfig.xml, loadOnStartup=true, schema=schema.xml, configSetProperties=configsetprops.json, transient=false, dataDir=data/}
   [junit4]   2> 359590 INFO  (qtp1322725678-3153) [    ] o.a.s.c.SolrResourceLoader new SolrResourceLoader for directory: '/home/jenkins/workspace/Lucene-Solr-trunk-Linux/solr/build/solr-core/test/J0/temp/solr.util.TestSolrCLIRunExample_66F19CD8A5CFBAA5-001/tempDir-001/schemaless/solr/gettingstarted'
   [junit4]   2> 359590 INFO  (qtp1322725678-3153) [    ] o.a.s.c.SolrResourceLoader JNDI not configured for solr (NoInitialContextEx)
   [junit4]   2> 359590 INFO  (qtp1322725678-3153) [    ] o.a.s.c.SolrResourceLoader solr home defaulted to 'solr/' (could not find system property or JNDI)
   [junit4]   2> 359597 INFO  (qtp1322725678-3153) [    ] o.a.s.c.SolrConfig current version of requestparams : 0
   [junit4]   2> 359598 INFO  (qtp1322725678-3153) [    ] o.a.s.c.SolrConfig Adding specified lib dirs to ClassLoader
   [junit4]   2> 359599 WARN  (qtp1322725678-3153) [    ] o.a.s.c.SolrConfig Couldn't add files from /home/jenkins/workspace/Lucene-Solr-trunk-Linux/solr/build/solr-core/test/J0/temp/solr.util.TestSolrCLIRunExample_66F19CD8A5CFBAA5-001/tempDir-001/schemaless/solr/gettingstarted/../../../../contrib/extraction/lib filtered by .*\.jar to classpath: /home/jenkins/workspace/Lucene-Solr-trunk-Linux/solr/build/solr-core/test/J0/temp/solr.util.TestSolrCLIRunExample_66F19CD8A5CFBAA5-001/tempDir-001/schemaless/solr/gettingstarted/../../../../contrib/extraction/lib
   [junit4]   2> 359599 WARN  (qtp1322725678-3153) [    ] o.a.s.c.SolrConfig Couldn't add files from /home/jenkins/workspace/Lucene-Solr-trunk-Linux/solr/build/solr-core/test/J0/temp/solr.util.TestSolrCLIRunExample_66F19CD8A5CFBAA5-001/tempDir-001/schemaless/solr/gettingstarted/../../../../dist filtered by solr-cell-\d.*\.jar to classpath: /home/jenkins/workspace/Lucene-Solr-trunk-Linux/solr/build/solr-core/test/J0/temp/solr.util.TestSolrCLIRunExample_66F19CD8A5CFBAA5-001/tempDir-001/schemaless/solr/gettingstarted/../../../../dist
   [junit4]   2> 359600 WARN  (qtp1322725678-3153) [    ] o.a.s.c.SolrConfig Couldn't add files from /home/jenkins/workspace/Lucene-Solr-trunk-Linux/solr/build/solr-core/test/J0/temp/solr.util.TestSolrCLIRunExample_66F19CD8A5CFBAA5-001/tempDir-001/schemaless/solr/gettingstarted/../../../../contrib/clustering/lib filtered by .*\.jar to classpath: /home/jenkins/workspace/Lucene-Solr-trunk-Linux/solr/build/solr-core/test/J0/temp/solr.util.TestSolrCLIRunExample_66F19CD8A5CFBAA5-001/tempDir-001/schemaless/solr/gettingstarted/../../../../contrib/clustering/lib
   [junit4]   2> 359600 WARN  (qtp1322725678-3153) [    ] o.a.s.c.SolrConfig Couldn't add files from /home/jenkins/workspace/Lucene-Solr-trunk-Linux/solr/build/solr-core/test/J0/temp/solr.util.TestSolrCLIRunExample_66F19CD8A5CFBAA5-001/tempDir-001/schemaless/solr/gettingstarted/../../../../dist filtered by solr-clustering-\d.*\.jar to classpath: /home/jenkins/workspace/Lucene-Solr-trunk-Linux/solr/build/solr-core/test/J0/temp/solr.util.TestSolrCLIRunExample_66F19CD8A5CFBAA5-001/tempDir-001/schemaless/solr/gettingstarted/../../../../dist
   [junit4]   2> 359600 WARN  (qtp1322725678-3153) [    ] o.a.s.c.SolrConfig Couldn't add files from /home/jenkins/workspace/Lucene-Solr-trunk-Linux/solr/build/solr-core/test/J0/temp/solr.util.TestSolrCLIRunExample_66F19CD8A5CFBAA5-001/tempDir-001/schemaless/solr/gettingstarted/../../../../contrib/langid/lib filtered by .*\.jar to classpath: /home/jenkins/workspace/Lucene-Solr-trunk-Linux/solr/build/solr-core/test/J0/temp/solr.util.TestSolrCLIRunExample_66F19CD8A5CFBAA5-001/tempDir-001/schemaless/solr/gettingstarted/../../../../contrib/langid/lib
   [junit4]   2> 359600 WARN  (qtp1322725678-3153) [    ] o.a.s.c.SolrConfig Couldn't add files from /home/jenkins/workspace/Lucene-Solr-trunk-Linux/solr/build/solr-core/test/J0/temp/solr.util.TestSolrCLIRunExample_66F19CD8A5CFBAA5-001/tempDir-001/schemaless/solr/gettingstarted/../../../../dist filtered by solr-langid-\d.*\.jar to classpath: /home/jenkins/workspace/Lucene-Solr-trunk-Linux/solr/build/solr-core/test/J0/temp/solr.util.TestSolrCLIRunExample_66F19CD8A5CFBAA5-001/tempDir-001/schemaless/solr/gettingstarted/../../../../dist
   [junit4]   2> 359601 WARN  (qtp1322725678-3153) [    ] o.a.s.c.SolrConfig Couldn't add files from /home/jenkins/workspace/Lucene-Solr-trunk-Linux/solr/build/solr-core/test/J0/temp/solr.util.TestSolrCLIRunExample_66F19CD8A5CFBAA5-001/tempDir-001/schemaless/solr/gettingstarted/../../../../contrib/velocity/lib filtered by .*\.jar to classpath: /home/jenkins/workspace/Lucene-Solr-trunk-Linux/solr/build/solr-core/test/J0/temp/solr.util.TestSolrCLIRunExample_66F19CD8A5CFBAA5-001/tempDir-001/schemaless/solr/gettingstarted/../../../../contrib/velocity/lib
   [junit4]   2> 359601 WARN  (qtp1322725678-3153) [    ] o.a.s.c.SolrConfig Couldn't add files from /home/jenkins/workspace/Lucene-Solr-trunk-Linux/solr/build/solr-core/test/J0/temp/solr.util.TestSolrCLIRunExample_66F19CD8A5CFBAA5-001/tempDir-001/schemaless/solr/gettingstarted/../../../../dist filtered by solr-velocity-\d.*\.jar to classpath: /home/jenkins/workspace/Lucene-Solr-trunk-Linux/solr/build/solr-core/test/J0/temp/solr.util.TestSolrCLIRunExample_66F19CD8A5CFBAA5-001/tempDir-001/schemaless/solr/gettingstarted/../../../../dist
   [junit4]   2> 359609 INFO  (qtp1322725678-3153) [    ] o.a.s.c.SolrConfig Using Lucene MatchVersion: 6.0.0
   [junit4]   2> 359656 INFO  (qtp1322725678-3153) [    ] o.a.s.c.SolrConfig Loaded SolrConfig: solrconfig.xml
   [junit4]   2> 359662 INFO  (qtp1322725678-3153) [    ] o.a.s.s.IndexSchema [gettingstarted] Schema name=example-data-driven-schema
   [junit4]   2> 359798 INFO  (qtp1322725678-3153) [    ] o.a.s.s.IndexSchema unique key field: id
   [junit4]   2> 359873 INFO  (qtp1322725678-3153) [    ] o.a.s.s.FileExchangeRateProvider Reloading exchange rates from file currency.xml
   [junit4]   2> 359877 INFO  (qtp1322725678-3153) [    ] o.a.s.s.FileExchangeRateProvider Reloading exchange rates from file currency.xml
   [junit4]   2> 359897 INFO  (qtp1322725678-3153) [    ] o.a.s.c.ConfigSetProperties Did not find ConfigSet properties, assuming default properties: Can't find resource 'configsetprops.json' in classpath or '/home/jenkins/workspace/Lucene-Solr-trunk-Linux/solr/build/solr-core/test/J0/temp/solr.util.TestSolrCLIRunExample_66F19CD8A5CFBAA5-001/tempDir-001/schemaless/solr/gettingstarted'
   [junit4]   2> 359898 INFO  (qtp1322725678-3153) [    ] o.a.s.c.CoreContainer Creating SolrCore 'gettingstarted' using configuration from instancedir /home/jenkins/workspace/Lucene-Solr-trunk-Linux/solr/build/solr-core/test/J0/temp/solr.util.TestSolrCLIRunExample_66F19CD8A5CFBAA5-001/tempDir-001/schemaless/solr/gettingstarted
   [junit4]   2> 359898 INFO  (qtp1322725678-3153) [    x:gettingstarted] o.a.s.c.SolrCore org.apache.solr.core.MockDirectoryFactory
   [junit4]   2> 359898 INFO  (qtp1322725678-3153) [    x:gettingstarted] o.a.s.c.SolrCore [[gettingstarted] ] Opening new SolrCore at [/home/jenkins/workspace/Lucene-Solr-trunk-Linux/solr/build/solr-core/test/J0/temp/solr.util.TestSolrCLIRunExample_66F19CD8A5CFBAA5-001/tempDir-001/schemaless/solr/gettingstarted], dataDir=[null]
   [junit4]   2> 359898 INFO  (qtp1322725678-3153) [    x:gettingstarted] o.a.s.c.JmxMonitoredMap JMX monitoring is enabled. Adding Solr mbeans to JMX Server: com.sun.jmx.mbeanserver.JmxMBeanServer@4664a70a
   [junit4]   2> 359903 INFO  (qtp1322725678-3153) [    x:gettingstarted] o.a.s.c.SolrCore [[gettingstarted] ] Added SolrEventListener for newSearcher: [org.apache.solr.core.QuerySenderListener{queries=[]}]
   [junit4]   2> 359903 INFO  (qtp1322725678-3153) [    x:gettingstarted] o.a.s.c.SolrCore [[gettingstarted] ] Added SolrEventListener for firstSearcher: [org.apache.solr.core.QuerySenderListener{queries=[]}]
   [junit4]   2> 359904 INFO  (qtp1322725678-3153) [    x:gettingstarted] o.a.s.c.CachingDirectoryFactory return new directory for /home/jenkins/workspace/Lucene-Solr-trunk-Linux/solr/build/solr-core/test/J0/temp/solr.util.TestSolrCLIRunExample_66F19CD8A5CFBAA5-001/tempDir-001/schemaless/solr/gettingstarted/data
   [junit4]   2> 359904 INFO  (qtp1322725678-3153) [    x:gettingstarted] o.a.s.c.SolrCore New index directory detected: old=null new=/home/jenkins/workspace/Lucene-Solr-trunk-Linux/solr/build/solr-core/test/J0/temp/solr.util.TestSolrCLIRunExample_66F19CD8A5CFBAA5-001/tempDir-001/schemaless/solr/gettingstarted/data/index/
   [junit4]   2> 359904 WARN  (qtp1322725678-3153) [    x:gettingstarted] o.a.s.c.SolrCore [gettingstarted] Solr index directory '/home/jenkins/workspace/Lucene-Solr-trunk-Linux/solr/build/solr-core/test/J0/temp/solr.util.TestSolrCLIRunExample_66F19CD8A5CFBAA5-001/tempDir-001/schemaless/solr/gettingstarted/data/index' doesn't exist. Creating new index...
   [junit4]   2> 359904 INFO  (qtp1322725678-3153) [    x:gettingstarted] o.a.s.c.CachingDirectoryFactory return new directory for /home/jenkins/workspace/Lucene-Solr-trunk-Linux/solr/build/solr-core/test/J0/temp/solr.util.TestSolrCLIRunExample_66F19CD8A5CFBAA5-001/tempDir-001/schemaless/solr/gettingstarted/data/index
   [junit4]   2> 359905 INFO  (qtp1322725678-3153) [    x:gettingstarted] o.a.s.c.SolrDeletionPolicy SolrDeletionPolicy.onCommit: commits: num=1
   [junit4]   2> 	commit{dir=MockDirectoryWrapper(RAMDirectory@2cefa1da lockFactory=org.apache.lucene.store.SingleInstanceLockFactory@5bdb4090),segFN=segments_1,generation=1}
   [junit4]   2> 359905 INFO  (qtp1322725678-3153) [    x:gettingstarted] o.a.s.c.SolrDeletionPolicy newest commit generation = 1
   [junit4]   2> 359906 INFO  (qtp1322725678-3153) [    x:gettingstarted] o.a.s.c.PluginBag queryResponseWriter : 'velocity' created with startup=lazy 
   [junit4]   2> 359906 INFO  (OldIndexDirectoryCleanupThreadForCore-gettingstarted) [    x:gettingstarted] o.a.s.c.SolrCore Looking for old index directories to cleanup for core gettingstarted in /home/jenkins/workspace/Lucene-Solr-trunk-Linux/solr/build/solr-core/test/J0/temp/solr.util.TestSolrCLIRunExample_66F19CD8A5CFBAA5-001/tempDir-001/schemaless/solr/gettingstarted/data/
   [junit4]   2> 359906 WARN  (OldIndexDirectoryCleanupThreadForCore-gettingstarted) [    x:gettingstarted] o.a.s.c.DirectoryFactory /home/jenkins/workspace/Lucene-Solr-trunk-Linux/solr/build/solr-core/test/J0/temp/solr.util.TestSolrCLIRunExample_66F19CD8A5CFBAA5-001/tempDir-001/schemaless/solr/gettingstarted/data/ does not point to a valid data directory; skipping clean-up of old index directories.
   [junit4]   2> 359913 INFO  (qtp1322725678-3153) [    x:gettingstarted] o.a.s.r.XSLTResponseWriter xsltCacheLifetimeSeconds=5
   [junit4]   2> 359935 INFO  (qtp1322725678-3153) [    x:gettingstarted] o.a.s.u.p.UpdateRequestProcessorChain creating updateRequestProcessorChain "add-unknown-fields-to-the-schema"
   [junit4]   2> 360020 INFO  (qtp1322725678-3153) [    x:gettingstarted] o.a.s.c.SolrCore no updateRequestProcessorChain defined as default, creating implicit default
   [junit4]   2> 360022 INFO  (qtp1322725678-3153) [    x:gettingstarted] o.a.s.h.l.XMLLoader xsltCacheLifetimeSeconds=60
   [junit4]   2> 360023 INFO  (qtp1322725678-3153) [    x:gettingstarted] o.a.s.h.l.XMLLoader xsltCacheLifetimeSeconds=60
   [junit4]   2> 360024 INFO  (qtp1322725678-3153) [    x:gettingstarted] o.a.s.h.l.XMLLoader xsltCacheLifetimeSeconds=60
   [junit4]   2> 360026 INFO  (qtp1322725678-3153) [    x:gettingstarted] o.a.s.h.l.XMLLoader xsltCacheLifetimeSeconds=60
   [junit4]   2> 360046 INFO  (qtp1322725678-3153) [    x:gettingstarted] o.a.s.c.PluginBag requestHandler : '/update/extract' created with startup=lazy 
   [junit4]   2> 360046 INFO  (qtp1322725678-3153) [    x:gettingstarted] o.a.s.c.PluginBag requestHandler : '/analysis/field' created with startup=lazy 
   [junit4]   2> 360046 INFO  (qtp1322725678-3153) [    x:gettingstarted] o.a.s.c.PluginBag requestHandler : '/analysis/document' created with startup=lazy 
   [junit4]   2> 360046 INFO  (qtp1322725678-3153) [    x:gettingstarted] o.a.s.c.PluginBag requestHandler : '/spell' created with startup=lazy 
   [junit4]   2> 360046 INFO  (qtp1322725678-3153) [    x:gettingstarted] o.a.s.c.PluginBag requestHandler : '/tvrh' created with startup=lazy 
   [junit4]   2> 360046 INFO  (qtp1322725678-3153) [    x:gettingstarted] o.a.s.c.PluginBag requestHandler : '/terms' created with startup=lazy 
   [junit4]   2> 360046 INFO  (qtp1322725678-3153) [    x:gettingstarted] o.a.s.c.PluginBag requestHandler : '/elevate' created with startup=lazy 
   [junit4]   2> 360046 INFO  (qtp1322725678-3153) [    x:gettingstarted] o.a.s.c.RequestHandlers Registered paths: /admin/mbeans,/browse,/update/json/docs,/admin/luke,/export,/get,/admin/properties,/elevate,/update/json,/admin/threads,/query,/analysis/field,/analysis/document,/spell,/update/csv,/sql,/tvrh,/select,/admin/segments,/admin/system,/replication,/config,/schema,/admin/plugins,/admin/logging,/admin/ping,/update,/admin/file,/debug/dump,/terms,/update/extract
   [junit4]   2> 360047 INFO  (qtp1322725678-3153) [    x:gettingstarted] o.a.s.c.SolrCore Using default statsCache cache: org.apache.solr.search.stats.LocalStatsCache
   [junit4]   2> 360047 INFO  (qtp1322725678-3153) [    x:gettingstarted] o.a.s.u.UpdateHandler Using UpdateLog implementation: org.apache.solr.update.UpdateLog
   [junit4]   2> 360047 INFO  (qtp1322725678-3153) [    x:gettingstarted] o.a.s.u.UpdateLog Initializing UpdateLog: dataDir= defaultSyncLevel=FLUSH numRecordsToKeep=100 maxNumLogsToKeep=10 numVersionBuckets=65536
   [junit4]   2> 360050 INFO  (qtp1322725678-3153) [    x:gettingstarted] o.a.s.u.CommitTracker Hard AutoCommit: if uncommited for 15000ms; 
   [junit4]   2> 360050 INFO  (qtp1322725678-3153) [    x:gettingstarted] o.a.s.u.CommitTracker Soft AutoCommit: disabled
   [junit4]   2> 360050 INFO  (qtp1322725678-3153) [    x:gettingstarted] o.a.s.c.SolrDeletionPolicy SolrDeletionPolicy.onInit: commits: num=1
   [junit4]   2> 	commit{dir=MockDirectoryWrapper(RAMDirectory@2cefa1da lockFactory=org.apache.lucene.store.SingleInstanceLockFactory@5bdb4090),segFN=segments_1,generation=1}
   [junit4]   2> 360050 INFO  (qtp1322725678-3153) [    x:gettingstarted] o.a.s.c.SolrDeletionPolicy newest commit generation = 1
   [junit4]   2> 360050 INFO  (qtp1322725678-3153) [    x:gettingstarted] o.a.s.s.SolrIndexSearcher Opening Searcher@3e627704[gettingstarted] main
   [junit4]   2> 360051 INFO  (qtp1322725678-3153) [    x:gettingstarted] o.a.s.r.ManagedResourceStorage File-based storage initialized to use dir: /home/jenkins/workspace/Lucene-Solr-trunk-Linux/solr/build/solr-core/test/J0/temp/solr.util.TestSolrCLIRunExample_66F19CD8A5CFBAA5-001/tempDir-001/schemaless/solr/gettingstarted/conf
   [junit4]   2> 360051 INFO  (qtp1322725678-3153) [    x:gettingstarted] o.a.s.r.RestManager Initializing RestManager with initArgs: {storageDir=/home/jenkins/workspace/Lucene-Solr-trunk-Linux/solr/build/solr-core/test/J0/temp/solr.util.TestSolrCLIRunExample_66F19CD8A5CFBAA5-001/tempDir-001/schemaless/solr/gettingstarted/conf}
   [junit4]   2> 360051 INFO  (qtp1322725678-3153) [    x:gettingstarted] o.a.s.r.ManagedResourceStorage Reading _rest_managed.json using file:dir=/home/jenkins/workspace/Lucene-Solr-trunk-Linux/solr/build/solr-core/test/J0/temp/solr.util.TestSolrCLIRunExample_66F19CD8A5CFBAA5-001/tempDir-001/schemaless/solr/gettingstarted/conf
   [junit4]   2> 360051 INFO  (qtp1322725678-3153) [    x:gettingstarted] o.a.s.r.RestManager Initializing 0 registered ManagedResources
   [junit4]   2> 360051 INFO  (qtp1322725678-3153) [    x:gettingstarted] o.a.s.h.c.SpellCheckComponent Initializing spell checkers
   [junit4]   2> 360051 INFO  (qtp1322725678-3153) [    x:gettingstarted] o.a.s.s.DirectSolrSpellChecker init: {name=default,field=_text_,classname=solr.DirectSolrSpellChecker,distanceMeasure=internal,accuracy=0.5,maxEdits=2,minPrefix=1,maxInspections=5,minQueryLength=4,maxQueryFrequency=0.01}
   [junit4]   2> 360052 INFO  (qtp1322725678-3153) [    x:gettingstarted] o.a.s.h.c.SpellCheckComponent No queryConverter defined, using default converter
   [junit4]   2> 360052 INFO  (qtp1322725678-3153) [    x:gettingstarted] o.a.s.h.c.QueryElevationComponent Loading QueryElevation from: /home/jenkins/workspace/Lucene-Solr-trunk-Linux/solr/build/solr-core/test/J0/temp/solr.util.TestSolrCLIRunExample_66F19CD8A5CFBAA5-001/tempDir-001/schemaless/solr/gettingstarted/conf/elevate.xml
   [junit4]   2> 360074 INFO  (qtp1322725678-3153) [    x:gettingstarted] o.a.s.h.ReplicationHandler Commits will be reserved for  10000
   [junit4]   2> 360074 INFO  (searcherExecutor-1490-thread-1-processing-x:gettingstarted) [    x:gettingstarted] o.a.s.c.QuerySenderListener QuerySenderListener sending requests to Searcher@3e627704[gettingstarted] main{ExitableDirectoryReader(UninvertingDirectoryReader())}
   [junit4]   2> 360075 INFO  (searcherExecutor-1490-thread-1-processing-x:gettingstarted) [    x:gettingstarted] o.a.s.c.QuerySenderListener QuerySenderListener done.
   [junit4]   2> 360075 INFO  (searcherExecutor-1490-thread-1-processing-x:gettingstarted) [    x:gettingstarted] o.a.s.h.c.SpellCheckComponent Loading spell index for spellchecker: default
   [junit4]   2> 360075 INFO  (searcherExecutor-1490-thread-1-processing-x:gettingstarted) [    x:gettingstarted] o.a.s.c.SolrCore [gettingstarted] Registered new searcher Searcher@3e627704[gettingstarted] main{ExitableDirectoryReader(UninvertingDirectoryReader())}
   [junit4]   2> 360075 INFO  (qtp1322725678-3153) [    x:gettingstarted] o.a.s.u.UpdateLog Looking up max value of version field to seed version buckets
   [junit4]   2> 360075 INFO  (qtp1322725678-3153) [    x:gettingstarted] o.a.s.u.VersionInfo Refreshing highest value of _version_ for 65536 version buckets from index
   [junit4]   2> 360076 INFO  (qtp1322725678-3153) [    x:gettingstarted] o.a.s.u.VersionInfo No terms found for _version_, cannot seed version bucket highest value from index
   [junit4]   2> 360076 INFO  (qtp1322725678-3153) [    x:gettingstarted] o.a.s.u.UpdateLog Could not find max version in index or recent updates, using new clock 1520077123905126400
   [junit4]   2> 360078 INFO  (qtp1322725678-3153) [    x:gettingstarted] o.a.s.u.UpdateLog Took 2.0ms to seed version buckets with highest version 1520077123905126400
   [junit4]   2> 360078 INFO  (qtp1322725678-3153) [    x:gettingstarted] o.a.s.c.CoreContainer registering core: gettingstarted
   [junit4]   2> 360079 INFO  (qtp1322725678-3153) [    x:gettingstarted] o.a.s.s.HttpSolrCall [admin] webapp=null path=/admin/cores params={name=gettingstarted&action=CREATE&instanceDir=gettingstarted&wt=json} status=0 QTime=489 
   [junit4]   2> 360081 INFO  (TEST-TestSolrCLIRunExample.testSchemalessExample-seed#[66F19CD8A5CFBAA5]) [    ] o.e.j.s.ServerConnector Stopped ServerConnector@17728463{HTTP/1.1,[http/1.1]}{127.0.0.1:54826}
   [junit4]   2> 360081 INFO  (TEST-TestSolrCLIRunExample.testSchemalessExample-seed#[66F19CD8A5CFBAA5]) [    ] o.a.s.c.CoreContainer Shutting down CoreContainer instance=283823806
   [junit4]   2> 360081 INFO  (TEST-TestSolrCLIRunExample.testSchemalessExample-seed#[66F19CD8A5CFBAA5]) [    x:gettingstarted] o.a.s.c.SolrCore [gettingstarted]  CLOSING SolrCore org.apache.solr.core.SolrCore@76ae455f
   [junit4]   2> 360082 INFO  (TEST-TestSolrCLIRunExample.testSchemalessExample-seed#[66F19CD8A5CFBAA5]) [    x:gettingstarted] o.a.s.u.DirectUpdateHandler2 closing DirectUpdateHandler2{commits=0,autocommit maxTime=15000ms,autocommits=0,soft autocommits=0,optimizes=0,rollbacks=0,expungeDeletes=0,docsPending=0,adds=0,deletesById=0,deletesByQuery=0,errors=0,cumulative_adds=0,cumulative_deletesById=0,cumulative_deletesByQuery=0,cumulative_errors=0,transaction_logs_total_size=0,transaction_logs_total_number=0}
   [junit4]   2> 360082 INFO  (TEST-TestSolrCLIRunExample.testSchemalessExample-seed#[66F19CD8A5CFBAA5]) [    x:gettingstarted] o.a.s.u.SolrCoreState Closing SolrCoreState
   [junit4]   2> 360082 INFO  (TEST-TestSolrCLIRunExample.testSchemalessExample-seed#[66F19CD8A5CFBAA5]) [    x:gettingstarted] o.a.s.u.DefaultSolrCoreState SolrCoreState ref count has reached 0 - closing IndexWriter
   [junit4]   2> 360082 INFO  (TEST-TestSolrCLIRunExample.testSchemalessExample-seed#[66F19CD8A5CFBAA5]) [    x:gettingstarted] o.a.s.u.DefaultSolrCoreState closing IndexWriter with IndexWriterCloser
   [junit4]   2> 360082 INFO  (TEST-TestSolrCLIRunExample.testSchemalessExample-seed#[66F19CD8A5CFBAA5]) [    x:gettingstarted] o.a.s.c.SolrCore [gettingstarted] Closing main searcher on request.
   [junit4]   2> 360096 INFO  (TEST-TestSolrCLIRunExample.testSchemalessExample-seed#[66F19CD8A5CFBAA5]) [    x:gettingstarted] o.a.s.c.CachingDirectoryFactory Closing MockDirectoryFactory - 2 directories currently being tracked
   [junit4]   2> 360096 INFO  (TEST-TestSolrCLIRunExample.testSchemalessExample-seed#[66F19CD8A5CFBAA5]) [    x:gettingstarted] o.a.s.c.CachingDirectoryFactory looking to close /home/jenkins/workspace/Lucene-Solr-trunk-Linux/solr/build/solr-core/test/J0/temp/solr.util.TestSolrCLIRunExample_66F19CD8A5CFBAA5-001/tempDir-001/schemaless/solr/gettingstarted/data [CachedDir<<refCount=0;path=/home/jenkins/workspace/Lucene-Solr-trunk-Linux/solr/build/solr-core/test/J0/temp/solr.util.TestSolrCLIRunExample_66F19CD8A5CFBAA5-001/tempDir-001/schemaless/solr/gettingstarted/data;done=false>>]
   [junit4]   2> 360096 INFO  (TEST-TestSolrCLIRunExample.testSchemalessExample-seed#[66F19CD8A5CFBAA5]) [    x:gettingstarted] o.a.s.c.CachingDirectoryFactory Closing directory: /home/jenkins/workspace/Lucene-Solr-trunk-Linux/solr/build/solr-core/test/J0/temp/solr.util.TestSolrCLIRunExample_66F19CD8A5CFBAA5-001/tempDir-001/schemaless/solr/gettingstarted/data
   [junit4]   2> 360096 INFO  (TEST-TestSolrCLIRunExample.testSchemalessExample-seed#[66F19CD8A5CFBAA5]) [    x:gettingstarted] o.a.s.c.CachingDirectoryFactory looking to close /home/jenkins/workspace/Lucene-Solr-trunk-Linux/solr/build/solr-core/test/J0/temp/solr.util.TestSolrCLIRunExample_66F19CD8A5CFBAA5-001/tempDir-001/schemaless/solr/gettingstarted/data/index [CachedDir<<refCount=0;path=/home/jenkins/workspace/Lucene-Solr-trunk-Linux/solr/build/solr-core/test/J0/temp/solr.util.TestSolrCLIRunExample_66F19CD8A5CFBAA5-001/tempDir-001/schemaless/solr/gettingstarted/data/index;done=false>>]
   [junit4]   2> 360096 INFO  (TEST-TestSolrCLIRunExample.testSchemalessExample-seed#[66F19CD8A5CFBAA5]) [    x:gettingstarted] o.a.s.c.CachingDirectoryFactory Closing directory: /home/jenkins/workspace/Lucene-Solr-trunk-Linux/solr/build/solr-core/test/J0/temp/solr.util.TestSolrCLIRunExample_66F19CD8A5CFBAA5-001/tempDir-001/schemaless/solr/gettingstarted/data/index
   [junit4]   2> 360098 INFO  (TEST-TestSolrCLIRunExample.testSchemalessExample-seed#[66F19CD8A5CFBAA5]) [    x:gettingstarted] o.e.j.s.h.ContextHandler Stopped o.e.j.s.ServletContextHandler@3a0a0696{/solr,null,UNAVAILABLE}
   [junit4]   2> 360098 INFO  (TEST-TestSolrCLIRunExample.testSchemalessExample-seed#[66F19CD8A5CFBAA5]) [    ] o.a.s.u.TestSolrCLIRunExample Stopped standalone Solr instance running on port 54826
   [junit4]   2> 360098 INFO  (TEST-TestSolrCLIRunExample.testSchemalessExample-seed#[66F19CD8A5CFBAA5]) [    ] o.a.s.SolrTestCaseJ4 ###Ending testSchemalessExample
   [junit4]   2> 360101 INFO  (TEST-TestSolrCLIRunExample.testInteractiveSolrCloudExample-seed#[66F19CD8A5CFBAA5]) [    ] o.a.s.SolrTestCaseJ4 ###Starting testInteractiveSolrCloudExample
   [junit4]   2> 360108 INFO  (TEST-TestSolrCLIRunExample.testInteractiveSolrCloudExample-seed#[66F19CD8A5CFBAA5]) [    ] o.a.s.c.ZkTestServer STARTING ZK TEST SERVER
   [junit4]   2> 360108 INFO  (Thread-1397) [    ] o.a.s.c.ZkTestServer client port:0.0.0.0/0.0.0.0:0
   [junit4]   2> 360108 INFO  (Thread-1397) [    ] o.a.s.c.ZkTestServer Starting server
   [junit4]   2> 360208 INFO  (TEST-TestSolrCLIRunExample.testInteractiveSolrCloudExample-seed#[66F19CD8A5CFBAA5]) [    ] o.a.s.c.ZkTestServer start zk server on port:52342
   [junit4]   2> 360208 INFO  (TEST-TestSolrCLIRunExample.testInteractiveSolrCloudExample-seed#[66F19CD8A5CFBAA5]) [    ] o.a.s.c.c.SolrZkClient Using default ZkCredentialsProvider
   [junit4]   2> 360209 INFO  (TEST-TestSolrCLIRunExample.testInteractiveSolrCloudExample-seed#[66F19CD8A5CFBAA5]) [    ] o.a.s.c.c.ConnectionManager Waiting for client to connect to ZooKeeper
   [junit4]   2> 360211 INFO  (zkCallback-337-thread-1) [    ] o.a.s.c.c.ConnectionManager Watcher org.apache.solr.common.cloud.ConnectionManager@563d38d2 name:ZooKeeperConnection Watcher:127.0.0.1:52342 got event WatchedEvent state:SyncConnected type:None path:null path:null type:None
   [junit4]   2> 360211 INFO  (TEST-TestSolrCLIRunExample.testInteractiveSolrCloudExample-seed#[66F19CD8A5CFBAA5]) [    ] o.a.s.c.c.ConnectionManager Client is connected to ZooKeeper
   [junit4]   2> 360211 INFO  (TEST-TestSolrCLIRunExample.testInteractiveSolrCloudExample-seed#[66F19CD8A5CFBAA5]) [    ] o.a.s.c.c.SolrZkClient Using default ZkACLProvider
   [junit4]   2> 360211 INFO  (TEST-TestSolrCLIRunExample.testInteractiveSolrCloudExample-seed#[66F19CD8A5CFBAA5]) [    ] o.a.s.c.c.SolrZkClient makePath: /solr/solr.xml
   [junit4]   2> 360217 INFO  (jetty-launcher-336-thread-1) [    ] o.e.j.s.Server jetty-9.3.6.v20151106
   [junit4]   2> 360218 INFO  (jetty-launcher-336-thread-1) [    ] o.e.j.s.h.ContextHandler Started o.e.j.s.ServletContextHandler@b3e25ae{/solr,null,AVAILABLE}
   [junit4]   2> 360222 INFO  (TEST-TestSolrCLIRunExample.testInteractiveSolrCloudExample-seed#[66F19CD8A5CFBAA5]) [    ] o.a.s.c.ZkTestServer connecting to 127.0.0.1:52342 52342
   [junit4]   2> 360257 INFO  (Thread-1397) [    ] o.a.s.c.ZkTestServer connecting to 127.0.0.1:52342 52342
   [junit4]   2> 
   [junit4]   2> ERROR: java.lang.Exception: Error starting up MiniSolrCloudCluster
   [junit4]   2> 
   [junit4]   2> 365261 INFO  (TEST-TestSolrCLIRunExample.testInteractiveSolrCloudExample-seed#[66F19CD8A5CFBAA5]) [    ] o.a.s.SolrTestCaseJ4 ###Ending testInteractiveSolrCloudExample
   [junit4]   2> NOTE: reproduce with: ant test  -Dtestcase=TestSolrCLIRunExample -Dtests.method=testInteractiveSolrCloudExample -Dtests.seed=66F19CD8A5CFBAA5 -Dtests.multiplier=3 -Dtests.slow=true -Dtests.locale=es_HN -Dtests.timezone=Europe/Sarajevo -Dtests.asserts=true -Dtests.file.encoding=UTF-8
   [junit4] FAILURE 5.17s J0 | TestSolrCLIRunExample.testInteractiveSolrCloudExample <<<
   [junit4]    > Throwable #1: java.lang.AssertionError: After running Solr cloud example, test collection 'testCloudExamplePrompt' not found in Solr at: http://localhost:42986/solr; tool output: 
   [junit4]    > Welcome to the SolrCloud example!
   [junit4]    > This interactive session will help you launch a SolrCloud cluster on your local workstation.
   [junit4]    > To begin, how many Solr nodes would you like to run in your local cluster? (specify 1-4 nodes) [2]: 
   [junit4]    > Ok, let's start up 1 Solr nodes for your example SolrCloud cluster.
   [junit4]    > Please enter the port for node1 [8983]: 
   [junit4]    > Creating Solr home directory /home/jenkins/workspace/Lucene-Solr-trunk-Linux/solr/build/solr-core/test/J0/temp/solr.util.TestSolrCLIRunExample_66F19CD8A5CFBAA5-001/tempDir-002/cloud/node1/solr
   [junit4]    > Starting up Solr on port 42986 using command:
   [junit4]    > /home/jenkins/workspace/Lucene-Solr-trunk-Linux/solr/bin/solr start -cloud -p 42986 -s "temp/solr.util.TestSolrCLIRunExample_66F19CD8A5CFBAA5-001/tempDir-002/cloud/node1/solr"
   [junit4]    > 	at __randomizedtesting.SeedInfo.seed([66F19CD8A5CFBAA5:BD807C1292BA7FC3]:0)
   [junit4]    > 	at org.apache.solr.util.TestSolrCLIRunExample.testInteractiveSolrCloudExample(TestSolrCLIRunExample.java:428)
   [junit4]    > 	at java.lang.Thread.run(Thread.java:745)
   [junit4]   2> 365265 INFO  (SUITE-TestSolrCLIRunExample-seed#[66F19CD8A5CFBAA5]-worker) [    ] o.a.s.SolrTestCaseJ4 ###deleteCore
   [junit4]   2> NOTE: leaving temporary files on disk at: /home/jenkins/workspace/Lucene-Solr-trunk-Linux/solr/build/solr-core/test/J0/temp/solr.util.TestSolrCLIRunExample_66F19CD8A5CFBAA5-001
   [junit4]   2> Dec 09, 2015 10:55:17 AM com.carrotsearch.randomizedtesting.ThreadLeakControl checkThreadLeaks
   [junit4]   2> WARNING: Will linger awaiting termination of 10 leaked thread(s).
   [junit4]   2> Dec 09, 2015 10:55:37 AM com.carrotsearch.randomizedtesting.ThreadLeakControl checkThreadLeaks
   [junit4]   2> SEVERE: 10 threads leaked from SUITE scope at org.apache.solr.util.TestSolrCLIRunExample: 
   [junit4]   2>    1) Thread[id=3179, name=qtp1440684073-3179, state=TIMED_WAITING, group=TGRP-TestSolrCLIRunExample]
   [junit4]   2>         at sun.misc.Unsafe.park(Native Method)
   [junit4]   2>         at java.util.concurrent.locks.LockSupport.parkNanos(LockSupport.java:215)
   [junit4]   2>         at java.util.concurrent.locks.AbstractQueuedSynchronizer$ConditionObject.awaitNanos(AbstractQueuedSynchronizer.java:2078)
   [junit4]   2>         at org.eclipse.jetty.util.BlockingArrayQueue.poll(BlockingArrayQueue.java:392)
   [junit4]   2>         at org.eclipse.jetty.util.thread.QueuedThreadPool.idleJobPoll(QueuedThreadPool.java:546)
   [junit4]   2>         at org.eclipse.jetty.util.thread.QueuedThreadPool.access$800(QueuedThreadPool.java:47)
   [junit4]   2>         at org.eclipse.jetty.util.thread.QueuedThreadPool$3.run(QueuedThreadPool.java:609)
   [junit4]   2>         at java.lang.Thread.run(Thread.java:745)
   [junit4]   2>    2) Thread[id=3183, name=Scheduler-1197058453, state=TIMED_WAITING, group=TGRP-TestSolrCLIRunExample]
   [junit4]   2>         at sun.misc.Unsafe.park(Native Method)
   [junit4]   2>         at java.util.concurrent.locks.LockSupport.parkNanos(LockSupport.java:215)
   [junit4]   2>         at java.util.concurrent.locks.AbstractQueuedSynchronizer$ConditionObject.awaitNanos(AbstractQueuedSynchronizer.java:2078)
   [junit4]   2>         at java.util.concurrent.ScheduledThreadPoolExecutor$DelayedWorkQueue.take(ScheduledThreadPoolExecutor.java:1093)
   [junit4]   2>         at java.util.concurrent.ScheduledThreadPoolExecutor$DelayedWorkQueue.take(ScheduledThreadPoolExecutor.java:809)
   [junit4]   2>         at java.util.concurrent.ThreadPoolExecutor.getTask(ThreadPoolExecutor.java:1067)
   [junit4]   2>         at java.util.concurrent.ThreadPoolExecutor.runWorker(ThreadPoolExecutor.java:1127)
   [junit4]   2>         at java.util.concurrent.ThreadPoolExecutor$Worker.run(ThreadPoolExecutor.java:617)
   [junit4]   2>         at java.lang.Thread.run(Thread.java:745)
   [junit4]   2>    3) Thread[id=3176, name=qtp1440684073-3176, state=TIMED_WAITING, group=TGRP-TestSolrCLIRunExample]
   [junit4]   2>         at sun.misc.Unsafe.park(Native Method)
   [junit4]   2>         at java.util.concurrent.locks.LockSupport.parkNanos(LockSupport.java:215)
   [junit4]   2>         at java.util.concurrent.locks.AbstractQueuedSynchronizer$ConditionObject.awaitNanos(AbstractQueuedSynchronizer.java:2078)
   [junit4]   2>         at org.eclipse.jetty.util.BlockingArrayQueue.poll(BlockingArrayQueue.java:392)
   [junit4]   2>         at org.eclipse.jetty.util.thread.QueuedThreadPool.idleJobPoll(QueuedThreadPool.java:546)
   [junit4]   2>         at org.eclipse.jetty.util.thread.QueuedThreadPool.access$800(QueuedThreadPool.java:47)
   [junit4]   2>         at org.eclipse.jetty.util.thread.QueuedThreadPool$3.run(QueuedThreadPool.java:609)
   [junit4]   2>         at java.lang.Thread.run(Thread.java:745)
   [junit4]   2>    4) Thread[id=3178, name=qtp1440684073-3178, state=TIMED_WAITING, group=TGRP-TestSolrCLIRunExample]
   [junit4]   2>         at sun.misc.Unsafe.park(Native Method)
   [junit4]   2>         at java.util.concurrent.locks.LockSupport.parkNanos(LockSupport.java:215)
   [junit4]   2>         at java.util.concurrent.locks.AbstractQueuedSynchronizer$ConditionObject.awaitNanos(AbstractQueuedSynchronizer.java:2078)
   [junit4]   2>         at org.eclipse.jetty.util.BlockingArrayQueue.poll(BlockingArrayQueue.java:392)
   [junit4]   2>         at org.eclipse.jetty.util.thread.QueuedThreadPool.idleJobPoll(QueuedThreadPool.java:546)
   [junit4]   2>         at org.eclipse.jetty.util.thread.QueuedThreadPool.access$800(QueuedThreadPool.java:47)
   [junit4]   2>         at org.eclipse.jetty.util.thread.QueuedThreadPool$3.run(QueuedThreadPool.java:609)
   [junit4]   2>         at java.lang.Thread.run(Thread.java:745)
   [junit4]   2>    5) Thread[id=3181, name=qtp1440684073-3181, state=TIMED_WAITING, group=TGRP-TestSolrCLIRunExample]
   [junit4]   2>         at sun.misc.Unsafe.park(Native Method)
   [junit4]   2>         at java.util.concurrent.locks.LockSupport.parkNanos(LockSupport.java:215)
   [junit4]   2>         at java.util.concurrent.locks.AbstractQueuedSynchronizer$ConditionObject.awaitNanos(AbstractQueuedSynchronizer.java:2078)
   [junit4]   2>         at org.eclipse.jetty.util.BlockingArrayQueue.poll(BlockingArrayQueue.java:392)
   [junit4]   2>         at org.eclipse.jetty.util.thread.QueuedThreadPool.idleJobPoll(QueuedThreadPool.java:546)
   [junit4]   2>         at org.eclipse.jetty.util.thread.QueuedThreadPool.access$800(QueuedThreadPool.java:47)
   [junit4]   2>         at org.eclipse.jetty.util.thread.QueuedThreadPool$3.run(QueuedThreadPool.java:609)
   [junit4]   2>         at java.lang.Thread.run(Thread.java:745)
   [junit4]   2>    6) Thread[id=3177, name=qtp1440684073-3177, state=TIMED_WAITING, group=TGRP-TestSolrCLIRunExample]
   [junit4]   2>         at sun.misc.Unsafe.park(Native Method)
   [junit4]   2>         at java.util.concurrent.locks.LockSupport.parkNanos(LockSupport.java:215)
   [junit4]   2>         at java.util.concurrent.locks.AbstractQueuedSynchronizer$ConditionObject.awaitNanos(AbstractQueuedSynchronizer.java:2078)
   [junit4]   2>         at org.eclipse.jetty.util.BlockingArrayQueue.poll(BlockingArrayQueue.java:392)
   [junit4]   2>         at org.eclipse.jetty.util.thread.QueuedThreadPool.idleJobPoll(QueuedThreadPool.java:546)
   [junit4]   2>         at org.eclipse.jetty.util.thread.QueuedThreadPool.access$800(QueuedThreadPool.java:47)
   [junit4]   2>         at org.eclipse.jetty.util.thread.QueuedThreadPool$3.run(QueuedThreadPool.java:609)
   [junit4]   2>         at java.lang.Thread.run(Thread.java:745)
   [junit4]   2>    7) Thread[id=3184, name=org.eclipse.jetty.server.session.HashSessionManager@357a7edcTimer, state=TIMED_WAITING, group=TGRP-TestSolrCLIRunExample]
   [junit4]   2>         at sun.misc.Unsafe.park(Native Method)
   [junit4]   2>         at java.util.concurrent.locks.LockSupport.parkNanos(LockSupport.java:215)
   [junit4]   2>         at java.util.concurrent.locks.AbstractQueuedSynchronizer$ConditionObject.awaitNanos(AbstractQueuedSynchronizer.java:2078)
   [junit4]   2>         at java.util.concurrent.ScheduledThreadPoolExecutor$DelayedWorkQueue.take(ScheduledThreadPoolExecutor.java:1093)
   [junit4]   2>         at java.util.concurrent.ScheduledThreadPoolExecutor$DelayedWorkQueue.take(ScheduledThreadPoolExecutor.java:809)
   [junit4]   2>         at java.util.concurrent.ThreadPoolExecutor.getTask(ThreadPoolExecutor.java:1067)
   [junit4]   2>         at java.util.concurrent.ThreadPoolExecutor.runWorker(ThreadPoolExecutor.java:1127)
   [junit4]   2>         at java.util.concurrent.ThreadPoolExecutor$Worker.run(ThreadPoolExecutor.java:617)
   [junit4]   2>         at java.lang.Thread.run(Thread.java:745)
   [junit4]   2>    8) Thread[id=3175, name=qtp1440684073-3175, state=TIMED_WAITING, group=TGRP-TestSolrCLIRunExample]
   [junit4]   2>         at sun.misc.Unsafe.park(Native Method)
   [junit4]   2>         at java.util.concurrent.locks.LockSupport.parkNanos(LockSupport.java:215)
   [junit4]   2>         at java.util.concurrent.locks.AbstractQueuedSynchronizer$ConditionObject.awaitNanos(AbstractQueuedSynchronizer.java:2078)
   [junit4]   2>         at org.eclipse.jetty.util.BlockingArrayQueue.poll(BlockingArrayQueue.java:392)
   [junit4]   2>         at org.eclipse.jetty.util.thread.QueuedThreadPool.idleJobPoll(QueuedThreadPool.java:546)
   [junit4]   2>         at org.eclipse.jetty.util.thread.QueuedThreadPool.access$800(QueuedThreadPool.java:47)
   [junit4]   2>         at org.eclipse.jetty.util.thread.QueuedThreadPool$3.run(QueuedThreadPool.java:609)
   [junit4]   2>         at java.lang.Thread.run(Thread.java:745)
   [junit4]   2>    9) Thread[id=3180, name=qtp1440684073-3180, state=TIMED_WAITING, group=TGRP-TestSolrCLIRunExample]
   [junit4]   2>         at sun.misc.Unsafe.park(Native Method)
   [junit4]   2>         at java.util.concurrent.locks.LockSupport.parkNanos(LockSupport.java:215)
   [junit4]   2>         at java.util.concurrent.locks.AbstractQueuedSynchronizer$ConditionObject.awaitNanos(AbstractQueuedSynchronizer.java:2078)
   [junit4]   2>         at org.eclipse.jetty.util.BlockingArrayQueue.poll(BlockingArrayQueue.java:392)
   [junit4]   2>         at org.eclipse.jetty.util.thread.QueuedThreadPool.idleJobPoll(QueuedThreadPool.java:546)
   [junit4]   2>         at org.eclipse.jetty.util.thread.QueuedThreadPool.access$800(QueuedThreadPool.java:47)
   [junit4]   2>         at org.eclipse.jetty.util.thread.QueuedThreadPool$3.run(QueuedThreadPool.java:609)
   [junit4]   2>         at java.lang.Thread.run(Thread.java:745)
   [junit4]   2>   10) Thread[id=3182, name=qtp1440684073-3182, state=TIMED_WAITING, group=TGRP-TestSolrCLIRunExample]
   [junit4]   2>         at sun.misc.Unsafe.park(Native Method)
   [junit4]   2>         at java.util.concurrent.locks.LockSupport.parkNanos(LockSupport.java:215)
   [junit4]   2>         at java.util.concurrent.locks.AbstractQueuedSynchronizer$ConditionObject.awaitNanos(AbstractQueuedSynchronizer.java:2078)
   [junit4]   2>         at org.eclipse.jetty.util.BlockingArrayQueue.poll(BlockingArrayQueue.java:392)
   [junit4]   2>         at org.eclipse.jetty.util.thread.QueuedThreadPool.idleJobPoll(QueuedThreadPool.java:546)
   [junit4]   2>         at org.eclipse.jetty.util.thread.QueuedThreadPool.access$800(QueuedThreadPool.java:47)
   [junit4]   2>         at org.eclipse.jetty.util.thread.QueuedThreadPool$3.run(QueuedThreadPool.java:609)
   [junit4]   2>         at java.lang.Thread.run(Thread.java:745)
   [junit4]   2> Dec 09, 2015 10:55:37 AM com.carrotsearch.randomizedtesting.ThreadLeakControl tryToInterruptAll
   [junit4]   2> INFO: Starting to interrupt leaked threads:
   [junit4]   2>    1) Thread[id=3179, name=qtp1440684073-3179, state=TIMED_WAITING, group=TGRP-TestSolrCLIRunExample]
   [junit4]   2>    2) Thread[id=3183, name=Scheduler-1197058453, state=TIMED_WAITING, group=TGRP-TestSolrCLIRunExample]
   [junit4]   2>    3) Thread[id=3176, name=qtp1440684073-3176, state=TIMED_WAITING, group=TGRP-TestSolrCLIRunExample]
   [junit4]   2>    4) Thread[id=3178, name=qtp1440684073-3178, state=TIMED_WAITING, group=TGRP-TestSolrCLIRunExample]
   [junit4]   2>    5) Thread[id=3181, name=qtp1440684073-3181, state=TIMED_WAITING, group=TGRP-TestSolrCLIRunExample]
   [junit4]   2>    6) Thread[id=3177, name=qtp1440684073-3177, state=TIMED_WAITING, group=TGRP-TestSolrCLIRunExample]
   [junit4]   2>    7) Thread[id=3184, name=org.eclipse.jetty.server.session.HashSessionManager@357a7edcTimer, state=TIMED_WAITING, group=TGRP-TestSolrCLIRunExample]
   [junit4]   2>    8) Thread[id=3175, name=qtp1440684073-3175, state=TIMED_WAITING, group=TGRP-TestSolrCLIRunExample]
   [junit4]   2>    9) Thread[id=3180, name=qtp1440684073-3180, state=TIMED_WAITING, group=TGRP-TestSolrCLIRunExample]
   [junit4]   2>   10) Thread[id=3182, name=qtp1440684073-3182, state=TIMED_WAITING, group=TGRP-TestSolrCLIRunExample]
   [junit4]   2> Dec 09, 2015 10:55:40 AM com.carrotsearch.randomizedtesting.ThreadLeakControl tryToInterruptAll
   [junit4]   2> SEVERE: There are still zombie threads that couldn't be terminated:
   [junit4]   2>    1) Thread[id=3183, name=Scheduler-1197058453, state=TIMED_WAITING, group=TGRP-TestSolrCLIRunExample]
   [junit4]   2>         at sun.misc.Unsafe.park(Native Method)
   [junit4]   2>         at java.util.concurrent.locks.LockSupport.parkNanos(LockSupport.java:215)
   [junit4]   2>         at java.util.concurrent.locks.AbstractQueuedSynchronizer$ConditionObject.awaitNanos(AbstractQueuedSynchronizer.java:2078)
   [junit4]   2>         at java.util.concurrent.ScheduledThreadPoolExecutor$DelayedWorkQueue.take(ScheduledThreadPoolExecutor.java:1093)
   [junit4]   2>         at java.util.concurrent.ScheduledThreadPoolExecutor$DelayedWorkQueue.take(ScheduledThreadPoolExecutor.java:809)
   [junit4]   2>         at java.util.concurrent.ThreadPoolExecutor.getTask(ThreadPoolExecutor.java:1067)
   [junit4]   2>         at java.util.concurrent.ThreadPoolExecutor.runWorker(ThreadPoolExecutor.java:1127)
   [junit4]   2>         at java.util.concurrent.ThreadPoolExecutor$Worker.run(ThreadPoolExecutor.java:617)
   [junit4]   2>         at java.lang.Thread.run(Thread.java:745)
   [junit4]   2>    2) Thread[id=3184, name=org.eclipse.jetty.server.session.HashSessionManager@357a7edcTimer, state=TIMED_WAITING, group=TGRP-TestSolrCLIRunExample]
   [junit4]   2>         at sun.misc.Unsafe.park(Native Method)
   [junit4]   2>         at java.util.concurrent.locks.LockSupport.parkNanos(LockSupport.java:215)
   [junit4]   2>         at java.util.concurrent.locks.AbstractQueuedSynchronizer$ConditionObject.awaitNanos(AbstractQueuedSynchronizer.java:2078)
   [junit4]   2>         at java.util.concurrent.ScheduledThreadPoolExecutor$DelayedWorkQueue.take(ScheduledThreadPoolExecutor.java:1093)
   [junit4]   2>         at java.util.concurrent.ScheduledThreadPoolExecutor$DelayedWorkQueue.take(ScheduledThreadPoolExecutor.java:809)
   [junit4]   2>         at java.util.concurrent.ThreadPoolExecutor.getTask(ThreadPoolExecutor.java:1067)
   [junit4]   2>         at java.util.concurrent.ThreadPoolExecutor.runWorker(ThreadPoolExecutor.java:1127)
   [junit4]   2>         at java.util.concurrent.ThreadPoolExecutor$Worker.run(ThreadPoolExecutor.java:617)
   [junit4]   2>         at java.lang.Thread.run(Thread.java:745)
   [junit4]   2> NOTE: test params are: codec=Asserting(Lucene60): {}, docValues:{}, sim=RandomSimilarityProvider(queryNorm=true,coord=no): {}, locale=es_HN, timezone=Europe/Sarajevo
   [junit4]   2> NOTE: Linux 3.19.0-37-generic amd64/Oracle Corporation 1.8.0_66 (64-bit)/cpus=12,threads=11,free=209007560,total=536870912
   [junit4]   2> NOTE: All tests run in this JVM: [DateFieldTest, TestAnalyzedSuggestions, TestRealTimeGet, IgnoreCommitOptimizeUpdateProcessorFactoryTest, HdfsRecoverLeaseTest, SynonymTokenizerTest, TestInitQParser, QueryEqualityTest, TestRandomDVFaceting, TestSolrConfigHandler, DistributedFacetPivotLongTailTest, DisMaxRequestHandlerTest, TestBadConfig, TestArbitraryIndexDir, TestRequestForwarding, SolrCoreTest, AlternateDirectoryTest, SolrXmlInZkTest, DeleteLastCustomShardedReplicaTest, ReturnFieldsTest, TestRawResponseWriter, TestMiniSolrCloudClusterBase, ResponseLogComponentTest, TestRandomRequestDistribution, TestSolr4Spatial, TestDocSet, TestPhraseSuggestions, TestConfigSetsAPIExclusivity, TestSolrCloudWithKerberosAlt, ZkNodePropsTest, TestImplicitCoreProperties, DistributedSuggestComponentTest, TestManagedResource, RecoveryAfterSoftCommitTest, TestNonDefinedSimilarityFactory, CoreAdminCreateDiscoverTest, CdcrReplicationHandlerTest, TestLRUCache, JsonLoaderTest, TestRTGBase, ResourceLoaderTest, TestHighlightDedupGrouping, CurrencyFieldOpenExchangeTest, TestCSVLoader, DistributedQueryElevationComponentTest, JSONWriterTest, URLClassifyProcessorTest, TestExactSharedStatsCache, AliasIntegrationTest, DistributedFacetPivotWhiteBoxTest, TestFieldTypeResource, DistributedSpellCheckComponentTest, IndexSchemaTest, TestBinaryField, TestJsonFacets, TestCloudPivotFacet, StandardRequestHandlerTest, TestIBSimilarityFactory, BitVectorTest, TestRangeQuery, InfoHandlerTest, LeaderInitiatedRecoveryOnShardRestartTest, TestSolrCLIRunExample]
   [junit4]   2> NOTE: reproduce with: ant test  -Dtestcase=TestSolrCLIRunExample -Dtests.seed=66F19CD8A5CFBAA5 -Dtests.multiplier=3 -Dtests.slow=true -Dtests.locale=es_HN -Dtests.timezone=Europe/Sarajevo -Dtests.asserts=true -Dtests.file.encoding=UTF-8
   [junit4] ERROR   0.00s J0 | TestSolrCLIRunExample (suite) <<<
   [junit4]    > Throwable #1: com.carrotsearch.randomizedtesting.ThreadLeakError: 10 threads leaked from SUITE scope at org.apache.solr.util.TestSolrCLIRunExample: 
   [junit4]    >    1) Thread[id=3179, name=qtp1440684073-3179, state=TIMED_WAITING, group=TGRP-TestSolrCLIRunExample]
   [junit4]    >         at sun.misc.Unsafe.park(Native Method)
   [junit4]    >         at java.util.concurrent.locks.LockSupport.parkNanos(LockSupport.java:215)
   [junit4]    >         at java.util.concurrent.locks.AbstractQueuedSynchronizer$ConditionObject.awaitNanos(AbstractQueuedSynchronizer.java:2078)
   [junit4]    >         at org.eclipse.jetty.util.BlockingArrayQueue.poll(BlockingArrayQueue.java:392)
   [junit4]    >         at org.eclipse.jetty.util.thread.QueuedThreadPool.idleJobPoll(QueuedThreadPool.java:546)
   [junit4]    >         at org.eclipse.jetty.util.thread.QueuedThreadPool.access$800(QueuedThreadPool.java:47)
   [junit4]    >         at org.eclipse.jetty.util.thread.QueuedThreadPool$3.run(QueuedThreadPool.java:609)
   [junit4]    >         at java.lang.Thread.run(Thread.java:745)
   [junit4]    >    2) Thread[id=3183, name=Scheduler-1197058453, state=TIMED_WAITING, group=TGRP-TestSolrCLIRunExample]
   [junit4]    >         at sun.misc.Unsafe.park(Native Method)
   [junit4]    >         at java.util.concurrent.locks.LockSupport.parkNanos(LockSupport.java:215)
   [junit4]    >         at java.util.concurrent.locks.AbstractQueuedSynchronizer$ConditionObject.awaitNanos(AbstractQueuedSynchronizer.java:2078)
   [junit4]    >         at java.util.concurrent.ScheduledThreadPoolExecutor$DelayedWorkQueue.take(ScheduledThreadPoolExecutor.java:1093)
   [junit4]    >         at java.util.concurrent.ScheduledThreadPoolExecutor$DelayedWorkQueue.take(ScheduledThreadPoolExecutor.java:809)
   [junit4]    >         at java.util.concurrent.ThreadPoolExecutor.getTask(ThreadPoolExecutor.java:1067)
   [junit4]    >         at java.util.concurrent.ThreadPoolExecutor.runWorker(ThreadPoolExecutor.java:1127)
   [junit4]    >         at java.util.concurrent.ThreadPoolExecutor$Worker.run(ThreadPoolExecutor.java:617)
   [junit4]    >         at java.lang.Thread.run(Thread.java:745)
   [junit4]    >    3) Thread[id=3176, name=qtp1440684073-3176, state=TIMED_WAITING, group=TGRP-TestSolrCLIRunExample]
   [junit4]    >         at sun.misc.Unsafe.park(Native Method)
   [junit4]    >         at java.util.concurrent.locks.LockSupport.parkNanos(LockSupport.java:215)
   [junit4]    >         at java.util.concurrent.locks.AbstractQueuedSynchronizer$ConditionObject.awaitNanos(AbstractQueuedSynchronizer.java:2078)
   [junit4]    >         at org.eclipse.jetty.util.BlockingArrayQueue.poll(BlockingArrayQueue.java:392)
   [junit4]    >         at org.eclipse.jetty.util.thread.QueuedThreadPool.idleJobPoll(QueuedThreadPool.java:546)
   [junit4]    >         at org.eclipse.jetty.util.thread.QueuedThreadPool.access$800(QueuedThreadPool.java:47)
   [junit4]    >         at org.eclipse.jetty.util.thread.QueuedThreadPool$3.run(QueuedThreadPool.java:609)
   [junit4]    >         at java.lang.Thread.run(Thread.java:745)
   [junit4]    >    4) Thread[id=3178, name=qtp1440684073-3178, state=TIMED_WAITING, group=TGRP-TestSolrCLIRunExample]
   [junit4]    >         at sun.misc.Unsafe.park(Native Method)
   [junit4]    >         at java.util.concurrent.locks.LockSupport.parkNanos(LockSupport.java:215)
   [junit4]    >         at java.util.concurrent.locks.AbstractQueuedSynchronizer$ConditionObject.awaitNanos(AbstractQueuedSynchronizer.java:2078)
   [junit4]    >         at org.eclipse.jetty.util.BlockingArrayQueue.poll(BlockingArrayQueue.java:392)
   [junit4]    >         at org.eclipse.jetty.util.thread.QueuedThreadPool.idleJobPoll(QueuedThreadPool.java:546)
   [junit4]    >         at org.eclipse.jetty.util.thread.QueuedThreadPool.access$800(QueuedThreadPool.java:47)
   [junit4]    >         at org.eclipse.jetty.util.thread.QueuedThreadPool$3.run(QueuedThreadPool.java:609)
   [junit4]    >         at java.lang.Thread.run(Thread.java:745)
   [junit4]    >    5) Thread[id=3181, name=qtp1440684073-3181, state=TIMED_WAITING, group=TGRP-TestSolrCLIRunExample]
   [junit4]    >         at sun.misc.Unsafe.park(Native Method)
   [junit4]    >         at java.util.concurrent.locks.LockSupport.parkNanos(LockSupport.java:215)
   [junit4]    >         at java.util.concurrent.locks.AbstractQueuedSynchronizer$ConditionObject.awaitNanos(AbstractQueuedSynchronizer.java:2078)
   [junit4]    >         at org.eclipse.jetty.util.BlockingArrayQueue.poll(BlockingArrayQueue.java:392)
   [junit4]    >         at org.eclipse.jetty.util.thread.QueuedThreadPool.idleJobPoll(QueuedThreadPool.java:546)
   [junit4]    >         at org.eclipse.jetty.util.thread.QueuedThreadPool.access$800(QueuedThreadPool.java:47)
   [junit4]    >         at org.eclipse.jetty.util.thread.QueuedThreadPool$3.run(QueuedThreadPool.java:609)
   [junit4]    >         at java.lang.Thread.run(Thread.java:745)
   [junit4]    >    6) Thread[id=3177, name=qtp1440684073-3177, state=TIMED_WAITING, group=TGRP-TestSolrCLIRunExample]
   [junit4]    >         at sun.misc.Unsafe.park(Native Method)
   [junit4]    >         at java.util.concurrent.locks.LockSupport.parkNanos(LockSupport.java:215)
   [junit4]    >         at java.util.concurrent.locks.AbstractQueuedSynchronizer$ConditionObject.awaitNanos(AbstractQueuedSynchronizer.java:2078)
   [junit4]    >         at org.eclipse.jetty.util.BlockingArrayQueue.poll(BlockingArrayQueue.java:392)
   [junit4]    >         at org.eclipse.jetty.util.thread.QueuedThreadPool.idleJobPoll(QueuedThreadPool.java:546)
   [junit4]    >         at org.eclipse.jetty.util.thread.QueuedThreadPool.access$800(QueuedThreadPool.java:47)
   [junit4]    >         at org.eclipse.jetty.util.thread.QueuedThreadPool$3.run(QueuedThreadPool.java:609)
   [junit4]    >         at java.lang.Thread.run(Thread.java:745)
   [junit4]    >    7) Thread[id=3184, name=org.eclipse.jetty.server.session.HashSessionManager@357a7edcTimer, state=TIMED_WAITING, group=TGRP-TestSolrCLIRunExample]
   [junit4]    >         at sun.misc.Unsafe.park(Native Method)
   [junit4]    >         at java.util.concurrent.locks.LockSupport.parkNanos(LockSupport.java:215)
   [junit4]    >         at java.util.concurrent.locks.AbstractQueuedSynchronizer$ConditionObject.awaitNanos(AbstractQueuedSynchronizer.java:2078)
   [junit4]    >         at java.util.concurrent.ScheduledThreadPoolExecutor$DelayedWorkQueue.take(ScheduledThreadPoolExecutor.java:1093)
   [junit4]    >         at java.util.concurrent.ScheduledThreadPoolExecutor$DelayedWorkQueue.take(ScheduledThreadPoolExecutor.java:809)
   [junit4]    >         at java.util.concurrent.ThreadPoolExecutor.getTask(ThreadPoolExecutor.java:1067)
   [junit4]    >         at java.util.concurrent.ThreadPoolExecutor.runWorker(ThreadPoolExecutor.java:1127)
   [junit4]    >         at java.util.concurrent.ThreadPoolExecutor$Worker.run(ThreadPoolExecutor.java:617)
   [junit4]    >         at java.lang.Thread.run(Thread.java:745)
   [junit4]    >    8) Thread[id=3175, name=qtp1440684073-3175, state=TIMED_WAITING, group=TGRP-TestSolrCLIRunExample]
   [junit4]    >         at sun.misc.Unsafe.park(Native Method)
   [junit4]    >         at java.util.concurrent.locks.LockSupport.parkNanos(LockSupport.java:215)
   [junit4]    >         at java.util.concurrent.locks.AbstractQueuedSynchronizer$ConditionObject.awaitNanos(AbstractQueuedSynchronizer.java:2078)
   [junit4]    >         at org.eclipse.jetty.util.BlockingArrayQueue.poll(BlockingArrayQueue.java:392)
   [junit4]    >         at org.eclipse.jetty.util.thread.QueuedThreadPool.idleJobPoll(QueuedThreadPool.java:546)
   [junit4]    >         at org.eclipse.jetty.util.thread.QueuedThreadPool.access$800(QueuedThreadPool.java:47)
   [junit4]    >         at org.eclipse.jetty.util.thread.QueuedThreadPool$3.run(QueuedThreadPool.java:609)
   [junit4]    >         at java.lang.Thread.run(Thread.java:745)
   [junit4]    >    9) Thread[id=3180, name=qtp1440684073-3180, state=TIMED_WAITING, group=TGRP-TestSolrCLIRunExample]
   [junit4]    >         at sun.misc.Unsafe.park(Native Method)
   [junit4]    >         at java.util.concurrent.locks.LockSupport.parkNanos(LockSupport.java:215)
   [junit4]    >         at java.util.concurrent.locks.AbstractQueuedSynchronizer$ConditionObject.awaitNanos(AbstractQueuedSynchronizer.java:2078)
   [junit4]    >         at org.eclipse.jetty.util.BlockingArrayQueue.poll(BlockingArrayQueue.java:392)
   [junit4]    >         at org.eclipse.jetty.util.thread.QueuedThreadPool.idleJobPoll(QueuedThreadPool.java:546)
   [junit4]    >         at org.eclipse.jetty.util.thread.QueuedThreadPool.access$800(QueuedThreadPool.java:47)
   [junit4]    >         at org.eclipse.jetty.util.thread.QueuedThreadPool$3.run(QueuedThreadPool.java:609)
   [junit4]    >         at java.lang.Thread.run(Thread.java:745)
   [junit4]    >   10) Thread[id=3182, name=qtp1440684073-3182, state=TIMED_WAITING, group=TGRP-TestSolrCLIRunExample]
   [junit4]    >         at sun.misc.Unsafe.park(Native Method)
   [junit4]    >         at java.util.concurrent.locks.LockSupport.parkNanos(LockSupport.java:215)
   [junit4]    >         at java.util.concurrent.locks.AbstractQueuedSynchronizer$ConditionObject.awaitNanos(AbstractQueuedSynchronizer.java:2078)
   [junit4]    >         at org.eclipse.jetty.util.BlockingArrayQueue.poll(BlockingArrayQueue.java:392)
   [junit4]    >         at org.eclipse.jetty.util.thread.QueuedThreadPool.idleJobPoll(QueuedThreadPool.java:546)
   [junit4]    >         at org.eclipse.jetty.util.thread.QueuedThreadPool.access$800(QueuedThreadPool.java:47)
   [junit4]    >         at org.eclipse.jetty.util.thread.QueuedThreadPool$3.run(QueuedThreadPool.java:609)
   [junit4]    >         at java.lang.Thread.run(Thread.java:745)
   [junit4]    > 	at __randomizedtesting.SeedInfo.seed([66F19CD8A5CFBAA5]:0)Throwable #2: com.carrotsearch.randomizedtesting.ThreadLeakError: There are still zombie threads that couldn't be terminated:
   [junit4]    >    1) Thread[id=3183, name=Scheduler-1197058453, state=TIMED_WAITING, group=TGRP-TestSolrCLIRunExample]
   [junit4]    >         at sun.misc.Unsafe.park(Native Method)
   [junit4]    >         at java.util.concurrent.locks.LockSupport.parkNanos(LockSupport.java:215)
   [junit4]    >         at java.util.concurrent.locks.AbstractQueuedSynchronizer$ConditionObject.awaitNanos(AbstractQueuedSynchronizer.java:2078)
   [junit4]    >         at java.util.concurrent.ScheduledThreadPoolExecutor$DelayedWorkQueue.take(ScheduledThreadPoolExecutor.java:1093)
   [junit4]    >         at java.util.concurrent.ScheduledThreadPoolExecutor$DelayedWorkQueue.take(ScheduledThreadPoolExecutor.java:809)
   [junit4]    >         at java.util.concurrent.ThreadPoolExecutor.getTask(ThreadPoolExecutor.java:1067)
   [junit4]    >         at java.util.concurrent.ThreadPoolExecutor.runWorker(ThreadPoolExecutor.java:1127)
   [junit4]    >         at java.util.concurrent.ThreadPoolExecutor$Worker.run(ThreadPoolExecutor.java:617)
   [junit4]    >         at java.lang.Thread.run(Thread.java:745)
   [junit4]    >    2) Thread[id=3184, name=org.eclipse.jetty.server.session.HashSessionManager@357a7edcTimer, state=TIMED_WAITING, group=TGRP-TestSolrCLIRunExample]
   [junit4]    >         at sun.misc.Unsafe.park(Native Method)
   [junit4]    >         at java.util.concurrent.locks.LockSupport.parkNanos(LockSupport.java:215)
   [junit4]    >         at java.util.concurrent.locks.AbstractQueuedSynchronizer$ConditionObject.awaitNanos(AbstractQueuedSynchronizer.java:2078)
   [junit4]    >         at java.util.concurrent.ScheduledThreadPoolExecutor$DelayedWorkQueue.take(ScheduledThreadPoolExecutor.java:1093)
   [junit4]    >         at java.util.concurrent.ScheduledThreadPoolExecutor$DelayedWorkQueue.take(ScheduledThreadPoolExecutor.java:809)
   [junit4]    >         at java.util.concurrent.ThreadPoolExecutor.getTask(ThreadPoolExecutor.java:1067)
   [junit4]    >         at java.util.concurrent.ThreadPoolExecutor.runWorker(ThreadPoolExecutor.java:1127)
   [junit4]    >         at java.util.concurrent.ThreadPoolExecutor$Worker.run(ThreadPoolExecutor.java:617)
   [junit4]    >         at java.lang.Thread.run(Thread.java:745)
   [junit4]    > 	at __randomizedtesting.SeedInfo.seed([66F19CD8A5CFBAA5]:0)
   [junit4] Completed [125/564 (1!)] on J0 in 31.02s, 3 tests, 1 failure, 2 errors, 1 skipped <<< FAILURES!

[...truncated 1433 lines...]
BUILD FAILED
/home/jenkins/workspace/Lucene-Solr-trunk-Linux/build.xml:784: The following error occurred while executing this line:
/home/jenkins/workspace/Lucene-Solr-trunk-Linux/build.xml:728: The following error occurred while executing this line:
/home/jenkins/workspace/Lucene-Solr-trunk-Linux/build.xml:59: The following error occurred while executing this line:
/home/jenkins/workspace/Lucene-Solr-trunk-Linux/solr/build.xml:233: The following error occurred while executing this line:
/home/jenkins/workspace/Lucene-Solr-trunk-Linux/solr/common-build.xml:516: The following error occurred while executing this line:
/home/jenkins/workspace/Lucene-Solr-trunk-Linux/lucene/common-build.xml:1436: The following error occurred while executing this line:
/home/jenkins/workspace/Lucene-Solr-trunk-Linux/lucene/common-build.xml:991: There were test failures: 564 suites (8 ignored), 2241 tests, 2 suite-level errors, 1 failure, 1200 ignored (68 assumptions) [seed: 66F19CD8A5CFBAA5]

Total time: 41 minutes 35 seconds
Build step 'Invoke Ant' marked build as failure
Archiving artifacts
[WARNINGS] Skipping publisher since build result is FAILURE
Recording test results
Email was triggered for: Failure - Any
Sending email for trigger: Failure - Any



Mime
View raw message