lucene-dev mailing list archives

Site index · List index
Message view « Date » · « Thread »
Top « Date » · « Thread »
From Policeman Jenkins Server <jenk...@thetaphi.de>
Subject [JENKINS] Lucene-Solr-5.x-MacOSX (64bit/jdk1.7.0) - Build # 2911 - Failure!
Date Sat, 26 Dec 2015 02:18:13 GMT
Build: http://jenkins.thetaphi.de/job/Lucene-Solr-5.x-MacOSX/2911/
Java: 64bit/jdk1.7.0 -XX:+UseCompressedOops -XX:+UseParallelGC

1 tests failed.
FAILED:  org.apache.solr.cloud.DeleteInactiveReplicaTest.deleteInactiveReplicaTest

Error Message:
KeeperErrorCode = Session expired for /clusterstate.json

Stack Trace:
org.apache.zookeeper.KeeperException$SessionExpiredException: KeeperErrorCode = Session expired for /clusterstate.json
	at __randomizedtesting.SeedInfo.seed([7D6D358D1920C6E2:B053AE7E5681B000]:0)
	at org.apache.zookeeper.KeeperException.create(KeeperException.java:127)
	at org.apache.zookeeper.KeeperException.create(KeeperException.java:51)
	at org.apache.zookeeper.ZooKeeper.getData(ZooKeeper.java:1155)
	at org.apache.solr.common.cloud.SolrZkClient$7.execute(SolrZkClient.java:345)
	at org.apache.solr.common.cloud.SolrZkClient$7.execute(SolrZkClient.java:342)
	at org.apache.solr.common.cloud.ZkCmdExecutor.retryOperation(ZkCmdExecutor.java:61)
	at org.apache.solr.common.cloud.SolrZkClient.getData(SolrZkClient.java:342)
	at org.apache.solr.common.cloud.ZkStateReader.refreshLegacyClusterState(ZkStateReader.java:444)
	at org.apache.solr.common.cloud.ZkStateReader.updateClusterState(ZkStateReader.java:240)
	at org.apache.solr.cloud.AbstractDistribZkTestBase.waitForRecoveriesToFinish(AbstractDistribZkTestBase.java:149)
	at org.apache.solr.cloud.AbstractDistribZkTestBase.waitForRecoveriesToFinish(AbstractDistribZkTestBase.java:136)
	at org.apache.solr.cloud.AbstractDistribZkTestBase.waitForRecoveriesToFinish(AbstractDistribZkTestBase.java:131)
	at org.apache.solr.cloud.AbstractFullDistribZkTestBase.waitForRecoveriesToFinish(AbstractFullDistribZkTestBase.java:831)
	at org.apache.solr.cloud.DeleteInactiveReplicaTest.deleteInactiveReplicaTest(DeleteInactiveReplicaTest.java:67)
	at sun.reflect.NativeMethodAccessorImpl.invoke0(Native Method)
	at sun.reflect.NativeMethodAccessorImpl.invoke(NativeMethodAccessorImpl.java:57)
	at sun.reflect.DelegatingMethodAccessorImpl.invoke(DelegatingMethodAccessorImpl.java:43)
	at java.lang.reflect.Method.invoke(Method.java:606)
	at com.carrotsearch.randomizedtesting.RandomizedRunner.invoke(RandomizedRunner.java:1764)
	at com.carrotsearch.randomizedtesting.RandomizedRunner$8.evaluate(RandomizedRunner.java:871)
	at com.carrotsearch.randomizedtesting.RandomizedRunner$9.evaluate(RandomizedRunner.java:907)
	at com.carrotsearch.randomizedtesting.RandomizedRunner$10.evaluate(RandomizedRunner.java:921)
	at org.apache.solr.BaseDistributedSearchTestCase$ShardsRepeatRule$ShardsFixedStatement.callStatement(BaseDistributedSearchTestCase.java:965)
	at org.apache.solr.BaseDistributedSearchTestCase$ShardsRepeatRule$ShardsStatement.evaluate(BaseDistributedSearchTestCase.java:940)
	at com.carrotsearch.randomizedtesting.rules.SystemPropertiesRestoreRule$1.evaluate(SystemPropertiesRestoreRule.java:57)
	at org.apache.lucene.util.TestRuleSetupTeardownChained$1.evaluate(TestRuleSetupTeardownChained.java:50)
	at org.apache.lucene.util.AbstractBeforeAfterRule$1.evaluate(AbstractBeforeAfterRule.java:46)
	at org.apache.lucene.util.TestRuleThreadAndTestName$1.evaluate(TestRuleThreadAndTestName.java:49)
	at org.apache.lucene.util.TestRuleIgnoreAfterMaxFailures$1.evaluate(TestRuleIgnoreAfterMaxFailures.java:65)
	at org.apache.lucene.util.TestRuleMarkFailure$1.evaluate(TestRuleMarkFailure.java:48)
	at com.carrotsearch.randomizedtesting.rules.StatementAdapter.evaluate(StatementAdapter.java:36)
	at com.carrotsearch.randomizedtesting.ThreadLeakControl$StatementRunner.run(ThreadLeakControl.java:367)
	at com.carrotsearch.randomizedtesting.ThreadLeakControl.forkTimeoutingTask(ThreadLeakControl.java:809)
	at com.carrotsearch.randomizedtesting.ThreadLeakControl$3.evaluate(ThreadLeakControl.java:460)
	at com.carrotsearch.randomizedtesting.RandomizedRunner.runSingleTest(RandomizedRunner.java:880)
	at com.carrotsearch.randomizedtesting.RandomizedRunner$5.evaluate(RandomizedRunner.java:781)
	at com.carrotsearch.randomizedtesting.RandomizedRunner$6.evaluate(RandomizedRunner.java:816)
	at com.carrotsearch.randomizedtesting.RandomizedRunner$7.evaluate(RandomizedRunner.java:827)
	at com.carrotsearch.randomizedtesting.rules.StatementAdapter.evaluate(StatementAdapter.java:36)
	at com.carrotsearch.randomizedtesting.rules.SystemPropertiesRestoreRule$1.evaluate(SystemPropertiesRestoreRule.java:57)
	at org.apache.lucene.util.AbstractBeforeAfterRule$1.evaluate(AbstractBeforeAfterRule.java:46)
	at com.carrotsearch.randomizedtesting.rules.StatementAdapter.evaluate(StatementAdapter.java:36)
	at org.apache.lucene.util.TestRuleStoreClassName$1.evaluate(TestRuleStoreClassName.java:42)
	at com.carrotsearch.randomizedtesting.rules.NoShadowingOrOverridesOnMethodsRule$1.evaluate(NoShadowingOrOverridesOnMethodsRule.java:40)
	at com.carrotsearch.randomizedtesting.rules.NoShadowingOrOverridesOnMethodsRule$1.evaluate(NoShadowingOrOverridesOnMethodsRule.java:40)
	at com.carrotsearch.randomizedtesting.rules.StatementAdapter.evaluate(StatementAdapter.java:36)
	at com.carrotsearch.randomizedtesting.rules.StatementAdapter.evaluate(StatementAdapter.java:36)
	at com.carrotsearch.randomizedtesting.rules.StatementAdapter.evaluate(StatementAdapter.java:36)
	at org.apache.lucene.util.TestRuleAssertionsRequired$1.evaluate(TestRuleAssertionsRequired.java:54)
	at org.apache.lucene.util.TestRuleMarkFailure$1.evaluate(TestRuleMarkFailure.java:48)
	at org.apache.lucene.util.TestRuleIgnoreAfterMaxFailures$1.evaluate(TestRuleIgnoreAfterMaxFailures.java:65)
	at org.apache.lucene.util.TestRuleIgnoreTestSuites$1.evaluate(TestRuleIgnoreTestSuites.java:55)
	at com.carrotsearch.randomizedtesting.rules.StatementAdapter.evaluate(StatementAdapter.java:36)
	at com.carrotsearch.randomizedtesting.ThreadLeakControl$StatementRunner.run(ThreadLeakControl.java:367)
	at java.lang.Thread.run(Thread.java:745)




Build Log:
[...truncated 10980 lines...]
   [junit4] Suite: org.apache.solr.cloud.DeleteInactiveReplicaTest
   [junit4]   2> Creating dataDir: /Users/jenkins/workspace/Lucene-Solr-5.x-MacOSX/solr/build/solr-core/test/J1/temp/solr.cloud.DeleteInactiveReplicaTest_7D6D358D1920C6E2-001/init-core-data-001
   [junit4]   2> 2206585 INFO  (SUITE-DeleteInactiveReplicaTest-seed#[7D6D358D1920C6E2]-worker) [    ] o.a.s.SolrTestCaseJ4 Randomized ssl (true) and clientAuth (false)
   [junit4]   2> 2206585 INFO  (SUITE-DeleteInactiveReplicaTest-seed#[7D6D358D1920C6E2]-worker) [    ] o.a.s.BaseDistributedSearchTestCase Setting hostContext system property: /qc/d
   [junit4]   2> 2206588 INFO  (TEST-DeleteInactiveReplicaTest.deleteInactiveReplicaTest-seed#[7D6D358D1920C6E2]) [    ] o.a.s.c.ZkTestServer STARTING ZK TEST SERVER
   [junit4]   2> 2206589 INFO  (Thread-5378) [    ] o.a.s.c.ZkTestServer client port:0.0.0.0/0.0.0.0:0
   [junit4]   2> 2206589 INFO  (Thread-5378) [    ] o.a.s.c.ZkTestServer Starting server
   [junit4]   2> 2206690 INFO  (TEST-DeleteInactiveReplicaTest.deleteInactiveReplicaTest-seed#[7D6D358D1920C6E2]) [    ] o.a.s.c.ZkTestServer start zk server on port:61808
   [junit4]   2> 2206691 INFO  (TEST-DeleteInactiveReplicaTest.deleteInactiveReplicaTest-seed#[7D6D358D1920C6E2]) [    ] o.a.s.c.c.SolrZkClient Using default ZkCredentialsProvider
   [junit4]   2> 2206692 INFO  (TEST-DeleteInactiveReplicaTest.deleteInactiveReplicaTest-seed#[7D6D358D1920C6E2]) [    ] o.a.s.c.c.ConnectionManager Waiting for client to connect to ZooKeeper
   [junit4]   2> 2206703 INFO  (zkCallback-1531-thread-1) [    ] o.a.s.c.c.ConnectionManager Watcher org.apache.solr.common.cloud.ConnectionManager@5875db09 name:ZooKeeperConnection Watcher:127.0.0.1:61808 got event WatchedEvent state:SyncConnected type:None path:null path:null type:None
   [junit4]   2> 2206703 INFO  (TEST-DeleteInactiveReplicaTest.deleteInactiveReplicaTest-seed#[7D6D358D1920C6E2]) [    ] o.a.s.c.c.ConnectionManager Client is connected to ZooKeeper
   [junit4]   2> 2206704 INFO  (TEST-DeleteInactiveReplicaTest.deleteInactiveReplicaTest-seed#[7D6D358D1920C6E2]) [    ] o.a.s.c.c.SolrZkClient Using default ZkACLProvider
   [junit4]   2> 2206704 INFO  (TEST-DeleteInactiveReplicaTest.deleteInactiveReplicaTest-seed#[7D6D358D1920C6E2]) [    ] o.a.s.c.c.SolrZkClient makePath: /solr
   [junit4]   2> 2206709 INFO  (TEST-DeleteInactiveReplicaTest.deleteInactiveReplicaTest-seed#[7D6D358D1920C6E2]) [    ] o.a.s.c.c.SolrZkClient Using default ZkCredentialsProvider
   [junit4]   2> 2206710 INFO  (TEST-DeleteInactiveReplicaTest.deleteInactiveReplicaTest-seed#[7D6D358D1920C6E2]) [    ] o.a.s.c.c.ConnectionManager Waiting for client to connect to ZooKeeper
   [junit4]   2> 2206712 INFO  (zkCallback-1532-thread-1) [    ] o.a.s.c.c.ConnectionManager Watcher org.apache.solr.common.cloud.ConnectionManager@4acf321a name:ZooKeeperConnection Watcher:127.0.0.1:61808/solr got event WatchedEvent state:SyncConnected type:None path:null path:null type:None
   [junit4]   2> 2206713 INFO  (TEST-DeleteInactiveReplicaTest.deleteInactiveReplicaTest-seed#[7D6D358D1920C6E2]) [    ] o.a.s.c.c.ConnectionManager Client is connected to ZooKeeper
   [junit4]   2> 2206713 INFO  (TEST-DeleteInactiveReplicaTest.deleteInactiveReplicaTest-seed#[7D6D358D1920C6E2]) [    ] o.a.s.c.c.SolrZkClient Using default ZkACLProvider
   [junit4]   2> 2206713 INFO  (TEST-DeleteInactiveReplicaTest.deleteInactiveReplicaTest-seed#[7D6D358D1920C6E2]) [    ] o.a.s.c.c.SolrZkClient makePath: /collections/collection1
   [junit4]   2> 2206718 INFO  (TEST-DeleteInactiveReplicaTest.deleteInactiveReplicaTest-seed#[7D6D358D1920C6E2]) [    ] o.a.s.c.c.SolrZkClient makePath: /collections/collection1/shards
   [junit4]   2> 2206721 INFO  (TEST-DeleteInactiveReplicaTest.deleteInactiveReplicaTest-seed#[7D6D358D1920C6E2]) [    ] o.a.s.c.c.SolrZkClient makePath: /collections/control_collection
   [junit4]   2> 2206725 INFO  (TEST-DeleteInactiveReplicaTest.deleteInactiveReplicaTest-seed#[7D6D358D1920C6E2]) [    ] o.a.s.c.c.SolrZkClient makePath: /collections/control_collection/shards
   [junit4]   2> 2206729 INFO  (TEST-DeleteInactiveReplicaTest.deleteInactiveReplicaTest-seed#[7D6D358D1920C6E2]) [    ] o.a.s.c.AbstractZkTestCase put /Users/jenkins/workspace/Lucene-Solr-5.x-MacOSX/solr/core/src/test-files/solr/collection1/conf/solrconfig-tlog.xml to /configs/conf1/solrconfig.xml
   [junit4]   2> 2206729 INFO  (TEST-DeleteInactiveReplicaTest.deleteInactiveReplicaTest-seed#[7D6D358D1920C6E2]) [    ] o.a.s.c.c.SolrZkClient makePath: /configs/conf1/solrconfig.xml
   [junit4]   2> 2206734 INFO  (TEST-DeleteInactiveReplicaTest.deleteInactiveReplicaTest-seed#[7D6D358D1920C6E2]) [    ] o.a.s.c.AbstractZkTestCase put /Users/jenkins/workspace/Lucene-Solr-5.x-MacOSX/solr/core/src/test-files/solr/collection1/conf/schema.xml to /configs/conf1/schema.xml
   [junit4]   2> 2206735 INFO  (TEST-DeleteInactiveReplicaTest.deleteInactiveReplicaTest-seed#[7D6D358D1920C6E2]) [    ] o.a.s.c.c.SolrZkClient makePath: /configs/conf1/schema.xml
   [junit4]   2> 2206738 INFO  (TEST-DeleteInactiveReplicaTest.deleteInactiveReplicaTest-seed#[7D6D358D1920C6E2]) [    ] o.a.s.c.AbstractZkTestCase put /Users/jenkins/workspace/Lucene-Solr-5.x-MacOSX/solr/core/src/test-files/solr/collection1/conf/solrconfig.snippet.randomindexconfig.xml to /configs/conf1/solrconfig.snippet.randomindexconfig.xml
   [junit4]   2> 2206739 INFO  (TEST-DeleteInactiveReplicaTest.deleteInactiveReplicaTest-seed#[7D6D358D1920C6E2]) [    ] o.a.s.c.c.SolrZkClient makePath: /configs/conf1/solrconfig.snippet.randomindexconfig.xml
   [junit4]   2> 2206742 INFO  (TEST-DeleteInactiveReplicaTest.deleteInactiveReplicaTest-seed#[7D6D358D1920C6E2]) [    ] o.a.s.c.AbstractZkTestCase put /Users/jenkins/workspace/Lucene-Solr-5.x-MacOSX/solr/core/src/test-files/solr/collection1/conf/stopwords.txt to /configs/conf1/stopwords.txt
   [junit4]   2> 2206743 INFO  (TEST-DeleteInactiveReplicaTest.deleteInactiveReplicaTest-seed#[7D6D358D1920C6E2]) [    ] o.a.s.c.c.SolrZkClient makePath: /configs/conf1/stopwords.txt
   [junit4]   2> 2206747 INFO  (TEST-DeleteInactiveReplicaTest.deleteInactiveReplicaTest-seed#[7D6D358D1920C6E2]) [    ] o.a.s.c.AbstractZkTestCase put /Users/jenkins/workspace/Lucene-Solr-5.x-MacOSX/solr/core/src/test-files/solr/collection1/conf/protwords.txt to /configs/conf1/protwords.txt
   [junit4]   2> 2206747 INFO  (TEST-DeleteInactiveReplicaTest.deleteInactiveReplicaTest-seed#[7D6D358D1920C6E2]) [    ] o.a.s.c.c.SolrZkClient makePath: /configs/conf1/protwords.txt
   [junit4]   2> 2206751 INFO  (TEST-DeleteInactiveReplicaTest.deleteInactiveReplicaTest-seed#[7D6D358D1920C6E2]) [    ] o.a.s.c.AbstractZkTestCase put /Users/jenkins/workspace/Lucene-Solr-5.x-MacOSX/solr/core/src/test-files/solr/collection1/conf/currency.xml to /configs/conf1/currency.xml
   [junit4]   2> 2206751 INFO  (TEST-DeleteInactiveReplicaTest.deleteInactiveReplicaTest-seed#[7D6D358D1920C6E2]) [    ] o.a.s.c.c.SolrZkClient makePath: /configs/conf1/currency.xml
   [junit4]   2> 2206754 INFO  (TEST-DeleteInactiveReplicaTest.deleteInactiveReplicaTest-seed#[7D6D358D1920C6E2]) [    ] o.a.s.c.AbstractZkTestCase put /Users/jenkins/workspace/Lucene-Solr-5.x-MacOSX/solr/core/src/test-files/solr/collection1/conf/enumsConfig.xml to /configs/conf1/enumsConfig.xml
   [junit4]   2> 2206755 INFO  (TEST-DeleteInactiveReplicaTest.deleteInactiveReplicaTest-seed#[7D6D358D1920C6E2]) [    ] o.a.s.c.c.SolrZkClient makePath: /configs/conf1/enumsConfig.xml
   [junit4]   2> 2206758 INFO  (TEST-DeleteInactiveReplicaTest.deleteInactiveReplicaTest-seed#[7D6D358D1920C6E2]) [    ] o.a.s.c.AbstractZkTestCase put /Users/jenkins/workspace/Lucene-Solr-5.x-MacOSX/solr/core/src/test-files/solr/collection1/conf/open-exchange-rates.json to /configs/conf1/open-exchange-rates.json
   [junit4]   2> 2206758 INFO  (TEST-DeleteInactiveReplicaTest.deleteInactiveReplicaTest-seed#[7D6D358D1920C6E2]) [    ] o.a.s.c.c.SolrZkClient makePath: /configs/conf1/open-exchange-rates.json
   [junit4]   2> 2206762 INFO  (TEST-DeleteInactiveReplicaTest.deleteInactiveReplicaTest-seed#[7D6D358D1920C6E2]) [    ] o.a.s.c.AbstractZkTestCase put /Users/jenkins/workspace/Lucene-Solr-5.x-MacOSX/solr/core/src/test-files/solr/collection1/conf/mapping-ISOLatin1Accent.txt to /configs/conf1/mapping-ISOLatin1Accent.txt
   [junit4]   2> 2206762 INFO  (TEST-DeleteInactiveReplicaTest.deleteInactiveReplicaTest-seed#[7D6D358D1920C6E2]) [    ] o.a.s.c.c.SolrZkClient makePath: /configs/conf1/mapping-ISOLatin1Accent.txt
   [junit4]   2> 2206766 INFO  (TEST-DeleteInactiveReplicaTest.deleteInactiveReplicaTest-seed#[7D6D358D1920C6E2]) [    ] o.a.s.c.AbstractZkTestCase put /Users/jenkins/workspace/Lucene-Solr-5.x-MacOSX/solr/core/src/test-files/solr/collection1/conf/old_synonyms.txt to /configs/conf1/old_synonyms.txt
   [junit4]   2> 2206767 INFO  (TEST-DeleteInactiveReplicaTest.deleteInactiveReplicaTest-seed#[7D6D358D1920C6E2]) [    ] o.a.s.c.c.SolrZkClient makePath: /configs/conf1/old_synonyms.txt
   [junit4]   2> 2206770 INFO  (TEST-DeleteInactiveReplicaTest.deleteInactiveReplicaTest-seed#[7D6D358D1920C6E2]) [    ] o.a.s.c.AbstractZkTestCase put /Users/jenkins/workspace/Lucene-Solr-5.x-MacOSX/solr/core/src/test-files/solr/collection1/conf/synonyms.txt to /configs/conf1/synonyms.txt
   [junit4]   2> 2206770 INFO  (TEST-DeleteInactiveReplicaTest.deleteInactiveReplicaTest-seed#[7D6D358D1920C6E2]) [    ] o.a.s.c.c.SolrZkClient makePath: /configs/conf1/synonyms.txt
   [junit4]   2> 2206775 INFO  (TEST-DeleteInactiveReplicaTest.deleteInactiveReplicaTest-seed#[7D6D358D1920C6E2]) [    ] o.a.s.c.c.SolrZkClient Using default ZkCredentialsProvider
   [junit4]   2> 2206775 INFO  (TEST-DeleteInactiveReplicaTest.deleteInactiveReplicaTest-seed#[7D6D358D1920C6E2]) [    ] o.a.s.c.c.ConnectionManager Waiting for client to connect to ZooKeeper
   [junit4]   2> 2206777 INFO  (zkCallback-1533-thread-1) [    ] o.a.s.c.c.ConnectionManager Watcher org.apache.solr.common.cloud.ConnectionManager@30713517 name:ZooKeeperConnection Watcher:127.0.0.1:61808/solr got event WatchedEvent state:SyncConnected type:None path:null path:null type:None
   [junit4]   2> 2206778 INFO  (TEST-DeleteInactiveReplicaTest.deleteInactiveReplicaTest-seed#[7D6D358D1920C6E2]) [    ] o.a.s.c.c.ConnectionManager Client is connected to ZooKeeper
   [junit4]   2> 2206778 INFO  (TEST-DeleteInactiveReplicaTest.deleteInactiveReplicaTest-seed#[7D6D358D1920C6E2]) [    ] o.a.s.c.c.SolrZkClient Using default ZkACLProvider
   [junit4]   2> 2207056 INFO  (TEST-DeleteInactiveReplicaTest.deleteInactiveReplicaTest-seed#[7D6D358D1920C6E2]) [    ] o.a.s.SolrTestCaseJ4 Writing core.properties file to /Users/jenkins/workspace/Lucene-Solr-5.x-MacOSX/solr/build/solr-core/test/J1/temp/solr.cloud.DeleteInactiveReplicaTest_7D6D358D1920C6E2-001/control-001/cores/collection1
   [junit4]   2> 2207058 INFO  (TEST-DeleteInactiveReplicaTest.deleteInactiveReplicaTest-seed#[7D6D358D1920C6E2]) [    ] o.e.j.s.Server jetty-9.2.13.v20150730
   [junit4]   2> 2207061 INFO  (TEST-DeleteInactiveReplicaTest.deleteInactiveReplicaTest-seed#[7D6D358D1920C6E2]) [    ] o.e.j.s.h.ContextHandler Started o.e.j.s.ServletContextHandler@3a438697{/qc/d,null,AVAILABLE}
   [junit4]   2> 2207066 INFO  (TEST-DeleteInactiveReplicaTest.deleteInactiveReplicaTest-seed#[7D6D358D1920C6E2]) [    ] o.e.j.s.ServerConnector Started ServerConnector@27394163{SSL-http/1.1}{127.0.0.1:61812}
   [junit4]   2> 2207066 INFO  (TEST-DeleteInactiveReplicaTest.deleteInactiveReplicaTest-seed#[7D6D358D1920C6E2]) [    ] o.e.j.s.Server Started @2210707ms
   [junit4]   2> 2207066 INFO  (TEST-DeleteInactiveReplicaTest.deleteInactiveReplicaTest-seed#[7D6D358D1920C6E2]) [    ] o.a.s.c.s.e.JettySolrRunner Jetty properties: {solr.data.dir=/Users/jenkins/workspace/Lucene-Solr-5.x-MacOSX/solr/build/solr-core/test/J1/temp/solr.cloud.DeleteInactiveReplicaTest_7D6D358D1920C6E2-001/tempDir-001/control/data, hostContext=/qc/d, coreRootDirectory=/Users/jenkins/workspace/Lucene-Solr-5.x-MacOSX/solr/build/solr-core/test/J1/../../../../../../../../../Users/jenkins/workspace/Lucene-Solr-5.x-MacOSX/solr/build/solr-core/test/J1/temp/solr.cloud.DeleteInactiveReplicaTest_7D6D358D1920C6E2-001/control-001/cores, hostPort=61812}
   [junit4]   2> 2207067 INFO  (TEST-DeleteInactiveReplicaTest.deleteInactiveReplicaTest-seed#[7D6D358D1920C6E2]) [    ] o.a.s.s.SolrDispatchFilter SolrDispatchFilter.init(): sun.misc.Launcher$AppClassLoader@3827de24
   [junit4]   2> 2207067 INFO  (TEST-DeleteInactiveReplicaTest.deleteInactiveReplicaTest-seed#[7D6D358D1920C6E2]) [    ] o.a.s.c.SolrResourceLoader new SolrResourceLoader for directory: '/Users/jenkins/workspace/Lucene-Solr-5.x-MacOSX/solr/build/solr-core/test/J1/temp/solr.cloud.DeleteInactiveReplicaTest_7D6D358D1920C6E2-001/control-001'
   [junit4]   2> 2207067 INFO  (TEST-DeleteInactiveReplicaTest.deleteInactiveReplicaTest-seed#[7D6D358D1920C6E2]) [    ] o.a.s.c.SolrResourceLoader JNDI not configured for solr (NoInitialContextEx)
   [junit4]   2> 2207067 INFO  (TEST-DeleteInactiveReplicaTest.deleteInactiveReplicaTest-seed#[7D6D358D1920C6E2]) [    ] o.a.s.c.SolrResourceLoader solr home defaulted to 'solr/' (could not find system property or JNDI)
   [junit4]   2> 2207067 INFO  (TEST-DeleteInactiveReplicaTest.deleteInactiveReplicaTest-seed#[7D6D358D1920C6E2]) [    ] o.a.s.c.c.SolrZkClient Using default ZkCredentialsProvider
   [junit4]   2> 2207068 INFO  (TEST-DeleteInactiveReplicaTest.deleteInactiveReplicaTest-seed#[7D6D358D1920C6E2]) [    ] o.a.s.c.c.ConnectionManager Waiting for client to connect to ZooKeeper
   [junit4]   2> 2207071 INFO  (zkCallback-1534-thread-1) [    ] o.a.s.c.c.ConnectionManager Watcher org.apache.solr.common.cloud.ConnectionManager@156c86a3 name:ZooKeeperConnection Watcher:127.0.0.1:61808/solr got event WatchedEvent state:SyncConnected type:None path:null path:null type:None
   [junit4]   2> 2207071 INFO  (TEST-DeleteInactiveReplicaTest.deleteInactiveReplicaTest-seed#[7D6D358D1920C6E2]) [    ] o.a.s.c.c.ConnectionManager Client is connected to ZooKeeper
   [junit4]   2> 2207071 INFO  (TEST-DeleteInactiveReplicaTest.deleteInactiveReplicaTest-seed#[7D6D358D1920C6E2]) [    ] o.a.s.c.c.SolrZkClient Using default ZkACLProvider
   [junit4]   2> 2207073 INFO  (TEST-DeleteInactiveReplicaTest.deleteInactiveReplicaTest-seed#[7D6D358D1920C6E2]) [    ] o.a.s.s.SolrDispatchFilter Loading solr.xml from SolrHome (not found in ZooKeeper)
   [junit4]   2> 2207073 INFO  (TEST-DeleteInactiveReplicaTest.deleteInactiveReplicaTest-seed#[7D6D358D1920C6E2]) [    ] o.a.s.c.SolrXmlConfig Loading container configuration from /Users/jenkins/workspace/Lucene-Solr-5.x-MacOSX/solr/build/solr-core/test/J1/temp/solr.cloud.DeleteInactiveReplicaTest_7D6D358D1920C6E2-001/control-001/solr.xml
   [junit4]   2> 2207133 INFO  (TEST-DeleteInactiveReplicaTest.deleteInactiveReplicaTest-seed#[7D6D358D1920C6E2]) [    ] o.a.s.c.CorePropertiesLocator Config-defined core root directory: /Users/jenkins/workspace/Lucene-Solr-5.x-MacOSX/solr/build/solr-core/test/J1/../../../../../../../../../Users/jenkins/workspace/Lucene-Solr-5.x-MacOSX/solr/build/solr-core/test/J1/temp/solr.cloud.DeleteInactiveReplicaTest_7D6D358D1920C6E2-001/control-001/cores
   [junit4]   2> 2207133 INFO  (TEST-DeleteInactiveReplicaTest.deleteInactiveReplicaTest-seed#[7D6D358D1920C6E2]) [    ] o.a.s.c.CoreContainer New CoreContainer 1420536006
   [junit4]   2> 2207133 INFO  (TEST-DeleteInactiveReplicaTest.deleteInactiveReplicaTest-seed#[7D6D358D1920C6E2]) [    ] o.a.s.c.CoreContainer Loading cores into CoreContainer [instanceDir=/Users/jenkins/workspace/Lucene-Solr-5.x-MacOSX/solr/build/solr-core/test/J1/temp/solr.cloud.DeleteInactiveReplicaTest_7D6D358D1920C6E2-001/control-001]
   [junit4]   2> 2207134 WARN  (TEST-DeleteInactiveReplicaTest.deleteInactiveReplicaTest-seed#[7D6D358D1920C6E2]) [    ] o.a.s.c.CoreContainer Couldn't add files from /Users/jenkins/workspace/Lucene-Solr-5.x-MacOSX/solr/build/solr-core/test/J1/temp/solr.cloud.DeleteInactiveReplicaTest_7D6D358D1920C6E2-001/control-001/lib to classpath: /Users/jenkins/workspace/Lucene-Solr-5.x-MacOSX/solr/build/solr-core/test/J1/temp/solr.cloud.DeleteInactiveReplicaTest_7D6D358D1920C6E2-001/control-001/lib
   [junit4]   2> 2207134 INFO  (TEST-DeleteInactiveReplicaTest.deleteInactiveReplicaTest-seed#[7D6D358D1920C6E2]) [    ] o.a.s.h.c.HttpShardHandlerFactory created with socketTimeout : 90000,urlScheme : ,connTimeout : 15000,maxConnectionsPerHost : 20,maxConnections : 10000,corePoolSize : 0,maximumPoolSize : 2147483647,maxThreadIdleTime : 5,sizeOfQueue : -1,fairnessPolicy : false,useRetries : false,
   [junit4]   2> 2207139 INFO  (TEST-DeleteInactiveReplicaTest.deleteInactiveReplicaTest-seed#[7D6D358D1920C6E2]) [    ] o.a.s.u.UpdateShardHandler Creating UpdateShardHandler HTTP client with params: socketTimeout=340000&connTimeout=45000&retry=true
   [junit4]   2> 2207141 INFO  (TEST-DeleteInactiveReplicaTest.deleteInactiveReplicaTest-seed#[7D6D358D1920C6E2]) [    ] o.a.s.l.LogWatcher SLF4J impl is org.slf4j.impl.Log4jLoggerFactory
   [junit4]   2> 2207141 INFO  (TEST-DeleteInactiveReplicaTest.deleteInactiveReplicaTest-seed#[7D6D358D1920C6E2]) [    ] o.a.s.l.LogWatcher Registering Log Listener [Log4j (org.slf4j.impl.Log4jLoggerFactory)]
   [junit4]   2> 2207142 INFO  (TEST-DeleteInactiveReplicaTest.deleteInactiveReplicaTest-seed#[7D6D358D1920C6E2]) [    ] o.a.s.c.ZkContainer Zookeeper client=127.0.0.1:61808/solr
   [junit4]   2> 2207142 INFO  (TEST-DeleteInactiveReplicaTest.deleteInactiveReplicaTest-seed#[7D6D358D1920C6E2]) [    ] o.a.s.c.ZkController zkHost includes chroot
   [junit4]   2> 2207142 INFO  (TEST-DeleteInactiveReplicaTest.deleteInactiveReplicaTest-seed#[7D6D358D1920C6E2]) [    ] o.a.s.c.c.SolrZkClient Using default ZkCredentialsProvider
   [junit4]   2> 2207143 INFO  (TEST-DeleteInactiveReplicaTest.deleteInactiveReplicaTest-seed#[7D6D358D1920C6E2]) [    ] o.a.s.c.c.ConnectionManager Waiting for client to connect to ZooKeeper
   [junit4]   2> 2207145 INFO  (zkCallback-1536-thread-1) [    ] o.a.s.c.c.ConnectionManager Watcher org.apache.solr.common.cloud.ConnectionManager@ef0b075 name:ZooKeeperConnection Watcher:127.0.0.1:61808 got event WatchedEvent state:SyncConnected type:None path:null path:null type:None
   [junit4]   2> 2207145 INFO  (TEST-DeleteInactiveReplicaTest.deleteInactiveReplicaTest-seed#[7D6D358D1920C6E2]) [    ] o.a.s.c.c.ConnectionManager Client is connected to ZooKeeper
   [junit4]   2> 2207146 INFO  (TEST-DeleteInactiveReplicaTest.deleteInactiveReplicaTest-seed#[7D6D358D1920C6E2]) [    ] o.a.s.c.c.SolrZkClient Using default ZkACLProvider
   [junit4]   2> 2207148 INFO  (TEST-DeleteInactiveReplicaTest.deleteInactiveReplicaTest-seed#[7D6D358D1920C6E2]) [n:127.0.0.1:61812_qc%2Fd    ] o.a.s.c.c.ConnectionManager Waiting for client to connect to ZooKeeper
   [junit4]   2> 2207151 INFO  (zkCallback-1537-thread-1-processing-n:127.0.0.1:61812_qc%2Fd) [n:127.0.0.1:61812_qc%2Fd    ] o.a.s.c.c.ConnectionManager Watcher org.apache.solr.common.cloud.ConnectionManager@30f3e927 name:ZooKeeperConnection Watcher:127.0.0.1:61808/solr got event WatchedEvent state:SyncConnected type:None path:null path:null type:None
   [junit4]   2> 2207151 INFO  (TEST-DeleteInactiveReplicaTest.deleteInactiveReplicaTest-seed#[7D6D358D1920C6E2]) [n:127.0.0.1:61812_qc%2Fd    ] o.a.s.c.c.ConnectionManager Client is connected to ZooKeeper
   [junit4]   2> 2207153 INFO  (TEST-DeleteInactiveReplicaTest.deleteInactiveReplicaTest-seed#[7D6D358D1920C6E2]) [n:127.0.0.1:61812_qc%2Fd    ] o.a.s.c.c.SolrZkClient makePath: /overseer/queue
   [junit4]   2> 2207158 INFO  (TEST-DeleteInactiveReplicaTest.deleteInactiveReplicaTest-seed#[7D6D358D1920C6E2]) [n:127.0.0.1:61812_qc%2Fd    ] o.a.s.c.c.SolrZkClient makePath: /overseer/collection-queue-work
   [junit4]   2> 2207164 INFO  (TEST-DeleteInactiveReplicaTest.deleteInactiveReplicaTest-seed#[7D6D358D1920C6E2]) [n:127.0.0.1:61812_qc%2Fd    ] o.a.s.c.c.SolrZkClient makePath: /overseer/collection-map-running
   [junit4]   2> 2207169 INFO  (TEST-DeleteInactiveReplicaTest.deleteInactiveReplicaTest-seed#[7D6D358D1920C6E2]) [n:127.0.0.1:61812_qc%2Fd    ] o.a.s.c.c.SolrZkClient makePath: /overseer/collection-map-completed
   [junit4]   2> 2207174 INFO  (TEST-DeleteInactiveReplicaTest.deleteInactiveReplicaTest-seed#[7D6D358D1920C6E2]) [n:127.0.0.1:61812_qc%2Fd    ] o.a.s.c.c.SolrZkClient makePath: /overseer/collection-map-failure
   [junit4]   2> 2207180 INFO  (TEST-DeleteInactiveReplicaTest.deleteInactiveReplicaTest-seed#[7D6D358D1920C6E2]) [n:127.0.0.1:61812_qc%2Fd    ] o.a.s.c.c.SolrZkClient makePath: /live_nodes
   [junit4]   2> 2207184 INFO  (TEST-DeleteInactiveReplicaTest.deleteInactiveReplicaTest-seed#[7D6D358D1920C6E2]) [n:127.0.0.1:61812_qc%2Fd    ] o.a.s.c.c.SolrZkClient makePath: /aliases.json
   [junit4]   2> 2207187 INFO  (TEST-DeleteInactiveReplicaTest.deleteInactiveReplicaTest-seed#[7D6D358D1920C6E2]) [n:127.0.0.1:61812_qc%2Fd    ] o.a.s.c.c.SolrZkClient makePath: /clusterstate.json
   [junit4]   2> 2207189 INFO  (TEST-DeleteInactiveReplicaTest.deleteInactiveReplicaTest-seed#[7D6D358D1920C6E2]) [n:127.0.0.1:61812_qc%2Fd    ] o.a.s.c.c.SolrZkClient makePath: /security.json
   [junit4]   2> 2207191 INFO  (TEST-DeleteInactiveReplicaTest.deleteInactiveReplicaTest-seed#[7D6D358D1920C6E2]) [n:127.0.0.1:61812_qc%2Fd    ] o.a.s.c.ZkController Register node as live in ZooKeeper:/live_nodes/127.0.0.1:61812_qc%2Fd
   [junit4]   2> 2207192 INFO  (TEST-DeleteInactiveReplicaTest.deleteInactiveReplicaTest-seed#[7D6D358D1920C6E2]) [n:127.0.0.1:61812_qc%2Fd    ] o.a.s.c.c.SolrZkClient makePath: /live_nodes/127.0.0.1:61812_qc%2Fd
   [junit4]   2> 2207196 INFO  (TEST-DeleteInactiveReplicaTest.deleteInactiveReplicaTest-seed#[7D6D358D1920C6E2]) [n:127.0.0.1:61812_qc%2Fd    ] o.a.s.c.c.SolrZkClient makePath: /overseer_elect
   [junit4]   2> 2207199 INFO  (TEST-DeleteInactiveReplicaTest.deleteInactiveReplicaTest-seed#[7D6D358D1920C6E2]) [n:127.0.0.1:61812_qc%2Fd    ] o.a.s.c.c.SolrZkClient makePath: /overseer_elect/election
   [junit4]   2> 2207202 INFO  (TEST-DeleteInactiveReplicaTest.deleteInactiveReplicaTest-seed#[7D6D358D1920C6E2]) [n:127.0.0.1:61812_qc%2Fd    ] o.a.s.c.Overseer Overseer (id=null) closing
   [junit4]   2> 2207202 INFO  (TEST-DeleteInactiveReplicaTest.deleteInactiveReplicaTest-seed#[7D6D358D1920C6E2]) [n:127.0.0.1:61812_qc%2Fd    ] o.a.s.c.LeaderElector Joined leadership election with path: /overseer_elect/election/95098976750075909-127.0.0.1:61812_qc%2Fd-n_0000000000
   [junit4]   2> 2207203 INFO  (TEST-DeleteInactiveReplicaTest.deleteInactiveReplicaTest-seed#[7D6D358D1920C6E2]) [n:127.0.0.1:61812_qc%2Fd    ] o.a.s.c.OverseerElectionContext I am going to be the leader 127.0.0.1:61812_qc%2Fd
   [junit4]   2> 2207203 INFO  (TEST-DeleteInactiveReplicaTest.deleteInactiveReplicaTest-seed#[7D6D358D1920C6E2]) [n:127.0.0.1:61812_qc%2Fd    ] o.a.s.c.c.SolrZkClient makePath: /overseer_elect/leader
   [junit4]   2> 2207207 INFO  (TEST-DeleteInactiveReplicaTest.deleteInactiveReplicaTest-seed#[7D6D358D1920C6E2]) [n:127.0.0.1:61812_qc%2Fd    ] o.a.s.c.Overseer Overseer (id=95098976750075909-127.0.0.1:61812_qc%2Fd-n_0000000000) starting
   [junit4]   2> 2207210 INFO  (TEST-DeleteInactiveReplicaTest.deleteInactiveReplicaTest-seed#[7D6D358D1920C6E2]) [n:127.0.0.1:61812_qc%2Fd    ] o.a.s.c.c.SolrZkClient makePath: /overseer/queue-work
   [junit4]   2> 2207224 INFO  (TEST-DeleteInactiveReplicaTest.deleteInactiveReplicaTest-seed#[7D6D358D1920C6E2]) [n:127.0.0.1:61812_qc%2Fd    ] o.a.s.c.OverseerAutoReplicaFailoverThread Starting OverseerAutoReplicaFailoverThread autoReplicaFailoverWorkLoopDelay=10000 autoReplicaFailoverWaitAfterExpiration=30000 autoReplicaFailoverBadNodeExpiration=60000
   [junit4]   2> 2207225 INFO  (OverseerCollectionConfigSetProcessor-95098976750075909-127.0.0.1:61812_qc%2Fd-n_0000000000) [n:127.0.0.1:61812_qc%2Fd    ] o.a.s.c.OverseerTaskProcessor Process current queue of overseer operations
   [junit4]   2> 2207225 INFO  (TEST-DeleteInactiveReplicaTest.deleteInactiveReplicaTest-seed#[7D6D358D1920C6E2]) [n:127.0.0.1:61812_qc%2Fd    ] o.a.s.c.c.ZkStateReader Updating cluster state from ZooKeeper... 
   [junit4]   2> 2207225 INFO  (OverseerStateUpdate-95098976750075909-127.0.0.1:61812_qc%2Fd-n_0000000000) [n:127.0.0.1:61812_qc%2Fd    ] o.a.s.c.Overseer Starting to work on the main queue
   [junit4]   2> 2207256 INFO  (TEST-DeleteInactiveReplicaTest.deleteInactiveReplicaTest-seed#[7D6D358D1920C6E2]) [n:127.0.0.1:61812_qc%2Fd    ] o.a.s.c.CoreContainer Security conf doesn't exist. Skipping setup for authorization module.
   [junit4]   2> 2207256 INFO  (TEST-DeleteInactiveReplicaTest.deleteInactiveReplicaTest-seed#[7D6D358D1920C6E2]) [n:127.0.0.1:61812_qc%2Fd    ] o.a.s.c.CoreContainer No authentication plugin used.
   [junit4]   2> 2207259 INFO  (TEST-DeleteInactiveReplicaTest.deleteInactiveReplicaTest-seed#[7D6D358D1920C6E2]) [n:127.0.0.1:61812_qc%2Fd    ] o.a.s.c.CorePropertiesLocator Looking for core definitions underneath /Users/jenkins/workspace/Lucene-Solr-5.x-MacOSX/solr/build/solr-core/test/J1/../../../../../../../../../Users/jenkins/workspace/Lucene-Solr-5.x-MacOSX/solr/build/solr-core/test/J1/temp/solr.cloud.DeleteInactiveReplicaTest_7D6D358D1920C6E2-001/control-001/cores
   [junit4]   2> 2207260 INFO  (TEST-DeleteInactiveReplicaTest.deleteInactiveReplicaTest-seed#[7D6D358D1920C6E2]) [n:127.0.0.1:61812_qc%2Fd    ] o.a.s.c.CoreDescriptor Created CoreDescriptor: {name=collection1, coreNodeName=, config=solrconfig.xml, collection=control_collection, schema=schema.xml, shard=, transient=false, configSetProperties=configsetprops.json, loadOnStartup=true, dataDir=data/}
   [junit4]   2> 2207260 INFO  (TEST-DeleteInactiveReplicaTest.deleteInactiveReplicaTest-seed#[7D6D358D1920C6E2]) [n:127.0.0.1:61812_qc%2Fd    ] o.a.s.c.CorePropertiesLocator Found core collection1 in /Users/jenkins/workspace/Lucene-Solr-5.x-MacOSX/solr/build/solr-core/test/J1/../../../../../../../../../Users/jenkins/workspace/Lucene-Solr-5.x-MacOSX/solr/build/solr-core/test/J1/temp/solr.cloud.DeleteInactiveReplicaTest_7D6D358D1920C6E2-001/control-001/cores/collection1
   [junit4]   2> 2207260 INFO  (TEST-DeleteInactiveReplicaTest.deleteInactiveReplicaTest-seed#[7D6D358D1920C6E2]) [n:127.0.0.1:61812_qc%2Fd    ] o.a.s.c.CorePropertiesLocator Found 1 core definitions
   [junit4]   2> 2207262 INFO  (TEST-DeleteInactiveReplicaTest.deleteInactiveReplicaTest-seed#[7D6D358D1920C6E2]) [n:127.0.0.1:61812_qc%2Fd    ] o.a.s.s.SolrDispatchFilter user.dir=/Users/jenkins/workspace/Lucene-Solr-5.x-MacOSX/solr/build/solr-core/test/J1
   [junit4]   2> 2207262 INFO  (TEST-DeleteInactiveReplicaTest.deleteInactiveReplicaTest-seed#[7D6D358D1920C6E2]) [n:127.0.0.1:61812_qc%2Fd    ] o.a.s.s.SolrDispatchFilter SolrDispatchFilter.init() done
   [junit4]   2> 2207263 INFO  (coreLoadExecutor-6493-thread-1-processing-n:127.0.0.1:61812_qc%2Fd) [n:127.0.0.1:61812_qc%2Fd c:control_collection   x:collection1] o.a.s.c.ZkController publishing state=down
   [junit4]   2> 2207263 INFO  (coreLoadExecutor-6493-thread-1-processing-n:127.0.0.1:61812_qc%2Fd) [n:127.0.0.1:61812_qc%2Fd c:control_collection   x:collection1] o.a.s.c.ZkController numShards not found on descriptor - reading it from system property
   [junit4]   2> 2207268 INFO  (OverseerStateUpdate-95098976750075909-127.0.0.1:61812_qc%2Fd-n_0000000000) [n:127.0.0.1:61812_qc%2Fd    ] o.a.s.c.Overseer processMessage: queueSize: 1, message = {
   [junit4]   2>   "numShards":"1",
   [junit4]   2>   "collection":"control_collection",
   [junit4]   2>   "base_url":"https://127.0.0.1:61812/qc/d",
   [junit4]   2>   "operation":"state",
   [junit4]   2>   "state":"down",
   [junit4]   2>   "shard":null,
   [junit4]   2>   "node_name":"127.0.0.1:61812_qc%2Fd",
   [junit4]   2>   "core":"collection1",
   [junit4]   2>   "roles":null} current state version: 0
   [junit4]   2> 2207268 INFO  (coreLoadExecutor-6493-thread-1-processing-n:127.0.0.1:61812_qc%2Fd) [n:127.0.0.1:61812_qc%2Fd c:control_collection   x:collection1] o.a.s.c.ZkController look for our core node name
   [junit4]   2> 2207270 INFO  (OverseerStateUpdate-95098976750075909-127.0.0.1:61812_qc%2Fd-n_0000000000) [n:127.0.0.1:61812_qc%2Fd    ] o.a.s.c.o.ReplicaMutator Update state numShards=1 message={
   [junit4]   2>   "numShards":"1",
   [junit4]   2>   "collection":"control_collection",
   [junit4]   2>   "base_url":"https://127.0.0.1:61812/qc/d",
   [junit4]   2>   "operation":"state",
   [junit4]   2>   "state":"down",
   [junit4]   2>   "shard":null,
   [junit4]   2>   "node_name":"127.0.0.1:61812_qc%2Fd",
   [junit4]   2>   "core":"collection1",
   [junit4]   2>   "roles":null}
   [junit4]   2> 2207270 INFO  (OverseerStateUpdate-95098976750075909-127.0.0.1:61812_qc%2Fd-n_0000000000) [n:127.0.0.1:61812_qc%2Fd    ] o.a.s.c.o.ClusterStateMutator building a new cName: control_collection
   [junit4]   2> 2207271 INFO  (OverseerStateUpdate-95098976750075909-127.0.0.1:61812_qc%2Fd-n_0000000000) [n:127.0.0.1:61812_qc%2Fd    ] o.a.s.c.o.ReplicaMutator Assigning new node to shard shard=shard1
   [junit4]   2> 2207274 INFO  (zkCallback-1537-thread-1-processing-n:127.0.0.1:61812_qc%2Fd) [n:127.0.0.1:61812_qc%2Fd    ] o.a.s.c.c.ZkStateReader A cluster state change: [WatchedEvent state:SyncConnected type:NodeDataChanged path:/clusterstate.json], has occurred - updating... (live nodes size: [1])
   [junit4]   2> 2208270 INFO  (coreLoadExecutor-6493-thread-1-processing-n:127.0.0.1:61812_qc%2Fd) [n:127.0.0.1:61812_qc%2Fd c:control_collection   x:collection1] o.a.s.c.ZkController waiting to find shard id in clusterstate for collection1
   [junit4]   2> 2208271 INFO  (coreLoadExecutor-6493-thread-1-processing-n:127.0.0.1:61812_qc%2Fd) [n:127.0.0.1:61812_qc%2Fd c:control_collection   x:collection1] o.a.s.c.ZkController Check for collection zkNode:control_collection
   [junit4]   2> 2208272 INFO  (coreLoadExecutor-6493-thread-1-processing-n:127.0.0.1:61812_qc%2Fd) [n:127.0.0.1:61812_qc%2Fd c:control_collection   x:collection1] o.a.s.c.ZkController Collection zkNode exists
   [junit4]   2> 2208272 INFO  (coreLoadExecutor-6493-thread-1-processing-n:127.0.0.1:61812_qc%2Fd) [n:127.0.0.1:61812_qc%2Fd c:control_collection   x:collection1] o.a.s.c.c.ZkStateReader Load collection config from: [/collections/control_collection]
   [junit4]   2> 2208274 INFO  (coreLoadExecutor-6493-thread-1-processing-n:127.0.0.1:61812_qc%2Fd) [n:127.0.0.1:61812_qc%2Fd c:control_collection   x:collection1] o.a.s.c.c.ZkStateReader path=[/collections/control_collection] [configName]=[conf1] specified config exists in ZooKeeper
   [junit4]   2> 2208274 INFO  (coreLoadExecutor-6493-thread-1-processing-n:127.0.0.1:61812_qc%2Fd) [n:127.0.0.1:61812_qc%2Fd c:control_collection   x:collection1] o.a.s.c.SolrResourceLoader new SolrResourceLoader for directory: '/Users/jenkins/workspace/Lucene-Solr-5.x-MacOSX/solr/build/solr-core/test/J1/temp/solr.cloud.DeleteInactiveReplicaTest_7D6D358D1920C6E2-001/control-001/cores/collection1'
   [junit4]   2> 2208274 INFO  (coreLoadExecutor-6493-thread-1-processing-n:127.0.0.1:61812_qc%2Fd) [n:127.0.0.1:61812_qc%2Fd c:control_collection   x:collection1] o.a.s.c.SolrResourceLoader JNDI not configured for solr (NoInitialContextEx)
   [junit4]   2> 2208275 INFO  (coreLoadExecutor-6493-thread-1-processing-n:127.0.0.1:61812_qc%2Fd) [n:127.0.0.1:61812_qc%2Fd c:control_collection   x:collection1] o.a.s.c.SolrResourceLoader solr home defaulted to 'solr/' (could not find system property or JNDI)
   [junit4]   2> 2208278 INFO  (coreLoadExecutor-6493-thread-1-processing-n:127.0.0.1:61812_qc%2Fd) [n:127.0.0.1:61812_qc%2Fd c:control_collection   x:collection1] o.a.s.c.Config loaded config solrconfig.xml with version 0 
   [junit4]   2> 2208290 INFO  (coreLoadExecutor-6493-thread-1-processing-n:127.0.0.1:61812_qc%2Fd) [n:127.0.0.1:61812_qc%2Fd c:control_collection   x:collection1] o.a.s.c.SolrConfig current version of requestparams : -1
   [junit4]   2> 2208319 INFO  (coreLoadExecutor-6493-thread-1-processing-n:127.0.0.1:61812_qc%2Fd) [n:127.0.0.1:61812_qc%2Fd c:control_collection   x:collection1] o.a.s.c.SolrConfig Using Lucene MatchVersion: 5.5.0
   [junit4]   2> 2208344 INFO  (coreLoadExecutor-6493-thread-1-processing-n:127.0.0.1:61812_qc%2Fd) [n:127.0.0.1:61812_qc%2Fd c:control_collection   x:collection1] o.a.s.c.SolrConfig Loaded SolrConfig: solrconfig.xml
   [junit4]   2> 2208351 INFO  (coreLoadExecutor-6493-thread-1-processing-n:127.0.0.1:61812_qc%2Fd) [n:127.0.0.1:61812_qc%2Fd c:control_collection   x:collection1] o.a.s.s.IndexSchema [collection1] Schema name=test
   [junit4]   2> 2208557 INFO  (coreLoadExecutor-6493-thread-1-processing-n:127.0.0.1:61812_qc%2Fd) [n:127.0.0.1:61812_qc%2Fd c:control_collection   x:collection1] o.a.s.s.OpenExchangeRatesOrgProvider Initialized with rates=open-exchange-rates.json, refreshInterval=1440.
   [junit4]   2> 2208570 INFO  (coreLoadExecutor-6493-thread-1-processing-n:127.0.0.1:61812_qc%2Fd) [n:127.0.0.1:61812_qc%2Fd c:control_collection   x:collection1] o.a.s.s.IndexSchema default search field in schema is text
   [junit4]   2> 2208572 INFO  (coreLoadExecutor-6493-thread-1-processing-n:127.0.0.1:61812_qc%2Fd) [n:127.0.0.1:61812_qc%2Fd c:control_collection   x:collection1] o.a.s.s.IndexSchema unique key field: id
   [junit4]   2> 2208590 INFO  (coreLoadExecutor-6493-thread-1-processing-n:127.0.0.1:61812_qc%2Fd) [n:127.0.0.1:61812_qc%2Fd c:control_collection   x:collection1] o.a.s.s.FileExchangeRateProvider Reloading exchange rates from file currency.xml
   [junit4]   2> 2208593 INFO  (coreLoadExecutor-6493-thread-1-processing-n:127.0.0.1:61812_qc%2Fd) [n:127.0.0.1:61812_qc%2Fd c:control_collection   x:collection1] o.a.s.s.FileExchangeRateProvider Reloading exchange rates from file currency.xml
   [junit4]   2> 2208596 INFO  (coreLoadExecutor-6493-thread-1-processing-n:127.0.0.1:61812_qc%2Fd) [n:127.0.0.1:61812_qc%2Fd c:control_collection   x:collection1] o.a.s.s.OpenExchangeRatesOrgProvider Reloading exchange rates from open-exchange-rates.json
   [junit4]   2> 2208598 WARN  (coreLoadExecutor-6493-thread-1-processing-n:127.0.0.1:61812_qc%2Fd) [n:127.0.0.1:61812_qc%2Fd c:control_collection   x:collection1] o.a.s.s.OpenExchangeRatesOrgProvider Unknown key IMPORTANT NOTE
   [junit4]   2> 2208598 WARN  (coreLoadExecutor-6493-thread-1-processing-n:127.0.0.1:61812_qc%2Fd) [n:127.0.0.1:61812_qc%2Fd c:control_collection   x:collection1] o.a.s.s.OpenExchangeRatesOrgProvider Expected key, got STRING
   [junit4]   2> 2208598 INFO  (coreLoadExecutor-6493-thread-1-processing-n:127.0.0.1:61812_qc%2Fd) [n:127.0.0.1:61812_qc%2Fd c:control_collection   x:collection1] o.a.s.s.OpenExchangeRatesOrgProvider Reloading exchange rates from open-exchange-rates.json
   [junit4]   2> 2208599 WARN  (coreLoadExecutor-6493-thread-1-processing-n:127.0.0.1:61812_qc%2Fd) [n:127.0.0.1:61812_qc%2Fd c:control_collection   x:collection1] o.a.s.s.OpenExchangeRatesOrgProvider Unknown key IMPORTANT NOTE
   [junit4]   2> 2208600 WARN  (coreLoadExecutor-6493-thread-1-processing-n:127.0.0.1:61812_qc%2Fd) [n:127.0.0.1:61812_qc%2Fd c:control_collection   x:collection1] o.a.s.s.OpenExchangeRatesOrgProvider Expected key, got STRING
   [junit4]   2> 2208601 INFO  (coreLoadExecutor-6493-thread-1-processing-n:127.0.0.1:61812_qc%2Fd) [n:127.0.0.1:61812_qc%2Fd c:control_collection   x:collection1] o.a.s.c.ConfigSetProperties Did not find ConfigSet properties, assuming default properties: Can't find resource 'configsetprops.json' in classpath or '/configs/conf1', cwd=/Users/jenkins/workspace/Lucene-Solr-5.x-MacOSX/solr/build/solr-core/test/J1
   [junit4]   2> 2208602 INFO  (coreLoadExecutor-6493-thread-1-processing-n:127.0.0.1:61812_qc%2Fd) [n:127.0.0.1:61812_qc%2Fd c:control_collection   x:collection1] o.a.s.c.CoreContainer Creating SolrCore 'collection1' using configuration from collection control_collection
   [junit4]   2> 2208602 INFO  (coreLoadExecutor-6493-thread-1-processing-n:127.0.0.1:61812_qc%2Fd) [n:127.0.0.1:61812_qc%2Fd c:control_collection s:shard1 r:core_node1 x:collection1] o.a.s.c.SolrCore org.apache.solr.core.MockDirectoryFactory
   [junit4]   2> 2208602 INFO  (coreLoadExecutor-6493-thread-1-processing-n:127.0.0.1:61812_qc%2Fd) [n:127.0.0.1:61812_qc%2Fd c:control_collection s:shard1 r:core_node1 x:collection1] o.a.s.c.SolrCore [[collection1] ] Opening new SolrCore at [/Users/jenkins/workspace/Lucene-Solr-5.x-MacOSX/solr/build/solr-core/test/J1/temp/solr.cloud.DeleteInactiveReplicaTest_7D6D358D1920C6E2-001/control-001/cores/collection1], dataDir=[/Users/jenkins/workspace/Lucene-Solr-5.x-MacOSX/solr/build/solr-core/test/J1/../../../../../../../../../Users/jenkins/workspace/Lucene-Solr-5.x-MacOSX/solr/build/solr-core/test/J1/temp/solr.cloud.DeleteInactiveReplicaTest_7D6D358D1920C6E2-001/control-001/cores/collection1/data/]
   [junit4]   2> 2208602 INFO  (coreLoadExecutor-6493-thread-1-processing-n:127.0.0.1:61812_qc%2Fd) [n:127.0.0.1:61812_qc%2Fd c:control_collection s:shard1 r:core_node1 x:collection1] o.a.s.c.JmxMonitoredMap JMX monitoring is enabled. Adding Solr mbeans to JMX Server: com.sun.jmx.mbeanserver.JmxMBeanServer@143bc8f8
   [junit4]   2> 2208603 INFO  (coreLoadExecutor-6493-thread-1-processing-n:127.0.0.1:61812_qc%2Fd) [n:127.0.0.1:61812_qc%2Fd c:control_collection s:shard1 r:core_node1 x:collection1] o.a.s.c.CachingDirectoryFactory return new directory for /Users/jenkins/workspace/Lucene-Solr-5.x-MacOSX/solr/build/solr-core/test/J1/../../../../../../../../../Users/jenkins/workspace/Lucene-Solr-5.x-MacOSX/solr/build/solr-core/test/J1/temp/solr.cloud.DeleteInactiveReplicaTest_7D6D358D1920C6E2-001/control-001/cores/collection1/data
   [junit4]   2> 2208603 INFO  (coreLoadExecutor-6493-thread-1-processing-n:127.0.0.1:61812_qc%2Fd) [n:127.0.0.1:61812_qc%2Fd c:control_collection s:shard1 r:core_node1 x:collection1] o.a.s.c.SolrCore New index directory detected: old=null new=/Users/jenkins/workspace/Lucene-Solr-5.x-MacOSX/solr/build/solr-core/test/J1/../../../../../../../../../Users/jenkins/workspace/Lucene-Solr-5.x-MacOSX/solr/build/solr-core/test/J1/temp/solr.cloud.DeleteInactiveReplicaTest_7D6D358D1920C6E2-001/control-001/cores/collection1/data/index/
   [junit4]   2> 2208603 WARN  (coreLoadExecutor-6493-thread-1-processing-n:127.0.0.1:61812_qc%2Fd) [n:127.0.0.1:61812_qc%2Fd c:control_collection s:shard1 r:core_node1 x:collection1] o.a.s.c.SolrCore [collection1] Solr index directory '/Users/jenkins/workspace/Lucene-Solr-5.x-MacOSX/solr/build/solr-core/test/J1/../../../../../../../../../Users/jenkins/workspace/Lucene-Solr-5.x-MacOSX/solr/build/solr-core/test/J1/temp/solr.cloud.DeleteInactiveReplicaTest_7D6D358D1920C6E2-001/control-001/cores/collection1/data/index' doesn't exist. Creating new index...
   [junit4]   2> 2208603 INFO  (coreLoadExecutor-6493-thread-1-processing-n:127.0.0.1:61812_qc%2Fd) [n:127.0.0.1:61812_qc%2Fd c:control_collection s:shard1 r:core_node1 x:collection1] o.a.s.c.CachingDirectoryFactory return new directory for /Users/jenkins/workspace/Lucene-Solr-5.x-MacOSX/solr/build/solr-core/test/J1/../../../../../../../../../Users/jenkins/workspace/Lucene-Solr-5.x-MacOSX/solr/build/solr-core/test/J1/temp/solr.cloud.DeleteInactiveReplicaTest_7D6D358D1920C6E2-001/control-001/cores/collection1/data/index
   [junit4]   2> 2208603 INFO  (coreLoadExecutor-6493-thread-1-processing-n:127.0.0.1:61812_qc%2Fd) [n:127.0.0.1:61812_qc%2Fd c:control_collection s:shard1 r:core_node1 x:collection1] o.a.s.u.RandomMergePolicy RandomMergePolicy wrapping class org.apache.lucene.index.TieredMergePolicy: [TieredMergePolicy: maxMergeAtOnce=16, maxMergeAtOnceExplicit=17, maxMergedSegmentMB=46.5576171875, floorSegmentMB=1.15234375, forceMergeDeletesPctAllowed=13.366977627588057, segmentsPerTier=3.0, maxCFSSegmentSizeMB=8.796093022207999E12, noCFSRatio=0.0
   [junit4]   2> 2208604 INFO  (coreLoadExecutor-6493-thread-1-processing-n:127.0.0.1:61812_qc%2Fd) [n:127.0.0.1:61812_qc%2Fd c:control_collection s:shard1 r:core_node1 x:collection1] o.a.s.c.SolrDeletionPolicy SolrDeletionPolicy.onCommit: commits: num=1
   [junit4]   2> 	commit{dir=MockDirectoryWrapper(RAMDirectory@223f25d2 lockFactory=org.apache.lucene.store.SingleInstanceLockFactory@5fcc0f8e),segFN=segments_1,generation=1}
   [junit4]   2> 2208604 INFO  (coreLoadExecutor-6493-thread-1-processing-n:127.0.0.1:61812_qc%2Fd) [n:127.0.0.1:61812_qc%2Fd c:control_collection s:shard1 r:core_node1 x:collection1] o.a.s.c.SolrDeletionPolicy newest commit generation = 1
   [junit4]   2> 2208604 INFO  (OldIndexDirectoryCleanupThreadForCore-collection1) [n:127.0.0.1:61812_qc%2Fd c:control_collection s:shard1 r:core_node1 x:collection1] o.a.s.c.SolrCore Looking for old index directories to cleanup for core collection1 in /Users/jenkins/workspace/Lucene-Solr-5.x-MacOSX/solr/build/solr-core/test/J1/../../../../../../../../../Users/jenkins/workspace/Lucene-Solr-5.x-MacOSX/solr/build/solr-core/test/J1/temp/solr.cloud.DeleteInactiveReplicaTest_7D6D358D1920C6E2-001/control-001/cores/collection1/data/
   [junit4]   2> 2208605 WARN  (OldIndexDirectoryCleanupThreadForCore-collection1) [n:127.0.0.1:61812_qc%2Fd c:control_collection s:shard1 r:core_node1 x:collection1] o.a.s.c.DirectoryFactory /Users/jenkins/workspace/Lucene-Solr-5.x-MacOSX/solr/build/solr-core/test/J1/../../../../../../../../../Users/jenkins/workspace/Lucene-Solr-5.x-MacOSX/solr/build/solr-core/test/J1/temp/solr.cloud.DeleteInactiveReplicaTest_7D6D358D1920C6E2-001/control-001/cores/collection1/data/ does not point to a valid data directory; skipping clean-up of old index directories.
   [junit4]   2> 2208608 INFO  (coreLoadExecutor-6493-thread-1-processing-n:127.0.0.1:61812_qc%2Fd) [n:127.0.0.1:61812_qc%2Fd c:control_collection s:shard1 r:core_node1 x:collection1] o.a.s.u.p.UpdateRequestProcessorChain creating updateRequestProcessorChain "nodistrib"
   [junit4]   2> 2208608 INFO  (coreLoadExecutor-6493-thread-1-processing-n:127.0.0.1:61812_qc%2Fd) [n:127.0.0.1:61812_qc%2Fd c:control_collection s:shard1 r:core_node1 x:collection1] o.a.s.u.p.UpdateRequestProcessorChain creating updateRequestProcessorChain "dedupe"
   [junit4]   2> 2208608 INFO  (coreLoadExecutor-6493-thread-1-processing-n:127.0.0.1:61812_qc%2Fd) [n:127.0.0.1:61812_qc%2Fd c:control_collection s:shard1 r:core_node1 x:collection1] o.a.s.u.p.UpdateRequestProcessorChain inserting DistributedUpdateProcessorFactory into updateRequestProcessorChain "dedupe"
   [junit4]   2> 2208608 INFO  (coreLoadExecutor-6493-thread-1-processing-n:127.0.0.1:61812_qc%2Fd) [n:127.0.0.1:61812_qc%2Fd c:control_collection s:shard1 r:core_node1 x:collection1] o.a.s.u.p.UpdateRequestProcessorChain creating updateRequestProcessorChain "stored_sig"
   [junit4]   2> 2208608 INFO  (coreLoadExecutor-6493-thread-1-processing-n:127.0.0.1:61812_qc%2Fd) [n:127.0.0.1:61812_qc%2Fd c:control_collection s:shard1 r:core_node1 x:collection1] o.a.s.u.p.UpdateRequestProcessorChain inserting DistributedUpdateProcessorFactory into updateRequestProcessorChain "stored_sig"
   [junit4]   2> 2208608 INFO  (coreLoadExecutor-6493-thread-1-processing-n:127.0.0.1:61812_qc%2Fd) [n:127.0.0.1:61812_qc%2Fd c:control_collection s:shard1 r:core_node1 x:collection1] o.a.s.u.p.UpdateRequestProcessorChain creating updateRequestProcessorChain "distrib-dup-test-chain-explicit"
   [junit4]   2> 2208608 INFO  (coreLoadExecutor-6493-thread-1-processing-n:127.0.0.1:61812_qc%2Fd) [n:127.0.0.1:61812_qc%2Fd c:control_collection s:shard1 r:core_node1 x:collection1] o.a.s.u.p.UpdateRequestProcessorChain creating updateRequestProcessorChain "distrib-dup-test-chain-implicit"
   [junit4]   2> 2208608 INFO  (coreLoadExecutor-6493-thread-1-processing-n:127.0.0.1:61812_qc%2Fd) [n:127.0.0.1:61812_qc%2Fd c:control_collection s:shard1 r:core_node1 x:collection1] o.a.s.u.p.UpdateRequestProcessorChain inserting DistributedUpdateProcessorFactory into updateRequestProcessorChain "distrib-dup-test-chain-implicit"
   [junit4]   2> 2208608 INFO  (coreLoadExecutor-6493-thread-1-processing-n:127.0.0.1:61812_qc%2Fd) [n:127.0.0.1:61812_qc%2Fd c:control_collection s:shard1 r:core_node1 x:collection1] o.a.s.c.SolrCore no updateRequestProcessorChain defined as default, creating implicit default
   [junit4]   2> 2208609 WARN  (coreLoadExecutor-6493-thread-1-processing-n:127.0.0.1:61812_qc%2Fd) [n:127.0.0.1:61812_qc%2Fd c:control_collection s:shard1 r:core_node1 x:collection1] o.a.s.c.RequestHandlers INVALID paramSet a in requestHandler {type = requestHandler,name = /dump,class = DumpRequestHandler,args = {defaults={a=A,b=B}}}
   [junit4]   2> 2208615 INFO  (coreLoadExecutor-6493-thread-1-processing-n:127.0.0.1:61812_qc%2Fd) [n:127.0.0.1:61812_qc%2Fd c:control_collection s:shard1 r:core_node1 x:collection1] o.a.s.h.l.XMLLoader xsltCacheLifetimeSeconds=60
   [junit4]   2> 2208617 INFO  (coreLoadExecutor-6493-thread-1-processing-n:127.0.0.1:61812_qc%2Fd) [n:127.0.0.1:61812_qc%2Fd c:control_collection s:shard1 r:core_node1 x:collection1] o.a.s.h.l.XMLLoader xsltCacheLifetimeSeconds=60
   [junit4]   2> 2208618 INFO  (coreLoadExecutor-6493-thread-1-processing-n:127.0.0.1:61812_qc%2Fd) [n:127.0.0.1:61812_qc%2Fd c:control_collection s:shard1 r:core_node1 x:collection1] o.a.s.h.l.XMLLoader xsltCacheLifetimeSeconds=60
   [junit4]   2> 2208619 INFO  (coreLoadExecutor-6493-thread-1-processing-n:127.0.0.1:61812_qc%2Fd) [n:127.0.0.1:61812_qc%2Fd c:control_collection s:shard1 r:core_node1 x:collection1] o.a.s.h.l.XMLLoader xsltCacheLifetimeSeconds=60
   [junit4]   2> 2208623 INFO  (coreLoadExecutor-6493-thread-1-processing-n:127.0.0.1:61812_qc%2Fd) [n:127.0.0.1:61812_qc%2Fd c:control_collection s:shard1 r:core_node1 x:collection1] o.a.s.c.RequestHandlers Registered paths: /get,/admin/ping,/admin/logging,/update/csv,standard,/update,/admin/plugins,/update/json/docs,/replication,/admin/file,/dump,/schema,/admin/system,/update/json,/config,/admin/threads,/admin/luke,/admin/properties,/admin/segments,/admin/mbeans
   [junit4]   2> 2208624 INFO  (coreLoadExecutor-6493-thread-1-processing-n:127.0.0.1:61812_qc%2Fd) [n:127.0.0.1:61812_qc%2Fd c:control_collection s:shard1 r:core_node1 x:collection1] o.a.s.c.SolrCore Using default statsCache cache: org.apache.solr.search.stats.LocalStatsCache
   [junit4]   2> 2208625 INFO  (coreLoadExecutor-6493-thread-1-processing-n:127.0.0.1:61812_qc%2Fd) [n:127.0.0.1:61812_qc%2Fd c:control_collection s:shard1 r:core_node1 x:collection1] o.a.s.u.UpdateHandler Using UpdateLog implementation: org.apache.solr.update.UpdateLog
   [junit4]   2> 2208625 INFO  (coreLoadExecutor-6493-thread-1-processing-n:127.0.0.1:61812_qc%2Fd) [n:127.0.0.1:61812_qc%2Fd c:control_collection s:shard1 r:core_node1 x:collection1] o.a.s.u.UpdateLog Initializing UpdateLog: dataDir= defaultSyncLevel=FLUSH numRecordsToKeep=100 maxNumLogsToKeep=10 numVersionBuckets=65536
   [junit4]   2> 2208626 INFO  (coreLoadExecutor-6493-thread-1-processing-n:127.0.0.1:61812_qc%2Fd) [n:127.0.0.1:61812_qc%2Fd c:control_collection s:shard1 r:core_node1 x:collection1] o.a.s.u.CommitTracker Hard AutoCommit: disabled
   [junit4]   2> 2208626 INFO  (coreLoadExecutor-6493-thread-1-processing-n:127.0.0.1:61812_qc%2Fd) [n:127.0.0.1:61812_qc%2Fd c:control_collection s:shard1 r:core_node1 x:collection1] o.a.s.u.CommitTracker Soft AutoCommit: disabled
   [junit4]   2> 2208626 INFO  (coreLoadExecutor-6493-thread-1-processing-n:127.0.0.1:61812_qc%2Fd) [n:127.0.0.1:61812_qc%2Fd c:control_collection s:shard1 r:core_node1 x:collection1] o.a.s.u.RandomMergePolicy RandomMergePolicy wrapping class org.apache.lucene.index.TieredMergePolicy: [TieredMergePolicy: maxMergeAtOnce=17, maxMergeAtOnceExplicit=14, maxMergedSegmentMB=92.640625, floorSegmentMB=1.76171875, forceMergeDeletesPctAllowed=29.025009080853113, segmentsPerTier=23.0, maxCFSSegmentSizeMB=8.796093022207999E12, noCFSRatio=1.0
   [junit4]   2> 2208627 INFO  (coreLoadExecutor-6493-thread-1-processing-n:127.0.0.1:61812_qc%2Fd) [n:127.0.0.1:61812_qc%2Fd c:control_collection s:shard1 r:core_node1 x:collection1] o.a.s.c.SolrDeletionPolicy SolrDeletionPolicy.onInit: commits: num=1
   [junit4]   2> 	commit{dir=MockDirectoryWrapper(RAMDirectory@223f25d2 lockFactory=org.apache.lucene.store.SingleInstanceLockFactory@5fcc0f8e),segFN=segments_1,generation=1}
   [junit4]   2> 2208627 INFO  (coreLoadExecutor-6493-thread-1-processing-n:127.0.0.1:61812_qc%2Fd) [n:127.0.0.1:61812_qc%2Fd c:control_collection s:shard1 r:core_node1 x:collection1] o.a.s.c.SolrDeletionPolicy newest commit generation = 1
   [junit4]   2> 2208627 INFO  (coreLoadExecutor-6493-thread-1-processing-n:127.0.0.1:61812_qc%2Fd) [n:127.0.0.1:61812_qc%2Fd c:control_collection s:shard1 r:core_node1 x:collection1] o.a.s.s.SolrIndexSearcher Opening Searcher@368fd6d3[collection1] main
   [junit4]   2> 2208627 INFO  (coreLoadExecutor-6493-thread-1-processing-n:127.0.0.1:61812_qc%2Fd) [n:127.0.0.1:61812_qc%2Fd c:control_collection s:shard1 r:core_node1 x:collection1] o.a.s.c.c.ZkStateReader Load collection config from: [/collections/control_collection]
   [junit4]   2> 2208628 INFO  (coreLoadExecutor-6493-thread-1-processing-n:127.0.0.1:61812_qc%2Fd) [n:127.0.0.1:61812_qc%2Fd c:control_collection s:shard1 r:core_node1 x:collection1] o.a.s.c.c.ZkStateReader path=[/collections/control_collection] [configName]=[conf1] specified config exists in ZooKeeper
   [junit4]   2> 2208628 INFO  (coreLoadExecutor-6493-thread-1-processing-n:127.0.0.1:61812_qc%2Fd) [n:127.0.0.1:61812_qc%2Fd c:control_collection s:shard1 r:core_node1 x:collection1] o.a.s.r.ManagedResourceStorage Setting up ZooKeeper-based storage for the RestManager with znodeBase: /configs/conf1
   [junit4]   2> 2208629 INFO  (coreLoadExecutor-6493-thread-1-processing-n:127.0.0.1:61812_qc%2Fd) [n:127.0.0.1:61812_qc%2Fd c:control_collection s:shard1 r:core_node1 x:collection1] o.a.s.r.ManagedResourceStorage Configured ZooKeeperStorageIO with znodeBase: /configs/conf1
   [junit4]   2> 2208629 INFO  (coreLoadExecutor-6493-thread-1-processing-n:127.0.0.1:61812_qc%2Fd) [n:127.0.0.1:61812_qc%2Fd c:control_collection s:shard1 r:core_node1 x:collection1] o.a.s.r.RestManager Initializing RestManager with initArgs: {}
   [junit4]   2> 2208629 INFO  (coreLoadExecutor-6493-thread-1-processing-n:127.0.0.1:61812_qc%2Fd) [n:127.0.0.1:61812_qc%2Fd c:control_collection s:shard1 r:core_node1 x:collection1] o.a.s.r.ManagedResourceStorage Reading _rest_managed.json using ZooKeeperStorageIO:path=/configs/conf1
   [junit4]   2> 2208630 INFO  (coreLoadExecutor-6493-thread-1-processing-n:127.0.0.1:61812_qc%2Fd) [n:127.0.0.1:61812_qc%2Fd c:control_collection s:shard1 r:core_node1 x:collection1] o.a.s.r.ManagedResourceStorage No data found for znode /configs/conf1/_rest_managed.json
   [junit4]   2> 2208630 INFO  (coreLoadExecutor-6493-thread-1-processing-n:127.0.0.1:61812_qc%2Fd) [n:127.0.0.1:61812_qc%2Fd c:control_collection s:shard1 r:core_node1 x:collection1] o.a.s.r.ManagedResourceStorage Loaded null at path _rest_managed.json using ZooKeeperStorageIO:path=/configs/conf1
   [junit4]   2> 2208630 INFO  (coreLoadExecutor-6493-thread-1-processing-n:127.0.0.1:61812_qc%2Fd) [n:127.0.0.1:61812_qc%2Fd c:control_collection s:shard1 r:core_node1 x:collection1] o.a.s.r.RestManager Initializing 0 registered ManagedResources
   [junit4]   2> 2208630 INFO  (coreLoadExecutor-6493-thread-1-processing-n:127.0.0.1:61812_qc%2Fd) [n:127.0.0.1:61812_qc%2Fd c:control_collection s:shard1 r:core_node1 x:collection1] o.a.s.h.ReplicationHandler Commits will be reserved for  10000
   [junit4]   2> 2208631 INFO  (searcherExecutor-6494-thread-1-processing-c:control_collection r:core_node1 s:shard1 n:127.0.0.1:61812_qc%2Fd x:collection1) [n:127.0.0.1:61812_qc%2Fd c:control_collection s:shard1 r:core_node1 x:collection1] o.a.s.c.SolrCore [collection1] Registered new searcher Searcher@368fd6d3[collection1] main{ExitableDirectoryReader(UninvertingDirectoryReader())}
   [junit4]   2> 2208631 INFO  (coreLoadExecutor-6493-thread-1-processing-n:127.0.0.1:61812_qc%2Fd) [n:127.0.0.1:61812_qc%2Fd c:control_collection s:shard1 r:core_node1 x:collection1] o.a.s.u.UpdateLog Looking up max value of version field to seed version buckets
   [junit4]   2> 2208631 INFO  (coreLoadExecutor-6493-thread-1-processing-n:127.0.0.1:61812_qc%2Fd) [n:127.0.0.1:61812_qc%2Fd c:control_collection s:shard1 r:core_node1 x:collection1] o.a.s.u.VersionInfo Refreshing highest value of _version_ for 65536 version buckets from index
   [junit4]   2> 2208631 INFO  (coreLoadExecutor-6493-thread-1-processing-n:127.0.0.1:61812_qc%2Fd) [n:127.0.0.1:61812_qc%2Fd c:control_collection s:shard1 r:core_node1 x:collection1] o.a.s.u.VersionInfo No terms found for _version_, cannot seed version bucket highest value from index
   [junit4]   2> 2208631 INFO  (coreLoadExecutor-6493-thread-1-processing-n:127.0.0.1:61812_qc%2Fd) [n:127.0.0.1:61812_qc%2Fd c:control_collection s:shard1 r:core_node1 x:collection1] o.a.s.u.UpdateLog Could not find max version in index or recent updates, using new clock 1521583630140309504
   [junit4]   2> 2208633 INFO  (coreLoadExecutor-6493-thread-1-processing-n:127.0.0.1:61812_qc%2Fd) [n:127.0.0.1:61812_qc%2Fd c:control_collection s:shard1 r:core_node1 x:collection1] o.a.s.u.UpdateLog Took 1.0ms to seed version buckets with highest version 1521583630140309504
   [junit4]   2> 2208633 INFO  (coreLoadExecutor-6493-thread-1-processing-n:127.0.0.1:61812_qc%2Fd) [n:127.0.0.1:61812_qc%2Fd c:control_collection s:shard1 r:core_node1 x:collection1] o.a.s.c.ZkController watch zkdir /configs/conf1
   [junit4]   2> 2208634 INFO  (coreLoadExecutor-6493-thread-1-processing-n:127.0.0.1:61812_qc%2Fd) [n:127.0.0.1:61812_qc%2Fd c:control_collection s:shard1 r:core_node1 x:collection1] o.a.s.c.CoreContainer registering core: collection1
   [junit4]   2> 2208635 INFO  (coreZkRegister-6487-thread-1-processing-c:control_collection r:core_node1 s:shard1 n:127.0.0.1:61812_qc%2Fd x:collection1) [n:127.0.0.1:61812_qc%2Fd c:control_collection s:shard1 r:core_node1 x:collection1] o.a.s.c.ZkController Register replica - core:collection1 address:https://127.0.0.1:61812/qc/d collection:control_collection shard:shard1
   [junit4]   2> 2208636 INFO  (coreZkRegister-6487-thread-1-processing-c:control_collection r:core_node1 s:shard1 n:127.0.0.1:61812_qc%2Fd x:collection1) [n:127.0.0.1:61812_qc%2Fd c:control_collection s:shard1 r:core_node1 x:collection1] o.a.s.c.c.SolrZkClient makePath: /collections/control_collection/leader_elect/shard1/election
   [junit4]   2> 2208643 INFO  (coreZkRegister-6487-thread-1-processing-c:control_collection r:core_node1 s:shard1 n:127.0.0.1:61812_qc%2Fd x:collection1) [n:127.0.0.1:61812_qc%2Fd c:control_collection s:shard1 r:core_node1 x:collection1] o.a.s.c.LeaderElector Joined leadership election with path: /collections/control_collection/leader_elect/shard1/election/95098976750075909-core_node1-n_0000000000
   [junit4]   2> 2208644 INFO  (coreZkRegister-6487-thread-1-processing-c:control_collection r:core_node1 s:shard1 n:127.0.0.1:61812_qc%2Fd x:collection1) [n:127.0.0.1:61812_qc%2Fd c:control_collection s:shard1 r:core_node1 x:collection1] o.a.s.c.ShardLeaderElectionContext Running the leader process for shard=shard1 and weAreReplacement=false and leaderVoteWait=10000
   [junit4]   2> 2208647 INFO  (coreZkRegister-6487-thread-1-processing-c:control_collection r:core_node1 s:shard1 n:127.0.0.1:61812_qc%2Fd x:collection1) [n:127.0.0.1:61812_qc%2Fd c:control_collection s:shard1 r:core_node1 x:collection1] o.a.s.c.ShardLeaderElectionContext Enough replicas found to continue.
   [junit4]   2> 2208647 INFO  (coreZkRegister-6487-thread-1-processing-c:control_collection r:core_node1 s:shard1 n:127.0.0.1:61812_qc%2Fd x:collection1) [n:127.0.0.1:61812_qc%2Fd c:control_collection s:shard1 r:core_node1 x:collection1] o.a.s.c.ShardLeaderElectionContext I may be the new leader - try and sync
   [junit4]   2> 2208647 INFO  (coreZkRegister-6487-thread-1-processing-c:control_collection r:core_node1 s:shard1 n:127.0.0.1:61812_qc%2Fd x:collection1) [n:127.0.0.1:61812_qc%2Fd c:control_collection s:shard1 r:core_node1 x:collection1] o.a.s.c.SyncStrategy Sync replicas to https://127.0.0.1:61812/qc/d/collection1/
   [junit4]   2> 2208647 INFO  (coreZkRegister-6487-thread-1-processing-c:control_collection r:core_node1 s:shard1 n:127.0.0.1:61812_qc%2Fd x:collection1) [n:127.0.0.1:61812_qc%2Fd c:control_collection s:shard1 r:core_node1 x:collection1] o.a.s.c.SyncStrategy Sync Success - now sync replicas to me
   [junit4]   2> 2208647 INFO  (coreZkRegister-6487-thread-1-processing-c:control_collection r:core_node1 s:shard1 n:127.0.0.1:61812_qc%2Fd x:collection1) [n:127.0.0.1:61812_qc%2Fd c:control_collection s:shard1 r:core_node1 x:collection1] o.a.s.c.SyncStrategy https://127.0.0.1:61812/qc/d/collection1/ has no replicas
   [junit4]   2> 2208647 INFO  (OverseerStateUpdate-95098976750075909-127.0.0.1:61812_qc%2Fd-n_0000000000) [n:127.0.0.1:61812_qc%2Fd    ] o.a.s.c.Overseer processMessage: queueSize: 1, message = {
   [junit4]   2>   "operation":"leader",
   [junit4]   2>   "shard":"shard1",
   [junit4]   2>   "collection":"control_collection"} current state version: 1
   [junit4]   2> 2208648 INFO  (coreZkRegister-6487-thread-1-processing-c:control_collection r:core_node1 s:shard1 n:127.0.0.1:61812_qc%2Fd x:collection1) [n:127.0.0.1:61812_qc%2Fd c:control_collection s:shard1 r:core_node1 x:collection1] o.a.s.c.c.SolrZkClient makePath: /collections/control_collection/leaders/shard1
   [junit4]   2> 2208653 INFO  (coreZkRegister-6487-thread-1-processing-c:control_collection r:core_node1 s:shard1 n:127.0.0.1:61812_qc%2Fd x:collection1) [n:127.0.0.1:61812_qc%2Fd c:control_collection s:shard1 r:core_node1 x:collection1] o.a.s.c.ShardLeaderElectionContextBase Creating leader registration node
   [junit4]   2> 2208656 INFO  (coreZkRegister-6487-thread-1-processing-c:control_collection r:core_node1 s:shard1 n:127.0.0.1:61812_qc%2Fd x:collection1) [n:127.0.0.1:61812_qc%2Fd c:control_collection s:shard1 r:core_node1 x:collection1] o.a.s.c.ShardLeaderElectionContext I am the new leader: https://127.0.0.1:61812/qc/d/collection1/ shard1
   [junit4]   2> 2208658 INFO  (OverseerStateUpdate-95098976750075909-127.0.0.1:61812_qc%2Fd-n_0000000000) [n:127.0.0.1:61812_qc%2Fd    ] o.a.s.c.Overseer processMessage: queueSize: 1, message = {
   [junit4]   2>   "operation":"leader",
   [junit4]   2>   "shard":"shard1",
   [junit4]   2>   "collection":"control_collection",
   [junit4]   2>   "base_url":"https://127.0.0.1:61812/qc/d",
   [junit4]   2>   "core":"collection1",
   [junit4]   2>   "state":"active"} current state version: 1
   [junit4]   2> 2208765 INFO  (zkCallback-1537-thread-1-processing-n:127.0.0.1:61812_qc%2Fd) [n:127.0.0.1:61812_qc%2Fd    ] o.a.s.c.c.ZkStateReader A cluster state change: [WatchedEvent state:SyncConnected type:NodeDataChanged path:/clusterstate.json], has occurred - updating... (live nodes size: [1])
   [junit4]   2> 2208772 INFO  (TEST-DeleteInactiveReplicaTest.deleteInactiveReplicaTest-seed#[7D6D358D1920C6E2]) [    ] o.a.s.c.c.SolrZkClient Using default ZkCredentialsProvider
   [junit4]   2> 2208774 INFO  (TEST-DeleteInactiveReplicaTest.deleteInactiveReplicaTest-seed#[7D6D358D1920C6E2]) [    ] o.a.s.c.c.ConnectionManager Waiting for client to connect to ZooKeeper
   [junit4]   2> 2208777 INFO  (zkCallback-1539-thread-1) [    ] o.a.s.c.c.ConnectionManager Watcher org.apache.solr.common.cloud.ConnectionManager@543064d5 name:ZooKeeperConnection Watcher:127.0.0.1:61808/solr got event WatchedEvent state:SyncConnected type:None path:null path:null type:None
   [junit4]   2> 2208777 INFO  (TEST-DeleteInactiveReplicaTest.deleteInactiveReplicaTest-seed#[7D6D358D1920C6E2]) [    ] o.a.s.c.c.ConnectionManager Client is connected to ZooKeeper
   [junit4]   2> 2208778 INFO  (TEST-DeleteInactiveReplicaTest.deleteInactiveReplicaTest-seed#[7D6D358D1920C6E2]) [    ] o.a.s.c.c.SolrZkClient Using default ZkACLProvider
   [junit4]   2> 2208778 INFO  (TEST-DeleteInactiveReplicaTest.deleteInactiveReplicaTest-seed#[7D6D358D1920C6E2]) [    ] o.a.s.c.c.ZkStateReader Updating cluster state from ZooKeeper... 
   [junit4]   2> 2208784 INFO  (TEST-DeleteInactiveReplicaTest.deleteInactiveReplicaTest-seed#[7D6D358D1920C6E2]) [    ] o.a.s.c.ChaosMonkey monkey: init - expire sessions:false cause connection loss:false
   [junit4]   2> 2208784 INFO  (TEST-DeleteInactiveReplicaTest.deleteInactiveReplicaTest-seed#[7D6D358D1920C6E2]) [    ] o.a.s.c.AbstractFullDistribZkTestBase Creating collection1 with stateFormat=2
   [junit4]   2> 2208784 INFO  (TEST-DeleteInactiveReplicaTest.deleteInactiveReplicaTest-seed#[7D6D358D1920C6E2]) [    ] o.a.s.c.c.SolrZkClient Using default ZkCredentialsProvider
   [junit4]   2> 2208785 INFO  (TEST-DeleteInactiveReplicaTest.deleteInactiveReplicaTest-seed#[7D6D358D1920C6E2]) [    ] o.a.s.c.c.ConnectionManager Waiting for client to connect to ZooKeeper
   [junit4]   2> 2208787 INFO  (zkCallback-1540-thread-1) [    ] o.a.s.c.c.ConnectionManager Watcher org.apache.solr.common.cloud.ConnectionManager@29555c5c name:ZooKeeperConnection Watcher:127.0.0.1:61808/solr got event WatchedEvent state:SyncConnected type:None path:null path:null type:None
   [junit4]   2> 2208787 INFO  (TEST-DeleteInactiveReplicaTest.deleteInactiveReplicaTest-seed#[7D6D358D1920C6E2]) [    ] o.a.s.c.c.ConnectionManager Client is connected to ZooKeeper
   [junit4]   2> 2208788 INFO  (TEST-DeleteInactiveReplicaTest.deleteInactiveReplicaTest-seed#[7D6D358D1920C6E2]) [    ] o.a.s.c.c.SolrZkClient Using default ZkACLProvider
   [junit4]   2> 2208793 INFO  (OverseerStateUpdate-95098976750075909-127.0.0.1:61812_qc%2Fd-n_0000000000) [n:127.0.0.1:61812_qc%2Fd    ] o.a.s.c.Overseer processMessage: queueSize: 1, message = {
   [junit4]   2>   "operation":"create",
   [junit4]   2>   "name":"collection1",
   [junit4]   2>   "numShards":"2",
   [junit4]   2>   "stateFormat":"2"} current state version: 2
   [junit4]   2> 2208793 INFO  (OverseerStateUpdate-95098976750075909-127.0.0.1:61812_qc%2Fd-n_0000000000) [n:127.0.0.1:61812_qc%2Fd    ] o.a.s.c.o.ClusterStateMutator building a new cName: collection1
   [junit4]   2> 2208814 INFO  (coreZkRegister-6487-thread-1-processing-c:control_collection r:core_node1 s:shard1 n:127.0.0.1:61812_qc%2Fd x:collection1) [n:127.0.0.1:61812_qc%2Fd c:control_collection s:shard1 r:core_node1 x:collection1] o.a.s.c.ZkController We are https://127.0.0.1:61812/qc/d/collection1/ and leader is https://127.0.0.1:61812/qc/d/collection1/
   [junit4]   2> 2208814 INFO  (coreZkRegister-6487-thread-1-processing-c:control_collection r:core_node1 s:shard1 n:127.0.0.1:61812_qc%2Fd x:collection1) [n:127.0.0.1:61812_qc%2Fd c:control_collection s:shard1 r:core_node1 x:collection1] o.a.s.c.ZkController No LogReplay needed for core=collection1 baseURL=https://127.0.0.1:61812/qc/d
   [junit4]   2> 2208814 INFO  (coreZkRegister-6487-thread-1-processing-c:control_collection r:core_node1 s:shard1 n:127.0.0.1:61812_qc%2Fd x:collection1) [n:127.0.0.1:61812_qc%2Fd c:control_collection s:shard1 r:core_node1 x:collection1] o.a.s.c.ZkController I am the leader, no recovery necessary
   [junit4]   2> 2208814 INFO  (coreZkRegister-6487-thread-1-processing-c:control_collection r:core_node1 s:shard1 n:127.0.0.1:61812_qc%2Fd x:collection1) [n:127.0.0.1:61812_qc%2Fd c:control_collection s:shard1 r:core_node1 x:collection1] o.a.s.c.ZkController publishing state=active
   [junit4]   2> 2208814 INFO  (coreZkRegister-6487-thread-1-processing-c:control_collection r:core_node1 s:shard1 n:127.0.0.1:61812_qc%2Fd x:collection1) [n:127.0.0.1:61812_qc%2Fd c:control_collection s:shard1 r:core_node1 x:collection1] o.a.s.c.ZkController numShards not found on descriptor - reading it from system property
   [junit4]   2> 2208818 INFO  (OverseerStateUpdate-95098976750075909-127.0.0.1:61812_qc%2Fd-n_0000000000) [n:127.0.0.1:61812_qc%2Fd    ] o.a.s.c.Overseer processMessage: queueSize: 1, message = {
   [junit4]   2>   "numShards":"2",
   [junit4]   2>   "core_node_name":"core_node1",
   [junit4]   2>   "collection":"control_collection",
   [junit4]   2>   "base_url":"https://127.0.0.1:61812/qc/d",
   [junit4]   2>   "operation":"state",
   [junit4]   2>   "state":"active",
   [junit4]   2>   "shard":"shard1",
   [junit4]   2>   "node_name":"127.0.0.1:61812_qc%2Fd",
   [junit4]   2>   "core":"collection1",
   [junit4]   2>   "roles":null} current state version: 2
   [junit4]   2> 2208819 INFO  (OverseerStateUpdate-95098976750075909-127.0.0.1:61812_qc%2Fd-n_0000000000) [n:127.0.0.1:61812_qc%2Fd    ] o.a.s.c.o.ReplicaMutator Update state numShards=2 message={
   [junit4]   2>   "numShards":"2",
   [junit4]   2>   "core_node_name":"core_node1",
   [junit4]   2>   "collection":"control_collection",
   [junit4]   2>   "base_url":"https://127.0.0.1:61812/qc/d",
   [junit4]   2>   "operation":"state",
   [junit4]   2>   "state":"active",
   [junit4]   2>   "shard":"shard1",
   [junit4]   2>   "node_name":"127.0.0.1:61812_qc%2Fd",
   [junit4]   2>   "core":"collection1",
   [junit4]   2>   "roles":null}
   [junit4]   2> 2208820 INFO  (OverseerStateUpdate-95098976750075909-127.0.0.1:61812_qc%2Fd-n_0000000000) [n:127.0.0.1:61812_qc%2Fd    ] o.a.s.c.o.ZkStateWriter going to create_collection /collections/collection1/state.json
   [junit4]   2> 2208928 INFO  (zkCallback-1537-thread-1-processing-n:127.0.0.1:61812_qc%2Fd) [n:127.0.0.1:61812_qc%2Fd    ] o.a.s.c.c.ZkStateReader A cluster state change: [WatchedEvent state:SyncConnected type:NodeDataChanged path:/clusterstate.json], has occurred - updating... (live nodes size: [1])
   [junit4]   2> 2208929 INFO  (zkCallback-1539-thread-1) [    ] o.a.s.c.c.ZkStateReader A cluster state change: [WatchedEvent state:SyncConnected type:NodeDataChanged path:/clusterstate.json], has occurred - updating... (live nodes size: [1])
   [junit4]   2> 2209036 INFO  (TEST-DeleteInactiveReplicaTest.deleteInactiveReplicaTest-seed#[7D6D358D1920C6E2]) [    ] o.a.s.SolrTestCaseJ4 Writing core.properties file to /Users/jenkins/workspace/Lucene-Solr-5.x-MacOSX/solr/build/solr-core/test/J1/temp/solr.cloud.DeleteInactiveReplicaTest_7D6D358D1920C6E2-001/shard-1-001/cores/collection1
   [junit4]   2> 2209038 INFO  (TEST-DeleteInactiveReplicaTest.deleteInactiveReplicaTest-seed#[7D6D358D1920C6E2]) [    ] o.a.s.c.AbstractFullDistribZkTestBase create jetty 1 in directory /Users/jenkins/workspace/Lucene-Solr-5.x-MacOSX/solr/build/solr-core/test/J1/temp/solr.cloud.DeleteInactiveReplicaTest_7D6D358D1920C6E2-001/shard-1-001
   [junit4]   2> 2209039 INFO  (TEST-DeleteInactiveReplicaTest.deleteInactiveReplicaTest-seed#[7D6D358D1920C6E2]) [    ] o.e.j.s.Server jetty-9.2.13.v20150730
   [junit4]   2> 2209043 INFO  (TEST-DeleteInactiveReplicaTest.deleteInactiveReplicaTest-seed#[7D6D358D1920C6E2]) [    ] o.e.j.s.h.ContextHandler Started o.e.j.s.ServletContextHandler@6cbba2b3{/qc/d,null,AVAILABLE}
   [junit4]   2> 2209047 INFO  (TEST-DeleteInactiveReplicaTest.deleteInactiveReplicaTest-seed#[7D6D358D1920C6E2]) [    ] o.e.j.s.ServerConnector Started ServerConnector@12b6cd8a{SSL-http/1.1}{127.0.0.1:61823}
   [junit4]   2> 2209048 INFO  (TEST-DeleteInactiveReplicaTest.deleteInactiveReplicaTest-seed#[7D6D358D1920C6E2]) [    ] o.e.j.s.Server Started @2212689ms
   [junit4]   2> 2209048 INFO  (TEST-DeleteInactiveReplicaTest.deleteInactiveReplicaTest-seed#[7D6D358D1920C6E2]) [    ] o.a.s.c.s.e.JettySolrRunner Jetty properties: {hostContext=/qc/d, solr.data.dir=/Users/jenkins/workspace/Lucene-Solr-5.x-MacOSX/solr/build/solr-core/test/J1/temp/solr.cloud.DeleteInactiveReplicaTest_7D6D358D1920C6E2-001/tempDir-001/jetty1, coreRootDirectory=/Users/jenkins/workspace/Lucene-Solr-5.x-MacOSX/solr/build/solr-core/test/J1/../../../../../../../../../Users/jenkins/workspace/Lucene-Solr-5.x-MacOSX/solr/build/solr-core/test/J1/temp/solr.cloud.DeleteInactiveReplicaTest_7D6D358D1920C6E2-001/shard-1-001/cores, hostPort=61823, solrconfig=solrconfig.xml}
   [junit4]   2> 2209048 INFO  (TEST-DeleteInactiveReplicaTest.deleteInactiveReplicaTest-seed#[7D6D358D1920C6E2]) [    ] o.a.s.s.SolrDispatchFilter SolrDispatchFilter.init(): sun.misc.Launcher$AppClassLoader@3827de24
   [junit4]   2> 2209048 INFO  (TEST-DeleteInactiveReplicaTest.deleteInactiveReplicaTest-seed#[7D6D358D1920C6E2]) [    ] o.a.s.c.SolrResourceLoader new SolrResourceLoader for directory: '/Users/jenkins/workspace/Lucene-Solr-5.x-MacOSX/solr/build/solr-core/test/J1/temp/solr.cloud.DeleteInactiveReplicaTest_7D6D358D1920C6E2-001/shard-1-001'
   [junit4]   2> 2209049 INFO  (TEST-DeleteInactiveReplicaTest.deleteInactiveReplicaTest-seed#[7D6D358D1920C6E2]) [    ] o.a.s.c.SolrResourceLoader JNDI not configured for solr (NoInitialContextEx)
   [junit4]   2> 2209049 INFO  (TEST-DeleteInactiveReplicaTest.deleteInactiveReplicaTest-seed#[7D6D358D1920C6E2]) [    ] o.a.s.c.SolrResourceLoader solr home defaulted to 'solr/' (could not find system property or JNDI)
   [junit4]   2> 2209049 INFO  (TEST-DeleteInactiveReplicaTest.deleteInactiveReplicaTest-seed#[7D6D358D1920C6E2]) [    ] o.a.s.c.c.SolrZkClient Using default ZkCredentialsProvider
   [junit4]   2> 2209050 INFO  (TEST-DeleteInactiveReplicaTest.deleteInactiveReplicaTest-seed#[7D6D358D1920C6E2]) [    ] o.a.s.c.c.ConnectionManager Waiting for client to connect to ZooKeeper
   [junit4]   2> 2209052 INFO  (zkCallback-1541-thread-1) [    ] o.a.s.c.c.ConnectionManager Watcher org.apache.solr.common.cloud.ConnectionManager@53ee1f46 name:ZooKeeperConnection Watcher:127.0.0.1:61808/solr got event WatchedEvent state:SyncConnected type:None path:null path:null type:None
   [junit4]   2> 2209052 INFO  (TEST-DeleteInactiveReplicaTest.deleteInactiveReplicaTest-seed#[7D6D358D1920C6E2]) [    ] o.a.s.c.c.ConnectionManager Client is connected to ZooKeeper
   [junit4]   2> 2209053 INFO  (TEST-DeleteInactiveReplicaTest.deleteInactiveReplicaTest-seed#[7D6D358D1920C6E2]) [    ] o.a.s.c.c.SolrZkClient Using default ZkACLProvider
   [junit4]   2> 2209055 INFO  (TEST-DeleteInactiveReplicaTest.deleteInactiveReplicaTest-seed#[7D6D358D1920C6E2]) [    ] o.a.s.s.SolrDispatchFilter Loading solr.xml from SolrHome (not found in ZooKeeper)
   [junit4]   2> 2209055 INFO  (TEST-DeleteInactiveReplicaTest.deleteInactiveReplicaTest-seed#[7D6D358D1920C6E2]) [    ] o.a.s.c.SolrXmlConfig Loading container configuration from /Users/jenkins/workspace/Lucene-Solr-5.x-MacOSX/solr/build/solr-core/test/J1/temp/solr.cloud.DeleteInactiveReplicaTest_7D6D358D1920C6E2-001/shard-1-001/solr.xml
   [junit4]   2> 2209086 INFO  (TEST-DeleteInactiveReplicaTest.deleteInactiveReplicaTest-seed#[7D6D358D1920C6E2]) [    ] o.a.s.c.CorePropertiesLocator Config-defined core root directory: /Users/jenkins/workspace/Lucene-Solr-5.x-MacOSX/solr/build/solr-core/test/J1/../../../../../../../../../Users/jenkins/workspace/Lucene-Solr-5.x-MacOSX/solr/build/solr-core/test/J1/temp/solr.cloud.DeleteInactiveReplicaTest_7D6D358D1920C6E2-001/shard-1-001/cores
   [junit4]   2> 2209086 INFO  (TEST-DeleteInactiveReplicaTest.deleteInactiveReplicaTest-seed#[7D6D358D1920C6E2]) [    ] o.a.s.c.CoreContainer New CoreContainer 182782108
   [junit4]   2> 2209086 INFO  (TEST-DeleteInactiveReplicaTest.deleteInactiveReplicaTest-seed#[7D6D358D1920C6E2]) [    ] o.a.s.c.CoreContainer Loading cores into CoreContainer [instanceDir=/Users/jenkins/workspace/Lucene-Solr-5.x-MacOSX/solr/build/solr-core/test/J1/temp/solr.cloud.DeleteInactiveReplicaTest_7D6D358D1920C6E2-001/shard-1-001]
   [junit4]   2> 2209086 WARN  (TEST-DeleteInactiveReplicaTest.deleteInactiveReplicaTest-seed#[7D6D358D1920C6E2]) [    ] o.a.s.c.CoreContainer Couldn't add files from /Users/jenkins/workspace/Lucene-Solr-5.x-MacOSX/solr/build/solr-core/test/J1/temp/solr.cloud.DeleteInactiveReplicaTest_7D6D358D1920C6E2-001/shard-1-001/lib to classpath: /Users/jenkins/workspace/Lucene-Solr-5.x-MacOSX/solr/build/solr-core/test/J1/temp/solr.cloud.DeleteInactiveReplicaTest_7D6D358D1920C6E2-001/shard-1-001/lib
   [junit4]   2> 2209086 INFO  (TEST-DeleteInactiveReplicaTest.deleteInactiveReplicaTest-seed#[7D6D358D1920C6E2]) [    ] o.a.s.h.c.HttpShardHandlerFactory created with socketTimeout : 90000,urlScheme : ,connTimeout : 15000,maxConnectionsPerHost : 20,maxConnections : 10000,corePoolSize : 0,maximumPoolSize : 2147483647,maxThreadIdleTime : 5,sizeOfQueue : -1,fairnessPolicy : false,useRetries : false,
   [junit4]   2> 2209092 INFO  (TEST-DeleteInactiveReplicaTest.deleteInactiveReplicaTest-seed#[7D6D358D1920C6E2]) [    ] o.a.s.u.UpdateShardHandler Creating UpdateShardHandler HTTP client with params: socketTimeout=340000&connTimeout=45000&retry=true
   [junit4]   2> 2209094 INFO  (TEST-DeleteInactiveReplicaTest.deleteInactiveReplicaTest-seed#[7D6D358D1920C6E2]) [    ] o.a.s.l.LogWatcher SLF4J impl is org.slf4j.impl.Log4jLoggerFactory
   [junit4]   2> 2209094 INFO  (TEST-DeleteInactiveReplicaTest.deleteInactiveReplicaTest-seed#[7D6D358D1920C6E2]) [    ] o.a.s.l.LogWatcher Registering Log Listener [Log4j (org.slf4j.impl.Log4jLoggerFactory)]
   [junit4]   2> 2209094 INFO  (TEST-DeleteInactiveReplicaTest.deleteInactiveReplicaTest-seed#[7D6D358D1920C6E2]) [    ] o.a.s.c.ZkContainer Zookeeper client=127.0.0.1:61808/solr
   [junit4]   2> 2209094 INFO  (TEST-DeleteInactiveReplicaTest.deleteInactiveReplicaTest-seed#[7D6D358D1920C6E2]) [    ] o.a.s.c.ZkController zkHost includes chroot
   [junit4]   2> 2209094 INFO  (TEST-DeleteInactiveReplicaTest.deleteInactiveReplicaTest-seed#[7D6D358D1920C6E2]) [    ] o.a.s.c.c.SolrZkClient Using default ZkCredentialsProvider
   [junit4]   2> 2209096 INFO  (TEST-DeleteInactiveReplicaTest.deleteInactiveReplicaTest-seed#[7D6D358D1920C6E2]) [    ] o.a.s.c.c.ConnectionManager Waiting for client to connect to ZooKeeper
   [junit4]   2> 2209099 INFO  (zkCallback-1543-thread-1) [    ] o.a.s.c.c.ConnectionManager Watcher org.apache.solr.common.cloud.ConnectionManager@9ddbc0d name:ZooKeeperConnection Watcher:127.0.0.1:61808 got event WatchedEvent state:SyncConnected type:None path:null path:null type:None
   [junit4]   2> 2209099 INFO  (TEST-DeleteInactiveReplicaTest.deleteInactiveReplicaTest-seed#[7D6D358D1920C6E2]) [    ] o.a.s.c.c.ConnectionManager Client is connected to ZooKeeper
   [junit4]   2> 2209100 INFO  (TEST-DeleteInactiveReplicaTest.deleteInactiveReplicaTest-seed#[7D6D358D1920C6E2]) [    ] o.a.s.c.c.SolrZkClient Using default ZkACLProvider
   [junit4]   2> 2209104 INFO  (TEST-DeleteInactiveReplicaTest.deleteInactiveReplicaTest-seed#[7D6D358D1920C6E2]) [n:127.0.0.1:61823_qc%2Fd    ] o.a.s.c.c.ConnectionManager Waiting for client to connect to ZooKeeper
   [junit4]   2> 2209106 INFO  (zkCallback-1544-thread-1-processing-n:127.0.0.1:61823_qc%2Fd) [n:127.0.0.1:61823_qc%2Fd    ] o.a.s.c.c.ConnectionManager Watcher org.apache.solr.common.cloud.ConnectionManager@37678d5f name:ZooKeeperConnection Watcher:127.0.0.1:61808/solr got event WatchedEvent state:SyncConnected type:None path:null path:null type:None
   [junit4]   2> 2209107 INFO  (TEST-DeleteInactiveReplicaTest.deleteInactiveReplicaTest-seed#[7D6D358D1920C6E2]) [n:127.0.0.1:61823_qc%2Fd    ] o.a.s.c.c.ConnectionManager Client is connected to ZooKeeper
   [junit4]   2> 2209126 INFO  (TEST-DeleteInactiveReplicaTest.deleteInactiveReplicaTest-seed#[7D6D358D1920C6E2]) [n:127.0.0.1:61823_qc%2Fd    ] o.a.s.c.c.ZkStateReader Updating cluster state from ZooKeeper... 
   [junit4]   2> 2210141 INFO  (TEST-DeleteInactiveReplicaTest.deleteInactiveReplicaTest-seed#[7D6D358D1920C6E2]) [n:127.0.0.1:61823_qc%2Fd    ] o.a.s.c.ZkController Register node as live in ZooKeeper:/live_nodes/127.0.0.1:61823_qc%2Fd
   [junit4]   2> 2210142 INFO  (TEST-DeleteInactiveReplicaTest.deleteInactiveReplicaTest-seed#[7D6D358D1920C6E2]) [n:127.0.0.1:61823_qc%2Fd    ] o.a.s.c.c.SolrZkClient makePath: /live_nodes/127.0.0.1:61823_qc%2Fd
   [junit4]   2> 2210144 INFO  (zkCallback-1544-thread-1-processing-n:127.0.0.1:61823_qc%2Fd) [n:127.0.0.1:61823_qc%2Fd    ] o.a.s.c.c.ZkStateReader A live node change: [WatchedEvent state:SyncConnected type:NodeChildrenChanged path:/live_nodes], has occurred - updating... (live nodes size: [1])
   [junit4]   2> 2210144 INFO  (zkCallback-1537-thread-1-processing-n:127.0.0.1:61812_qc%2Fd) [n:127.0.0.1:61812_qc%2Fd    ] o.a.s.c.c.ZkStateReader A live node change: [WatchedEvent state:SyncConnected type:NodeChildrenChanged path:/live_nodes], has occurred - updating... (live nodes size: [1])
   [junit4]   2> 2210144 INFO  (zkCallback-1539-thread-1) [    ] o.a.s.c.c.ZkStateReader A live node change: [WatchedEvent state:SyncConnected type:NodeChildrenChanged path:/live_nodes], has occurred - updating... (live nodes size: [1])
   [junit4]   2> 2210147 INFO  (TEST-DeleteInactiveReplicaTest.deleteInactiveReplicaTest-seed#[7D6D358D1920C6E2]) [n:127.0.0.1:61823_qc%2Fd    ] o.a.s.c.Overseer Overseer (id=null) closing
   [junit4]   2> 2210148 INFO  (TEST-DeleteInactiveReplicaTest.deleteInactiveReplicaTest-seed#[7D6D358D1920C6E2]) [n:127.0.0.1:61823_qc%2Fd    ] o.a.s.c.LeaderElector Joined leadership election with path: /overseer_elect/election/95098976750075914-127.0.0.1:61823_qc%2Fd-n_0000000001
   [junit4]   2> 2210149 INFO  (TEST-DeleteInactiveReplicaTest.deleteInactiveReplicaTest-seed#[7D6D358D1920C6E2]) [n:127.0.0.1:61823_qc%2Fd    ] o.a.s.c.LeaderElector Watching path /overseer_elect/election/95098976750075909-127.0.0.1:61812_qc%2Fd-n_0000000000 to know if I could be the leader
   [junit4]   2> 2210163 INFO  (TEST-DeleteInactiveReplicaTest.deleteInactiveReplicaTest-seed#[7D6D358D1920C6E2]) [n:127.0.0.1:61823_qc%2Fd    ] o.a.s.c.CoreContainer Security conf doesn't exist. Skipping setup for authorization module.
   [junit4]   2> 2210163 INFO  (TEST-DeleteInactiveReplicaTest.deleteInactiveReplicaTest-seed#[7D6D358D1920C6E2]) [n:127.0.0.1:61823_qc%2Fd    ] o.a.s.c.CoreContainer No authentication plugin used.
   [junit4]   2> 2210165 INFO  (TEST-DeleteInactiveReplicaTest.deleteInactiveReplicaTest-seed#[7D6D358D1920C6E2]) [n:127.0.0.1:61823_qc%2Fd    ] o.a.s.c.CorePropertiesLocator Looking for core definitions underneath /Users/jenkins/workspace/Lucene-Solr-5.x-MacOSX/solr/build/solr-core/test/J1/../../../../../../../../../Users/jenkins/workspace/Lucene-Solr-5.x-MacOSX/solr/build/solr-core/test/J1/temp/solr.cloud.DeleteInactiveReplicaTest_7D6D358D1920C6E2-001/shard-1-001/cores
   [junit4]   2> 2210166 INFO  (TEST-DeleteInactiveReplicaTest.deleteInactiveReplicaTest-seed#[7D6D358D1920C6E2]) [n:127.0.0.1:61823_qc%2Fd    ] o.a.s.c.CoreDescriptor Created CoreDescriptor: {shard=, collection=collection1, loadOnStartup=true, transient=false, name=collection1, config=solrconfig.xml, schema=schema.xml, configSetProperties=configsetprops.json, coreNodeName=, dataDir=data/}
   [junit4]   2> 2210166 INFO  (TEST-DeleteInactiveReplicaTest.deleteInactiveReplicaTest-seed#[7D6D358D1920C6E2]) [n:127.0.0.1:61823_qc%2Fd    ] o.a.s.c.CorePropertiesLocator Found core collection1 in /Users/jenkins/workspace/Lucene-Solr-5.x-MacOSX/solr/build/solr-core/test/J1/../../../../../../../../../Users/jenkins/workspace/Lucene-Solr-5.x-MacOSX/solr/build/solr-core/test/J1/temp/solr.cloud.DeleteInactiveReplicaTest_7D6D358D1920C6E2-001/shard-1-001/cores/collection1
   [junit4]   2> 2210166 INFO  (TEST-DeleteInactiveReplicaTest.deleteInactiveReplicaTest-seed#[7D6D358D1920C6E2]) [n:127.0.0.1:61823_qc%2Fd    ] o.a.s.c.CorePropertiesLocator Found 1 core definitions
   [junit4]   2> 2210168 INFO  (TEST-DeleteInactiveReplicaTest.deleteInactiveReplicaTest-seed#[7D6D358D1920C6E2]) [n:127.0.0.1:61823_qc%2Fd    ] o.a.s.s.SolrDispatchFilter user.dir=/Users/jenkins/workspace/Lucene-Solr-5.x-MacOSX/solr/build/solr-core/test/J1
   [junit4]   2> 2210168 INFO  (TEST-DeleteInactiveReplicaTest.deleteInactiveReplicaTest-seed#[7D6D358D1920C6E2]) [n:127.0.0.1:61823_qc%2Fd    ] o.a.s.s.SolrDispatchFilter SolrDispatchFilter.init() done
   [junit4]   2> 2210169 INFO  (coreLoadExecutor-6504-thread-1-processing-n:127.0.0.1:61823_qc%2Fd) [n:127.0.0.1:61823_qc%2Fd c:collection1   x:collection1] o.a.s.c.ZkController publishing state=down
   [junit4]   2> 2210170 INFO  (coreLoadExecutor-6504-thread-1-processing-n:127.0.0.1:61823_qc%2Fd) [n:127.0.0.1:61823_qc%2Fd c:collection1   x:collection1] o.a.s.c.ZkController numShards not found on descriptor - reading it from system property
   [junit4]   2> 2210172 INFO  (coreLoadExecutor-6504-thread-1-processing-n:127.0.0.1:61823_qc%2Fd) [n:127.0.0.1:61823_qc%2Fd c:collection1   x:collection1] o.a.s.c.ZkController Registering watch for collection collection1
   [junit4]   2> 2210173 INFO  (coreLoadExecutor-6504-thread-1-processing-n:127.0.0.1:61823_qc%2Fd) [n:127.0.0.1:61823_qc%2Fd c:collection1   x:collection1] o.a.s.c.c.ZkStateReader addZkWatch [collection1]
   [junit4]   2> 2210173 INFO  (coreLoadExecutor-6504-thread-1-processing-n:127.0.0.1:61823_qc%2Fd) [n:127.0.0.1:61823_qc%2Fd c:collection1   x:collection1] o.a.s.c.c.ZkStateReader Add data for [collection1] ver [0]
   [junit4]   2> 2210173 INFO  (coreLoadExecutor-6504-thread-1-processing-n:127.0.0.1:61823_qc%2Fd) [n:127.0.0.1:61823_qc%2Fd c:collection1   x:collection1] o.a.s.c.ZkController look for our core node name
   [junit4]   2> 2210175 INFO  (OverseerStateUpdate-95098976750075909-127.0.0.1:61812_qc%2Fd-n_0000000000) [n:127.0.0.1:61812_qc%2Fd    ] o.a.s.c.Overseer processMessage: queueSize: 1, message = {
   [junit4]   2>   "numShards":"2",
   [junit4]   2>   "collection":"collection1",
   [junit4]   2>   "base_url":"https://127.0.0.1:61823/qc/d",
   [junit4]   2>   "operation":"state",
   [junit4]   2>   "state":"down",
   [junit4]   2>   "shard":null,
   [junit4]   2>   "node_name":"127.0.0.1:61823_qc%2Fd",
   [junit4]   2>   "core":"collection1",
   [junit4]   2>   "roles":null} current state version: 3
   [junit4]   2> 2210178 INFO  (OverseerStateUpdate-95098976750075909-127.0.0.1:61812_qc%2Fd-n_0000000000) [n:127.0.0.1:61812_qc%2Fd    ] o.a.s.c.o.ReplicaMutator Update state numShards=2 message={
   [junit4]   2>   "numShards":"2",
   [junit4]   2>   "collection":"collection1",
   [junit4]   2>   "base_url":"https://127.0.0.1:61823/qc/d",
   [junit4]   2>   "operation":"state",
   [junit4]   2>   "state":"down",
   [junit4]   2>   "shard":null,
   [junit4]   2>   "node_name":"127.0.0.1:61823_qc%2Fd",
   [junit4]   2>   "core":"collection1",
   [junit4]   2>   "roles":null}
   [junit4]   2> 2210178 INFO  (OverseerStateUpdate-95098976750075909-127.0.0.1:61812_qc%2Fd-n_0000000000) [n:127.0.0.1:61812_qc%2Fd    ] o.a.s.c.o.ReplicaMutator Collection already exists with numShards=2
   [junit4]   2> 2210191 INFO  (OverseerStateUpdate-95098976750075909-127.0.0.1:61812_qc%2Fd-n_0000000000) [n:127.0.0.1:61812_qc%2Fd    ] o.a.s.c.o.ReplicaMutator Assigning new node to shard shard=shard1
   [junit4]   2> 2210296 INFO  (OverseerStateUpdate-95098976750075909-127.0.0.1:61812_qc%2Fd-n_0000000000) [n:127.0.0.1:61812_qc%2Fd    ] o.a.s.c.o.ZkStateWriter going to update_collection /collections/collection1/state.json version: 0
   [junit4]   2> 2210300 INFO  (zkCallback-1544-thread-1-processing-n:127.0.0.1:61823_qc%2Fd) [n:127.0.0.1:61823_qc%2Fd    ] o.a.s.c.c.ZkStateReader A cluster state change: [WatchedEvent state:SyncConnected type:NodeDataChanged path:/collections/collection1/state.json] for collection [collection1] has occurred - updating... (live nodes size: [2])
   [junit4]   2> 2210300 INFO  (zkCallback-1544-thread-1-processing-n:127.0.0.1:61823_qc%2Fd) [n:127.0.0.1:61823_qc%2Fd    ] o.a.s.c.c.ZkStateReader Updating data for [collection1] from [0] to [1]
   [junit4]   2> 2211175 INFO  (coreLoadExecutor-6504-thread-1-processing-n:127.0.0.1:61823_qc%2Fd) [n:127.0.0.1:61823_qc%2Fd c:collection1   x:collection1] o.a.s.c.ZkController waiting to find shard id in clusterstate for collection1
   [junit4]   2> 2211175 INFO  (coreLoadExecutor-6504-thread-1-processing-n:127.0.0.1:61823_qc%2Fd) [n:127.0.0.1:61823_qc%2Fd c:collection1   x:collection1] o.a.s.c.ZkController Check for collection zkNode:collection1
   [junit4]   2> 2211176 INFO  (coreLoadExecutor-6504-thread-1-processing-n:127.0.0.1:61823_qc%

[...truncated too long message...]

llection1 s:shard2 r:core_node4 x:collection1] o.a.s.c.ZkTestServer connecting to 127.0.0.1:61808 61808
   [junit4]   2> 2255484 INFO  (Thread-5378) [    ] o.a.s.c.ZkTestServer connecting to 127.0.0.1:61808 61808
   [junit4]   2> 2256749 WARN  (Thread-5378) [    ] o.a.s.c.ZkTestServer Watch limit violations: 
   [junit4]   2> Maximum concurrent create/delete watches above limit:
   [junit4]   2> 
   [junit4]   2> 	10	/solr/aliases.json
   [junit4]   2> 	5	/solr/security.json
   [junit4]   2> 	5	/solr/configs/conf1
   [junit4]   2> 
   [junit4]   2> Maximum concurrent data watches above limit:
   [junit4]   2> 
   [junit4]   2> 	11	/solr/clusterstate.json
   [junit4]   2> 	4	/solr/collections/collection1/state.json
   [junit4]   2> 	4	/solr/collections/delDeadColl/state.json
   [junit4]   2> 
   [junit4]   2> Maximum concurrent children watches above limit:
   [junit4]   2> 
   [junit4]   2> 	11	/solr/collections
   [junit4]   2> 	11	/solr/live_nodes
   [junit4]   2> 	4	/solr/overseer/collection-queue-work
   [junit4]   2> 	2	/solr/overseer/queue-work
   [junit4]   2> 	2	/solr/overseer/queue
   [junit4]   2> 
   [junit4]   2> NOTE: reproduce with: ant test  -Dtestcase=DeleteInactiveReplicaTest -Dtests.method=deleteInactiveReplicaTest -Dtests.seed=7D6D358D1920C6E2 -Dtests.slow=true -Dtests.locale=de_LU -Dtests.timezone=America/Resolute -Dtests.asserts=true -Dtests.file.encoding=US-ASCII
   [junit4] ERROR   50.2s J1 | DeleteInactiveReplicaTest.deleteInactiveReplicaTest <<<
   [junit4]    > Throwable #1: org.apache.zookeeper.KeeperException$SessionExpiredException: KeeperErrorCode = Session expired for /clusterstate.json
   [junit4]    > 	at __randomizedtesting.SeedInfo.seed([7D6D358D1920C6E2:B053AE7E5681B000]:0)
   [junit4]    > 	at org.apache.zookeeper.KeeperException.create(KeeperException.java:127)
   [junit4]    > 	at org.apache.zookeeper.KeeperException.create(KeeperException.java:51)
   [junit4]    > 	at org.apache.zookeeper.ZooKeeper.getData(ZooKeeper.java:1155)
   [junit4]    > 	at org.apache.solr.common.cloud.SolrZkClient$7.execute(SolrZkClient.java:345)
   [junit4]    > 	at org.apache.solr.common.cloud.SolrZkClient$7.execute(SolrZkClient.java:342)
   [junit4]    > 	at org.apache.solr.common.cloud.ZkCmdExecutor.retryOperation(ZkCmdExecutor.java:61)
   [junit4]    > 	at org.apache.solr.common.cloud.SolrZkClient.getData(SolrZkClient.java:342)
   [junit4]    > 	at org.apache.solr.common.cloud.ZkStateReader.refreshLegacyClusterState(ZkStateReader.java:444)
   [junit4]    > 	at org.apache.solr.common.cloud.ZkStateReader.updateClusterState(ZkStateReader.java:240)
   [junit4]    > 	at org.apache.solr.cloud.AbstractDistribZkTestBase.waitForRecoveriesToFinish(AbstractDistribZkTestBase.java:149)
   [junit4]    > 	at org.apache.solr.cloud.AbstractDistribZkTestBase.waitForRecoveriesToFinish(AbstractDistribZkTestBase.java:136)
   [junit4]    > 	at org.apache.solr.cloud.AbstractDistribZkTestBase.waitForRecoveriesToFinish(AbstractDistribZkTestBase.java:131)
   [junit4]    > 	at org.apache.solr.cloud.AbstractFullDistribZkTestBase.waitForRecoveriesToFinish(AbstractFullDistribZkTestBase.java:831)
   [junit4]    > 	at org.apache.solr.cloud.DeleteInactiveReplicaTest.deleteInactiveReplicaTest(DeleteInactiveReplicaTest.java:67)
   [junit4]    > 	at org.apache.solr.BaseDistributedSearchTestCase$ShardsRepeatRule$ShardsFixedStatement.callStatement(BaseDistributedSearchTestCase.java:965)
   [junit4]    > 	at org.apache.solr.BaseDistributedSearchTestCase$ShardsRepeatRule$ShardsStatement.evaluate(BaseDistributedSearchTestCase.java:940)
   [junit4]    > 	at java.lang.Thread.run(Thread.java:745)
   [junit4]   2> 2256752 INFO  (SUITE-DeleteInactiveReplicaTest-seed#[7D6D358D1920C6E2]-worker) [n:127.0.0.1:61871_qc%2Fd c:collection1 s:shard2 r:core_node4 x:collection1] o.a.s.SolrTestCaseJ4 ###deleteCore
   [junit4]   2> NOTE: leaving temporary files on disk at: /Users/jenkins/workspace/Lucene-Solr-5.x-MacOSX/solr/build/solr-core/test/J1/temp/solr.cloud.DeleteInactiveReplicaTest_7D6D358D1920C6E2-001
   [junit4]   2> NOTE: test params are: codec=CheapBastard, sim=DefaultSimilarity, locale=de_LU, timezone=America/Resolute
   [junit4]   2> NOTE: Mac OS X 10.8.5 x86_64/Oracle Corporation 1.7.0_80 (64-bit)/cpus=3,threads=1,free=166370648,total=502267904
   [junit4]   2> NOTE: All tests run in this JVM: [DocValuesMissingTest, TestClassNameShortening, TermVectorComponentTest, DistributedExpandComponentTest, TestAddFieldRealTimeGet, RollingRestartTest, TestSystemIdResolver, TestReloadDeadlock, TestFastWriter, DistribCursorPagingTest, TestPHPSerializedResponseWriter, TestNonDefinedSimilarityFactory, TestBinaryResponseWriter, TestReversedWildcardFilterFactory, ShardRoutingCustomTest, OverseerStatusTest, TestCoreDiscovery, TestLeaderElectionZkExpiry, FieldMutatingUpdateProcessorTest, RAMDirectoryFactoryTest, TestSimpleQParserPlugin, HdfsRecoveryZkTest, TestOrdValues, TestDynamicFieldResource, BasicFunctionalityTest, ReplicationFactorTest, TestCrossCoreJoin, TestJoin, SynonymTokenizerTest, TestSchemaResource, VersionInfoTest, VMParamsZkACLAndCredentialsProvidersTest, TestSolrConfigHandler, TestBlobHandler, TestSuggestSpellingConverter, HdfsWriteToMultipleCollectionsTest, TestDistribIDF, CollectionReloadTest, SuggesterTSTTest, TestChildDocTransformer, TestNoOpRegenerator, SpellCheckCollatorTest, TestSolrJ, TestSolr4Spatial, SuggestComponentTest, AtomicUpdatesTest, OutOfBoxZkACLAndCredentialsProvidersTest, TestIndexingPerformance, TermVectorComponentDistributedTest, TestFieldTypeResource, TestImplicitCoreProperties, TestExpandComponent, SpellingQueryConverterTest, PluginInfoTest, TestIntervalFaceting, TestSolrIndexConfig, QueryParsingTest, TestRandomRequestDistribution, TestUniqueKeyFieldResource, TestSolrConfigHandlerConcurrent, TestQuerySenderListener, FieldAnalysisRequestHandlerTest, ResponseLogComponentTest, CleanupOldIndexTest, LeaderInitiatedRecoveryOnCommitTest, AssignTest, TestSimpleTrackingShardHandler, TestUtils, TestCloudSchemaless, HdfsBasicDistributedZkTest, UpdateRequestProcessorFactoryTest, TestManagedSynonymFilterFactory, DistributedFacetPivotSmallTest, HLLUtilTest, TestSolr4Spatial2, TestRTGBase, CSVRequestHandlerTest, BinaryUpdateRequestHandlerTest, CursorMarkTest, RecoveryAfterSoftCommitTest, HdfsNNFailoverTest, TestBM25SimilarityFactory, FullSolrCloudDistribCmdsTest, ConnectionManagerTest, DateMathParserTest, ParsingFieldUpdateProcessorsTest, UniqFieldsUpdateProcessorFactoryTest, IndexSchemaRuntimeFieldTest, TestJsonRequest, ExitableDirectoryReaderTest, TestQueryUtils, StatsComponentTest, AutoCommitTest, TestHighFrequencyDictionaryFactory, TestExactStatsCache, TestConfigSetsAPIExclusivity, TestRandomMergePolicy, SpellPossibilityIteratorTest, SuggesterWFSTTest, ResourceLoaderTest, TestBinaryField, RulesTest, TestAtomicUpdateErrorCases, AnalyticsMergeStrategyTest, TestRequestStatusCollectionAPI, DebugComponentTest, TestFuzzyAnalyzedSuggestions, SignatureUpdateProcessorFactoryTest, TestReplicationHandlerBackup, TestWriterPerf, ZkNodePropsTest, TestManagedSchemaFieldResource, BadIndexSchemaTest, SuggesterTest, TestReloadAndDeleteDocs, TestConfigSetImmutable, MultiTermTest, TestRestoreCore, TestNamedUpdateProcessors, TestFileDictionaryLookup, FileUtilsTest, TestSolrCoreProperties, TestReload, BasicAuthIntegrationTest, TestRealTimeGet, TestDefaultSearchFieldResource, ZkStateWriterTest, BasicDistributedZk2Test, TestDistributedMissingSort, ConvertedLegacyTest, ZkSolrClientTest, SimpleCollectionCreateDeleteTest, TestIndexSearcher, OpenCloseCoreStressTest, BasicDistributedZkTest, ChaosMonkeySafeLeaderTest, CollectionsAPIDistributedZkTest, SyncSliceTest, BasicZkTest, RecoveryZkTest, TestReplicationHandler, TestDistributedGrouping, TestFaceting, TestRecovery, TestHashPartitioner, TestStressReorder, TestStressVersions, HardAutoCommitTest, DistributedTermsComponentTest, TestRangeQuery, SimpleFacetsTest, SolrCoreTest, SpellCheckComponentTest, QueryElevationComponentTest, TestSort, TestFiltering, SoftAutoCommitTest, CoreAdminHandlerTest, SpatialFilterTest, NoCacheHeaderTest, SolrCoreCheckLockOnStartupTest, DirectUpdateHandlerOptimizeTest, SortByFunctionTest, SolrInfoMBeanTest, CacheHeaderTest, LukeRequestHandlerTest, TestQueryTypes, TestOmitPositions, TermsComponentTest, DocumentBuilderTest, RequiredFieldsTest, TestSolrQueryParser, LoggingHandlerTest, IndexSchemaTest, JSONWriterTest, MBeansHandlerTest, SearchHandlerTest, HighlighterConfigTest, TestQuerySenderNoQuery, CopyFieldTest, TestStressRecovery, SolrTestCaseJ4Test, TestTolerantSearch, AsyncCallRequestStatusResponseTest, CollectionTooManyReplicasTest, DeleteInactiveReplicaTest]
   [junit4] Completed [413/558 (1!)] on J1 in 50.20s, 1 test, 1 error <<< FAILURES!

[...truncated 476 lines...]
BUILD FAILED
/Users/jenkins/workspace/Lucene-Solr-5.x-MacOSX/build.xml:794: The following error occurred while executing this line:
/Users/jenkins/workspace/Lucene-Solr-5.x-MacOSX/build.xml:738: The following error occurred while executing this line:
/Users/jenkins/workspace/Lucene-Solr-5.x-MacOSX/build.xml:59: The following error occurred while executing this line:
/Users/jenkins/workspace/Lucene-Solr-5.x-MacOSX/solr/build.xml:233: The following error occurred while executing this line:
/Users/jenkins/workspace/Lucene-Solr-5.x-MacOSX/solr/common-build.xml:526: The following error occurred while executing this line:
/Users/jenkins/workspace/Lucene-Solr-5.x-MacOSX/lucene/common-build.xml:1456: The following error occurred while executing this line:
/Users/jenkins/workspace/Lucene-Solr-5.x-MacOSX/lucene/common-build.xml:1010: There were test failures: 558 suites (7 ignored), 2219 tests, 1 error, 87 ignored (37 assumptions) [seed: 7D6D358D1920C6E2]

Total time: 80 minutes 52 seconds
Build step 'Invoke Ant' marked build as failure
Archiving artifacts
[WARNINGS] Skipping publisher since build result is FAILURE
Recording test results
Email was triggered for: Failure - Any
Sending email for trigger: Failure - Any



Mime
View raw message