lucene-dev mailing list archives

Site index · List index
Message view « Date » · « Thread »
Top « Date » · « Thread »
From Apache Jenkins Server <jenk...@builds.apache.org>
Subject [JENKINS] Lucene-Solr-Tests-trunk-Java8 - Build # 708 - Still Failing
Date Fri, 18 Dec 2015 14:31:42 GMT
Build: https://builds.apache.org/job/Lucene-Solr-Tests-trunk-Java8/708/

1 tests failed.
FAILED:  org.apache.solr.handler.PingRequestHandlerTest.testPingInClusterWithNoHealthCheck

Error Message:
Could not find a healthy node to handle the request.

Stack Trace:
org.apache.solr.common.SolrException: Could not find a healthy node to handle the request.
	at __randomizedtesting.SeedInfo.seed([A3C1F353237F8CCB:4D124D83A693B62F]:0)
	at org.apache.solr.client.solrj.impl.CloudSolrClient.sendRequest(CloudSolrClient.java:1085)
	at org.apache.solr.client.solrj.impl.CloudSolrClient.requestWithRetryOnStaleState(CloudSolrClient.java:871)
	at org.apache.solr.client.solrj.impl.CloudSolrClient.requestWithRetryOnStaleState(CloudSolrClient.java:954)
	at org.apache.solr.client.solrj.impl.CloudSolrClient.requestWithRetryOnStaleState(CloudSolrClient.java:954)
	at org.apache.solr.client.solrj.impl.CloudSolrClient.requestWithRetryOnStaleState(CloudSolrClient.java:954)
	at org.apache.solr.client.solrj.impl.CloudSolrClient.requestWithRetryOnStaleState(CloudSolrClient.java:954)
	at org.apache.solr.client.solrj.impl.CloudSolrClient.requestWithRetryOnStaleState(CloudSolrClient.java:954)
	at org.apache.solr.client.solrj.impl.CloudSolrClient.request(CloudSolrClient.java:807)
	at org.apache.solr.client.solrj.SolrRequest.process(SolrRequest.java:150)
	at org.apache.solr.handler.PingRequestHandlerTest.testPingInClusterWithNoHealthCheck(PingRequestHandlerTest.java:200)
	at sun.reflect.NativeMethodAccessorImpl.invoke0(Native Method)
	at sun.reflect.NativeMethodAccessorImpl.invoke(NativeMethodAccessorImpl.java:62)
	at sun.reflect.DelegatingMethodAccessorImpl.invoke(DelegatingMethodAccessorImpl.java:43)
	at java.lang.reflect.Method.invoke(Method.java:497)
	at com.carrotsearch.randomizedtesting.RandomizedRunner.invoke(RandomizedRunner.java:1764)
	at com.carrotsearch.randomizedtesting.RandomizedRunner$8.evaluate(RandomizedRunner.java:871)
	at com.carrotsearch.randomizedtesting.RandomizedRunner$9.evaluate(RandomizedRunner.java:907)
	at com.carrotsearch.randomizedtesting.RandomizedRunner$10.evaluate(RandomizedRunner.java:921)
	at com.carrotsearch.randomizedtesting.rules.SystemPropertiesRestoreRule$1.evaluate(SystemPropertiesRestoreRule.java:57)
	at org.apache.lucene.util.TestRuleSetupTeardownChained$1.evaluate(TestRuleSetupTeardownChained.java:50)
	at org.apache.lucene.util.AbstractBeforeAfterRule$1.evaluate(AbstractBeforeAfterRule.java:46)
	at org.apache.lucene.util.TestRuleThreadAndTestName$1.evaluate(TestRuleThreadAndTestName.java:49)
	at org.apache.lucene.util.TestRuleIgnoreAfterMaxFailures$1.evaluate(TestRuleIgnoreAfterMaxFailures.java:65)
	at org.apache.lucene.util.TestRuleMarkFailure$1.evaluate(TestRuleMarkFailure.java:48)
	at com.carrotsearch.randomizedtesting.rules.StatementAdapter.evaluate(StatementAdapter.java:36)
	at com.carrotsearch.randomizedtesting.ThreadLeakControl$StatementRunner.run(ThreadLeakControl.java:367)
	at com.carrotsearch.randomizedtesting.ThreadLeakControl.forkTimeoutingTask(ThreadLeakControl.java:809)
	at com.carrotsearch.randomizedtesting.ThreadLeakControl$3.evaluate(ThreadLeakControl.java:460)
	at com.carrotsearch.randomizedtesting.RandomizedRunner.runSingleTest(RandomizedRunner.java:880)
	at com.carrotsearch.randomizedtesting.RandomizedRunner$5.evaluate(RandomizedRunner.java:781)
	at com.carrotsearch.randomizedtesting.RandomizedRunner$6.evaluate(RandomizedRunner.java:816)
	at com.carrotsearch.randomizedtesting.RandomizedRunner$7.evaluate(RandomizedRunner.java:827)
	at com.carrotsearch.randomizedtesting.rules.StatementAdapter.evaluate(StatementAdapter.java:36)
	at com.carrotsearch.randomizedtesting.rules.SystemPropertiesRestoreRule$1.evaluate(SystemPropertiesRestoreRule.java:57)
	at org.apache.lucene.util.AbstractBeforeAfterRule$1.evaluate(AbstractBeforeAfterRule.java:46)
	at com.carrotsearch.randomizedtesting.rules.StatementAdapter.evaluate(StatementAdapter.java:36)
	at org.apache.lucene.util.TestRuleStoreClassName$1.evaluate(TestRuleStoreClassName.java:42)
	at com.carrotsearch.randomizedtesting.rules.NoShadowingOrOverridesOnMethodsRule$1.evaluate(NoShadowingOrOverridesOnMethodsRule.java:40)
	at com.carrotsearch.randomizedtesting.rules.NoShadowingOrOverridesOnMethodsRule$1.evaluate(NoShadowingOrOverridesOnMethodsRule.java:40)
	at com.carrotsearch.randomizedtesting.rules.StatementAdapter.evaluate(StatementAdapter.java:36)
	at com.carrotsearch.randomizedtesting.rules.StatementAdapter.evaluate(StatementAdapter.java:36)
	at com.carrotsearch.randomizedtesting.rules.StatementAdapter.evaluate(StatementAdapter.java:36)
	at org.apache.lucene.util.TestRuleAssertionsRequired$1.evaluate(TestRuleAssertionsRequired.java:54)
	at org.apache.lucene.util.TestRuleMarkFailure$1.evaluate(TestRuleMarkFailure.java:48)
	at org.apache.lucene.util.TestRuleIgnoreAfterMaxFailures$1.evaluate(TestRuleIgnoreAfterMaxFailures.java:65)
	at org.apache.lucene.util.TestRuleIgnoreTestSuites$1.evaluate(TestRuleIgnoreTestSuites.java:55)
	at com.carrotsearch.randomizedtesting.rules.StatementAdapter.evaluate(StatementAdapter.java:36)
	at com.carrotsearch.randomizedtesting.ThreadLeakControl$StatementRunner.run(ThreadLeakControl.java:367)
	at java.lang.Thread.run(Thread.java:745)




Build Log:
[...truncated 9274 lines...]
   [junit4] Suite: org.apache.solr.handler.PingRequestHandlerTest
   [junit4]   2> Creating dataDir: /x1/jenkins/jenkins-slave/workspace/Lucene-Solr-Tests-trunk-Java8/solr/build/solr-core/test/J0/temp/solr.handler.PingRequestHandlerTest_A3C1F353237F8CCB-001/init-core-data-001
   [junit4]   2> 87820 INFO  (SUITE-PingRequestHandlerTest-seed#[A3C1F353237F8CCB]-worker) [    ] o.a.s.SolrTestCaseJ4 Randomized ssl (true) and clientAuth (false)
   [junit4]   2> 87820 INFO  (SUITE-PingRequestHandlerTest-seed#[A3C1F353237F8CCB]-worker) [    ] o.a.s.SolrTestCaseJ4 ####initCore
   [junit4]   2> 87820 INFO  (SUITE-PingRequestHandlerTest-seed#[A3C1F353237F8CCB]-worker) [    ] o.a.s.c.SolrResourceLoader new SolrResourceLoader for directory: '/x1/jenkins/jenkins-slave/workspace/Lucene-Solr-Tests-trunk-Java8/solr/core/src/test-files/solr/collection1'
   [junit4]   2> 87821 INFO  (SUITE-PingRequestHandlerTest-seed#[A3C1F353237F8CCB]-worker) [    ] o.a.s.c.SolrResourceLoader JNDI not configured for solr (NoInitialContextEx)
   [junit4]   2> 87821 INFO  (SUITE-PingRequestHandlerTest-seed#[A3C1F353237F8CCB]-worker) [    ] o.a.s.c.SolrResourceLoader using system property solr.solr.home: /x1/jenkins/jenkins-slave/workspace/Lucene-Solr-Tests-trunk-Java8/solr/core/src/test-files/solr
   [junit4]   2> 87821 INFO  (SUITE-PingRequestHandlerTest-seed#[A3C1F353237F8CCB]-worker) [    ] o.a.s.c.SolrResourceLoader Adding 'file:/x1/jenkins/jenkins-slave/workspace/Lucene-Solr-Tests-trunk-Java8/solr/core/src/test-files/solr/collection1/lib/.svn/' to classloader
   [junit4]   2> 87821 INFO  (SUITE-PingRequestHandlerTest-seed#[A3C1F353237F8CCB]-worker) [    ] o.a.s.c.SolrResourceLoader Adding 'file:/x1/jenkins/jenkins-slave/workspace/Lucene-Solr-Tests-trunk-Java8/solr/core/src/test-files/solr/collection1/lib/classes/' to classloader
   [junit4]   2> 87821 INFO  (SUITE-PingRequestHandlerTest-seed#[A3C1F353237F8CCB]-worker) [    ] o.a.s.c.SolrResourceLoader Adding 'file:/x1/jenkins/jenkins-slave/workspace/Lucene-Solr-Tests-trunk-Java8/solr/core/src/test-files/solr/collection1/lib/README' to classloader
   [junit4]   2> 87861 INFO  (SUITE-PingRequestHandlerTest-seed#[A3C1F353237F8CCB]-worker) [    ] o.a.s.c.SolrConfig current version of requestparams : -1
   [junit4]   2> 87871 INFO  (SUITE-PingRequestHandlerTest-seed#[A3C1F353237F8CCB]-worker) [    ] o.a.s.c.SolrConfig Using Lucene MatchVersion: 6.0.0
   [junit4]   2> 87892 INFO  (SUITE-PingRequestHandlerTest-seed#[A3C1F353237F8CCB]-worker) [    ] o.a.s.c.SolrConfig Loaded SolrConfig: solrconfig.xml
   [junit4]   2> 87898 INFO  (SUITE-PingRequestHandlerTest-seed#[A3C1F353237F8CCB]-worker) [    ] o.a.s.s.IndexSchema [null] Schema name=test
   [junit4]   2> 87997 INFO  (SUITE-PingRequestHandlerTest-seed#[A3C1F353237F8CCB]-worker) [    ] o.a.s.s.OpenExchangeRatesOrgProvider Initialized with rates=open-exchange-rates.json, refreshInterval=1440.
   [junit4]   2> 88003 INFO  (SUITE-PingRequestHandlerTest-seed#[A3C1F353237F8CCB]-worker) [    ] o.a.s.s.IndexSchema default search field in schema is text
   [junit4]   2> 88004 INFO  (SUITE-PingRequestHandlerTest-seed#[A3C1F353237F8CCB]-worker) [    ] o.a.s.s.IndexSchema unique key field: id
   [junit4]   2> 88024 INFO  (SUITE-PingRequestHandlerTest-seed#[A3C1F353237F8CCB]-worker) [    ] o.a.s.s.FileExchangeRateProvider Reloading exchange rates from file currency.xml
   [junit4]   2> 88027 INFO  (SUITE-PingRequestHandlerTest-seed#[A3C1F353237F8CCB]-worker) [    ] o.a.s.s.FileExchangeRateProvider Reloading exchange rates from file currency.xml
   [junit4]   2> 88028 INFO  (SUITE-PingRequestHandlerTest-seed#[A3C1F353237F8CCB]-worker) [    ] o.a.s.s.OpenExchangeRatesOrgProvider Reloading exchange rates from open-exchange-rates.json
   [junit4]   2> 88029 WARN  (SUITE-PingRequestHandlerTest-seed#[A3C1F353237F8CCB]-worker) [    ] o.a.s.s.OpenExchangeRatesOrgProvider Unknown key IMPORTANT NOTE
   [junit4]   2> 88029 WARN  (SUITE-PingRequestHandlerTest-seed#[A3C1F353237F8CCB]-worker) [    ] o.a.s.s.OpenExchangeRatesOrgProvider Expected key, got STRING
   [junit4]   2> 88029 INFO  (SUITE-PingRequestHandlerTest-seed#[A3C1F353237F8CCB]-worker) [    ] o.a.s.s.OpenExchangeRatesOrgProvider Reloading exchange rates from open-exchange-rates.json
   [junit4]   2> 88029 WARN  (SUITE-PingRequestHandlerTest-seed#[A3C1F353237F8CCB]-worker) [    ] o.a.s.s.OpenExchangeRatesOrgProvider Unknown key IMPORTANT NOTE
   [junit4]   2> 88029 WARN  (SUITE-PingRequestHandlerTest-seed#[A3C1F353237F8CCB]-worker) [    ] o.a.s.s.OpenExchangeRatesOrgProvider Expected key, got STRING
   [junit4]   2> 88029 INFO  (SUITE-PingRequestHandlerTest-seed#[A3C1F353237F8CCB]-worker) [    ] o.a.s.c.SolrResourceLoader JNDI not configured for solr (NoInitialContextEx)
   [junit4]   2> 88029 INFO  (SUITE-PingRequestHandlerTest-seed#[A3C1F353237F8CCB]-worker) [    ] o.a.s.c.SolrResourceLoader using system property solr.solr.home: /x1/jenkins/jenkins-slave/workspace/Lucene-Solr-Tests-trunk-Java8/solr/core/src/test-files/solr
   [junit4]   2> 88029 INFO  (SUITE-PingRequestHandlerTest-seed#[A3C1F353237F8CCB]-worker) [    ] o.a.s.c.SolrResourceLoader new SolrResourceLoader for directory: '/x1/jenkins/jenkins-slave/workspace/Lucene-Solr-Tests-trunk-Java8/solr/core/src/test-files/solr'
   [junit4]   2> 88029 INFO  (SUITE-PingRequestHandlerTest-seed#[A3C1F353237F8CCB]-worker) [    ] o.a.s.c.SolrResourceLoader JNDI not configured for solr (NoInitialContextEx)
   [junit4]   2> 88029 INFO  (SUITE-PingRequestHandlerTest-seed#[A3C1F353237F8CCB]-worker) [    ] o.a.s.c.SolrResourceLoader using system property solr.solr.home: /x1/jenkins/jenkins-slave/workspace/Lucene-Solr-Tests-trunk-Java8/solr/core/src/test-files/solr
   [junit4]   2> 88030 INFO  (SUITE-PingRequestHandlerTest-seed#[A3C1F353237F8CCB]-worker) [    ] o.a.s.c.CoreContainer New CoreContainer 2125388365
   [junit4]   2> 88030 INFO  (SUITE-PingRequestHandlerTest-seed#[A3C1F353237F8CCB]-worker) [    ] o.a.s.c.CoreContainer Loading cores into CoreContainer [instanceDir=/x1/jenkins/jenkins-slave/workspace/Lucene-Solr-Tests-trunk-Java8/solr/core/src/test-files/solr]
   [junit4]   2> 88030 WARN  (SUITE-PingRequestHandlerTest-seed#[A3C1F353237F8CCB]-worker) [    ] o.a.s.c.CoreContainer Couldn't add files from /x1/jenkins/jenkins-slave/workspace/Lucene-Solr-Tests-trunk-Java8/solr/core/src/test-files/solr/lib to classpath: /x1/jenkins/jenkins-slave/workspace/Lucene-Solr-Tests-trunk-Java8/solr/core/src/test-files/solr/lib
   [junit4]   2> 88030 INFO  (SUITE-PingRequestHandlerTest-seed#[A3C1F353237F8CCB]-worker) [    ] o.a.s.h.c.HttpShardHandlerFactory created with socketTimeout : 600000,connTimeout : 60000,maxConnectionsPerHost : 20,maxConnections : 10000,corePoolSize : 0,maximumPoolSize : 2147483647,maxThreadIdleTime : 5,sizeOfQueue : -1,fairnessPolicy : false,useRetries : false,
   [junit4]   2> 88034 INFO  (SUITE-PingRequestHandlerTest-seed#[A3C1F353237F8CCB]-worker) [    ] o.a.s.u.UpdateShardHandler Creating UpdateShardHandler HTTP client with params: socketTimeout=30000&connTimeout=30000&retry=true
   [junit4]   2> 88036 INFO  (SUITE-PingRequestHandlerTest-seed#[A3C1F353237F8CCB]-worker) [    ] o.a.s.l.LogWatcher SLF4J impl is org.slf4j.impl.Log4jLoggerFactory
   [junit4]   2> 88036 INFO  (SUITE-PingRequestHandlerTest-seed#[A3C1F353237F8CCB]-worker) [    ] o.a.s.l.LogWatcher Registering Log Listener [Log4j (org.slf4j.impl.Log4jLoggerFactory)]
   [junit4]   2> 88037 INFO  (SUITE-PingRequestHandlerTest-seed#[A3C1F353237F8CCB]-worker) [    ] o.a.s.c.CoreContainer Security conf doesn't exist. Skipping setup for authorization module.
   [junit4]   2> 88037 INFO  (SUITE-PingRequestHandlerTest-seed#[A3C1F353237F8CCB]-worker) [    ] o.a.s.c.CoreContainer No authentication plugin used.
   [junit4]   2> 88038 INFO  (SUITE-PingRequestHandlerTest-seed#[A3C1F353237F8CCB]-worker) [    ] o.a.s.c.CoreDescriptor Created CoreDescriptor: {name=collection1, config=solrconfig.xml, transient=false, schema=schema.xml, loadOnStartup=true, configSetProperties=configsetprops.json, collection=collection1, dataDir=/x1/jenkins/jenkins-slave/workspace/Lucene-Solr-Tests-trunk-Java8/solr/build/solr-core/test/J0/temp/solr.handler.PingRequestHandlerTest_A3C1F353237F8CCB-001/init-core-data-001, shard=shard1}
   [junit4]   2> 88042 INFO  (coreLoadExecutor-296-thread-1) [    ] o.a.s.c.SolrResourceLoader new SolrResourceLoader for directory: '/x1/jenkins/jenkins-slave/workspace/Lucene-Solr-Tests-trunk-Java8/solr/core/src/test-files/solr/collection1'
   [junit4]   2> 88043 INFO  (coreLoadExecutor-296-thread-1) [    ] o.a.s.c.SolrResourceLoader JNDI not configured for solr (NoInitialContextEx)
   [junit4]   2> 88043 INFO  (coreLoadExecutor-296-thread-1) [    ] o.a.s.c.SolrResourceLoader using system property solr.solr.home: /x1/jenkins/jenkins-slave/workspace/Lucene-Solr-Tests-trunk-Java8/solr/core/src/test-files/solr
   [junit4]   2> 88043 INFO  (coreLoadExecutor-296-thread-1) [    ] o.a.s.c.SolrResourceLoader Adding 'file:/x1/jenkins/jenkins-slave/workspace/Lucene-Solr-Tests-trunk-Java8/solr/core/src/test-files/solr/collection1/lib/.svn/' to classloader
   [junit4]   2> 88043 INFO  (coreLoadExecutor-296-thread-1) [    ] o.a.s.c.SolrResourceLoader Adding 'file:/x1/jenkins/jenkins-slave/workspace/Lucene-Solr-Tests-trunk-Java8/solr/core/src/test-files/solr/collection1/lib/classes/' to classloader
   [junit4]   2> 88043 INFO  (coreLoadExecutor-296-thread-1) [    ] o.a.s.c.SolrResourceLoader Adding 'file:/x1/jenkins/jenkins-slave/workspace/Lucene-Solr-Tests-trunk-Java8/solr/core/src/test-files/solr/collection1/lib/README' to classloader
   [junit4]   2> 88067 INFO  (coreLoadExecutor-296-thread-1) [    ] o.a.s.c.SolrConfig current version of requestparams : -1
   [junit4]   2> 88077 INFO  (coreLoadExecutor-296-thread-1) [    ] o.a.s.c.SolrConfig Using Lucene MatchVersion: 6.0.0
   [junit4]   2> 88098 INFO  (coreLoadExecutor-296-thread-1) [    ] o.a.s.c.SolrConfig Loaded SolrConfig: solrconfig.xml
   [junit4]   2> 88104 INFO  (coreLoadExecutor-296-thread-1) [    ] o.a.s.s.IndexSchema [collection1] Schema name=test
   [junit4]   2> 88212 INFO  (coreLoadExecutor-296-thread-1) [    ] o.a.s.s.OpenExchangeRatesOrgProvider Initialized with rates=open-exchange-rates.json, refreshInterval=1440.
   [junit4]   2> 88218 INFO  (coreLoadExecutor-296-thread-1) [    ] o.a.s.s.IndexSchema default search field in schema is text
   [junit4]   2> 88219 INFO  (coreLoadExecutor-296-thread-1) [    ] o.a.s.s.IndexSchema unique key field: id
   [junit4]   2> 88241 INFO  (coreLoadExecutor-296-thread-1) [    ] o.a.s.s.FileExchangeRateProvider Reloading exchange rates from file currency.xml
   [junit4]   2> 88244 INFO  (coreLoadExecutor-296-thread-1) [    ] o.a.s.s.FileExchangeRateProvider Reloading exchange rates from file currency.xml
   [junit4]   2> 88245 INFO  (coreLoadExecutor-296-thread-1) [    ] o.a.s.s.OpenExchangeRatesOrgProvider Reloading exchange rates from open-exchange-rates.json
   [junit4]   2> 88246 WARN  (coreLoadExecutor-296-thread-1) [    ] o.a.s.s.OpenExchangeRatesOrgProvider Unknown key IMPORTANT NOTE
   [junit4]   2> 88246 WARN  (coreLoadExecutor-296-thread-1) [    ] o.a.s.s.OpenExchangeRatesOrgProvider Expected key, got STRING
   [junit4]   2> 88246 INFO  (coreLoadExecutor-296-thread-1) [    ] o.a.s.s.OpenExchangeRatesOrgProvider Reloading exchange rates from open-exchange-rates.json
   [junit4]   2> 88246 WARN  (coreLoadExecutor-296-thread-1) [    ] o.a.s.s.OpenExchangeRatesOrgProvider Unknown key IMPORTANT NOTE
   [junit4]   2> 88246 WARN  (coreLoadExecutor-296-thread-1) [    ] o.a.s.s.OpenExchangeRatesOrgProvider Expected key, got STRING
   [junit4]   2> 88248 INFO  (coreLoadExecutor-296-thread-1) [    ] o.a.s.c.ConfigSetProperties Did not find ConfigSet properties, assuming default properties: Can't find resource 'configsetprops.json' in classpath or '/x1/jenkins/jenkins-slave/workspace/Lucene-Solr-Tests-trunk-Java8/solr/core/src/test-files/solr/collection1'
   [junit4]   2> 88248 INFO  (coreLoadExecutor-296-thread-1) [    ] o.a.s.c.CoreContainer Creating SolrCore 'collection1' using configuration from instancedir /x1/jenkins/jenkins-slave/workspace/Lucene-Solr-Tests-trunk-Java8/solr/core/src/test-files/solr/collection1
   [junit4]   2> 88248 INFO  (coreLoadExecutor-296-thread-1) [    x:collection1] o.a.s.c.SolrCore org.apache.solr.core.MockDirectoryFactory
   [junit4]   2> 88249 INFO  (coreLoadExecutor-296-thread-1) [    x:collection1] o.a.s.c.SolrCore [[collection1] ] Opening new SolrCore at [/x1/jenkins/jenkins-slave/workspace/Lucene-Solr-Tests-trunk-Java8/solr/core/src/test-files/solr/collection1], dataDir=[/x1/jenkins/jenkins-slave/workspace/Lucene-Solr-Tests-trunk-Java8/solr/build/solr-core/test/J0/temp/solr.handler.PingRequestHandlerTest_A3C1F353237F8CCB-001/init-core-data-001/]
   [junit4]   2> 88249 INFO  (coreLoadExecutor-296-thread-1) [    x:collection1] o.a.s.c.JmxMonitoredMap JMX monitoring is enabled. Adding Solr mbeans to JMX Server: com.sun.jmx.mbeanserver.JmxMBeanServer@7d06e741
   [junit4]   2> 88249 INFO  (coreLoadExecutor-296-thread-1) [    x:collection1] o.a.s.c.CachingDirectoryFactory return new directory for /x1/jenkins/jenkins-slave/workspace/Lucene-Solr-Tests-trunk-Java8/solr/build/solr-core/test/J0/temp/solr.handler.PingRequestHandlerTest_A3C1F353237F8CCB-001/init-core-data-001
   [junit4]   2> 88249 INFO  (coreLoadExecutor-296-thread-1) [    x:collection1] o.a.s.c.SolrCore New index directory detected: old=null new=/x1/jenkins/jenkins-slave/workspace/Lucene-Solr-Tests-trunk-Java8/solr/build/solr-core/test/J0/temp/solr.handler.PingRequestHandlerTest_A3C1F353237F8CCB-001/init-core-data-001/index/
   [junit4]   2> 88249 WARN  (coreLoadExecutor-296-thread-1) [    x:collection1] o.a.s.c.SolrCore [collection1] Solr index directory '/x1/jenkins/jenkins-slave/workspace/Lucene-Solr-Tests-trunk-Java8/solr/build/solr-core/test/J0/temp/solr.handler.PingRequestHandlerTest_A3C1F353237F8CCB-001/init-core-data-001/index' doesn't exist. Creating new index...
   [junit4]   2> 88250 INFO  (coreLoadExecutor-296-thread-1) [    x:collection1] o.a.s.c.CachingDirectoryFactory return new directory for /x1/jenkins/jenkins-slave/workspace/Lucene-Solr-Tests-trunk-Java8/solr/build/solr-core/test/J0/temp/solr.handler.PingRequestHandlerTest_A3C1F353237F8CCB-001/init-core-data-001/index
   [junit4]   2> 88250 INFO  (coreLoadExecutor-296-thread-1) [    x:collection1] o.a.s.u.RandomMergePolicy RandomMergePolicy wrapping class org.apache.lucene.index.LogByteSizeMergePolicy: [LogByteSizeMergePolicy: minMergeSize=1677721, mergeFactor=47, maxMergeSize=2147483648, maxMergeSizeForForcedMerge=9223372036854775807, calibrateSizeByDeletes=true, maxMergeDocs=2147483647, maxCFSSegmentSizeMB=8.796093022207999E12, noCFSRatio=0.48886247741646127]
   [junit4]   2> 88251 INFO  (coreLoadExecutor-296-thread-1) [    x:collection1] o.a.s.c.SolrDeletionPolicy SolrDeletionPolicy.onCommit: commits: num=1
   [junit4]   2> 	commit{dir=MockDirectoryWrapper(RAMDirectory@761b297a lockFactory=org.apache.lucene.store.SingleInstanceLockFactory@1c0eb169),segFN=segments_1,generation=1}
   [junit4]   2> 88251 INFO  (coreLoadExecutor-296-thread-1) [    x:collection1] o.a.s.c.SolrDeletionPolicy newest commit generation = 1
   [junit4]   2> 88256 INFO  (coreLoadExecutor-296-thread-1) [    x:collection1] o.a.s.u.p.UpdateRequestProcessorChain creating updateRequestProcessorChain "dedupe"
   [junit4]   2> 88256 INFO  (coreLoadExecutor-296-thread-1) [    x:collection1] o.a.s.u.p.UpdateRequestProcessorChain inserting DistributedUpdateProcessorFactory into updateRequestProcessorChain "dedupe"
   [junit4]   2> 88256 INFO  (coreLoadExecutor-296-thread-1) [    x:collection1] o.a.s.u.p.UpdateRequestProcessorChain creating updateRequestProcessorChain "dedupe-allfields"
   [junit4]   2> 88256 INFO  (coreLoadExecutor-296-thread-1) [    x:collection1] o.a.s.u.p.UpdateRequestProcessorChain inserting DistributedUpdateProcessorFactory into updateRequestProcessorChain "dedupe-allfields"
   [junit4]   2> 88256 INFO  (coreLoadExecutor-296-thread-1) [    x:collection1] o.a.s.u.p.UpdateRequestProcessorChain creating updateRequestProcessorChain "stored_sig"
   [junit4]   2> 88256 INFO  (coreLoadExecutor-296-thread-1) [    x:collection1] o.a.s.u.p.UpdateRequestProcessorChain inserting DistributedUpdateProcessorFactory into updateRequestProcessorChain "stored_sig"
   [junit4]   2> 88256 INFO  (coreLoadExecutor-296-thread-1) [    x:collection1] o.a.s.u.p.UpdateRequestProcessorChain creating updateRequestProcessorChain "uniq-fields"
   [junit4]   2> 88257 INFO  (coreLoadExecutor-296-thread-1) [    x:collection1] o.a.s.u.p.UpdateRequestProcessorChain inserting DistributedUpdateProcessorFactory into updateRequestProcessorChain "uniq-fields"
   [junit4]   2> 88257 INFO  (coreLoadExecutor-296-thread-1) [    x:collection1] o.a.s.u.p.UpdateRequestProcessorChain creating updateRequestProcessorChain "distrib-dup-test-chain-explicit"
   [junit4]   2> 88257 INFO  (coreLoadExecutor-296-thread-1) [    x:collection1] o.a.s.u.p.UpdateRequestProcessorChain creating updateRequestProcessorChain "distrib-dup-test-chain-implicit"
   [junit4]   2> 88257 INFO  (coreLoadExecutor-296-thread-1) [    x:collection1] o.a.s.u.p.UpdateRequestProcessorChain inserting DistributedUpdateProcessorFactory into updateRequestProcessorChain "distrib-dup-test-chain-implicit"
   [junit4]   2> 88257 INFO  (coreLoadExecutor-296-thread-1) [    x:collection1] o.a.s.c.SolrCore no updateRequestProcessorChain defined as default, creating implicit default
   [junit4]   2> 88259 INFO  (coreLoadExecutor-296-thread-1) [    x:collection1] o.a.s.h.l.XMLLoader xsltCacheLifetimeSeconds=60
   [junit4]   2> 88260 INFO  (coreLoadExecutor-296-thread-1) [    x:collection1] o.a.s.h.l.XMLLoader xsltCacheLifetimeSeconds=60
   [junit4]   2> 88260 INFO  (OldIndexDirectoryCleanupThreadForCore-collection1) [    x:collection1] o.a.s.c.SolrCore Looking for old index directories to cleanup for core collection1 in /x1/jenkins/jenkins-slave/workspace/Lucene-Solr-Tests-trunk-Java8/solr/build/solr-core/test/J0/temp/solr.handler.PingRequestHandlerTest_A3C1F353237F8CCB-001/init-core-data-001/
   [junit4]   2> 88261 INFO  (coreLoadExecutor-296-thread-1) [    x:collection1] o.a.s.h.l.XMLLoader xsltCacheLifetimeSeconds=60
   [junit4]   2> 88262 INFO  (coreLoadExecutor-296-thread-1) [    x:collection1] o.a.s.h.l.XMLLoader xsltCacheLifetimeSeconds=60
   [junit4]   2> 88268 INFO  (coreLoadExecutor-296-thread-1) [    x:collection1] o.a.s.c.PluginBag requestHandler : 'lazy' created with startup=lazy 
   [junit4]   2> 88270 INFO  (coreLoadExecutor-296-thread-1) [    x:collection1] o.a.s.c.RequestHandlers Registered paths: /admin/mbeans,standard,spellCheckCompRH,lazy,/update/json/docs,/admin/luke,/export,spellCheckWithWordbreak_Direct,tvrh,/get,/admin/properties,/update/json,mltrh,/admin/threads,/search-facet-def,/update/csv,/sql,/search-facet-invariants,/admin/segments,spellCheckCompRH1,/mlt,/admin/system,/replication,dismax,defaults,/config,/stream,/schema,/admin/plugins,/admin/logging,spellCheckWithWordbreak,mock,/admin/ping,/update,/admin/file,/terms,spellCheckCompRH_Direct,/debug/dump
   [junit4]   2> 88270 WARN  (coreLoadExecutor-296-thread-1) [    x:collection1] o.a.s.c.SolrCore solrconfig.xml uses deprecated <admin/gettableFiles>, Please update your config to use the ShowFileRequestHandler.
   [junit4]   2> 88271 INFO  (coreLoadExecutor-296-thread-1) [    x:collection1] o.a.s.c.SolrCore Using default statsCache cache: org.apache.solr.search.stats.LocalStatsCache
   [junit4]   2> 88271 INFO  (coreLoadExecutor-296-thread-1) [    x:collection1] o.a.s.u.UpdateHandler Using UpdateLog implementation: org.apache.solr.update.UpdateLog
   [junit4]   2> 88271 INFO  (coreLoadExecutor-296-thread-1) [    x:collection1] o.a.s.u.UpdateLog Initializing UpdateLog: dataDir= defaultSyncLevel=FLUSH numRecordsToKeep=100 maxNumLogsToKeep=10 numVersionBuckets=65536
   [junit4]   2> 88272 INFO  (coreLoadExecutor-296-thread-1) [    x:collection1] o.a.s.u.CommitTracker Hard AutoCommit: disabled
   [junit4]   2> 88272 INFO  (coreLoadExecutor-296-thread-1) [    x:collection1] o.a.s.u.CommitTracker Soft AutoCommit: disabled
   [junit4]   2> 88272 INFO  (coreLoadExecutor-296-thread-1) [    x:collection1] o.a.s.u.RandomMergePolicy RandomMergePolicy wrapping class org.apache.lucene.index.TieredMergePolicy: [TieredMergePolicy: maxMergeAtOnce=44, maxMergeAtOnceExplicit=26, maxMergedSegmentMB=57.412109375, floorSegmentMB=0.2060546875, forceMergeDeletesPctAllowed=21.572361910252997, segmentsPerTier=42.0, maxCFSSegmentSizeMB=8.796093022207999E12, noCFSRatio=1.0
   [junit4]   2> 88273 INFO  (coreLoadExecutor-296-thread-1) [    x:collection1] o.a.s.c.SolrDeletionPolicy SolrDeletionPolicy.onInit: commits: num=1
   [junit4]   2> 	commit{dir=MockDirectoryWrapper(RAMDirectory@761b297a lockFactory=org.apache.lucene.store.SingleInstanceLockFactory@1c0eb169),segFN=segments_1,generation=1}
   [junit4]   2> 88273 INFO  (coreLoadExecutor-296-thread-1) [    x:collection1] o.a.s.c.SolrDeletionPolicy newest commit generation = 1
   [junit4]   2> 88273 INFO  (coreLoadExecutor-296-thread-1) [    x:collection1] o.a.s.s.SolrIndexSearcher Opening Searcher@67130d2d[collection1] main
   [junit4]   2> 88273 INFO  (coreLoadExecutor-296-thread-1) [    x:collection1] o.a.s.r.RestManager Initializing RestManager with initArgs: {storageIO=org.apache.solr.rest.ManagedResourceStorage$InMemoryStorageIO}
   [junit4]   2> 88273 INFO  (coreLoadExecutor-296-thread-1) [    x:collection1] o.a.s.r.ManagedResourceStorage Reading _rest_managed.json using InMemoryStorage
   [junit4]   2> 88273 INFO  (coreLoadExecutor-296-thread-1) [    x:collection1] o.a.s.r.RestManager Initializing 0 registered ManagedResources
   [junit4]   2> 88274 INFO  (coreLoadExecutor-296-thread-1) [    x:collection1] o.a.s.h.c.SpellCheckComponent Initializing spell checkers
   [junit4]   2> 88291 INFO  (coreLoadExecutor-296-thread-1) [    x:collection1] o.a.s.s.DirectSolrSpellChecker init: {name=direct,classname=DirectSolrSpellChecker,field=lowerfilt,minQueryLength=3}
   [junit4]   2> 88341 INFO  (coreLoadExecutor-296-thread-1) [    x:collection1] o.a.s.h.ReplicationHandler Commits will be reserved for  10000
   [junit4]   2> 88341 INFO  (searcherExecutor-297-thread-1-processing-x:collection1) [    x:collection1] o.a.s.h.c.SpellCheckComponent Loading spell index for spellchecker: default
   [junit4]   2> 88341 INFO  (searcherExecutor-297-thread-1-processing-x:collection1) [    x:collection1] o.a.s.h.c.SpellCheckComponent Loading spell index for spellchecker: direct
   [junit4]   2> 88341 INFO  (searcherExecutor-297-thread-1-processing-x:collection1) [    x:collection1] o.a.s.h.c.SpellCheckComponent Loading spell index for spellchecker: wordbreak
   [junit4]   2> 88341 INFO  (searcherExecutor-297-thread-1-processing-x:collection1) [    x:collection1] o.a.s.h.c.SpellCheckComponent Loading spell index for spellchecker: multipleFields
   [junit4]   2> 88342 INFO  (searcherExecutor-297-thread-1-processing-x:collection1) [    x:collection1] o.a.s.h.c.SpellCheckComponent Loading spell index for spellchecker: jarowinkler
   [junit4]   2> 88342 INFO  (coreLoadExecutor-296-thread-1) [    x:collection1] o.a.s.u.UpdateLog Looking up max value of version field to seed version buckets
   [junit4]   2> 88342 INFO  (coreLoadExecutor-296-thread-1) [    x:collection1] o.a.s.u.VersionInfo Refreshing highest value of _version_ for 65536 version buckets from index
   [junit4]   2> 88342 INFO  (searcherExecutor-297-thread-1-processing-x:collection1) [    x:collection1] o.a.s.h.c.SpellCheckComponent Loading spell index for spellchecker: external
   [junit4]   2> 88342 INFO  (coreLoadExecutor-296-thread-1) [    x:collection1] o.a.s.u.VersionInfo No terms found for _version_, cannot seed version bucket highest value from index
   [junit4]   2> 88342 INFO  (coreLoadExecutor-296-thread-1) [    x:collection1] o.a.s.u.UpdateLog Could not find max version in index or recent updates, using new clock 1520903949098418176
   [junit4]   2> 88343 INFO  (searcherExecutor-297-thread-1-processing-x:collection1) [    x:collection1] o.a.s.h.c.SpellCheckComponent Loading spell index for spellchecker: freq
   [junit4]   2> 88343 INFO  (searcherExecutor-297-thread-1-processing-x:collection1) [    x:collection1] o.a.s.h.c.SpellCheckComponent Loading spell index for spellchecker: fqcn
   [junit4]   2> 88344 INFO  (searcherExecutor-297-thread-1-processing-x:collection1) [    x:collection1] o.a.s.h.c.SpellCheckComponent Loading spell index for spellchecker: perDict
   [junit4]   2> 88344 INFO  (coreLoadExecutor-296-thread-1) [    x:collection1] o.a.s.u.UpdateLog Took 2.0ms to seed version buckets with highest version 1520903949098418176
   [junit4]   2> 88345 INFO  (coreLoadExecutor-296-thread-1) [    x:collection1] o.a.s.c.CoreContainer registering core: collection1
   [junit4]   2> 88345 INFO  (searcherExecutor-297-thread-1-processing-x:collection1) [    x:collection1] o.a.s.c.SolrCore [collection1] Registered new searcher Searcher@67130d2d[collection1] main{ExitableDirectoryReader(UninvertingDirectoryReader())}
   [junit4]   2> 88346 INFO  (SUITE-PingRequestHandlerTest-seed#[A3C1F353237F8CCB]-worker) [    ] o.a.s.SolrTestCaseJ4 ####initCore end
   [junit4]   2> 88348 INFO  (TEST-PingRequestHandlerTest.testGettingStatus-seed#[A3C1F353237F8CCB]) [    ] o.a.s.SolrTestCaseJ4 ###Starting testGettingStatus
   [junit4]   2> 88352 INFO  (TEST-PingRequestHandlerTest.testGettingStatus-seed#[A3C1F353237F8CCB]) [    ] o.a.s.SolrTestCaseJ4 ###Ending testGettingStatus
   [junit4]   2> 88355 INFO  (TEST-PingRequestHandlerTest.testPingWithNoHealthCheck-seed#[A3C1F353237F8CCB]) [    ] o.a.s.SolrTestCaseJ4 ###Starting testPingWithNoHealthCheck
   [junit4]   2> 88356 INFO  (TEST-PingRequestHandlerTest.testPingWithNoHealthCheck-seed#[A3C1F353237F8CCB]) [    ] o.a.s.c.S.Request [collection1]  webapp=null path=null params={wt=xml} hits=0 status=0 QTime=0
   [junit4]   2> 88356 INFO  (TEST-PingRequestHandlerTest.testPingWithNoHealthCheck-seed#[A3C1F353237F8CCB]) [    ] o.a.s.c.S.Request [collection1]  webapp=null path=null params={action=ping&wt=xml} hits=0 status=0 QTime=0
   [junit4]   2> 88356 INFO  (TEST-PingRequestHandlerTest.testPingWithNoHealthCheck-seed#[A3C1F353237F8CCB]) [    ] o.a.s.SolrTestCaseJ4 ###Ending testPingWithNoHealthCheck
   [junit4]   2> 88358 INFO  (TEST-PingRequestHandlerTest.testDisablingServer-seed#[A3C1F353237F8CCB]) [    ] o.a.s.SolrTestCaseJ4 ###Starting testDisablingServer
   [junit4]   2> 88358 INFO  (TEST-PingRequestHandlerTest.testDisablingServer-seed#[A3C1F353237F8CCB]) [    ] o.a.s.c.S.Request [collection1]  webapp=null path=null params={wt=xml} hits=0 status=0 QTime=0
   [junit4]   2> 88359 INFO  (TEST-PingRequestHandlerTest.testDisablingServer-seed#[A3C1F353237F8CCB]) [    ] o.a.s.SolrTestCaseJ4 ###Ending testDisablingServer
   [junit4]   2> 88361 INFO  (TEST-PingRequestHandlerTest.testBadActionRaisesException-seed#[A3C1F353237F8CCB]) [    ] o.a.s.SolrTestCaseJ4 ###Starting testBadActionRaisesException
   [junit4]   2> 88361 INFO  (TEST-PingRequestHandlerTest.testBadActionRaisesException-seed#[A3C1F353237F8CCB]) [    ] o.a.s.SolrTestCaseJ4 ###Ending testBadActionRaisesException
   [junit4]   2> 88363 INFO  (TEST-PingRequestHandlerTest.testEnablingServer-seed#[A3C1F353237F8CCB]) [    ] o.a.s.SolrTestCaseJ4 ###Starting testEnablingServer
   [junit4]   2> 88365 INFO  (TEST-PingRequestHandlerTest.testEnablingServer-seed#[A3C1F353237F8CCB]) [    ] o.a.s.c.S.Request [collection1]  webapp=null path=null params={wt=xml} hits=0 status=0 QTime=0
   [junit4]   2> 88365 INFO  (TEST-PingRequestHandlerTest.testEnablingServer-seed#[A3C1F353237F8CCB]) [    ] o.a.s.SolrTestCaseJ4 ###Ending testEnablingServer
   [junit4]   2> 88368 INFO  (TEST-PingRequestHandlerTest.testPingInClusterWithNoHealthCheck-seed#[A3C1F353237F8CCB]) [    ] o.a.s.SolrTestCaseJ4 ###Starting testPingInClusterWithNoHealthCheck
   [junit4]   2> 88369 INFO  (TEST-PingRequestHandlerTest.testPingInClusterWithNoHealthCheck-seed#[A3C1F353237F8CCB]) [    ] o.a.s.c.ZkTestServer STARTING ZK TEST SERVER
   [junit4]   2> 88369 INFO  (Thread-224) [    ] o.a.s.c.ZkTestServer client port:0.0.0.0/0.0.0.0:0
   [junit4]   2> 88369 INFO  (Thread-224) [    ] o.a.s.c.ZkTestServer Starting server
   [junit4]   2> 88469 INFO  (TEST-PingRequestHandlerTest.testPingInClusterWithNoHealthCheck-seed#[A3C1F353237F8CCB]) [    ] o.a.s.c.ZkTestServer start zk server on port:37996
   [junit4]   2> 88469 INFO  (TEST-PingRequestHandlerTest.testPingInClusterWithNoHealthCheck-seed#[A3C1F353237F8CCB]) [    ] o.a.s.c.c.SolrZkClient Using default ZkCredentialsProvider
   [junit4]   2> 88470 INFO  (TEST-PingRequestHandlerTest.testPingInClusterWithNoHealthCheck-seed#[A3C1F353237F8CCB]) [    ] o.a.s.c.c.ConnectionManager Waiting for client to connect to ZooKeeper
   [junit4]   2> 88473 INFO  (zkCallback-104-thread-1) [    ] o.a.s.c.c.ConnectionManager Watcher org.apache.solr.common.cloud.ConnectionManager@334abb6b name:ZooKeeperConnection Watcher:127.0.0.1:37996 got event WatchedEvent state:SyncConnected type:None path:null path:null type:None
   [junit4]   2> 88473 INFO  (TEST-PingRequestHandlerTest.testPingInClusterWithNoHealthCheck-seed#[A3C1F353237F8CCB]) [    ] o.a.s.c.c.ConnectionManager Client is connected to ZooKeeper
   [junit4]   2> 88473 INFO  (TEST-PingRequestHandlerTest.testPingInClusterWithNoHealthCheck-seed#[A3C1F353237F8CCB]) [    ] o.a.s.c.c.SolrZkClient Using default ZkACLProvider
   [junit4]   2> 88473 INFO  (TEST-PingRequestHandlerTest.testPingInClusterWithNoHealthCheck-seed#[A3C1F353237F8CCB]) [    ] o.a.s.c.c.SolrZkClient makePath: /solr/solr.xml
   [junit4]   2> 88478 INFO  (TEST-PingRequestHandlerTest.testPingInClusterWithNoHealthCheck-seed#[A3C1F353237F8CCB]) [    ] o.a.s.c.c.SolrZkClient makePath: /solr/clusterprops.json
   [junit4]   2> 88509 INFO  (jetty-launcher-103-thread-3) [    ] o.e.j.s.Server jetty-9.3.6.v20151106
   [junit4]   2> 88510 INFO  (jetty-launcher-103-thread-3) [    ] o.e.j.s.h.ContextHandler Started o.e.j.s.ServletContextHandler@1ed743fa{/solr,null,AVAILABLE}
   [junit4]   2> 88513 INFO  (jetty-launcher-103-thread-1) [    ] o.e.j.s.Server jetty-9.3.6.v20151106
   [junit4]   2> 88516 INFO  (jetty-launcher-103-thread-4) [    ] o.e.j.s.Server jetty-9.3.6.v20151106
   [junit4]   2> 88517 INFO  (jetty-launcher-103-thread-5) [    ] o.e.j.s.Server jetty-9.3.6.v20151106
   [junit4]   2> 88517 INFO  (jetty-launcher-103-thread-2) [    ] o.e.j.s.Server jetty-9.3.6.v20151106
   [junit4]   2> 88532 INFO  (jetty-launcher-103-thread-4) [    ] o.e.j.s.h.ContextHandler Started o.e.j.s.ServletContextHandler@62209c6{/solr,null,AVAILABLE}
   [junit4]   2> 88536 INFO  (jetty-launcher-103-thread-3) [    ] o.e.j.u.s.SslContextFactory x509=X509@1ec095a(solrtest,h=[],w=[]) for SslContextFactory@2500520e(file:///x1/jenkins/jenkins-slave/workspace/Lucene-Solr-Tests-trunk-Java8/solr/server/etc/test/solrtest.keystore,file:///x1/jenkins/jenkins-slave/workspace/Lucene-Solr-Tests-trunk-Java8/solr/server/etc/test/solrtest.keystore)
   [junit4]   2> 88536 INFO  (jetty-launcher-103-thread-2) [    ] o.e.j.s.h.ContextHandler Started o.e.j.s.ServletContextHandler@49a5fedd{/solr,null,AVAILABLE}
   [junit4]   2> 88546 INFO  (jetty-launcher-103-thread-4) [    ] o.e.j.u.s.SslContextFactory x509=X509@1a4c51c(solrtest,h=[],w=[]) for SslContextFactory@3f245e6a(file:///x1/jenkins/jenkins-slave/workspace/Lucene-Solr-Tests-trunk-Java8/solr/server/etc/test/solrtest.keystore,file:///x1/jenkins/jenkins-slave/workspace/Lucene-Solr-Tests-trunk-Java8/solr/server/etc/test/solrtest.keystore)
   [junit4]   2> 88547 INFO  (jetty-launcher-103-thread-2) [    ] o.e.j.u.s.SslContextFactory x509=X509@459ff9b4(solrtest,h=[],w=[]) for SslContextFactory@23aab4cc(file:///x1/jenkins/jenkins-slave/workspace/Lucene-Solr-Tests-trunk-Java8/solr/server/etc/test/solrtest.keystore,file:///x1/jenkins/jenkins-slave/workspace/Lucene-Solr-Tests-trunk-Java8/solr/server/etc/test/solrtest.keystore)
   [junit4]   2> 88550 INFO  (jetty-launcher-103-thread-5) [    ] o.e.j.s.h.ContextHandler Started o.e.j.s.ServletContextHandler@1224969e{/solr,null,AVAILABLE}
   [junit4]   2> 88551 INFO  (jetty-launcher-103-thread-5) [    ] o.e.j.u.s.SslContextFactory x509=X509@7bc8f06f(solrtest,h=[],w=[]) for SslContextFactory@21dcf611(file:///x1/jenkins/jenkins-slave/workspace/Lucene-Solr-Tests-trunk-Java8/solr/server/etc/test/solrtest.keystore,file:///x1/jenkins/jenkins-slave/workspace/Lucene-Solr-Tests-trunk-Java8/solr/server/etc/test/solrtest.keystore)
   [junit4]   2> 88552 INFO  (jetty-launcher-103-thread-1) [    ] o.e.j.s.h.ContextHandler Started o.e.j.s.ServletContextHandler@74e08af4{/solr,null,AVAILABLE}
   [junit4]   2> 88553 INFO  (jetty-launcher-103-thread-1) [    ] o.e.j.u.s.SslContextFactory x509=X509@35ba174b(solrtest,h=[],w=[]) for SslContextFactory@1cec19a2(file:///x1/jenkins/jenkins-slave/workspace/Lucene-Solr-Tests-trunk-Java8/solr/server/etc/test/solrtest.keystore,file:///x1/jenkins/jenkins-slave/workspace/Lucene-Solr-Tests-trunk-Java8/solr/server/etc/test/solrtest.keystore)
   [junit4]   2> 88602 INFO  (jetty-launcher-103-thread-4) [    ] o.e.j.s.ServerConnector Started ServerConnector@15fd3f25{SSL,[ssl, http/1.1]}{127.0.0.1:57676}
   [junit4]   2> 88602 INFO  (jetty-launcher-103-thread-5) [    ] o.e.j.s.ServerConnector Started ServerConnector@6c46a4f2{SSL,[ssl, http/1.1]}{127.0.0.1:60011}
   [junit4]   2> 88603 INFO  (jetty-launcher-103-thread-4) [    ] o.e.j.s.Server Started @91511ms
   [junit4]   2> 88603 INFO  (jetty-launcher-103-thread-5) [    ] o.e.j.s.Server Started @91512ms
   [junit4]   2> 88603 INFO  (jetty-launcher-103-thread-5) [    ] o.a.s.c.s.e.JettySolrRunner Jetty properties: {hostContext=/solr, hostPort=60011}
   [junit4]   2> 88603 INFO  (jetty-launcher-103-thread-4) [    ] o.a.s.c.s.e.JettySolrRunner Jetty properties: {hostContext=/solr, hostPort=57676}
   [junit4]   2> 88603 INFO  (jetty-launcher-103-thread-5) [    ] o.a.s.s.SolrDispatchFilter SolrDispatchFilter.init(): sun.misc.Launcher$AppClassLoader@4e0e2f2a
   [junit4]   2> 88603 INFO  (jetty-launcher-103-thread-4) [    ] o.a.s.s.SolrDispatchFilter SolrDispatchFilter.init(): sun.misc.Launcher$AppClassLoader@4e0e2f2a
   [junit4]   2> 88603 INFO  (jetty-launcher-103-thread-5) [    ] o.a.s.c.SolrResourceLoader new SolrResourceLoader for directory: '/x1/jenkins/jenkins-slave/workspace/Lucene-Solr-Tests-trunk-Java8/solr/build/solr-core/test/J0/temp/solr.handler.PingRequestHandlerTest_A3C1F353237F8CCB-001/tempDir-001/node5'
   [junit4]   2> 88603 INFO  (jetty-launcher-103-thread-4) [    ] o.a.s.c.SolrResourceLoader new SolrResourceLoader for directory: '/x1/jenkins/jenkins-slave/workspace/Lucene-Solr-Tests-trunk-Java8/solr/build/solr-core/test/J0/temp/solr.handler.PingRequestHandlerTest_A3C1F353237F8CCB-001/tempDir-001/node4'
   [junit4]   2> 88603 INFO  (jetty-launcher-103-thread-5) [    ] o.a.s.c.SolrResourceLoader JNDI not configured for solr (NoInitialContextEx)
   [junit4]   2> 88604 INFO  (jetty-launcher-103-thread-5) [    ] o.a.s.c.SolrResourceLoader using system property solr.solr.home: /x1/jenkins/jenkins-slave/workspace/Lucene-Solr-Tests-trunk-Java8/solr/core/src/test-files/solr
   [junit4]   2> 88604 INFO  (jetty-launcher-103-thread-5) [    ] o.a.s.c.c.SolrZkClient Using default ZkCredentialsProvider
   [junit4]   2> 88603 INFO  (jetty-launcher-103-thread-4) [    ] o.a.s.c.SolrResourceLoader JNDI not configured for solr (NoInitialContextEx)
   [junit4]   2> 88611 INFO  (jetty-launcher-103-thread-4) [    ] o.a.s.c.SolrResourceLoader using system property solr.solr.home: /x1/jenkins/jenkins-slave/workspace/Lucene-Solr-Tests-trunk-Java8/solr/core/src/test-files/solr
   [junit4]   2> 88611 INFO  (jetty-launcher-103-thread-4) [    ] o.a.s.c.c.SolrZkClient Using default ZkCredentialsProvider
   [junit4]   2> 88621 INFO  (jetty-launcher-103-thread-5) [    ] o.a.s.c.c.ConnectionManager Waiting for client to connect to ZooKeeper
   [junit4]   2> 88638 INFO  (jetty-launcher-103-thread-4) [    ] o.a.s.c.c.ConnectionManager Waiting for client to connect to ZooKeeper
   [junit4]   2> 88638 INFO  (jetty-launcher-103-thread-3) [    ] o.e.j.s.ServerConnector Started ServerConnector@5d5337e2{SSL,[ssl, http/1.1]}{127.0.0.1:55543}
   [junit4]   2> 88639 INFO  (jetty-launcher-103-thread-3) [    ] o.e.j.s.Server Started @91548ms
   [junit4]   2> 88639 INFO  (jetty-launcher-103-thread-3) [    ] o.a.s.c.s.e.JettySolrRunner Jetty properties: {hostContext=/solr, hostPort=55543}
   [junit4]   2> 88639 INFO  (jetty-launcher-103-thread-3) [    ] o.a.s.s.SolrDispatchFilter SolrDispatchFilter.init(): sun.misc.Launcher$AppClassLoader@4e0e2f2a
   [junit4]   2> 88639 INFO  (jetty-launcher-103-thread-3) [    ] o.a.s.c.SolrResourceLoader new SolrResourceLoader for directory: '/x1/jenkins/jenkins-slave/workspace/Lucene-Solr-Tests-trunk-Java8/solr/build/solr-core/test/J0/temp/solr.handler.PingRequestHandlerTest_A3C1F353237F8CCB-001/tempDir-001/node3'
   [junit4]   2> 88640 INFO  (jetty-launcher-103-thread-3) [    ] o.a.s.c.SolrResourceLoader JNDI not configured for solr (NoInitialContextEx)
   [junit4]   2> 88640 INFO  (jetty-launcher-103-thread-3) [    ] o.a.s.c.SolrResourceLoader using system property solr.solr.home: /x1/jenkins/jenkins-slave/workspace/Lucene-Solr-Tests-trunk-Java8/solr/core/src/test-files/solr
   [junit4]   2> 88640 INFO  (jetty-launcher-103-thread-3) [    ] o.a.s.c.c.SolrZkClient Using default ZkCredentialsProvider
   [junit4]   2> 88657 INFO  (jetty-launcher-103-thread-1) [    ] o.e.j.s.ServerConnector Started ServerConnector@49e81b06{SSL,[ssl, http/1.1]}{127.0.0.1:57689}
   [junit4]   2> 88657 INFO  (jetty-launcher-103-thread-2) [    ] o.e.j.s.ServerConnector Started ServerConnector@3adae14e{SSL,[ssl, http/1.1]}{127.0.0.1:47572}
   [junit4]   2> 88657 INFO  (jetty-launcher-103-thread-1) [    ] o.e.j.s.Server Started @91565ms
   [junit4]   2> 88657 INFO  (jetty-launcher-103-thread-2) [    ] o.e.j.s.Server Started @91565ms
   [junit4]   2> 88657 INFO  (jetty-launcher-103-thread-1) [    ] o.a.s.c.s.e.JettySolrRunner Jetty properties: {hostContext=/solr, hostPort=57689}
   [junit4]   2> 88657 INFO  (jetty-launcher-103-thread-2) [    ] o.a.s.c.s.e.JettySolrRunner Jetty properties: {hostContext=/solr, hostPort=47572}
   [junit4]   2> 88666 INFO  (zkCallback-105-thread-1) [    ] o.a.s.c.c.ConnectionManager Watcher org.apache.solr.common.cloud.ConnectionManager@1405ddf4 name:ZooKeeperConnection Watcher:127.0.0.1:37996/solr got event WatchedEvent state:SyncConnected type:None path:null path:null type:None
   [junit4]   2> 88666 INFO  (jetty-launcher-103-thread-5) [    ] o.a.s.c.c.ConnectionManager Client is connected to ZooKeeper
   [junit4]   2> 88667 INFO  (jetty-launcher-103-thread-5) [    ] o.a.s.c.c.SolrZkClient Using default ZkACLProvider
   [junit4]   2> 88667 INFO  (jetty-launcher-103-thread-5) [    ] o.a.s.s.SolrDispatchFilter solr.xml found in ZooKeeper. Loading...
   [junit4]   2> 88667 INFO  (jetty-launcher-103-thread-2) [    ] o.a.s.s.SolrDispatchFilter SolrDispatchFilter.init(): sun.misc.Launcher$AppClassLoader@4e0e2f2a
   [junit4]   2> 88667 INFO  (jetty-launcher-103-thread-2) [    ] o.a.s.c.SolrResourceLoader new SolrResourceLoader for directory: '/x1/jenkins/jenkins-slave/workspace/Lucene-Solr-Tests-trunk-Java8/solr/build/solr-core/test/J0/temp/solr.handler.PingRequestHandlerTest_A3C1F353237F8CCB-001/tempDir-001/node2'
   [junit4]   2> 88667 INFO  (jetty-launcher-103-thread-2) [    ] o.a.s.c.SolrResourceLoader JNDI not configured for solr (NoInitialContextEx)
   [junit4]   2> 88668 INFO  (jetty-launcher-103-thread-2) [    ] o.a.s.c.SolrResourceLoader using system property solr.solr.home: /x1/jenkins/jenkins-slave/workspace/Lucene-Solr-Tests-trunk-Java8/solr/core/src/test-files/solr
   [junit4]   2> 88668 INFO  (jetty-launcher-103-thread-2) [    ] o.a.s.c.c.SolrZkClient Using default ZkCredentialsProvider
   [junit4]   2> 88669 INFO  (jetty-launcher-103-thread-1) [    ] o.a.s.s.SolrDispatchFilter SolrDispatchFilter.init(): sun.misc.Launcher$AppClassLoader@4e0e2f2a
   [junit4]   2> 88669 INFO  (jetty-launcher-103-thread-1) [    ] o.a.s.c.SolrResourceLoader new SolrResourceLoader for directory: '/x1/jenkins/jenkins-slave/workspace/Lucene-Solr-Tests-trunk-Java8/solr/build/solr-core/test/J0/temp/solr.handler.PingRequestHandlerTest_A3C1F353237F8CCB-001/tempDir-001/node1'
   [junit4]   2> 88669 INFO  (jetty-launcher-103-thread-1) [    ] o.a.s.c.SolrResourceLoader JNDI not configured for solr (NoInitialContextEx)
   [junit4]   2> 88669 INFO  (jetty-launcher-103-thread-1) [    ] o.a.s.c.SolrResourceLoader using system property solr.solr.home: /x1/jenkins/jenkins-slave/workspace/Lucene-Solr-Tests-trunk-Java8/solr/core/src/test-files/solr
   [junit4]   2> 88669 INFO  (jetty-launcher-103-thread-1) [    ] o.a.s.c.c.SolrZkClient Using default ZkCredentialsProvider
   [junit4]   2> 88676 INFO  (jetty-launcher-103-thread-3) [    ] o.a.s.c.c.ConnectionManager Waiting for client to connect to ZooKeeper
   [junit4]   2> 88694 INFO  (jetty-launcher-103-thread-2) [    ] o.a.s.c.c.ConnectionManager Waiting for client to connect to ZooKeeper
   [junit4]   2> 88697 INFO  (jetty-launcher-103-thread-1) [    ] o.a.s.c.c.ConnectionManager Waiting for client to connect to ZooKeeper
   [junit4]   2> 88698 INFO  (zkCallback-106-thread-1) [    ] o.a.s.c.c.ConnectionManager Watcher org.apache.solr.common.cloud.ConnectionManager@70c6eec3 name:ZooKeeperConnection Watcher:127.0.0.1:37996/solr got event WatchedEvent state:SyncConnected type:None path:null path:null type:None
   [junit4]   2> 88698 INFO  (jetty-launcher-103-thread-4) [    ] o.a.s.c.c.ConnectionManager Client is connected to ZooKeeper
   [junit4]   2> 88698 INFO  (jetty-launcher-103-thread-4) [    ] o.a.s.c.c.SolrZkClient Using default ZkACLProvider
   [junit4]   2> 88698 INFO  (jetty-launcher-103-thread-5) [    ] o.a.s.c.CorePropertiesLocator Config-defined core root directory: /x1/jenkins/jenkins-slave/workspace/Lucene-Solr-Tests-trunk-Java8/solr/build/solr-core/test/J0/temp/solr.handler.PingRequestHandlerTest_A3C1F353237F8CCB-001/tempDir-001/node5/.
   [junit4]   2> 88699 INFO  (jetty-launcher-103-thread-5) [    ] o.a.s.c.CoreContainer New CoreContainer 1756370843
   [junit4]   2> 88699 INFO  (jetty-launcher-103-thread-5) [    ] o.a.s.c.CoreContainer Loading cores into CoreContainer [instanceDir=/x1/jenkins/jenkins-slave/workspace/Lucene-Solr-Tests-trunk-Java8/solr/build/solr-core/test/J0/temp/solr.handler.PingRequestHandlerTest_A3C1F353237F8CCB-001/tempDir-001/node5]
   [junit4]   2> 88699 WARN  (jetty-launcher-103-thread-5) [    ] o.a.s.c.CoreContainer Couldn't add files from /x1/jenkins/jenkins-slave/workspace/Lucene-Solr-Tests-trunk-Java8/solr/build/solr-core/test/J0/temp/solr.handler.PingRequestHandlerTest_A3C1F353237F8CCB-001/tempDir-001/node5/lib to classpath: /x1/jenkins/jenkins-slave/workspace/Lucene-Solr-Tests-trunk-Java8/solr/build/solr-core/test/J0/temp/solr.handler.PingRequestHandlerTest_A3C1F353237F8CCB-001/tempDir-001/node5/lib
   [junit4]   2> 88708 INFO  (zkCallback-107-thread-1) [    ] o.a.s.c.c.ConnectionManager Watcher org.apache.solr.common.cloud.ConnectionManager@1787f7b name:ZooKeeperConnection Watcher:127.0.0.1:37996/solr got event WatchedEvent state:SyncConnected type:None path:null path:null type:None
   [junit4]   2> 88699 INFO  (jetty-launcher-103-thread-4) [    ] o.a.s.s.SolrDispatchFilter solr.xml found in ZooKeeper. Loading...
   [junit4]   2> 88731 INFO  (jetty-launcher-103-thread-5) [    ] o.a.s.h.c.HttpShardHandlerFactory created with socketTimeout : 90000,urlScheme : https,connTimeout : 15000,maxConnectionsPerHost : 20,maxConnections : 10000,corePoolSize : 0,maximumPoolSize : 2147483647,maxThreadIdleTime : 5,sizeOfQueue : -1,fairnessPolicy : false,useRetries : false,
   [junit4]   2> 88733 INFO  (jetty-launcher-103-thread-5) [    ] o.a.s.u.UpdateShardHandler Creating UpdateShardHandler HTTP client with params: socketTimeout=340000&connTimeout=45000&retry=true
   [junit4]   2> 88735 INFO  (jetty-launcher-103-thread-5) [    ] o.a.s.l.LogWatcher SLF4J impl is org.slf4j.impl.Log4jLoggerFactory
   [junit4]   2> 88735 INFO  (jetty-launcher-103-thread-5) [    ] o.a.s.l.LogWatcher Registering Log Listener [Log4j (org.slf4j.impl.Log4jLoggerFactory)]
   [junit4]   2> 88735 INFO  (jetty-launcher-103-thread-5) [    ] o.a.s.c.ZkContainer Zookeeper client=127.0.0.1:37996/solr
   [junit4]   2> 88735 INFO  (jetty-launcher-103-thread-5) [    ] o.a.s.c.ZkController zkHost includes chroot
   [junit4]   2> 88735 INFO  (jetty-launcher-103-thread-5) [    ] o.a.s.c.c.SolrZkClient Using default ZkCredentialsProvider
   [junit4]   2> 88736 INFO  (jetty-launcher-103-thread-3) [    ] o.a.s.c.c.ConnectionManager Client is connected to ZooKeeper
   [junit4]   2> 88777 INFO  (jetty-launcher-103-thread-3) [    ] o.a.s.c.c.SolrZkClient Using default ZkACLProvider
   [junit4]   2> 88777 INFO  (zkCallback-109-thread-1) [    ] o.a.s.c.c.ConnectionManager Watcher org.apache.solr.common.cloud.ConnectionManager@4e0ad514 name:ZooKeeperConnection Watcher:127.0.0.1:37996/solr got event WatchedEvent state:SyncConnected type:None path:null path:null type:None
   [junit4]   2> 88777 INFO  (zkCallback-112-thread-1) [    ] o.a.s.c.c.ConnectionManager Watcher org.apache.solr.common.cloud.ConnectionManager@3f5aafa9 name:ZooKeeperConnection Watcher:127.0.0.1:37996 got event WatchedEvent state:SyncConnected type:None path:null path:null type:None
   [junit4]   2> 88777 INFO  (jetty-launcher-103-thread-1) [    ] o.a.s.c.c.ConnectionManager Client is connected to ZooKeeper
   [junit4]   2> 88777 INFO  (jetty-launcher-103-thread-1) [    ] o.a.s.c.c.SolrZkClient Using default ZkACLProvider
   [junit4]   2> 88777 INFO  (jetty-launcher-103-thread-4) [    ] o.a.s.c.CorePropertiesLocator Config-defined core root directory: /x1/jenkins/jenkins-slave/workspace/Lucene-Solr-Tests-trunk-Java8/solr/build/solr-core/test/J0/temp/solr.handler.PingRequestHandlerTest_A3C1F353237F8CCB-001/tempDir-001/node4/.
   [junit4]   2> 88778 INFO  (jetty-launcher-103-thread-4) [    ] o.a.s.c.CoreContainer New CoreContainer 2064581020
   [junit4]   2> 88778 INFO  (jetty-launcher-103-thread-4) [    ] o.a.s.c.CoreContainer Loading cores into CoreContainer [instanceDir=/x1/jenkins/jenkins-slave/workspace/Lucene-Solr-Tests-trunk-Java8/solr/build/solr-core/test/J0/temp/solr.handler.PingRequestHandlerTest_A3C1F353237F8CCB-001/tempDir-001/node4]
   [junit4]   2> 88778 WARN  (jetty-launcher-103-thread-4) [    ] o.a.s.c.CoreContainer Couldn't add files from /x1/jenkins/jenkins-slave/workspace/Lucene-Solr-Tests-trunk-Java8/solr/build/solr-core/test/J0/temp/solr.handler.PingRequestHandlerTest_A3C1F353237F8CCB-001/tempDir-001/node4/lib to classpath: /x1/jenkins/jenkins-slave/workspace/Lucene-Solr-Tests-trunk-Java8/solr/build/solr-core/test/J0/temp/solr.handler.PingRequestHandlerTest_A3C1F353237F8CCB-001/tempDir-001/node4/lib
   [junit4]   2> 88756 INFO  (zkCallback-108-thread-1) [    ] o.a.s.c.c.ConnectionManager Watcher org.apache.solr.common.cloud.ConnectionManager@529b83c3 name:ZooKeeperConnection Watcher:127.0.0.1:37996/solr got event WatchedEvent state:SyncConnected type:None path:null path:null type:None
   [junit4]   2> 88778 INFO  (jetty-launcher-103-thread-4) [    ] o.a.s.h.c.HttpShardHandlerFactory created with socketTimeout : 90000,urlScheme : https,connTimeout : 15000,maxConnectionsPerHost : 20,maxConnections : 10000,corePoolSize : 0,maximumPoolSize : 2147483647,maxThreadIdleTime : 5,sizeOfQueue : -1,fairnessPolicy : false,useRetries : false,
   [junit4]   2> 88778 INFO  (jetty-launcher-103-thread-1) [    ] o.a.s.s.SolrDispatchFilter solr.xml found in ZooKeeper. Loading...
   [junit4]   2> 88756 INFO  (jetty-launcher-103-thread-5) [    ] o.a.s.c.c.ConnectionManager Waiting for client to connect to ZooKeeper
   [junit4]   2> 88778 INFO  (jetty-launcher-103-thread-2) [    ] o.a.s.c.c.ConnectionManager Client is connected to ZooKeeper
   [junit4]   2> 88902 INFO  (jetty-launcher-103-thread-2) [    ] o.a.s.c.c.SolrZkClient Using default ZkACLProvider
   [junit4]   2> 88902 INFO  (jetty-launcher-103-thread-3) [    ] o.a.s.s.SolrDispatchFilter solr.xml found in ZooKeeper. Loading...
   [junit4]   2> 88902 INFO  (jetty-launcher-103-thread-5) [    ] o.a.s.c.c.ConnectionManager Client is connected to ZooKeeper
   [junit4]   2> 88902 INFO  (jetty-launcher-103-thread-5) [    ] o.a.s.c.c.SolrZkClient Using default ZkACLProvider
   [junit4]   2> 88905 INFO  (jetty-launcher-103-thread-2) [    ] o.a.s.s.SolrDispatchFilter solr.xml found in ZooKeeper. Loading...
   [junit4]   2> 88911 INFO  (jetty-launcher-103-thread-4) [    ] o.a.s.u.UpdateShardHandler Creating UpdateShardHandler HTTP client with params: socketTimeout=340000&connTimeout=45000&retry=true
   [junit4]   2> 88913 WARN  (NIOServerCxn.Factory:0.0.0.0/0.0.0.0:0) [    ] o.a.z.s.NIOServerCnxn caught end of stream exception
   [junit4]   2> EndOfStreamException: Unable to read additional data from client sessionid 0x151b56156980003, likely client has closed socket
   [junit4]   2> 	at org.apache.zookeeper.server.NIOServerCnxn.doIO(NIOServerCnxn.java:228)
   [junit4]   2> 	at org.apache.zookeeper.server.NIOServerCnxnFactory.run(NIOServerCnxnFactory.java:208)
   [junit4]   2> 	at java.lang.Thread.run(Thread.java:745)
   [junit4]   2> 88915 INFO  (jetty-launcher-103-thread-5) [n:127.0.0.1:60011_solr    ] o.a.s.c.c.ConnectionManager Waiting for client to connect to ZooKeeper
   [junit4]   2> 88916 INFO  (jetty-launcher-103-thread-3) [    ] o.a.s.c.CorePropertiesLocator Config-defined core root directory: /x1/jenkins/jenkins-slave/workspace/Lucene-Solr-Tests-trunk-Java8/solr/build/solr-core/test/J0/temp/solr.handler.PingRequestHandlerTest_A3C1F353237F8CCB-001/tempDir-001/node3/.
   [junit4]   2> 88916 INFO  (jetty-launcher-103-thread-3) [    ] o.a.s.c.CoreContainer New CoreContainer 1041227946
   [junit4]   2> 88916 INFO  (jetty-launcher-103-thread-3) [    ] o.a.s.c.CoreContainer Loading cores into CoreContainer [instanceDir=/x1/jenkins/jenkins-slave/workspace/Lucene-Solr-Tests-trunk-Java8/solr/build/solr-core/test/J0/temp/solr.handler.PingRequestHandlerTest_A3C1F353237F8CCB-001/tempDir-001/node3]
   [junit4]   2> 88916 WARN  (jetty-launcher-103-thread-3) [    ] o.a.s.c.CoreContainer Couldn't add files from /x1/jenkins/jenkins-slave/workspace/Lucene-Solr-Tests-trunk-Java8/solr/build/solr-core/test/J0/temp/solr.handler.PingRequestHandlerTest_A3C1F353237F8CCB-001/tempDir-001/node3/lib to classpath: /x1/jenkins/jenkins-slave/workspace/Lucene-Solr-Tests-trunk-Java8/solr/build/solr-core/test/J0/temp/solr.handler.PingRequestHandlerTest_A3C1F353237F8CCB-001/tempDir-001/node3/lib
   [junit4]   2> 88916 INFO  (jetty-launcher-103-thread-2) [    ] o.a.s.c.CorePropertiesLocator Config-defined core root directory: /x1/jenkins/jenkins-slave/workspace/Lucene-Solr-Tests-trunk-Java8/solr/build/solr-core/test/J0/temp/solr.handler.PingRequestHandlerTest_A3C1F353237F8CCB-001/tempDir-001/node2/.
   [junit4]   2> 88916 INFO  (jetty-launcher-103-thread-3) [    ] o.a.s.h.c.HttpShardHandlerFactory created with socketTimeout : 90000,urlScheme : https,connTimeout : 15000,maxConnectionsPerHost : 20,maxConnections : 10000,corePoolSize : 0,maximumPoolSize : 2147483647,maxThreadIdleTime : 5,sizeOfQueue : -1,fairnessPolicy : false,useRetries : false,
   [junit4]   2> 88916 INFO  (jetty-launcher-103-thread-2) [    ] o.a.s.c.CoreContainer New CoreContainer 351115205
   [junit4]   2> 88914 INFO  (jetty-launcher-103-thread-4) [    ] o.a.s.l.LogWatcher SLF4J impl is org.slf4j.impl.Log4jLoggerFactory
   [junit4]   2> 88916 INFO  (jetty-launcher-103-thread-2) [    ] o.a.s.c.CoreContainer Loading cores into CoreContainer [instanceDir=/x1/jenkins/jenkins-slave/workspace/Lucene-Solr-Tests-trunk-Java8/solr/build/solr-core/test/J0/temp/solr.handler.PingRequestHandlerTest_A3C1F353237F8CCB-001/tempDir-001/node2]
   [junit4]   2> 88916 INFO  (jetty-launcher-103-thread-4) [    ] o.a.s.l.LogWatcher Registering Log Listener [Log4j (org.slf4j.impl.Log4jLoggerFactory)]
   [junit4]   2> 88917 INFO  (jetty-launcher-103-thread-4) [    ] o.a.s.c.ZkContainer Zookeeper client=127.0.0.1:37996/solr
   [junit4]   2> 88917 WARN  (jetty-launcher-103-thread-2) [    ] o.a.s.c.CoreContainer Couldn't add files from /x1/jenkins/jenkins-slave/workspace/Lucene-Solr-Tests-trunk-Java8/solr/build/solr-core/test/J0/temp/solr.handler.PingRequestHandlerTest_A3C1F353237F8CCB-001/tempDir-001/node2/lib to classpath: /x1/jenkins/jenkins-slave/workspace/Lucene-Solr-Tests-trunk-Java8/solr/build/solr-core/test/J0/temp/solr.handler.PingRequestHandlerTest_A3C1F353237F8CCB-001/tempDir-001/node2/lib
   [junit4]   2> 88917 INFO  (jetty-launcher-103-thread-2) [    ] o.a.s.h.c.HttpShardHandlerFactory created with socketTimeout : 90000,urlScheme : https,connTimeout : 15000,maxConnectionsPerHost : 20,maxConnections : 10000,corePoolSize : 0,maximumPoolSize : 2147483647,maxThreadIdleTime : 5,sizeOfQueue : -1,fairnessPolicy : false,useRetries : false,
   [junit4]   2> 88917 INFO  (jetty-launcher-103-thread-4) [    ] o.a.s.c.ZkController zkHost includes chroot
   [junit4]   2> 88918 INFO  (jetty-launcher-103-thread-4) [    ] o.a.s.c.c.SolrZkClient Using default ZkCredentialsProvider
   [junit4]   2> 88919 INFO  (jetty-launcher-103-thread-2) [    ] o.a.s.u.UpdateShardHandler Creating UpdateShardHandler HTTP client with params: socketTimeout=340000&connTimeout=45000&retry=true
   [junit4]   2> 88922 INFO  (jetty-launcher-103-thread-2) [    ] o.a.s.l.LogWatcher SLF4J impl is org.slf4j.impl.Log4jLoggerFactory
   [junit4]   2> 88922 INFO  (jetty-launcher-103-thread-2) [    ] o.a.s.l.LogWatcher Registering Log Listener [Log4j (org.slf4j.impl.Log4jLoggerFactory)]
   [junit4]   2> 88922 INFO  (jetty-launcher-103-thread-2) [    ] o.a.s.c.ZkContainer Zookeeper client=127.0.0.1:37996/solr
   [junit4]   2> 88922 INFO  (jetty-launcher-103-thread-2) [    ] o.a.s.c.ZkController zkHost includes chroot
   [junit4]   2> 88922 INFO  (jetty-launcher-103-thread-2) [    ] o.a.s.c.c.SolrZkClient Using default ZkCredentialsProvider
   [junit4]   2> 88925 INFO  (jetty-launcher-103-thread-4) [    ] o.a.s.c.c.ConnectionManager Waiting for client to connect to ZooKeeper
   [junit4]   2> 88929 INFO  (zkCallback-113-thread-1-processing-n:127.0.0.1:60011_solr) [n:127.0.0.1:60011_solr    ] o.a.s.c.c.ConnectionManager Watcher org.apache.solr.common.cloud.ConnectionManager@46a43c31 name:ZooKeeperConnection Watcher:127.0.0.1:37996/solr got event WatchedEvent state:SyncConnected type:None path:null path:null type:None
   [junit4]   2> 88929 INFO  (jetty-launcher-103-thread-5) [n:127.0.0.1:60011_solr    ] o.a.s.c.c.ConnectionManager Client is connected to ZooKeeper
   [junit4]   2> 88930 INFO  (jetty-launcher-103-thread-5) [n:127.0.0.1:60011_solr    ] o.a.s.c.c.SolrZkClient makePath: /overseer/queue
   [junit4]   2> 88931 INFO  (jetty-launcher-103-thread-3) [    ] o.a.s.u.UpdateShardHandler Creating UpdateShardHandler HTTP client with params: socketTimeout=340000&connTimeout=45000&retry=true
   [junit4]   2> 88932 INFO  (jetty-launcher-103-thread-5) [n:127.0.0.1:60011_solr    ] o.a.s.c.c.SolrZkClient makePath: /overseer/collection-queue-work
   [junit4]   2> 88932 INFO  (zkCallback-116-thread-1) [    ] o.a.s.c.c.ConnectionManager Watcher org.apache.solr.common.cloud.ConnectionManager@5fb407ec name:ZooKeeperConnection Watcher:127.0.0.1:37996 got event WatchedEvent state:SyncConnected type:None path:null path:null type:None
   [junit4]   2> 88933 INFO  (jetty-launcher-103-thread-4) [    ] o.a.s.c.c.ConnectionManager Client is connected to ZooKeeper
   [junit4]   2> 88933 INFO  (jetty-launcher-103-thread-3) [    ] o.a.s.l.LogWatcher SLF4J impl is org.slf4j.impl.Log4jLoggerFactory
   [junit4]   2> 88933 INFO  (jetty-launcher-103-thread-3) [    ] o.a.s.l.LogWatcher Registering Log Listener [Log4j (org.slf4j.impl.Log4jLoggerFactory)]
   [junit4]   2> 88933 INFO  (jetty-launcher-103-thread-4) [    ] o.a.s.c.c.SolrZkClient Using default ZkACLProvider
   [junit4]   2> 88933 INFO  (jetty-launcher-103-thread-3) [    ] o.a.s.c.ZkContainer Zookeeper client=127.0.0.1:37996/solr
   [junit4]   2> 88934 INFO  (jetty-launcher-103-thread-1) [    ] o.a.s.c.CorePropertiesLocator Config-defined core root directory: /x1/jenkins/jenkins-slave/workspace/Lucene-Solr-Tests-trunk-Java8/solr/build/solr-core/test/J0/temp/solr.handler.PingRequestHandlerTest_A3C1F353237F8CCB-001/tempDir-001/node1/.
   [junit4]   2> 88934 INFO  (jetty-launcher-103-thread-1) [    ] o.a.s.c.CoreContainer New CoreContainer 950480732
   [junit4]   2> 88934 INFO  (jetty-launcher-103-thread-1) [    ] o.a.s.c.CoreContainer Loading cores into CoreContainer [instanceDir=/x1/jenkins/jenkins-slave/workspace/Lucene-Solr-Tests-trunk-Java8/solr/build/solr-core/test/J0/temp/solr.handler.PingRequestHandlerTest_A3C1F353237F8CCB-001/tempDir-001/node1]
   [junit4]   2> 88934 WARN  (jetty-launcher-103-thread-1) [    ] o.a.s.c.CoreContainer Couldn't add files from /x1/jenkins/jenkins-slave/workspace/Lucene-Solr-Tests-trunk-Java8/solr/build/solr-core/test/J0/temp/solr.handler.PingRequestHandlerTest_A3C1F353237F8CCB-001/tempDir-001/node1/lib to classpath: /x1/jenkins/jenkins-slave/workspace/Lucene-Solr-Tests-trunk-Java8/solr/build/solr-core/test/J0/temp/solr.handler.PingRequestHandlerTest_A3C1F353237F8CCB-001/tempDir-001/node1/lib
   [junit4]   2> 88938 INFO  (jetty-launcher-103-thread-1) [    ] o.a.s.h.c.HttpShardHandlerFactory created with socketTimeout : 90000,urlScheme : https,connTimeout : 15000,maxConnectionsPerHost : 20,maxConnections : 10000,corePoolSize : 0,maximumPoolSize : 2147483647,maxThreadIdleTime : 5,sizeOfQueue : -1,fairnessPolicy : false,useRetries : false,
   [junit4]   2> 88940 INFO  (jetty-launcher-103-thread-1) [    ] o.a.s.u.UpdateShardHandler Creating UpdateShardHandler HTTP client with params: socketTimeout=340000&connTimeout=45000&retry=true
   [junit4]   2> 88941 INFO  (jetty-launcher-103-thread-1) [    ] o.a.s.l.LogWatcher SLF4J impl is org.slf4j.impl.Log4jLoggerFactory
   [junit4]   2> 88941 INFO  (jetty-launcher-103-thread-1) [    ] o.a.s.l.LogWatcher Registering Log Listener [Log4j (org.slf4j.impl.Log4jLoggerFactory)]
   [junit4]   2> 88942 INFO  (jetty-launcher-103-thread-1) [    ] o.a.s.c.ZkContainer Zookeeper client=127.0.0.1:37996/solr
   [junit4]   2> 88942 INFO  (jetty-launcher-103-thread-1) [    ] o.a.s.c.ZkController zkHost includes chroot
   [junit4]   2> 88942 INFO  (jetty-launcher-103-thread-1) [    ] o.a.s.c.c.SolrZkClient Using default ZkCredentialsProvider
   [junit4]   2> 88934 INFO  (jetty-launcher-103-thread-2) [    ] o.a.s.c.c.ConnectionManager Waiting for client to connect to ZooKeeper
   [junit4]   2> 88934 INFO  (jetty-launcher-103-thread-3) [    ] o.a.s.c.ZkController zkHost includes chroot
   [junit4]   2> 88943 INFO  (jetty-launcher-103-thread-1) [    ] o.a.s.c.c.ConnectionManager Waiting for client to connect to ZooKeeper
   [junit4]   2> 88943 INFO  (jetty-launcher-103-thread-3) [    ] o.a.s.c.c.SolrZkClient Using default ZkCredentialsProvider
   [junit4]   2> 88944 INFO  (jetty-launcher-103-thread-3) [    ] o.a.s.c.c.ConnectionManager Waiting for client to connect to ZooKeeper
   [junit4]   2> 88949 INFO  (zkCallback-119-thread-1) [    ] o.a.s.c.c.ConnectionManager Watcher org.apache.solr.common.cloud.ConnectionManager@71a5bfaf name:ZooKeeperConnection Watcher:127.0.0.1:37996 got event WatchedEvent state:SyncConnected type:None path:null path:null type:None
   [junit4]   2> 88949 INFO  (jetty-launcher-103-thread-2) [    ] o.a.s.c.c.ConnectionManager Client is connected to ZooKeeper
   [junit4]   2> 88950 INFO  (jetty-launcher-103-thread-2) [    ] o.a.s.c.c.SolrZkClient Using default ZkACLProvider
   [junit4]   2> 88950 INFO  (jetty-launcher-103-thread-5) [n:127.0.0.1:60011_solr    ] o.a.s.c.c.SolrZkClient makePath: /overseer/collection-map-running
   [junit4]   2> 88951 INFO  (zkCallback-125-thread-1) [    ] o.a.s.c.c.ConnectionManager Watcher org.apache.solr.common.cloud.ConnectionManager@3c8af5c0 name:ZooKeeperConnection Watcher:127.0.0.1:37996 got event WatchedEvent state:SyncConnected type:None path:null path:null type:None
   [junit4]   2> 88951 INFO  (zkCallback-124-thread-1) [    ] o.a.s.c.c.ConnectionManager Watcher org.apache.solr.common.cloud.ConnectionManager@fe50e8 name:ZooKeeperConnection Watcher:127.0.0.1:37996 got event WatchedEvent state:SyncConnected type:None path:null path:null type:None
   [junit4]   2> 88952 INFO  (jetty-launcher-103-thread-3) [    ] o.a.s.c.c.ConnectionManager Client is connected to ZooKeeper
   [junit4]   2> 88952 INFO  (jetty-launcher-103-thread-3) [    ] o.a.s.c.c.SolrZkClient Using default ZkACLProvider
   [junit4]   2> 88953 INFO  (jetty-launcher-103-thread-1) [    ] o.a.s.c.c.ConnectionManager Client is connected to ZooKeeper
   [junit4]   2> 88953 INFO  (jetty-launcher-103-thread-1) [    ] o.a.s.c.c.SolrZkClient Using default ZkACLProvider
   [junit4]   2> 88954 WARN  (NIOServerCxn.Factory:0.0.0.0/0.0.0.0:0) [    ] o.a.z.s.NIOServerCnxn caught end of stream exception
   [junit4]   2> EndOfStreamException: Unable to read additional data from client sessionid 0x151b5615698000a, likely client has closed socket
   [junit4]   2> 	at org.apache.zookeeper.server.NIOServerCnxn.doIO(NIOServerCnxn.java:228)
   [junit4]   2> 	at org.apache.zookeeper.server.NIOServerCnxnFactory.run(NIOServerCnxnFactory.java:208)
   [junit4]   2> 	at java.lang.Thread.run(Thread.java:745)
   [junit4]   2> 88960 INFO  (jetty-launcher-103-thread-1) [n:127.0.0.1:57689_solr    ] o.a.s.c.c.ConnectionManager Waiting for client to connect to ZooKeeper
   [junit4]   2> 88960 WARN  (NIOServerCxn.Factory:0.0.0.0/0.0.0.0:0) [    ] o.a.z.s.NIOServerCnxn caught end of stream exception
   [junit4]   2> EndOfStreamException: Unable to read additional data from client sessionid 0x151b5615698000b, likely client has closed socket
   [junit4]   2> 	at org.apache.zookeeper.server.NIOServerCnxn.doIO(NIOServerCnxn.java:228)
   [junit4]   2> 	at org.apache.zookeeper.server.NIOServerCnxnFactory.run(NIOServerCnxnFactory.java:208)
   [junit4]   2> 	at java.lang.Thread.run(Thread.java:745)
   [junit4]   2> 88958 INFO  (jetty-launcher-103-thread-4) [n:127.0.0.1:57676_solr    ] o.a.s.c.c.ConnectionManager Waiting for client to connect to ZooKeeper
   [junit4]   2> 88954 INFO  (jetty-launcher-103-thread-5) [n:127.0.0.1:60011_solr    ] o.a.s.c.c.SolrZkClient makePath: /overseer/collection-map-completed
   [junit4]   2> 88965 WARN  (NIOServerCxn.Factory:0.0.0.0/0.0.0.0:0) [    ] o.a.z.s.NIOServerCnxn caught end of stream exception
   [junit4]   2> EndOfStreamException: Unable to read additional data from client sessionid 0x151b56156980009, likely client has closed socket
   [junit4]   2> 	at org.apache.zookeeper.server.NIOServerCnxn.doIO(NIOServerCnxn.java:228)
   [junit4]   2> 	at org.apache.zookeeper.server.NIOServerCnxnFactory.run(NIOServerCnxnFactory.java:208)
   [junit4]   2> 	at java.lang.Thread.run(Thread.java:745)
   [junit4]   2> 88965 INFO  (jetty-launcher-103-thread-2) [n:127.0.0.1:47572_solr    ] o.a.s.c.c.ConnectionManager Waiting for client to connect to ZooKeeper
   [junit4]   2> 88964 INFO  (zkCallback-126-thread-1-processing-n:127.0.0.1:57676_solr) [n:127.0.0.1:57676_solr    ] o.a.s.c.c.ConnectionManager Watcher org.apache.solr.common.cloud.ConnectionManager@db56ea3 name:ZooKeeperConnection Watcher:127.0.0.1:37996/solr got event WatchedEvent state:SyncConnected type:None path:null path:null type:None
   [junit4]   2> 88969 INFO  (jetty-launcher-103-thread-4) [n:127.0.0.1:57676_solr    ] o.a.s.c.c.ConnectionManager Client is connected to ZooKeeper
   [junit4]   2> 88971 INFO  (jetty-launcher-103-thread-3) [n:127.0.0.1:55543_solr    ] o.a.s.c.c.ConnectionManager Waiting for client to connect to ZooKeeper
   [junit4]   2> 88974 INFO  (jetty-launcher-103-thread-5) [n:127.0.0.1:60011_solr    ] o.a.s.c.c.SolrZkClient makePath: /overseer/collection-map-failure
   [junit4]   2> 88977 INFO  (jetty-launcher-103-thread-4) [n:127.0.0.1:57676_solr    ] o.a.s.c.c.SolrZkClient makePath: /live_nodes
   [junit4]   2> 88977 INFO  (jetty-launcher-103-thread-5) [n:127.0.0.1:60011_solr    ] o.a.s.c.c.SolrZkClient makePath: /live_nodes
   [junit4]   2> 88979 INFO  (jetty-launcher-103-thread-5) [n:127.0.0.1:60011_solr    ] o.a.s.c.c.SolrZkClient makePath: /collections
   [junit4]   2> 88979 INFO  (jetty-launcher-103-thread-4) [n:127.0.0.1:57676_solr    ] o.a.s.c.c.SolrZkClient makePath: /collections
   [junit4]   2> 88980 INFO  (jetty-launcher-103-thread-4) [n:127.0.0.1:57676_solr    ] o.a.s.c.c.SolrZkClient makePath: /aliases.json
   [junit4]   2> 88980 INFO  (jetty-launcher-103-thread-5) [n:127.0.0.1:60011_solr    ] o.a.s.c.c.SolrZkClient makePath: /aliases.json
   [junit4]   2> 88981 INFO  (jetty-launcher-103-thread-5) [n:127.0.0.1:60011_solr    ] o.a.s.c.c.SolrZkClient makePath: /clusterstate.json
   [junit4]   2> 88981 INFO  (jetty-launcher-103-thread-4) [n:127.0.0.1:57676_solr    ] o.a.s.c.c.SolrZkClient makePath: /clusterstate.json
   [junit4]   2> 88982 INFO  (jetty-launcher-103-thread-5) [n:127.0.0.1:60011_solr    ] o.a.s.c.c.SolrZkClient makePath: /security.json
   [junit4]   2> 88983 INFO  (jetty-launcher-103-thread-4) [n:127.0.0.1:57676_solr    ] o.a.s.c.c.SolrZkClient makePath: /security.json
   [junit4]   2> 88984 INFO  (jetty-launcher-103-thread-4) [n:127.0.0.1:57676_solr    ] o.a.s.c.ZkController Register node as live in ZooKeeper:/live_nodes/127.0.0.1:57676_solr
   [junit4]   2> 88984 INFO  (jetty-launcher-103-thread-5) [n:127.0.0.1:60011_solr    ] o.a.s.c.ZkController Register node as live in ZooKeeper:/live_nodes/127.0.0.1:60011_solr
   [junit4]   2> 88984 INFO  (zkCallback-127-thread-1-processing-n:127.0.0.1:57689_solr) [n:127.0.0.1:57689_solr    ] o.a.s.c.c.ConnectionManager Watcher org.apache.solr.common.cloud.ConnectionManager@67184c63 name:ZooKeeperConnection Watcher:127.0.0.1:37996/solr got event WatchedEvent state:SyncConnected type:None path:null path:null type:None
   [junit4]   2> 88984 INFO  (jetty-launcher-103-thread-1) [n:127.0.0.1:57689_solr    ] o.a.s.c.c.ConnectionManager Client is connected to ZooKeeper
   [junit4]   2> 88984 INFO  (jetty-launcher-103-thread-4) [n:127.0.0.1:57676_solr    ] o.a.s.c.c.SolrZkClient makePath: /live_nodes/127.0.0.1:57676_solr
   [junit4]   2> 88984 INFO  (jetty-launcher-103-thread-5) [n:127.0.0.1:60011_solr    ] o.a.s.c.c.SolrZkClient makePath: /live_nodes/127.0.0.1:60011_solr
   [junit4]   2> 88985 INFO  (zkCallback-129-thread-1-processing-n:127.0.0.1:55543_solr) [n:127.0.0.1:55543_solr    ] o.a.s.c.c.ConnectionManager Watcher org.apache.solr.common.cloud.ConnectionManager@13256875 name:ZooKeeperConnection Watcher:127.0.0.1:37996/solr got event WatchedEvent state:SyncConnected type:None path:null path:null type:None
   [junit4]   2> 88985 INFO  (jetty-launcher-103-thread-3) [n:127.0.0.1:55543_solr    ] o.a.s.c.c.ConnectionManager Client is connected to ZooKeeper
   [junit4]   2> 88988 INFO  (jetty-launcher-103-thread-4) [n:127.0.0.1:57676_solr    ] o.a.s.c.c.SolrZkClient makePath: /overseer_elect
   [junit4]   2> 88988 INFO  (jetty-launcher-103-thread-5) [n:127.0.0.1:60011_solr    ] o.a.s.c.c.SolrZkClient makePath: /overseer_elect
   [junit4]   2> 88989 INFO  (jetty-launcher-103-thread-4) [n:127.0.0.1:57676_solr    ] o.a.s.c.c.SolrZkClient makePath: /overseer_elect/election
   [junit4]   2> 88990 INFO  (jetty-launcher-103-thread-5) [n:127.0.0.1:60011_solr    ] o.a.s.c.c.SolrZkClient makePath: /overseer_elect/election
   [junit4]   2> 88992 INFO  (jetty-launcher-103-thread-4) [n:127.0.0.1:57676_solr    ] o.a.s.c.Overseer Overseer (id=null) closing
   [junit4]   2> 88992 INFO  (jetty-launcher-103-thread-5) [n:127.0.0.1:60011_solr    ] o.a.s.c.Overseer Overseer (id=null) closing
   [junit4]   2> 88992 INFO  (jetty-launcher-103-thread-5) [n:127.0.0.1:60011_solr    ] o.a.s.c.LeaderElector Joined leadership election with path: /overseer_elect/election/95056496820748295-127.0.0.1:60011_solr-n_0000000000
   [junit4]   2> 88992 INFO  (jetty-launcher-103-thread-4) [n:127.0.0.1:57676_solr    ] o.a.s.c.LeaderElector Joined leadership election with path: /overseer_elect/election/95056496820748300-127.0.0.1:57676_solr-n_0000000001
   [junit4]   2> 88993 INFO  (jetty-launcher-103-thread-5) [n:127.0.0.1:60011_solr    ] o.a.s.c.OverseerElectionContext I am going to be the leader 127.0.0.1:60011_solr
   [junit4]   2> 88993 INFO  (jetty-launcher-103-thread-5) [n:127.0.0.1:60011_solr    ] o.a.s.c.c.SolrZkClient makePath: /overseer_elect/leader
   [junit4]   2> 88993 INFO  (jetty-launcher-103-thread-4) [n:127.0.0.1:57676_solr    ] o.a.s.c.LeaderElector Watching path /overseer_elect/election/95056496820748295-127.0.0.1:60011_solr-n_0000000000 to know if I could be the leader
   [junit4]   2> 88993 INFO  (jetty-launcher-103-thread-4) [n:127.0.0.1:57676_solr    ] o.a.s.c.c.ZkStateReader Updating cluster state from ZooKeeper... 
   [junit4]   2> 88995 INFO  (jetty-launcher-103-thread-3) [n:127.0.0.1:55543_solr    ] o.a.s.c.c.ZkStateReader Updating cluster state from ZooKeeper... 
   [junit4]   2> 88995 INFO  (jetty-launcher-103-thread-5) [n:127.0.0.1:60011_solr    ] o.a.s.c.Overseer Overseer (id=95056496820748295-127.0.0.1:60011_solr-n_0000000000) starting
   [junit4]   2> 88997 INFO  (jetty-launcher-103-thread-5) [n:127.0.0.1:60011_solr    ] o.a.s.c.c.SolrZkClient makePath: /overseer/queue-work
   [junit4]   2> 89002 INFO  (zkCallback-128-thread-1-processing-n:127.0.0.1:47572_solr) [n:127.0.0.1:47572_solr    ] o.a.s.c.c.ConnectionManager Watcher org.apache.solr.common.cloud.ConnectionManager@54af7dd0 name:ZooKeeperConnection Watcher:127.0.0.1:37996/solr got event WatchedEvent state:SyncConnected type:None path:null path:null type:None
   [junit4]   2> 89002 INFO  (jetty-launcher-103-thread-2) [n:127.0.0.1:47572_solr    ] o.a.s.c.c.ConnectionManager Client is connected to ZooKeeper
   [junit4]   2> 89008 INFO  (jetty-launcher-103-thread-1) [n:127.0.0.1:57689_solr    ] o.a.s.c.c.ZkStateReader Updating cluster state from ZooKeeper... 
   [junit4]   2> 89016 INFO  (jetty-launcher-103-thread-5) [n:127.0.0.1:60011_solr    ] o.a.s.c.OverseerAutoReplicaFailoverThread Starting OverseerAutoReplicaFailoverThread autoReplicaFailoverWorkLoopDelay=10000 autoReplicaFailoverWaitAfterExpiration=30000 autoReplicaFailoverBadNodeExpiration=60000
   [junit4]   2> 89022 INFO  (OverseerCollectionConfigSetProcessor-95056496820748295-127.0.0.1:60011_solr-n_0000000000) [n:127.0.0.1:60011_solr    ] o.a.s.c.OverseerTaskProcessor Process current queue of overseer operations
   [junit4]   2> 89023 INFO  (OverseerStateUpdate-95056496820748295-127.0.0.1:60011_solr-n_0000000000) [n:127.0.0.1:60011_solr    ] o.a.s.c.Overseer Starting to work on the main queue
   [junit4]   2> 89023 INFO  (jetty-launcher-103-thread-2) [n:127.0.0.1:47572_solr    ] o.a.s.c.c.ZkStateReader Updating cluster state from ZooKeeper... 
   [junit4]   2> 89023 INFO  (OverseerStateUpdate-95056496820748295-127.0.0.1:60011_solr-n_0000000000) [n:127.0.0.1:60011_solr    ] o.a.s.c.c.ZkStateReader Updating cluster state from ZooKeeper... 
   [junit4]   2> 89039 INFO  (jetty-launcher-103-thread-5) [n:127.0.0.1:60011_solr    ] o.a.s.c.c.ZkStateReader Updating cluster state from ZooKeeper... 
   [junit4]   2> 89068 INFO  (jetty-launcher-103-thread-4) [n:127.0.0.1:57676_solr    ] o.a.s.c.CoreContainer Security conf doesn't exist. Skipping setup for authorization module.
   [junit4]   2> 89068 INFO  (jetty-launcher-103-thread-4) [n:127.0.0.1:57676_solr    ] o.a.s.c.CoreContainer No authentication plugin used.
   [junit4]   2> 89068 INFO  (jetty-launcher-103-thread-4) [n:127.0.0.1:57676_solr    ] o.a.s.c.CorePropertiesLocator Looking for core definitions underneath /x1/jenkins/jenkins-slave/workspace/Lucene-Solr-Tests-trunk-Java8/solr/build/solr-core/test/J0/temp/solr.handler.PingRequestHandlerTest_A3C1F353237F8CCB-001/tempDir-001/node4/.
   [junit4]   2> 89069 INFO  (jetty-launcher-103-thread-4) [n:127.0.0.1:57676_solr    ] o.a.s.c.CorePropertiesLocator Found 0 core definitions
   [junit4]   2> 89074 INFO  (jetty-launcher-103-thread-4) [n:127.0.0.1:57676_solr    ] o.a.s.s.SolrDispatchFilter user.dir=/x1/jenkins/jenkins-slave/workspace/Lucene-Solr-Tests-trunk-Java8/solr/build/solr-core/test/J0
   [junit4]   2> 89074 INFO  (jetty-launcher-103-thread-4) [n:127.0.0.1:57676_solr    ] o.a.s.s.SolrDispatchFilter SolrDispatchFilter.init() done
   [junit4]   2> 89085 INFO  (jetty-launcher-103-thread-5) [n:127.0.0.1:60011_solr    ] o.a.s.c.CoreContainer Security conf doesn't exist. Skipping setup for authorization module.
   [junit4]   2> 89085 INFO  (jetty-launcher-103-thread-5) [n:127.0.0.1:60011_solr    ] o.a.s.c.CoreContainer No authentication plugin used.
   [junit4]   2> 89085 INFO  (jetty-launcher-103-thread-5) [n:127.0.0.1:60011_solr    ] o.a.s.c.CorePropertiesLocator Looking for core definitions underneath /x1/jenkins/jenkins-slave/workspace/Lucene-Solr-Tests-trunk-Java8/solr/build/solr-core/test/J0/temp/solr.handler.PingRequestHandlerTest_A3C1F353237F8CCB-001/tempDir-001/node5/.
   [junit4]   2> 89086 INFO  (jetty-launcher-103-thread-5) [n:127.0.0.1:60011_solr    ] o.a.s.c.CorePropertiesLocator Found 0 core definitions
   [junit4]   2> 89086 INFO  (jetty-launcher-103-thread-5) [n:127.0.0.1:60011_solr    ] o.a.s.s.SolrDispatchFilter user.dir=/x1/jenkins/jenkins-slave/workspace/Lucene-Solr-Tests-trunk-Java8/solr/build/solr-core/test/J0
   [junit4]   2> 89087 INFO  (jetty-launcher-103-thread-5) [n:127.0.0.1:60011_solr    ] o.a.s.s.SolrDispatchFilter SolrDispatchFilter.init() done
   [junit4]   2> 90004 INFO  (jetty-launcher-103-thread-3) [n:127.0.0.1:55543_solr    ] o.a.s.c.ZkController Register node as live in ZooKeeper:/live_nodes/127.0.0.1:55543_solr
   [junit4]   2> 90005 INFO  (jetty-launcher-103-thread-3) [n:127.0.0.1:55543_solr    ] o.a.s.c.c.SolrZkClient makePath: /live_nodes/127.0.0.1:55543_solr
   [junit4]   2> 90006 INFO  (zkCallback-127-thread-1-processing-n:127.0.0.1:57689_solr) [n:127.0.0.1:57689_solr    ] o.a.s.c.c.ZkStateReader A live node change: WatchedEvent state:SyncConnected type:NodeChildrenChanged path:/live_nodes, has occurred - updating... (live nodes size: 2)
   [junit4]   2> 90006 INFO  (zkCallback-113-thread-1-processing-n:127.0.0.1:60011_solr) [n:127.0.0.1:60011_solr    ] o.a.s.c.c.ZkStateReader A live node change: WatchedEvent state:SyncConnected type:NodeChildrenChanged path:/live_nodes, has occurred - updating... (live nodes size: 2)
   [junit4]   2> 90006 INFO  (zkCallback-126-thread-1-processing-n:127.0.0.1:57676_solr) [n:127.0.0.1:57676_solr    ] o.a.s.c.c.ZkStateReader A live node change: WatchedEvent state:SyncConnected type:NodeChildrenChanged path:/live_nodes, has occurred - updating... (live nodes size: 2)
   [junit4]   2> 90006 INFO  (zkCallback-128-thread-1-processing-n:127.0.0.1:47572_solr) [n:127.0.0.1:47572_solr    ] o.a.s.c.c.ZkStateReader A live node change: WatchedEvent state:SyncConnected type:NodeChildrenChanged path:/live_nodes, has occurred - updating... (live nodes size: 2)
   [junit4]   2> 90015 INFO  (zkCallback-113-thread-2-processing-n:127.0.0.1:60011_solr) [n:127.0.0.1:60011_solr    ] o.a.s.c.c.ZkStateReader A live node change: WatchedEvent state:SyncConnected type:NodeChildrenChanged path:/live_nodes, has occurred - updating... (live nodes size: 3)
   [junit4]   2> 90015 INFO  (zkCallback-129-thread-1-processing-n:127.0.0.1:55543_solr) [n:127.0.0.1:55543_solr    ] o.a.s.c.c.ZkStateReader A live node change: WatchedEvent state:SyncConnected type:NodeChildrenChanged path:/live_nodes, has occurred - updating... (live nodes size: 2)
   [junit4]   2> 90017 INFO  (jetty-launcher-103-thread-1) [n:127.0.0.1:57689_solr    ] o.a.s.c.ZkController Register node as live in ZooKeeper:/live_nodes/127.0.0.1:57689_solr
   [junit4]   2> 90018 INFO  (jetty-launcher-103-thread-1) [n:127.0.0.1:57689_solr    ] o.a.s.c.c.SolrZkClient makePath: /live_nodes/127.0.0.1:57689_solr
   [junit4]   2> 90019 INFO  (jetty-launcher-103-thread-3) [n:127.0.0.1:55543_solr    ] o.a.s.c.Overseer Overseer (id=null) closing
   [junit4]   2> 90020 INFO  (zkCallback-129-thread-1-processing-n:127.0.0.1:55543_solr) [n:127.0.0.1:55543_solr    ] o.a.s.c.c.ZkStateReader A live node change: WatchedEvent state:SyncConnected type:NodeChildrenChanged path:/live_nodes, has occurred - updating... (live nodes size: 3)
   [junit4]   2> 90020 INFO  (zkCallback-126-thread-1-processing-n:127.0.0.1:57676_solr) [n:127.0.0.1:57676_solr    ] o.a.s.c.c.ZkStateReader A live node change: WatchedEvent state:SyncConnected type:NodeChildrenChanged path:/live_nodes, has occurred - updating... (live nodes size: 3)
   [junit4]   2> 90020 INFO  (zkCallback-128-thread-1-processing-n:127.0.0.1:47572_solr) [n:127.0.0.1:47572_solr    ] o.a.s.c.c.ZkStateReader A live node change: WatchedEvent state:SyncConnected type:NodeChildrenChanged path:/live_nodes, has occurred - updating... (live nodes size: 3)
   [junit4]   2> 90020 INFO  (zkCallback-127-thread-1-processing-n:127.0.0.1:57689_solr) [n:127.0.0.1:57689_solr    ] o.a.s.c.c.ZkStateReader A live node change: WatchedEvent state:SyncConnected type:NodeChildrenChanged path:/live_nodes, has occurred - updating... (live nodes size: 3)
   [junit4]   2> 90020 INFO  (zkCallback-113-thread-1-processing-n:127.0.0.1:60011_solr) [n:127.0.0.1:60011_solr    ] o.a.s.c.c.ZkStateReader A live node change: WatchedEvent state:SyncConnected type:NodeChildrenChanged path:/live_nodes, has occurred - updating... (live nodes size: 3)
   [junit4]   2> 90020 INFO  (jetty-launcher-103-thread-3) [n:127.0.0.1:55543_solr    ] o.a.s.c.LeaderElector Joined leadership election with path: /overseer_elect/election/95056496820748302-127.0.0.1:55543_solr-n_0000000002
   [junit4]   2> 90021 INFO  (jetty-launcher-103-thread-3) [n:127.0.0.1:55543_solr    ] o.a.s.c.LeaderElector Watching path /overseer_elect/election/95056496820748300-127.0.0.1:57676_solr-n_0000000001 to know if I could be the leader
   [junit4]   2> 90022 INFO  (zkCallback-113-thread-2-processing-n:127.0.0.1:60011_solr) [n:127.0.0.1:60011_solr    ] o.a.s.c.c.ZkStateReader A live node change: WatchedEvent state:SyncConnected type:NodeChildrenChanged path:/live_nodes, has occurred - updating... (live nodes size: 4)
   [junit4]   2> 90025 INFO  (jetty-launcher-103-thread-1) [n:127.0.0.1:57689_solr    ] o.a.s.c.Overseer Overseer (id=null) closing
   [junit4]   2> 90025 INFO  (jetty-launcher-103-thread-1) [n:127.0.0.1:57689_solr    ] o.a.s.c.LeaderElector Joined leadership election with path: /overseer_elect/election/95056496820748301-127.0.0.1:57689_solr-n_0000000003
   [junit4]   2> 90026 INFO  (jetty-launcher-103-thread-1) [n:127.0.0.1:57689_solr    ] o.a.s.c.LeaderElector Watching path /overseer_elect/election/95056496820748302-127.0.0.1:55543_solr-n_0000000002 to know if I could be the leader
   [junit4]   2> 90035 INFO  (jetty-launcher-103-thread-2) [n:127.0.0.1:47572_solr    ] o.a.s.c.ZkController Register node as live in ZooKeeper:/live_nodes/127.0.0.1:47572_solr
   [junit4]   2> 90036 INFO  (jetty-launcher-103-thread-2) [n:127.0.0.1:47572_solr    ] o.a.s.c.c.SolrZkClient makePath: /live_nodes/127.0.0.1:47572_solr
   [junit4]   2> 90037 INFO  (zkCallback-126-thread-1-processing-n:127.0.0.1:57676_solr) [n:127.0.0.1:57676_solr    ] o.a.s.c.c.ZkStateReader A live node change: WatchedEvent state:SyncConnected type:NodeChildrenChanged path:/live_nodes, has occurred - updating... (live nodes size: 4)
   [junit4]   2> 90037 INFO  (zkCallback-129-thread-1-processing-n:127.0.0.1:55543_solr) [n:127.0.0.1:55543_solr    ] o.a.s.c.c.ZkStateReader A live node change: WatchedEvent state:SyncConnected type:NodeChildrenChanged path:/live_nodes, has occurred - updating... (live nodes size: 4)
   [junit4]   2> 90037 INFO  (zkCallback-128-thread-1-processing-n:127.0.0.1:47572_solr) [n:127.0.0.1:47572_solr    ] o.a.s.c.c.ZkStateReader A live node change: WatchedEvent state:SyncConnected type:NodeChildrenChanged path:/live_nodes, has occurred - updating... (live nodes size: 4)
   [junit4]   2> 90037 INFO  (zkCallback-127-thread-1-processing-n:127.0.0.1:57689_solr) [n:127.0.0.1:57689_solr    ] o.a.s.c.c.ZkStateReader A live node change: WatchedEvent state:SyncConnected type:NodeChildrenChanged path:/live_nodes, has occurred - updating... (live nodes size: 4)
   [junit4]   2> 90037 INFO  (zkCallback-113-thread-1-processing-n:127.0.0.1:60011_solr) [n:127.0.0.1:60011_solr    ] o.a.s.c.c.ZkStateReader A live node change: WatchedEvent state:SyncConnected type:NodeChildrenChanged path:/live_nodes, has occurred - updating... (live nodes size: 4)
   [junit4]   2> 90037 INFO  (zkCallback-113-thread-2-processing-n:127.0.0.1:60011_solr) [n:127.0.0.1:60011_solr    ] o.a.s.c.c.ZkStateReader A live node change: WatchedEvent state:SyncConnected type:NodeChildrenChanged path:/live_nodes, has occurred - updating... (live nodes size: 4)
   [junit4]   2> 90040 INFO  (jetty-launcher-103-thread-2) [n:127.0.0.1:47572_solr    ] o.a.s.c.Overseer Overseer (id=null) closing
   [junit4]   2> 90041 INFO  (jetty-launcher-103-thread-2) [n:127.0.0.1:47572_solr    ] o.a.s.c.LeaderElector Joined leadership election with path: /overseer_elect/election/95056496820748303-127.0.0.1:47572_solr-n_0000000004
   [junit4]   2> 90041 INFO  (jetty-launcher-103-thread-3) [n:127.0.0.1:55543_solr    ] o.a.s.c.CoreContainer Security conf doesn't exist. Skipping setup for authorization module.
   [junit4]   2> 90041 INFO  (jetty-launcher-103-thread-3) [n:127.0.0.1:55543_solr    ] o.a.s.c.CoreContainer No authentication plugin used.
   [junit4]   2> 90041 INFO  (jetty-launcher-103-thread-2) [n:127.0.0.1:47572_solr    ] o.a.s.c.LeaderElector Watching path /overseer_elect/election/95056496820748301-127.0.0.1:57689_solr-n_0000000003 to know if I could be the leader
   [junit4]   2> 90042 INFO  (jetty-launcher-103-thread-3) [n:127.0.0.1:55543_solr    ] o.a.s.c.CorePropertiesLocator Looking for core definitions underneath /x1/jenkins/jenkins-slave/workspace/Lucene-Solr-Tests-trunk-Java8/solr/build/solr-core/test/J0/temp/solr.handler.PingRequestHandlerTest_A3C1F353237F8CCB-001/tempDir-001/node3/.
   [junit4]   2> 90042 INFO  (jetty-launcher-103-thread-3) [n:127.0.0.1:55543_solr    ] o.a.s.c.CorePropertiesLocator Found 0 core definitions
   [junit4]   2> 90043 INFO  (jetty-launcher-103-thread-1) [n:127.0.0.1:57689_solr    ] o.a.s.c.CoreContainer Security conf doesn't exist. Skipping setup for authorization module.
   [junit4]   2> 90043 INFO  (jetty-launcher-103-thread-1) [n:127.0.0.1:57689_solr    ] o.a.s.c.CoreContainer No authentication plugin used.
   [junit4]   2> 90043 INFO  (jetty-launcher-103-thread-1) [n:127.0.0.1:57689_solr    ] o.a.s.c.CorePropertiesLocator Looking for core definitions underneath /x1/jenkins/jenkins-slave/workspace/Lucene-Solr-Tests-trunk-Java8/solr/build/solr-core/test/J0/temp/solr.handler.PingRequestHandlerTest_A3C1F353237F8CCB-001/tempDir-001/node1/.
   [junit4]   2> 90043 INFO  (jetty-launcher-103-thread-1) [n:127.0.0.1:57689_solr    ] o.a.s.c.CorePropertiesLocator Found 0 core definitions
   [junit4]   2> 90053 INFO  (jetty-launcher-103-thread-2) [n:127.0.0.1:47572_solr    ] o.a.s.c.CoreContainer Security conf doesn't exist. Skipping setup for authorization module.
   [junit4]   2> 90053 INFO  (jetty-launcher-103-thread-2) [n:127.0.0.1:47572_solr    ] o.a.s.c.CoreContainer No authentication plugin used.
   [junit4]   2> 90054 INFO  (jetty-launcher-103-thread-2) [n:127.0.0.1:47572_solr    ] o.a.s.c.CorePropertiesLocator Looking for core definitions underneath /x1/jenkins/jenkins-slave/workspace/Lucene-Solr-Tests-trunk-Java8/solr/build/solr-core/test/J0/temp/solr.handler.PingRequestHandlerTest_A3C1F353237F8CCB-001/tempDir-001/node2/.
   [junit4]   2> 90054 INFO  (jetty-launcher-103-thread-2) [n:127.0.0.1:47572_solr    ] o.a.s.c.CorePropertiesLocator Found 0 core definitions
   [junit4]   2> 90055 INFO  (jetty-launcher-103-thread-3) [n:127.0.0.1:55543_solr    ] o.a.s.s.SolrDispatchFilter user.dir=/x1/jenkins/jenkins-slave/workspace/Lucene-Solr-Tests-trunk-Java8/solr/build/solr-core/test/J0
   [junit4]   2> 90055 INFO  (jetty-launcher-103-thread-3) [n:127.0.0.1:55543_solr    ] o.a.s.s.SolrDispatchFilter SolrDispatchFilter.init() done
   [junit4]   2> 90093 INFO  (jetty-launcher-103-thread-1) [n:127.0.0.1:57689_solr    ] o.a.s.s.SolrDispatchFilter user.dir=/x1/jenkins/jenkins-slave/workspace/Lucene-Solr-Tests-trunk-Java8/solr/build/solr-core/test/J0
   [junit4]   2> 90093

[...truncated too long message...]

    ] o.a.s.c.c.ZkStateReader ZooKeeper watch triggered, but Solr cannot talk to ZK
   [junit4]   2> 99186 INFO  (jetty-launcher-103-thread-2) [n:127.0.0.1:57676_solr c:testSolrCloudCollection s:shard2 r:core_node3 x:testSolrCloudCollection_shard2_replica2] o.e.j.s.h.ContextHandler Stopped o.e.j.s.ServletContextHandler@62209c6{/solr,null,UNAVAILABLE}
   [junit4]   2> 99189 INFO  (TEST-PingRequestHandlerTest.testPingInClusterWithNoHealthCheck-seed#[A3C1F353237F8CCB]) [    ] o.a.s.c.ZkTestServer connecting to 127.0.0.1:37996 37996
   [junit4]   2> 99291 INFO  (Thread-224) [    ] o.a.s.c.ZkTestServer connecting to 127.0.0.1:37996 37996
   [junit4]   2> 99293 WARN  (Thread-224) [    ] o.a.s.c.ZkTestServer Watch limit violations: 
   [junit4]   2> Maximum concurrent create/delete watches above limit:
   [junit4]   2> 
   [junit4]   2> 	7	/solr/aliases.json
   [junit4]   2> 	6	/solr/security.json
   [junit4]   2> 	4	/solr/configs/solrCloudCollectionConfig
   [junit4]   2> 
   [junit4]   2> Maximum concurrent data watches above limit:
   [junit4]   2> 
   [junit4]   2> 	7	/solr/clusterstate.json
   [junit4]   2> 	4	/solr/collections/testSolrCloudCollection/state.json
   [junit4]   2> 	2	/solr/overseer_elect/election/95056496820748302-127.0.0.1:55543_solr-n_0000000002
   [junit4]   2> 
   [junit4]   2> Maximum concurrent children watches above limit:
   [junit4]   2> 
   [junit4]   2> 	10	/solr/live_nodes
   [junit4]   2> 	8	/solr/collections
   [junit4]   2> 	2	/solr/overseer/queue
   [junit4]   2> 	2	/solr/overseer/collection-queue-work
   [junit4]   2> 
   [junit4]   2> 99293 INFO  (TEST-PingRequestHandlerTest.testPingInClusterWithNoHealthCheck-seed#[A3C1F353237F8CCB]) [    ] o.a.s.SolrTestCaseJ4 ###Ending testPingInClusterWithNoHealthCheck
   [junit4]   2> NOTE: reproduce with: ant test  -Dtestcase=PingRequestHandlerTest -Dtests.method=testPingInClusterWithNoHealthCheck -Dtests.seed=A3C1F353237F8CCB -Dtests.multiplier=2 -Dtests.slow=true -Dtests.locale=ro -Dtests.timezone=Asia/Dili -Dtests.asserts=true -Dtests.file.encoding=UTF-8
   [junit4] ERROR   10.9s J0 | PingRequestHandlerTest.testPingInClusterWithNoHealthCheck <<<
   [junit4]    > Throwable #1: org.apache.solr.common.SolrException: Could not find a healthy node to handle the request.
   [junit4]    > 	at __randomizedtesting.SeedInfo.seed([A3C1F353237F8CCB:4D124D83A693B62F]:0)
   [junit4]    > 	at org.apache.solr.client.solrj.impl.CloudSolrClient.sendRequest(CloudSolrClient.java:1085)
   [junit4]    > 	at org.apache.solr.client.solrj.impl.CloudSolrClient.requestWithRetryOnStaleState(CloudSolrClient.java:871)
   [junit4]    > 	at org.apache.solr.client.solrj.impl.CloudSolrClient.requestWithRetryOnStaleState(CloudSolrClient.java:954)
   [junit4]    > 	at org.apache.solr.client.solrj.impl.CloudSolrClient.requestWithRetryOnStaleState(CloudSolrClient.java:954)
   [junit4]    > 	at org.apache.solr.client.solrj.impl.CloudSolrClient.requestWithRetryOnStaleState(CloudSolrClient.java:954)
   [junit4]    > 	at org.apache.solr.client.solrj.impl.CloudSolrClient.requestWithRetryOnStaleState(CloudSolrClient.java:954)
   [junit4]    > 	at org.apache.solr.client.solrj.impl.CloudSolrClient.requestWithRetryOnStaleState(CloudSolrClient.java:954)
   [junit4]    > 	at org.apache.solr.client.solrj.impl.CloudSolrClient.request(CloudSolrClient.java:807)
   [junit4]    > 	at org.apache.solr.client.solrj.SolrRequest.process(SolrRequest.java:150)
   [junit4]    > 	at org.apache.solr.handler.PingRequestHandlerTest.testPingInClusterWithNoHealthCheck(PingRequestHandlerTest.java:200)
   [junit4]    > 	at java.lang.Thread.run(Thread.java:745)
   [junit4]   2> 99297 INFO  (SUITE-PingRequestHandlerTest-seed#[A3C1F353237F8CCB]-worker) [    ] o.a.s.SolrTestCaseJ4 ###deleteCore
   [junit4]   2> 99297 INFO  (SUITE-PingRequestHandlerTest-seed#[A3C1F353237F8CCB]-worker) [    ] o.a.s.c.CoreContainer Shutting down CoreContainer instance=2125388365
   [junit4]   2> 99298 INFO  (SUITE-PingRequestHandlerTest-seed#[A3C1F353237F8CCB]-worker) [    x:collection1] o.a.s.c.SolrCore [collection1]  CLOSING SolrCore org.apache.solr.core.SolrCore@6f38f44e
   [junit4]   2> 99298 INFO  (SUITE-PingRequestHandlerTest-seed#[A3C1F353237F8CCB]-worker) [    x:collection1] o.a.s.u.DirectUpdateHandler2 closing DirectUpdateHandler2{commits=0,autocommits=0,soft autocommits=0,optimizes=0,rollbacks=0,expungeDeletes=0,docsPending=0,adds=0,deletesById=0,deletesByQuery=0,errors=0,cumulative_adds=0,cumulative_deletesById=0,cumulative_deletesByQuery=0,cumulative_errors=0,transaction_logs_total_size=0,transaction_logs_total_number=0}
   [junit4]   2> 99298 INFO  (SUITE-PingRequestHandlerTest-seed#[A3C1F353237F8CCB]-worker) [    x:collection1] o.a.s.u.SolrCoreState Closing SolrCoreState
   [junit4]   2> 99298 INFO  (SUITE-PingRequestHandlerTest-seed#[A3C1F353237F8CCB]-worker) [    x:collection1] o.a.s.u.DefaultSolrCoreState SolrCoreState ref count has reached 0 - closing IndexWriter
   [junit4]   2> 99298 INFO  (SUITE-PingRequestHandlerTest-seed#[A3C1F353237F8CCB]-worker) [    x:collection1] o.a.s.u.DefaultSolrCoreState closing IndexWriter with IndexWriterCloser
   [junit4]   2> 99300 INFO  (SUITE-PingRequestHandlerTest-seed#[A3C1F353237F8CCB]-worker) [    x:collection1] o.a.s.c.SolrCore [collection1] Closing main searcher on request.
   [junit4]   2> 99313 INFO  (SUITE-PingRequestHandlerTest-seed#[A3C1F353237F8CCB]-worker) [    x:collection1] o.a.s.c.CachingDirectoryFactory Closing MockDirectoryFactory - 2 directories currently being tracked
   [junit4]   2> 99313 INFO  (SUITE-PingRequestHandlerTest-seed#[A3C1F353237F8CCB]-worker) [    x:collection1] o.a.s.c.CachingDirectoryFactory looking to close /x1/jenkins/jenkins-slave/workspace/Lucene-Solr-Tests-trunk-Java8/solr/build/solr-core/test/J0/temp/solr.handler.PingRequestHandlerTest_A3C1F353237F8CCB-001/init-core-data-001 [CachedDir<<refCount=0;path=/x1/jenkins/jenkins-slave/workspace/Lucene-Solr-Tests-trunk-Java8/solr/build/solr-core/test/J0/temp/solr.handler.PingRequestHandlerTest_A3C1F353237F8CCB-001/init-core-data-001;done=false>>]
   [junit4]   2> 99313 INFO  (SUITE-PingRequestHandlerTest-seed#[A3C1F353237F8CCB]-worker) [    x:collection1] o.a.s.c.CachingDirectoryFactory Closing directory: /x1/jenkins/jenkins-slave/workspace/Lucene-Solr-Tests-trunk-Java8/solr/build/solr-core/test/J0/temp/solr.handler.PingRequestHandlerTest_A3C1F353237F8CCB-001/init-core-data-001
   [junit4]   2> 99313 INFO  (SUITE-PingRequestHandlerTest-seed#[A3C1F353237F8CCB]-worker) [    x:collection1] o.a.s.c.CachingDirectoryFactory looking to close /x1/jenkins/jenkins-slave/workspace/Lucene-Solr-Tests-trunk-Java8/solr/build/solr-core/test/J0/temp/solr.handler.PingRequestHandlerTest_A3C1F353237F8CCB-001/init-core-data-001/index [CachedDir<<refCount=0;path=/x1/jenkins/jenkins-slave/workspace/Lucene-Solr-Tests-trunk-Java8/solr/build/solr-core/test/J0/temp/solr.handler.PingRequestHandlerTest_A3C1F353237F8CCB-001/init-core-data-001/index;done=false>>]
   [junit4]   2> 99313 INFO  (SUITE-PingRequestHandlerTest-seed#[A3C1F353237F8CCB]-worker) [    x:collection1] o.a.s.c.CachingDirectoryFactory Closing directory: /x1/jenkins/jenkins-slave/workspace/Lucene-Solr-Tests-trunk-Java8/solr/build/solr-core/test/J0/temp/solr.handler.PingRequestHandlerTest_A3C1F353237F8CCB-001/init-core-data-001/index
   [junit4]   2> NOTE: leaving temporary files on disk at: /x1/jenkins/jenkins-slave/workspace/Lucene-Solr-Tests-trunk-Java8/solr/build/solr-core/test/J0/temp/solr.handler.PingRequestHandlerTest_A3C1F353237F8CCB-001
   [junit4]   2> Dec 18, 2015 1:57:24 PM com.carrotsearch.randomizedtesting.ThreadLeakControl checkThreadLeaks
   [junit4]   2> WARNING: Will linger awaiting termination of 1 leaked thread(s).
   [junit4]   2> NOTE: test params are: codec=CheapBastard, sim=RandomSimilarityProvider(queryNorm=false,coord=crazy): {}, locale=ro, timezone=Asia/Dili
   [junit4]   2> NOTE: Linux 3.13.0-52-generic amd64/Oracle Corporation 1.8.0_66 (64-bit)/cpus=4,threads=1,free=217635584,total=369098752
   [junit4]   2> NOTE: All tests run in this JVM: [CoreMergeIndexesAdminHandlerTest, SOLR749Test, BigEndianAscendingWordSerializerTest, TestReloadDeadlock, TestClassNameShortening, PeerSyncTest, FullHLLTest, TestLeaderElectionZkExpiry, TestAtomicUpdateErrorCases, DocumentAnalysisRequestHandlerTest, TestMergePolicyConfig, TestSolrCloudWithKerberosAlt, TestDistribDocBasedVersion, TestScoreJoinQPScore, ConjunctionSolrSpellCheckerTest, DisMaxRequestHandlerTest, AlternateDirectoryTest, HdfsSyncSliceTest, TestPhraseSuggestions, ZkNodePropsTest, PingRequestHandlerTest]
   [junit4] Completed [40/568 (1!)] on J0 in 11.77s, 6 tests, 1 error <<< FAILURES!

[...truncated 1724 lines...]
BUILD FAILED
/x1/jenkins/jenkins-slave/workspace/Lucene-Solr-Tests-trunk-Java8/build.xml:784: The following error occurred while executing this line:
/x1/jenkins/jenkins-slave/workspace/Lucene-Solr-Tests-trunk-Java8/build.xml:728: The following error occurred while executing this line:
/x1/jenkins/jenkins-slave/workspace/Lucene-Solr-Tests-trunk-Java8/build.xml:59: The following error occurred while executing this line:
/x1/jenkins/jenkins-slave/workspace/Lucene-Solr-Tests-trunk-Java8/solr/build.xml:233: The following error occurred while executing this line:
/x1/jenkins/jenkins-slave/workspace/Lucene-Solr-Tests-trunk-Java8/solr/common-build.xml:516: The following error occurred while executing this line:
/x1/jenkins/jenkins-slave/workspace/Lucene-Solr-Tests-trunk-Java8/lucene/common-build.xml:1436: The following error occurred while executing this line:
/x1/jenkins/jenkins-slave/workspace/Lucene-Solr-Tests-trunk-Java8/lucene/common-build.xml:991: There were test failures: 568 suites (8 ignored), 2260 tests, 1 error, 85 ignored (70 assumptions) [seed: A3C1F353237F8CCB]

Total time: 59 minutes 11 seconds
Build step 'Invoke Ant' marked build as failure
Archiving artifacts
Recording test results
Email was triggered for: Failure - Any
Sending email for trigger: Failure - Any



Mime
View raw message