lucene-dev mailing list archives

Site index · List index
Message view « Date » · « Thread »
Top « Date » · « Thread »
From Apache Jenkins Server <jenk...@builds.apache.org>
Subject [JENKINS] Lucene-Solr-Tests-5.3-Java7 - Build # 4 - Still Failing
Date Thu, 31 Dec 2015 22:12:57 GMT
Build: https://builds.apache.org/job/Lucene-Solr-Tests-5.3-Java7/4/

1 tests failed.
FAILED:  junit.framework.TestSuite.org.apache.solr.cloud.HttpPartitionTest

Error Message:
ObjectTracker found 1 object(s) that were not released!!! [TransactionLog]

Stack Trace:
java.lang.AssertionError: ObjectTracker found 1 object(s) that were not released!!! [TransactionLog]
	at __randomizedtesting.SeedInfo.seed([7913028C5C0B35D8]:0)
	at org.junit.Assert.fail(Assert.java:93)
	at org.junit.Assert.assertTrue(Assert.java:43)
	at org.junit.Assert.assertNull(Assert.java:551)
	at org.apache.solr.SolrTestCaseJ4.afterClass(SolrTestCaseJ4.java:236)
	at sun.reflect.GeneratedMethodAccessor44.invoke(Unknown Source)
	at sun.reflect.DelegatingMethodAccessorImpl.invoke(DelegatingMethodAccessorImpl.java:43)
	at java.lang.reflect.Method.invoke(Method.java:606)
	at com.carrotsearch.randomizedtesting.RandomizedRunner.invoke(RandomizedRunner.java:1627)
	at com.carrotsearch.randomizedtesting.RandomizedRunner$5.evaluate(RandomizedRunner.java:799)
	at com.carrotsearch.randomizedtesting.rules.StatementAdapter.evaluate(StatementAdapter.java:36)
	at com.carrotsearch.randomizedtesting.rules.SystemPropertiesRestoreRule$1.evaluate(SystemPropertiesRestoreRule.java:57)
	at org.apache.lucene.util.AbstractBeforeAfterRule$1.evaluate(AbstractBeforeAfterRule.java:46)
	at com.carrotsearch.randomizedtesting.rules.StatementAdapter.evaluate(StatementAdapter.java:36)
	at org.apache.lucene.util.TestRuleStoreClassName$1.evaluate(TestRuleStoreClassName.java:42)
	at com.carrotsearch.randomizedtesting.rules.NoShadowingOrOverridesOnMethodsRule$1.evaluate(NoShadowingOrOverridesOnMethodsRule.java:39)
	at com.carrotsearch.randomizedtesting.rules.NoShadowingOrOverridesOnMethodsRule$1.evaluate(NoShadowingOrOverridesOnMethodsRule.java:39)
	at com.carrotsearch.randomizedtesting.rules.StatementAdapter.evaluate(StatementAdapter.java:36)
	at com.carrotsearch.randomizedtesting.rules.StatementAdapter.evaluate(StatementAdapter.java:36)
	at com.carrotsearch.randomizedtesting.rules.StatementAdapter.evaluate(StatementAdapter.java:36)
	at org.apache.lucene.util.TestRuleAssertionsRequired$1.evaluate(TestRuleAssertionsRequired.java:54)
	at org.apache.lucene.util.TestRuleMarkFailure$1.evaluate(TestRuleMarkFailure.java:48)
	at org.apache.lucene.util.TestRuleIgnoreAfterMaxFailures$1.evaluate(TestRuleIgnoreAfterMaxFailures.java:65)
	at org.apache.lucene.util.TestRuleIgnoreTestSuites$1.evaluate(TestRuleIgnoreTestSuites.java:55)
	at com.carrotsearch.randomizedtesting.rules.StatementAdapter.evaluate(StatementAdapter.java:36)
	at com.carrotsearch.randomizedtesting.ThreadLeakControl$StatementRunner.run(ThreadLeakControl.java:365)
	at java.lang.Thread.run(Thread.java:745)




Build Log:
[...truncated 10193 lines...]
   [junit4] Suite: org.apache.solr.cloud.HttpPartitionTest
   [junit4]   2> Creating dataDir: /x1/jenkins/jenkins-slave/workspace/Lucene-Solr-Tests-5.3-Java7/solr/build/solr-core/test/J0/temp/solr.cloud.HttpPartitionTest_7913028C5C0B35D8-001/init-core-data-001
   [junit4]   2> 472127 INFO  (SUITE-HttpPartitionTest-seed#[7913028C5C0B35D8]-worker) [    ] o.a.s.BaseDistributedSearchTestCase Setting hostContext system property: /
   [junit4]   2> 472133 INFO  (TEST-HttpPartitionTest.test-seed#[7913028C5C0B35D8]) [    ] o.a.s.c.ZkTestServer STARTING ZK TEST SERVER
   [junit4]   2> 472133 INFO  (Thread-1021) [    ] o.a.s.c.ZkTestServer client port:0.0.0.0/0.0.0.0:0
   [junit4]   2> 472133 INFO  (Thread-1021) [    ] o.a.s.c.ZkTestServer Starting server
   [junit4]   2> 472233 INFO  (TEST-HttpPartitionTest.test-seed#[7913028C5C0B35D8]) [    ] o.a.s.c.ZkTestServer start zk server on port:45447
   [junit4]   2> 472233 INFO  (TEST-HttpPartitionTest.test-seed#[7913028C5C0B35D8]) [    ] o.a.s.c.c.SolrZkClient Using default ZkCredentialsProvider
   [junit4]   2> 472265 INFO  (TEST-HttpPartitionTest.test-seed#[7913028C5C0B35D8]) [    ] o.a.s.c.c.ConnectionManager Waiting for client to connect to ZooKeeper
   [junit4]   2> 472300 INFO  (zkCallback-559-thread-1) [    ] o.a.s.c.c.ConnectionManager Watcher org.apache.solr.common.cloud.ConnectionManager@7c255c13 name:ZooKeeperConnection Watcher:127.0.0.1:45447 got event WatchedEvent state:SyncConnected type:None path:null path:null type:None
   [junit4]   2> 472300 INFO  (TEST-HttpPartitionTest.test-seed#[7913028C5C0B35D8]) [    ] o.a.s.c.c.ConnectionManager Client is connected to ZooKeeper
   [junit4]   2> 472301 INFO  (TEST-HttpPartitionTest.test-seed#[7913028C5C0B35D8]) [    ] o.a.s.c.c.SolrZkClient Using default ZkACLProvider
   [junit4]   2> 472301 INFO  (TEST-HttpPartitionTest.test-seed#[7913028C5C0B35D8]) [    ] o.a.s.c.c.SolrZkClient makePath: /solr
   [junit4]   2> 472304 INFO  (TEST-HttpPartitionTest.test-seed#[7913028C5C0B35D8]) [    ] o.a.s.c.c.SolrZkClient Using default ZkCredentialsProvider
   [junit4]   2> 472312 INFO  (TEST-HttpPartitionTest.test-seed#[7913028C5C0B35D8]) [    ] o.a.s.c.c.ConnectionManager Waiting for client to connect to ZooKeeper
   [junit4]   2> 472315 INFO  (zkCallback-560-thread-1) [    ] o.a.s.c.c.ConnectionManager Watcher org.apache.solr.common.cloud.ConnectionManager@c658af0 name:ZooKeeperConnection Watcher:127.0.0.1:45447/solr got event WatchedEvent state:SyncConnected type:None path:null path:null type:None
   [junit4]   2> 472320 INFO  (TEST-HttpPartitionTest.test-seed#[7913028C5C0B35D8]) [    ] o.a.s.c.c.ConnectionManager Client is connected to ZooKeeper
   [junit4]   2> 472320 INFO  (TEST-HttpPartitionTest.test-seed#[7913028C5C0B35D8]) [    ] o.a.s.c.c.SolrZkClient Using default ZkACLProvider
   [junit4]   2> 472320 INFO  (TEST-HttpPartitionTest.test-seed#[7913028C5C0B35D8]) [    ] o.a.s.c.c.SolrZkClient makePath: /collections/collection1
   [junit4]   2> 472323 INFO  (TEST-HttpPartitionTest.test-seed#[7913028C5C0B35D8]) [    ] o.a.s.c.c.SolrZkClient makePath: /collections/collection1/shards
   [junit4]   2> 472324 INFO  (TEST-HttpPartitionTest.test-seed#[7913028C5C0B35D8]) [    ] o.a.s.c.c.SolrZkClient makePath: /collections/control_collection
   [junit4]   2> 472325 INFO  (TEST-HttpPartitionTest.test-seed#[7913028C5C0B35D8]) [    ] o.a.s.c.c.SolrZkClient makePath: /collections/control_collection/shards
   [junit4]   2> 472326 INFO  (TEST-HttpPartitionTest.test-seed#[7913028C5C0B35D8]) [    ] o.a.s.c.AbstractZkTestCase put /x1/jenkins/jenkins-slave/workspace/Lucene-Solr-Tests-5.3-Java7/solr/core/src/test-files/solr/collection1/conf/solrconfig-tlog.xml to /configs/conf1/solrconfig.xml
   [junit4]   2> 472327 INFO  (TEST-HttpPartitionTest.test-seed#[7913028C5C0B35D8]) [    ] o.a.s.c.c.SolrZkClient makePath: /configs/conf1/solrconfig.xml
   [junit4]   2> 472328 INFO  (TEST-HttpPartitionTest.test-seed#[7913028C5C0B35D8]) [    ] o.a.s.c.AbstractZkTestCase put /x1/jenkins/jenkins-slave/workspace/Lucene-Solr-Tests-5.3-Java7/solr/core/src/test-files/solr/collection1/conf/schema.xml to /configs/conf1/schema.xml
   [junit4]   2> 472329 INFO  (TEST-HttpPartitionTest.test-seed#[7913028C5C0B35D8]) [    ] o.a.s.c.c.SolrZkClient makePath: /configs/conf1/schema.xml
   [junit4]   2> 472330 INFO  (TEST-HttpPartitionTest.test-seed#[7913028C5C0B35D8]) [    ] o.a.s.c.AbstractZkTestCase put /x1/jenkins/jenkins-slave/workspace/Lucene-Solr-Tests-5.3-Java7/solr/core/src/test-files/solr/collection1/conf/solrconfig.snippet.randomindexconfig.xml to /configs/conf1/solrconfig.snippet.randomindexconfig.xml
   [junit4]   2> 472330 INFO  (TEST-HttpPartitionTest.test-seed#[7913028C5C0B35D8]) [    ] o.a.s.c.c.SolrZkClient makePath: /configs/conf1/solrconfig.snippet.randomindexconfig.xml
   [junit4]   2> 472332 INFO  (TEST-HttpPartitionTest.test-seed#[7913028C5C0B35D8]) [    ] o.a.s.c.AbstractZkTestCase put /x1/jenkins/jenkins-slave/workspace/Lucene-Solr-Tests-5.3-Java7/solr/core/src/test-files/solr/collection1/conf/stopwords.txt to /configs/conf1/stopwords.txt
   [junit4]   2> 472332 INFO  (TEST-HttpPartitionTest.test-seed#[7913028C5C0B35D8]) [    ] o.a.s.c.c.SolrZkClient makePath: /configs/conf1/stopwords.txt
   [junit4]   2> 472333 INFO  (TEST-HttpPartitionTest.test-seed#[7913028C5C0B35D8]) [    ] o.a.s.c.AbstractZkTestCase put /x1/jenkins/jenkins-slave/workspace/Lucene-Solr-Tests-5.3-Java7/solr/core/src/test-files/solr/collection1/conf/protwords.txt to /configs/conf1/protwords.txt
   [junit4]   2> 472333 INFO  (TEST-HttpPartitionTest.test-seed#[7913028C5C0B35D8]) [    ] o.a.s.c.c.SolrZkClient makePath: /configs/conf1/protwords.txt
   [junit4]   2> 472334 INFO  (TEST-HttpPartitionTest.test-seed#[7913028C5C0B35D8]) [    ] o.a.s.c.AbstractZkTestCase put /x1/jenkins/jenkins-slave/workspace/Lucene-Solr-Tests-5.3-Java7/solr/core/src/test-files/solr/collection1/conf/currency.xml to /configs/conf1/currency.xml
   [junit4]   2> 472335 INFO  (TEST-HttpPartitionTest.test-seed#[7913028C5C0B35D8]) [    ] o.a.s.c.c.SolrZkClient makePath: /configs/conf1/currency.xml
   [junit4]   2> 472336 INFO  (TEST-HttpPartitionTest.test-seed#[7913028C5C0B35D8]) [    ] o.a.s.c.AbstractZkTestCase put /x1/jenkins/jenkins-slave/workspace/Lucene-Solr-Tests-5.3-Java7/solr/core/src/test-files/solr/collection1/conf/enumsConfig.xml to /configs/conf1/enumsConfig.xml
   [junit4]   2> 472336 INFO  (TEST-HttpPartitionTest.test-seed#[7913028C5C0B35D8]) [    ] o.a.s.c.c.SolrZkClient makePath: /configs/conf1/enumsConfig.xml
   [junit4]   2> 472337 INFO  (TEST-HttpPartitionTest.test-seed#[7913028C5C0B35D8]) [    ] o.a.s.c.AbstractZkTestCase put /x1/jenkins/jenkins-slave/workspace/Lucene-Solr-Tests-5.3-Java7/solr/core/src/test-files/solr/collection1/conf/open-exchange-rates.json to /configs/conf1/open-exchange-rates.json
   [junit4]   2> 472338 INFO  (TEST-HttpPartitionTest.test-seed#[7913028C5C0B35D8]) [    ] o.a.s.c.c.SolrZkClient makePath: /configs/conf1/open-exchange-rates.json
   [junit4]   2> 472339 INFO  (TEST-HttpPartitionTest.test-seed#[7913028C5C0B35D8]) [    ] o.a.s.c.AbstractZkTestCase put /x1/jenkins/jenkins-slave/workspace/Lucene-Solr-Tests-5.3-Java7/solr/core/src/test-files/solr/collection1/conf/mapping-ISOLatin1Accent.txt to /configs/conf1/mapping-ISOLatin1Accent.txt
   [junit4]   2> 472339 INFO  (TEST-HttpPartitionTest.test-seed#[7913028C5C0B35D8]) [    ] o.a.s.c.c.SolrZkClient makePath: /configs/conf1/mapping-ISOLatin1Accent.txt
   [junit4]   2> 472340 INFO  (TEST-HttpPartitionTest.test-seed#[7913028C5C0B35D8]) [    ] o.a.s.c.AbstractZkTestCase put /x1/jenkins/jenkins-slave/workspace/Lucene-Solr-Tests-5.3-Java7/solr/core/src/test-files/solr/collection1/conf/old_synonyms.txt to /configs/conf1/old_synonyms.txt
   [junit4]   2> 472340 INFO  (TEST-HttpPartitionTest.test-seed#[7913028C5C0B35D8]) [    ] o.a.s.c.c.SolrZkClient makePath: /configs/conf1/old_synonyms.txt
   [junit4]   2> 472342 INFO  (TEST-HttpPartitionTest.test-seed#[7913028C5C0B35D8]) [    ] o.a.s.c.AbstractZkTestCase put /x1/jenkins/jenkins-slave/workspace/Lucene-Solr-Tests-5.3-Java7/solr/core/src/test-files/solr/collection1/conf/synonyms.txt to /configs/conf1/synonyms.txt
   [junit4]   2> 472342 INFO  (TEST-HttpPartitionTest.test-seed#[7913028C5C0B35D8]) [    ] o.a.s.c.c.SolrZkClient makePath: /configs/conf1/synonyms.txt
   [junit4]   2> 472943 INFO  (TEST-HttpPartitionTest.test-seed#[7913028C5C0B35D8]) [    ] o.a.s.SolrTestCaseJ4 Writing core.properties file to /x1/jenkins/jenkins-slave/workspace/Lucene-Solr-Tests-5.3-Java7/solr/build/solr-core/test/J0/temp/solr.cloud.HttpPartitionTest_7913028C5C0B35D8-001/control-001/cores/collection1
   [junit4]   2> 472945 INFO  (TEST-HttpPartitionTest.test-seed#[7913028C5C0B35D8]) [    ] o.e.j.s.Server jetty-9.2.11.v20150529
   [junit4]   2> 472994 INFO  (TEST-HttpPartitionTest.test-seed#[7913028C5C0B35D8]) [    ] o.e.j.s.h.ContextHandler Started o.e.j.s.ServletContextHandler@49ad3eb0{/,null,AVAILABLE}
   [junit4]   2> 473000 INFO  (TEST-HttpPartitionTest.test-seed#[7913028C5C0B35D8]) [    ] o.e.j.s.ServerConnector Started ServerConnector@d1cdb18{HTTP/1.1}{127.0.0.1:38198}
   [junit4]   2> 473001 INFO  (TEST-HttpPartitionTest.test-seed#[7913028C5C0B35D8]) [    ] o.e.j.s.Server Started @476063ms
   [junit4]   2> 473001 INFO  (TEST-HttpPartitionTest.test-seed#[7913028C5C0B35D8]) [    ] o.a.s.c.s.e.JettySolrRunner Jetty properties: {hostPort=33107, solr.data.dir=/x1/jenkins/jenkins-slave/workspace/Lucene-Solr-Tests-5.3-Java7/solr/build/solr-core/test/J0/temp/solr.cloud.HttpPartitionTest_7913028C5C0B35D8-001/tempDir-001/control/data, hostContext=/, coreRootDirectory=/x1/jenkins/jenkins-slave/workspace/Lucene-Solr-Tests-5.3-Java7/solr/build/solr-core/test/J0/temp/solr.cloud.HttpPartitionTest_7913028C5C0B35D8-001/control-001/cores}
   [junit4]   2> 473001 INFO  (TEST-HttpPartitionTest.test-seed#[7913028C5C0B35D8]) [    ] o.a.s.s.SolrDispatchFilter SolrDispatchFilter.init(): sun.misc.Launcher$AppClassLoader@7b3cb2c6
   [junit4]   2> 473001 INFO  (TEST-HttpPartitionTest.test-seed#[7913028C5C0B35D8]) [    ] o.a.s.c.SolrResourceLoader new SolrResourceLoader for directory: '/x1/jenkins/jenkins-slave/workspace/Lucene-Solr-Tests-5.3-Java7/solr/build/solr-core/test/J0/temp/solr.cloud.HttpPartitionTest_7913028C5C0B35D8-001/control-001/'
   [junit4]   2> 473019 INFO  (TEST-HttpPartitionTest.test-seed#[7913028C5C0B35D8]) [    ] o.a.s.c.c.SolrZkClient Using default ZkCredentialsProvider
   [junit4]   2> 473128 INFO  (TEST-HttpPartitionTest.test-seed#[7913028C5C0B35D8]) [    ] o.a.s.c.c.ConnectionManager Waiting for client to connect to ZooKeeper
   [junit4]   2> 473141 INFO  (zkCallback-561-thread-1) [    ] o.a.s.c.c.ConnectionManager Watcher org.apache.solr.common.cloud.ConnectionManager@2887223b name:ZooKeeperConnection Watcher:127.0.0.1:45447/solr got event WatchedEvent state:SyncConnected type:None path:null path:null type:None
   [junit4]   2> 473142 INFO  (TEST-HttpPartitionTest.test-seed#[7913028C5C0B35D8]) [    ] o.a.s.c.c.ConnectionManager Client is connected to ZooKeeper
   [junit4]   2> 473142 INFO  (TEST-HttpPartitionTest.test-seed#[7913028C5C0B35D8]) [    ] o.a.s.c.c.SolrZkClient Using default ZkACLProvider
   [junit4]   2> 473144 INFO  (TEST-HttpPartitionTest.test-seed#[7913028C5C0B35D8]) [    ] o.a.s.s.SolrDispatchFilter Loading solr.xml from SolrHome (not found in ZooKeeper)
   [junit4]   2> 473145 INFO  (TEST-HttpPartitionTest.test-seed#[7913028C5C0B35D8]) [    ] o.a.s.c.SolrXmlConfig Loading container configuration from /x1/jenkins/jenkins-slave/workspace/Lucene-Solr-Tests-5.3-Java7/solr/build/solr-core/test/J0/temp/solr.cloud.HttpPartitionTest_7913028C5C0B35D8-001/control-001/solr.xml
   [junit4]   2> 473201 INFO  (TEST-HttpPartitionTest.test-seed#[7913028C5C0B35D8]) [    ] o.a.s.c.CoresLocator Config-defined core root directory: /x1/jenkins/jenkins-slave/workspace/Lucene-Solr-Tests-5.3-Java7/solr/build/solr-core/test/J0/temp/solr.cloud.HttpPartitionTest_7913028C5C0B35D8-001/control-001/cores
   [junit4]   2> 473201 INFO  (TEST-HttpPartitionTest.test-seed#[7913028C5C0B35D8]) [    ] o.a.s.c.CoreContainer New CoreContainer 1071604171
   [junit4]   2> 473201 INFO  (TEST-HttpPartitionTest.test-seed#[7913028C5C0B35D8]) [    ] o.a.s.c.CoreContainer Loading cores into CoreContainer [instanceDir=/x1/jenkins/jenkins-slave/workspace/Lucene-Solr-Tests-5.3-Java7/solr/build/solr-core/test/J0/temp/solr.cloud.HttpPartitionTest_7913028C5C0B35D8-001/control-001/]
   [junit4]   2> 473201 INFO  (TEST-HttpPartitionTest.test-seed#[7913028C5C0B35D8]) [    ] o.a.s.c.CoreContainer loading shared library: /x1/jenkins/jenkins-slave/workspace/Lucene-Solr-Tests-5.3-Java7/solr/build/solr-core/test/J0/temp/solr.cloud.HttpPartitionTest_7913028C5C0B35D8-001/control-001/lib
   [junit4]   2> 473202 WARN  (TEST-HttpPartitionTest.test-seed#[7913028C5C0B35D8]) [    ] o.a.s.c.SolrResourceLoader Can't find (or read) directory to add to classloader: lib (resolved as: /x1/jenkins/jenkins-slave/workspace/Lucene-Solr-Tests-5.3-Java7/solr/build/solr-core/test/J0/temp/solr.cloud.HttpPartitionTest_7913028C5C0B35D8-001/control-001/lib).
   [junit4]   2> 473219 INFO  (TEST-HttpPartitionTest.test-seed#[7913028C5C0B35D8]) [    ] o.a.s.h.c.HttpShardHandlerFactory created with socketTimeout : 90000,urlScheme : ,connTimeout : 15000,maxConnectionsPerHost : 20,maxConnections : 10000,corePoolSize : 0,maximumPoolSize : 2147483647,maxThreadIdleTime : 5,sizeOfQueue : -1,fairnessPolicy : false,useRetries : false,
   [junit4]   2> 473221 INFO  (TEST-HttpPartitionTest.test-seed#[7913028C5C0B35D8]) [    ] o.a.s.u.UpdateShardHandler Creating UpdateShardHandler HTTP client with params: socketTimeout=340000&connTimeout=45000&retry=true
   [junit4]   2> 473222 INFO  (TEST-HttpPartitionTest.test-seed#[7913028C5C0B35D8]) [    ] o.a.s.l.LogWatcher SLF4J impl is org.slf4j.impl.Log4jLoggerFactory
   [junit4]   2> 473222 INFO  (TEST-HttpPartitionTest.test-seed#[7913028C5C0B35D8]) [    ] o.a.s.l.LogWatcher Registering Log Listener [Log4j (org.slf4j.impl.Log4jLoggerFactory)]
   [junit4]   2> 473222 INFO  (TEST-HttpPartitionTest.test-seed#[7913028C5C0B35D8]) [    ] o.a.s.c.ZkContainer Zookeeper client=127.0.0.1:45447/solr
   [junit4]   2> 473222 INFO  (TEST-HttpPartitionTest.test-seed#[7913028C5C0B35D8]) [    ] o.a.s.c.ZkController zkHost includes chroot
   [junit4]   2> 473222 INFO  (TEST-HttpPartitionTest.test-seed#[7913028C5C0B35D8]) [    ] o.a.s.c.c.SolrZkClient Using default ZkCredentialsProvider
   [junit4]   2> 473235 INFO  (TEST-HttpPartitionTest.test-seed#[7913028C5C0B35D8]) [    ] o.a.s.c.c.ConnectionManager Waiting for client to connect to ZooKeeper
   [junit4]   2> 473244 INFO  (zkCallback-563-thread-1) [    ] o.a.s.c.c.ConnectionManager Watcher org.apache.solr.common.cloud.ConnectionManager@28cf3576 name:ZooKeeperConnection Watcher:127.0.0.1:45447 got event WatchedEvent state:SyncConnected type:None path:null path:null type:None
   [junit4]   2> 473284 INFO  (TEST-HttpPartitionTest.test-seed#[7913028C5C0B35D8]) [    ] o.a.s.c.c.ConnectionManager Client is connected to ZooKeeper
   [junit4]   2> 473284 INFO  (TEST-HttpPartitionTest.test-seed#[7913028C5C0B35D8]) [    ] o.a.s.c.c.SolrZkClient Using default ZkACLProvider
   [junit4]   2> 473296 INFO  (TEST-HttpPartitionTest.test-seed#[7913028C5C0B35D8]) [n:127.0.0.1:33107_    ] o.a.s.c.c.ConnectionManager Waiting for client to connect to ZooKeeper
   [junit4]   2> 473324 INFO  (zkCallback-564-thread-1-processing-n:127.0.0.1:33107_) [n:127.0.0.1:33107_    ] o.a.s.c.c.ConnectionManager Watcher org.apache.solr.common.cloud.ConnectionManager@1d101131 name:ZooKeeperConnection Watcher:127.0.0.1:45447/solr got event WatchedEvent state:SyncConnected type:None path:null path:null type:None
   [junit4]   2> 473324 INFO  (TEST-HttpPartitionTest.test-seed#[7913028C5C0B35D8]) [n:127.0.0.1:33107_    ] o.a.s.c.c.ConnectionManager Client is connected to ZooKeeper
   [junit4]   2> 473326 INFO  (TEST-HttpPartitionTest.test-seed#[7913028C5C0B35D8]) [n:127.0.0.1:33107_    ] o.a.s.c.c.SolrZkClient makePath: /overseer/queue
   [junit4]   2> 473327 INFO  (TEST-HttpPartitionTest.test-seed#[7913028C5C0B35D8]) [n:127.0.0.1:33107_    ] o.a.s.c.c.SolrZkClient makePath: /overseer/collection-queue-work
   [junit4]   2> 473329 INFO  (TEST-HttpPartitionTest.test-seed#[7913028C5C0B35D8]) [n:127.0.0.1:33107_    ] o.a.s.c.c.SolrZkClient makePath: /overseer/collection-map-running
   [junit4]   2> 473331 INFO  (TEST-HttpPartitionTest.test-seed#[7913028C5C0B35D8]) [n:127.0.0.1:33107_    ] o.a.s.c.c.SolrZkClient makePath: /overseer/collection-map-completed
   [junit4]   2> 473332 INFO  (TEST-HttpPartitionTest.test-seed#[7913028C5C0B35D8]) [n:127.0.0.1:33107_    ] o.a.s.c.c.SolrZkClient makePath: /overseer/collection-map-failure
   [junit4]   2> 473334 INFO  (TEST-HttpPartitionTest.test-seed#[7913028C5C0B35D8]) [n:127.0.0.1:33107_    ] o.a.s.c.c.SolrZkClient makePath: /live_nodes
   [junit4]   2> 473335 INFO  (TEST-HttpPartitionTest.test-seed#[7913028C5C0B35D8]) [n:127.0.0.1:33107_    ] o.a.s.c.c.SolrZkClient makePath: /aliases.json
   [junit4]   2> 473350 INFO  (TEST-HttpPartitionTest.test-seed#[7913028C5C0B35D8]) [n:127.0.0.1:33107_    ] o.a.s.c.c.SolrZkClient makePath: /clusterstate.json
   [junit4]   2> 473356 INFO  (TEST-HttpPartitionTest.test-seed#[7913028C5C0B35D8]) [n:127.0.0.1:33107_    ] o.a.s.c.c.SolrZkClient makePath: /security.json
   [junit4]   2> 473357 INFO  (TEST-HttpPartitionTest.test-seed#[7913028C5C0B35D8]) [n:127.0.0.1:33107_    ] o.a.s.c.ZkController Register node as live in ZooKeeper:/live_nodes/127.0.0.1:33107_
   [junit4]   2> 473358 INFO  (TEST-HttpPartitionTest.test-seed#[7913028C5C0B35D8]) [n:127.0.0.1:33107_    ] o.a.s.c.c.SolrZkClient makePath: /live_nodes/127.0.0.1:33107_
   [junit4]   2> 473360 INFO  (TEST-HttpPartitionTest.test-seed#[7913028C5C0B35D8]) [n:127.0.0.1:33107_    ] o.a.s.c.c.SolrZkClient makePath: /overseer_elect
   [junit4]   2> 473362 INFO  (TEST-HttpPartitionTest.test-seed#[7913028C5C0B35D8]) [n:127.0.0.1:33107_    ] o.a.s.c.c.SolrZkClient makePath: /overseer_elect/election
   [junit4]   2> 473364 INFO  (TEST-HttpPartitionTest.test-seed#[7913028C5C0B35D8]) [n:127.0.0.1:33107_    ] o.a.s.c.Overseer Overseer (id=null) closing
   [junit4]   2> 473365 INFO  (TEST-HttpPartitionTest.test-seed#[7913028C5C0B35D8]) [n:127.0.0.1:33107_    ] o.a.s.c.LeaderElector Joined leadership election with path: /overseer_elect/election/95131940745838596-127.0.0.1:33107_-n_0000000000
   [junit4]   2> 473366 INFO  (TEST-HttpPartitionTest.test-seed#[7913028C5C0B35D8]) [n:127.0.0.1:33107_    ] o.a.s.c.OverseerElectionContext I am going to be the leader 127.0.0.1:33107_
   [junit4]   2> 473366 INFO  (TEST-HttpPartitionTest.test-seed#[7913028C5C0B35D8]) [n:127.0.0.1:33107_    ] o.a.s.c.c.SolrZkClient makePath: /overseer_elect/leader
   [junit4]   2> 473367 INFO  (TEST-HttpPartitionTest.test-seed#[7913028C5C0B35D8]) [n:127.0.0.1:33107_    ] o.a.s.c.Overseer Overseer (id=95131940745838596-127.0.0.1:33107_-n_0000000000) starting
   [junit4]   2> 473369 INFO  (TEST-HttpPartitionTest.test-seed#[7913028C5C0B35D8]) [n:127.0.0.1:33107_    ] o.a.s.c.c.SolrZkClient makePath: /overseer/queue-work
   [junit4]   2> 473402 INFO  (TEST-HttpPartitionTest.test-seed#[7913028C5C0B35D8]) [n:127.0.0.1:33107_    ] o.a.s.c.OverseerAutoReplicaFailoverThread Starting OverseerAutoReplicaFailoverThread autoReplicaFailoverWorkLoopDelay=10000 autoReplicaFailoverWaitAfterExpiration=30000 autoReplicaFailoverBadNodeExpiration=60000
   [junit4]   2> 473416 INFO  (OverseerCollectionProcessor-95131940745838596-127.0.0.1:33107_-n_0000000000) [n:127.0.0.1:33107_    ] o.a.s.c.OverseerCollectionProcessor Process current queue of collection creations
   [junit4]   2> 473416 INFO  (OverseerStateUpdate-95131940745838596-127.0.0.1:33107_-n_0000000000) [n:127.0.0.1:33107_    ] o.a.s.c.Overseer Starting to work on the main queue
   [junit4]   2> 473428 INFO  (TEST-HttpPartitionTest.test-seed#[7913028C5C0B35D8]) [n:127.0.0.1:33107_    ] o.a.s.c.c.ZkStateReader Updating cluster state from ZooKeeper... 
   [junit4]   2> 473454 INFO  (TEST-HttpPartitionTest.test-seed#[7913028C5C0B35D8]) [n:127.0.0.1:33107_    ] o.a.s.c.CoreContainer Security conf doesn't exist. Skipping setup for authorization module.
   [junit4]   2> 473454 INFO  (TEST-HttpPartitionTest.test-seed#[7913028C5C0B35D8]) [n:127.0.0.1:33107_    ] o.a.s.c.CoreContainer No authentication plugin used.
   [junit4]   2> 473455 INFO  (TEST-HttpPartitionTest.test-seed#[7913028C5C0B35D8]) [n:127.0.0.1:33107_    ] o.a.s.c.CoresLocator Looking for core definitions underneath /x1/jenkins/jenkins-slave/workspace/Lucene-Solr-Tests-5.3-Java7/solr/build/solr-core/test/J0/temp/solr.cloud.HttpPartitionTest_7913028C5C0B35D8-001/control-001/cores
   [junit4]   2> 473456 INFO  (TEST-HttpPartitionTest.test-seed#[7913028C5C0B35D8]) [n:127.0.0.1:33107_    ] o.a.s.c.SolrCore Created CoreDescriptor: {instanceDir=/x1/jenkins/jenkins-slave/workspace/Lucene-Solr-Tests-5.3-Java7/solr/build/solr-core/test/J0/temp/solr.cloud.HttpPartitionTest_7913028C5C0B35D8-001/control-001/cores/collection1, config=solrconfig.xml, dataDir=data/, transient=false, loadOnStartup=true, shard=, absoluteInstDir=/x1/jenkins/jenkins-slave/workspace/Lucene-Solr-Tests-5.3-Java7/solr/build/solr-core/test/J0/temp/solr.cloud.HttpPartitionTest_7913028C5C0B35D8-001/control-001/cores/collection1/, configSetProperties=configsetprops.json, schema=schema.xml, collection=control_collection, coreNodeName=, name=collection1}
   [junit4]   2> 473456 INFO  (TEST-HttpPartitionTest.test-seed#[7913028C5C0B35D8]) [n:127.0.0.1:33107_    ] o.a.s.c.CoresLocator Found core collection1 in /x1/jenkins/jenkins-slave/workspace/Lucene-Solr-Tests-5.3-Java7/solr/build/solr-core/test/J0/temp/solr.cloud.HttpPartitionTest_7913028C5C0B35D8-001/control-001/cores/collection1/
   [junit4]   2> 473457 INFO  (TEST-HttpPartitionTest.test-seed#[7913028C5C0B35D8]) [n:127.0.0.1:33107_    ] o.a.s.c.CoresLocator Found 1 core definitions
   [junit4]   2> 473458 INFO  (TEST-HttpPartitionTest.test-seed#[7913028C5C0B35D8]) [n:127.0.0.1:33107_    ] o.a.s.s.SolrDispatchFilter user.dir=/x1/jenkins/jenkins-slave/workspace/Lucene-Solr-Tests-5.3-Java7/solr/build/solr-core/test/J0
   [junit4]   2> 473458 INFO  (TEST-HttpPartitionTest.test-seed#[7913028C5C0B35D8]) [n:127.0.0.1:33107_    ] o.a.s.s.SolrDispatchFilter SolrDispatchFilter.init() done
   [junit4]   2> 473458 INFO  (coreLoadExecutor-1088-thread-1-processing-n:127.0.0.1:33107_) [n:127.0.0.1:33107_ c:control_collection   x:collection1] o.a.s.c.ZkController publishing state=down
   [junit4]   2> 473458 INFO  (coreLoadExecutor-1088-thread-1-processing-n:127.0.0.1:33107_) [n:127.0.0.1:33107_ c:control_collection   x:collection1] o.a.s.c.ZkController numShards not found on descriptor - reading it from system property
   [junit4]   2> 473489 INFO  (zkCallback-564-thread-1-processing-n:127.0.0.1:33107_) [n:127.0.0.1:33107_    ] o.a.s.c.DistributedQueue NodeChildrenChanged fired on path /overseer/queue state SyncConnected
   [junit4]   2> 473489 INFO  (OverseerStateUpdate-95131940745838596-127.0.0.1:33107_-n_0000000000) [n:127.0.0.1:33107_    ] o.a.s.c.Overseer processMessage: queueSize: 1, message = {
   [junit4]   2>   "core":"collection1",
   [junit4]   2>   "roles":null,
   [junit4]   2>   "state":"down",
   [junit4]   2>   "base_url":"http://127.0.0.1:33107",
   [junit4]   2>   "collection":"control_collection",
   [junit4]   2>   "operation":"state",
   [junit4]   2>   "numShards":"1",
   [junit4]   2>   "shard":null,
   [junit4]   2>   "node_name":"127.0.0.1:33107_"} current state version: 0
   [junit4]   2> 473490 INFO  (coreLoadExecutor-1088-thread-1-processing-n:127.0.0.1:33107_) [n:127.0.0.1:33107_ c:control_collection   x:collection1] o.a.s.c.ZkController look for our core node name
   [junit4]   2> 473490 INFO  (OverseerStateUpdate-95131940745838596-127.0.0.1:33107_-n_0000000000) [n:127.0.0.1:33107_    ] o.a.s.c.o.ReplicaMutator Update state numShards=1 message={
   [junit4]   2>   "core":"collection1",
   [junit4]   2>   "roles":null,
   [junit4]   2>   "state":"down",
   [junit4]   2>   "base_url":"http://127.0.0.1:33107",
   [junit4]   2>   "collection":"control_collection",
   [junit4]   2>   "operation":"state",
   [junit4]   2>   "numShards":"1",
   [junit4]   2>   "shard":null,
   [junit4]   2>   "node_name":"127.0.0.1:33107_"}
   [junit4]   2> 473490 INFO  (OverseerStateUpdate-95131940745838596-127.0.0.1:33107_-n_0000000000) [n:127.0.0.1:33107_    ] o.a.s.c.o.ClusterStateMutator building a new cName: control_collection
   [junit4]   2> 473490 INFO  (OverseerStateUpdate-95131940745838596-127.0.0.1:33107_-n_0000000000) [n:127.0.0.1:33107_    ] o.a.s.c.o.ReplicaMutator Assigning new node to shard shard=shard1
   [junit4]   2> 473491 INFO  (zkCallback-564-thread-1-processing-n:127.0.0.1:33107_) [n:127.0.0.1:33107_    ] o.a.s.c.c.ZkStateReader A cluster state change: WatchedEvent state:SyncConnected type:NodeDataChanged path:/clusterstate.json, has occurred - updating... (live nodes size: 1)
   [junit4]   2> 473500 INFO  (zkCallback-564-thread-1-processing-n:127.0.0.1:33107_) [n:127.0.0.1:33107_    ] o.a.s.c.c.ZkStateReader Updated cluster state version to 1
   [junit4]   2> 474492 INFO  (coreLoadExecutor-1088-thread-1-processing-n:127.0.0.1:33107_) [n:127.0.0.1:33107_ c:control_collection   x:collection1] o.a.s.c.ZkController waiting to find shard id in clusterstate for collection1
   [junit4]   2> 474492 INFO  (coreLoadExecutor-1088-thread-1-processing-n:127.0.0.1:33107_) [n:127.0.0.1:33107_ c:control_collection   x:collection1] o.a.s.c.ZkController Check for collection zkNode:control_collection
   [junit4]   2> 474492 INFO  (coreLoadExecutor-1088-thread-1-processing-n:127.0.0.1:33107_) [n:127.0.0.1:33107_ c:control_collection   x:collection1] o.a.s.c.ZkController Collection zkNode exists
   [junit4]   2> 474492 INFO  (coreLoadExecutor-1088-thread-1-processing-n:127.0.0.1:33107_) [n:127.0.0.1:33107_ c:control_collection   x:collection1] o.a.s.c.c.ZkStateReader Load collection config from:/collections/control_collection
   [junit4]   2> 474493 INFO  (coreLoadExecutor-1088-thread-1-processing-n:127.0.0.1:33107_) [n:127.0.0.1:33107_ c:control_collection   x:collection1] o.a.s.c.c.ZkStateReader path=/collections/control_collection configName=conf1 specified config exists in ZooKeeper
   [junit4]   2> 474493 INFO  (coreLoadExecutor-1088-thread-1-processing-n:127.0.0.1:33107_) [n:127.0.0.1:33107_ c:control_collection   x:collection1] o.a.s.c.SolrResourceLoader new SolrResourceLoader for directory: '/x1/jenkins/jenkins-slave/workspace/Lucene-Solr-Tests-5.3-Java7/solr/build/solr-core/test/J0/temp/solr.cloud.HttpPartitionTest_7913028C5C0B35D8-001/control-001/cores/collection1/'
   [junit4]   2> 474514 INFO  (coreLoadExecutor-1088-thread-1-processing-n:127.0.0.1:33107_) [n:127.0.0.1:33107_ c:control_collection   x:collection1] o.a.s.c.Config loaded config solrconfig.xml with version 0 
   [junit4]   2> 474521 INFO  (coreLoadExecutor-1088-thread-1-processing-n:127.0.0.1:33107_) [n:127.0.0.1:33107_ c:control_collection   x:collection1] o.a.s.c.SolrConfig current version of requestparams : -1
   [junit4]   2> 474534 INFO  (coreLoadExecutor-1088-thread-1-processing-n:127.0.0.1:33107_) [n:127.0.0.1:33107_ c:control_collection   x:collection1] o.a.s.c.SolrConfig Using Lucene MatchVersion: 5.3.2
   [junit4]   2> 474564 INFO  (coreLoadExecutor-1088-thread-1-processing-n:127.0.0.1:33107_) [n:127.0.0.1:33107_ c:control_collection   x:collection1] o.a.s.c.Config Loaded SolrConfig: solrconfig.xml
   [junit4]   2> 474565 INFO  (coreLoadExecutor-1088-thread-1-processing-n:127.0.0.1:33107_) [n:127.0.0.1:33107_ c:control_collection   x:collection1] o.a.s.s.IndexSchema Reading Solr Schema from /configs/conf1/schema.xml
   [junit4]   2> 474573 INFO  (coreLoadExecutor-1088-thread-1-processing-n:127.0.0.1:33107_) [n:127.0.0.1:33107_ c:control_collection   x:collection1] o.a.s.s.IndexSchema [collection1] Schema name=test
   [junit4]   2> 475123 INFO  (coreLoadExecutor-1088-thread-1-processing-n:127.0.0.1:33107_) [n:127.0.0.1:33107_ c:control_collection   x:collection1] o.a.s.s.OpenExchangeRatesOrgProvider Initialized with rates=open-exchange-rates.json, refreshInterval=1440.
   [junit4]   2> 475133 INFO  (coreLoadExecutor-1088-thread-1-processing-n:127.0.0.1:33107_) [n:127.0.0.1:33107_ c:control_collection   x:collection1] o.a.s.s.IndexSchema default search field in schema is text
   [junit4]   2> 475135 INFO  (coreLoadExecutor-1088-thread-1-processing-n:127.0.0.1:33107_) [n:127.0.0.1:33107_ c:control_collection   x:collection1] o.a.s.s.IndexSchema unique key field: id
   [junit4]   2> 475145 INFO  (coreLoadExecutor-1088-thread-1-processing-n:127.0.0.1:33107_) [n:127.0.0.1:33107_ c:control_collection   x:collection1] o.a.s.s.FileExchangeRateProvider Reloading exchange rates from file currency.xml
   [junit4]   2> 475148 INFO  (coreLoadExecutor-1088-thread-1-processing-n:127.0.0.1:33107_) [n:127.0.0.1:33107_ c:control_collection   x:collection1] o.a.s.s.FileExchangeRateProvider Reloading exchange rates from file currency.xml
   [junit4]   2> 475151 INFO  (coreLoadExecutor-1088-thread-1-processing-n:127.0.0.1:33107_) [n:127.0.0.1:33107_ c:control_collection   x:collection1] o.a.s.s.OpenExchangeRatesOrgProvider Reloading exchange rates from open-exchange-rates.json
   [junit4]   2> 475152 WARN  (coreLoadExecutor-1088-thread-1-processing-n:127.0.0.1:33107_) [n:127.0.0.1:33107_ c:control_collection   x:collection1] o.a.s.s.OpenExchangeRatesOrgProvider Unknown key IMPORTANT NOTE
   [junit4]   2> 475152 WARN  (coreLoadExecutor-1088-thread-1-processing-n:127.0.0.1:33107_) [n:127.0.0.1:33107_ c:control_collection   x:collection1] o.a.s.s.OpenExchangeRatesOrgProvider Expected key, got STRING
   [junit4]   2> 475152 INFO  (coreLoadExecutor-1088-thread-1-processing-n:127.0.0.1:33107_) [n:127.0.0.1:33107_ c:control_collection   x:collection1] o.a.s.s.OpenExchangeRatesOrgProvider Reloading exchange rates from open-exchange-rates.json
   [junit4]   2> 475153 WARN  (coreLoadExecutor-1088-thread-1-processing-n:127.0.0.1:33107_) [n:127.0.0.1:33107_ c:control_collection   x:collection1] o.a.s.s.OpenExchangeRatesOrgProvider Unknown key IMPORTANT NOTE
   [junit4]   2> 475153 WARN  (coreLoadExecutor-1088-thread-1-processing-n:127.0.0.1:33107_) [n:127.0.0.1:33107_ c:control_collection   x:collection1] o.a.s.s.OpenExchangeRatesOrgProvider Expected key, got STRING
   [junit4]   2> 475154 INFO  (coreLoadExecutor-1088-thread-1-processing-n:127.0.0.1:33107_) [n:127.0.0.1:33107_ c:control_collection   x:collection1] o.a.s.c.ConfigSetProperties Did not find ConfigSet properties, assuming default properties: Can't find resource 'configsetprops.json' in classpath or '/configs/conf1', cwd=/x1/jenkins/jenkins-slave/workspace/Lucene-Solr-Tests-5.3-Java7/solr/build/solr-core/test/J0
   [junit4]   2> 475154 INFO  (coreLoadExecutor-1088-thread-1-processing-n:127.0.0.1:33107_) [n:127.0.0.1:33107_ c:control_collection   x:collection1] o.a.s.c.CoreContainer Creating SolrCore 'collection1' using configuration from collection control_collection
   [junit4]   2> 475154 INFO  (coreLoadExecutor-1088-thread-1-processing-n:127.0.0.1:33107_) [n:127.0.0.1:33107_ c:control_collection s:shard1 r:core_node1 x:collection1] o.a.s.c.SolrCore org.apache.solr.core.MockDirectoryFactory
   [junit4]   2> 475155 INFO  (coreLoadExecutor-1088-thread-1-processing-n:127.0.0.1:33107_) [n:127.0.0.1:33107_ c:control_collection s:shard1 r:core_node1 x:collection1] o.a.s.c.SolrCore [[collection1] ] Opening new SolrCore at [/x1/jenkins/jenkins-slave/workspace/Lucene-Solr-Tests-5.3-Java7/solr/build/solr-core/test/J0/temp/solr.cloud.HttpPartitionTest_7913028C5C0B35D8-001/control-001/cores/collection1/], dataDir=[null]
   [junit4]   2> 475155 INFO  (coreLoadExecutor-1088-thread-1-processing-n:127.0.0.1:33107_) [n:127.0.0.1:33107_ c:control_collection s:shard1 r:core_node1 x:collection1] o.a.s.c.JmxMonitoredMap JMX monitoring is enabled. Adding Solr mbeans to JMX Server: com.sun.jmx.mbeanserver.JmxMBeanServer@413c6f94
   [junit4]   2> 475156 INFO  (coreLoadExecutor-1088-thread-1-processing-n:127.0.0.1:33107_) [n:127.0.0.1:33107_ c:control_collection s:shard1 r:core_node1 x:collection1] o.a.s.c.CachingDirectoryFactory return new directory for /x1/jenkins/jenkins-slave/workspace/Lucene-Solr-Tests-5.3-Java7/solr/build/solr-core/test/J0/temp/solr.cloud.HttpPartitionTest_7913028C5C0B35D8-001/control-001/cores/collection1/data
   [junit4]   2> 475156 INFO  (coreLoadExecutor-1088-thread-1-processing-n:127.0.0.1:33107_) [n:127.0.0.1:33107_ c:control_collection s:shard1 r:core_node1 x:collection1] o.a.s.c.SolrCore New index directory detected: old=null new=/x1/jenkins/jenkins-slave/workspace/Lucene-Solr-Tests-5.3-Java7/solr/build/solr-core/test/J0/temp/solr.cloud.HttpPartitionTest_7913028C5C0B35D8-001/control-001/cores/collection1/data/index/
   [junit4]   2> 475156 WARN  (coreLoadExecutor-1088-thread-1-processing-n:127.0.0.1:33107_) [n:127.0.0.1:33107_ c:control_collection s:shard1 r:core_node1 x:collection1] o.a.s.c.SolrCore [collection1] Solr index directory '/x1/jenkins/jenkins-slave/workspace/Lucene-Solr-Tests-5.3-Java7/solr/build/solr-core/test/J0/temp/solr.cloud.HttpPartitionTest_7913028C5C0B35D8-001/control-001/cores/collection1/data/index' doesn't exist. Creating new index...
   [junit4]   2> 475156 INFO  (coreLoadExecutor-1088-thread-1-processing-n:127.0.0.1:33107_) [n:127.0.0.1:33107_ c:control_collection s:shard1 r:core_node1 x:collection1] o.a.s.c.CachingDirectoryFactory return new directory for /x1/jenkins/jenkins-slave/workspace/Lucene-Solr-Tests-5.3-Java7/solr/build/solr-core/test/J0/temp/solr.cloud.HttpPartitionTest_7913028C5C0B35D8-001/control-001/cores/collection1/data/index
   [junit4]   2> 475156 INFO  (coreLoadExecutor-1088-thread-1-processing-n:127.0.0.1:33107_) [n:127.0.0.1:33107_ c:control_collection s:shard1 r:core_node1 x:collection1] o.a.s.u.RandomMergePolicy RandomMergePolicy wrapping class org.apache.lucene.index.TieredMergePolicy: [TieredMergePolicy: maxMergeAtOnce=30, maxMergeAtOnceExplicit=19, maxMergedSegmentMB=85.345703125, floorSegmentMB=0.5078125, forceMergeDeletesPctAllowed=27.474077925868915, segmentsPerTier=23.0, maxCFSSegmentSizeMB=8.796093022207999E12, noCFSRatio=0.6240372334468764
   [junit4]   2> 475157 INFO  (coreLoadExecutor-1088-thread-1-processing-n:127.0.0.1:33107_) [n:127.0.0.1:33107_ c:control_collection s:shard1 r:core_node1 x:collection1] o.a.s.c.SolrCore SolrDeletionPolicy.onCommit: commits: num=1
   [junit4]   2> 	commit{dir=MockDirectoryWrapper(RAMDirectory@4e35ec2a lockFactory=org.apache.lucene.store.SingleInstanceLockFactory@3623e183),segFN=segments_1,generation=1}
   [junit4]   2> 475157 INFO  (coreLoadExecutor-1088-thread-1-processing-n:127.0.0.1:33107_) [n:127.0.0.1:33107_ c:control_collection s:shard1 r:core_node1 x:collection1] o.a.s.c.SolrCore newest commit generation = 1
   [junit4]   2> 475163 INFO  (coreLoadExecutor-1088-thread-1-processing-n:127.0.0.1:33107_) [n:127.0.0.1:33107_ c:control_collection s:shard1 r:core_node1 x:collection1] o.a.s.u.p.UpdateRequestProcessorChain creating updateRequestProcessorChain "nodistrib"
   [junit4]   2> 475163 INFO  (coreLoadExecutor-1088-thread-1-processing-n:127.0.0.1:33107_) [n:127.0.0.1:33107_ c:control_collection s:shard1 r:core_node1 x:collection1] o.a.s.u.p.UpdateRequestProcessorChain creating updateRequestProcessorChain "dedupe"
   [junit4]   2> 475163 INFO  (coreLoadExecutor-1088-thread-1-processing-n:127.0.0.1:33107_) [n:127.0.0.1:33107_ c:control_collection s:shard1 r:core_node1 x:collection1] o.a.s.u.p.UpdateRequestProcessorChain inserting DistributedUpdateProcessorFactory into updateRequestProcessorChain "dedupe"
   [junit4]   2> 475164 INFO  (coreLoadExecutor-1088-thread-1-processing-n:127.0.0.1:33107_) [n:127.0.0.1:33107_ c:control_collection s:shard1 r:core_node1 x:collection1] o.a.s.u.p.UpdateRequestProcessorChain creating updateRequestProcessorChain "stored_sig"
   [junit4]   2> 475164 INFO  (coreLoadExecutor-1088-thread-1-processing-n:127.0.0.1:33107_) [n:127.0.0.1:33107_ c:control_collection s:shard1 r:core_node1 x:collection1] o.a.s.u.p.UpdateRequestProcessorChain inserting DistributedUpdateProcessorFactory into updateRequestProcessorChain "stored_sig"
   [junit4]   2> 475164 INFO  (coreLoadExecutor-1088-thread-1-processing-n:127.0.0.1:33107_) [n:127.0.0.1:33107_ c:control_collection s:shard1 r:core_node1 x:collection1] o.a.s.u.p.UpdateRequestProcessorChain creating updateRequestProcessorChain "distrib-dup-test-chain-explicit"
   [junit4]   2> 475164 INFO  (coreLoadExecutor-1088-thread-1-processing-n:127.0.0.1:33107_) [n:127.0.0.1:33107_ c:control_collection s:shard1 r:core_node1 x:collection1] o.a.s.u.p.UpdateRequestProcessorChain creating updateRequestProcessorChain "distrib-dup-test-chain-implicit"
   [junit4]   2> 475165 INFO  (coreLoadExecutor-1088-thread-1-processing-n:127.0.0.1:33107_) [n:127.0.0.1:33107_ c:control_collection s:shard1 r:core_node1 x:collection1] o.a.s.u.p.UpdateRequestProcessorChain inserting DistributedUpdateProcessorFactory into updateRequestProcessorChain "distrib-dup-test-chain-implicit"
   [junit4]   2> 475165 INFO  (coreLoadExecutor-1088-thread-1-processing-n:127.0.0.1:33107_) [n:127.0.0.1:33107_ c:control_collection s:shard1 r:core_node1 x:collection1] o.a.s.c.SolrCore no updateRequestProcessorChain defined as default, creating implicit default
   [junit4]   2> 475168 INFO  (OldIndexDirectoryCleanupThreadForCore-collection1) [n:127.0.0.1:33107_ c:control_collection s:shard1 r:core_node1 x:collection1] o.a.s.c.SolrCore Looking for old index directories to cleanup for core collection1 in /x1/jenkins/jenkins-slave/workspace/Lucene-Solr-Tests-5.3-Java7/solr/build/solr-core/test/J0/temp/solr.cloud.HttpPartitionTest_7913028C5C0B35D8-001/control-001/cores/collection1/data/
   [junit4]   2> 475168 WARN  (OldIndexDirectoryCleanupThreadForCore-collection1) [n:127.0.0.1:33107_ c:control_collection s:shard1 r:core_node1 x:collection1] o.a.s.c.DirectoryFactory /x1/jenkins/jenkins-slave/workspace/Lucene-Solr-Tests-5.3-Java7/solr/build/solr-core/test/J0/temp/solr.cloud.HttpPartitionTest_7913028C5C0B35D8-001/control-001/cores/collection1/data/ does not point to a valid data directory; skipping clean-up of old index directories.
   [junit4]   2> 475170 INFO  (coreLoadExecutor-1088-thread-1-processing-n:127.0.0.1:33107_) [n:127.0.0.1:33107_ c:control_collection s:shard1 r:core_node1 x:collection1] o.a.s.h.l.XMLLoader xsltCacheLifetimeSeconds=60
   [junit4]   2> 475172 INFO  (coreLoadExecutor-1088-thread-1-processing-n:127.0.0.1:33107_) [n:127.0.0.1:33107_ c:control_collection s:shard1 r:core_node1 x:collection1] o.a.s.h.l.XMLLoader xsltCacheLifetimeSeconds=60
   [junit4]   2> 475173 INFO  (coreLoadExecutor-1088-thread-1-processing-n:127.0.0.1:33107_) [n:127.0.0.1:33107_ c:control_collection s:shard1 r:core_node1 x:collection1] o.a.s.h.l.XMLLoader xsltCacheLifetimeSeconds=60
   [junit4]   2> 475175 INFO  (coreLoadExecutor-1088-thread-1-processing-n:127.0.0.1:33107_) [n:127.0.0.1:33107_ c:control_collection s:shard1 r:core_node1 x:collection1] o.a.s.h.l.XMLLoader xsltCacheLifetimeSeconds=60
   [junit4]   2> 475179 INFO  (coreLoadExecutor-1088-thread-1-processing-n:127.0.0.1:33107_) [n:127.0.0.1:33107_ c:control_collection s:shard1 r:core_node1 x:collection1] o.a.s.c.RequestHandlers Registered paths: /admin/properties,/config,/admin/segments,/get,/admin/system,standard,/replication,/admin/luke,/update/csv,/admin/threads,/admin/file,/admin/mbeans,/schema,/admin/logging,/admin/plugins,/update/json/docs,/admin/ping,/update,/update/json
   [junit4]   2> 475180 INFO  (coreLoadExecutor-1088-thread-1-processing-n:127.0.0.1:33107_) [n:127.0.0.1:33107_ c:control_collection s:shard1 r:core_node1 x:collection1] o.a.s.c.SolrCore Using default statsCache cache: org.apache.solr.search.stats.LocalStatsCache
   [junit4]   2> 475181 INFO  (coreLoadExecutor-1088-thread-1-processing-n:127.0.0.1:33107_) [n:127.0.0.1:33107_ c:control_collection s:shard1 r:core_node1 x:collection1] o.a.s.u.UpdateHandler Using UpdateLog implementation: org.apache.solr.update.UpdateLog
   [junit4]   2> 475181 INFO  (coreLoadExecutor-1088-thread-1-processing-n:127.0.0.1:33107_) [n:127.0.0.1:33107_ c:control_collection s:shard1 r:core_node1 x:collection1] o.a.s.u.UpdateLog Initializing UpdateLog: dataDir= defaultSyncLevel=FLUSH numRecordsToKeep=100 maxNumLogsToKeep=10 numVersionBuckets=65536
   [junit4]   2> 475182 INFO  (coreLoadExecutor-1088-thread-1-processing-n:127.0.0.1:33107_) [n:127.0.0.1:33107_ c:control_collection s:shard1 r:core_node1 x:collection1] o.a.s.c.SolrCore Hard AutoCommit: disabled
   [junit4]   2> 475182 INFO  (coreLoadExecutor-1088-thread-1-processing-n:127.0.0.1:33107_) [n:127.0.0.1:33107_ c:control_collection s:shard1 r:core_node1 x:collection1] o.a.s.c.SolrCore Soft AutoCommit: disabled
   [junit4]   2> 475182 INFO  (coreLoadExecutor-1088-thread-1-processing-n:127.0.0.1:33107_) [n:127.0.0.1:33107_ c:control_collection s:shard1 r:core_node1 x:collection1] o.a.s.u.RandomMergePolicy RandomMergePolicy wrapping class org.apache.lucene.index.LogByteSizeMergePolicy: [LogByteSizeMergePolicy: minMergeSize=1677721, mergeFactor=17, maxMergeSize=2147483648, maxMergeSizeForForcedMerge=9223372036854775807, calibrateSizeByDeletes=false, maxMergeDocs=2147483647, maxCFSSegmentSizeMB=8.796093022207999E12, noCFSRatio=0.6511089431130539]
   [junit4]   2> 475183 INFO  (coreLoadExecutor-1088-thread-1-processing-n:127.0.0.1:33107_) [n:127.0.0.1:33107_ c:control_collection s:shard1 r:core_node1 x:collection1] o.a.s.c.SolrCore SolrDeletionPolicy.onInit: commits: num=1
   [junit4]   2> 	commit{dir=MockDirectoryWrapper(RAMDirectory@4e35ec2a lockFactory=org.apache.lucene.store.SingleInstanceLockFactory@3623e183),segFN=segments_1,generation=1}
   [junit4]   2> 475183 INFO  (coreLoadExecutor-1088-thread-1-processing-n:127.0.0.1:33107_) [n:127.0.0.1:33107_ c:control_collection s:shard1 r:core_node1 x:collection1] o.a.s.c.SolrCore newest commit generation = 1
   [junit4]   2> 475183 INFO  (coreLoadExecutor-1088-thread-1-processing-n:127.0.0.1:33107_) [n:127.0.0.1:33107_ c:control_collection s:shard1 r:core_node1 x:collection1] o.a.s.s.SolrIndexSearcher Opening Searcher@2829913a[collection1] main
   [junit4]   2> 475184 INFO  (coreLoadExecutor-1088-thread-1-processing-n:127.0.0.1:33107_) [n:127.0.0.1:33107_ c:control_collection s:shard1 r:core_node1 x:collection1] o.a.s.c.c.ZkStateReader Load collection config from:/collections/control_collection
   [junit4]   2> 475185 INFO  (coreLoadExecutor-1088-thread-1-processing-n:127.0.0.1:33107_) [n:127.0.0.1:33107_ c:control_collection s:shard1 r:core_node1 x:collection1] o.a.s.c.c.ZkStateReader path=/collections/control_collection configName=conf1 specified config exists in ZooKeeper
   [junit4]   2> 475185 INFO  (coreLoadExecutor-1088-thread-1-processing-n:127.0.0.1:33107_) [n:127.0.0.1:33107_ c:control_collection s:shard1 r:core_node1 x:collection1] o.a.s.r.ManagedResourceStorage Setting up ZooKeeper-based storage for the RestManager with znodeBase: /configs/conf1
   [junit4]   2> 475185 INFO  (coreLoadExecutor-1088-thread-1-processing-n:127.0.0.1:33107_) [n:127.0.0.1:33107_ c:control_collection s:shard1 r:core_node1 x:collection1] o.a.s.r.ManagedResourceStorage Configured ZooKeeperStorageIO with znodeBase: /configs/conf1
   [junit4]   2> 475185 INFO  (coreLoadExecutor-1088-thread-1-processing-n:127.0.0.1:33107_) [n:127.0.0.1:33107_ c:control_collection s:shard1 r:core_node1 x:collection1] o.a.s.r.RestManager Initializing RestManager with initArgs: {}
   [junit4]   2> 475185 INFO  (coreLoadExecutor-1088-thread-1-processing-n:127.0.0.1:33107_) [n:127.0.0.1:33107_ c:control_collection s:shard1 r:core_node1 x:collection1] o.a.s.r.ManagedResourceStorage Reading _rest_managed.json using ZooKeeperStorageIO:path=/configs/conf1
   [junit4]   2> 475186 INFO  (coreLoadExecutor-1088-thread-1-processing-n:127.0.0.1:33107_) [n:127.0.0.1:33107_ c:control_collection s:shard1 r:core_node1 x:collection1] o.a.s.r.ManagedResourceStorage No data found for znode /configs/conf1/_rest_managed.json
   [junit4]   2> 475186 INFO  (coreLoadExecutor-1088-thread-1-processing-n:127.0.0.1:33107_) [n:127.0.0.1:33107_ c:control_collection s:shard1 r:core_node1 x:collection1] o.a.s.r.ManagedResourceStorage Loaded null at path _rest_managed.json using ZooKeeperStorageIO:path=/configs/conf1
   [junit4]   2> 475186 INFO  (coreLoadExecutor-1088-thread-1-processing-n:127.0.0.1:33107_) [n:127.0.0.1:33107_ c:control_collection s:shard1 r:core_node1 x:collection1] o.a.s.r.RestManager Initializing 0 registered ManagedResources
   [junit4]   2> 475186 INFO  (coreLoadExecutor-1088-thread-1-processing-n:127.0.0.1:33107_) [n:127.0.0.1:33107_ c:control_collection s:shard1 r:core_node1 x:collection1] o.a.s.h.ReplicationHandler Commits will be reserved for  10000
   [junit4]   2> 475187 INFO  (coreLoadExecutor-1088-thread-1-processing-n:127.0.0.1:33107_) [n:127.0.0.1:33107_ c:control_collection s:shard1 r:core_node1 x:collection1] o.a.s.u.UpdateLog Looking up max value of version field to seed version buckets
   [junit4]   2> 475187 INFO  (coreLoadExecutor-1088-thread-1-processing-n:127.0.0.1:33107_) [n:127.0.0.1:33107_ c:control_collection s:shard1 r:core_node1 x:collection1] o.a.s.u.VersionInfo Refreshing highest value of _version_ for 65536 version buckets from index
   [junit4]   2> 475187 INFO  (coreLoadExecutor-1088-thread-1-processing-n:127.0.0.1:33107_) [n:127.0.0.1:33107_ c:control_collection s:shard1 r:core_node1 x:collection1] o.a.s.u.VersionInfo No terms found for _version_, cannot seed version bucket highest value from index
   [junit4]   2> 475187 INFO  (coreLoadExecutor-1088-thread-1-processing-n:127.0.0.1:33107_) [n:127.0.0.1:33107_ c:control_collection s:shard1 r:core_node1 x:collection1] o.a.s.u.UpdateLog Could not find max version in index or recent updates, using new clock 1522111055134720000
   [junit4]   2> 475189 INFO  (coreLoadExecutor-1088-thread-1-processing-n:127.0.0.1:33107_) [n:127.0.0.1:33107_ c:control_collection s:shard1 r:core_node1 x:collection1] o.a.s.u.UpdateLog Took 2 ms to seed version buckets with highest version 1522111055134720000
   [junit4]   2> 475189 INFO  (coreLoadExecutor-1088-thread-1-processing-n:127.0.0.1:33107_) [n:127.0.0.1:33107_ c:control_collection s:shard1 r:core_node1 x:collection1] o.a.s.c.ZkController watch zkdir /configs/conf1
   [junit4]   2> 475190 INFO  (coreLoadExecutor-1088-thread-1-processing-n:127.0.0.1:33107_) [n:127.0.0.1:33107_ c:control_collection s:shard1 r:core_node1 x:collection1] o.a.s.c.CoreContainer registering core: collection1
   [junit4]   2> 475190 INFO  (searcherExecutor-1089-thread-1-processing-x:collection1 r:core_node1 c:control_collection s:shard1 n:127.0.0.1:33107_) [n:127.0.0.1:33107_ c:control_collection s:shard1 r:core_node1 x:collection1] o.a.s.c.SolrCore [collection1] Registered new searcher Searcher@2829913a[collection1] main{ExitableDirectoryReader(UninvertingDirectoryReader())}
   [junit4]   2> 475191 INFO  (coreZkRegister-1082-thread-1-processing-x:collection1 r:core_node1 c:control_collection s:shard1 n:127.0.0.1:33107_) [n:127.0.0.1:33107_ c:control_collection s:shard1 r:core_node1 x:collection1] o.a.s.c.ZkController Register replica - core:collection1 address:http://127.0.0.1:33107 collection:control_collection shard:shard1
   [junit4]   2> 475191 INFO  (coreZkRegister-1082-thread-1-processing-x:collection1 r:core_node1 c:control_collection s:shard1 n:127.0.0.1:33107_) [n:127.0.0.1:33107_ c:control_collection s:shard1 r:core_node1 x:collection1] o.a.s.c.c.SolrZkClient makePath: /collections/control_collection/leader_elect/shard1/election
   [junit4]   2> 475195 INFO  (coreZkRegister-1082-thread-1-processing-x:collection1 r:core_node1 c:control_collection s:shard1 n:127.0.0.1:33107_) [n:127.0.0.1:33107_ c:control_collection s:shard1 r:core_node1 x:collection1] o.a.s.c.LeaderElector Joined leadership election with path: /collections/control_collection/leader_elect/shard1/election/95131940745838596-core_node1-n_0000000000
   [junit4]   2> 475196 INFO  (coreZkRegister-1082-thread-1-processing-x:collection1 r:core_node1 c:control_collection s:shard1 n:127.0.0.1:33107_) [n:127.0.0.1:33107_ c:control_collection s:shard1 r:core_node1 x:collection1] o.a.s.c.ShardLeaderElectionContext Running the leader process for shard shard1
   [junit4]   2> 475197 INFO  (zkCallback-564-thread-1-processing-n:127.0.0.1:33107_) [n:127.0.0.1:33107_    ] o.a.s.c.DistributedQueue NodeChildrenChanged fired on path /overseer/queue state SyncConnected
   [junit4]   2> 475198 INFO  (OverseerStateUpdate-95131940745838596-127.0.0.1:33107_-n_0000000000) [n:127.0.0.1:33107_    ] o.a.s.c.Overseer processMessage: queueSize: 1, message = {
   [junit4]   2>   "operation":"leader",
   [junit4]   2>   "shard":"shard1",
   [junit4]   2>   "collection":"control_collection"} current state version: 1
   [junit4]   2> 475199 INFO  (zkCallback-564-thread-1-processing-n:127.0.0.1:33107_) [n:127.0.0.1:33107_    ] o.a.s.c.c.ZkStateReader A cluster state change: WatchedEvent state:SyncConnected type:NodeDataChanged path:/clusterstate.json, has occurred - updating... (live nodes size: 1)
   [junit4]   2> 475201 INFO  (zkCallback-564-thread-1-processing-n:127.0.0.1:33107_) [n:127.0.0.1:33107_    ] o.a.s.c.c.ZkStateReader Updated cluster state version to 2
   [junit4]   2> 475203 INFO  (coreZkRegister-1082-thread-1-processing-x:collection1 r:core_node1 c:control_collection s:shard1 n:127.0.0.1:33107_) [n:127.0.0.1:33107_ c:control_collection s:shard1 r:core_node1 x:collection1] o.a.s.c.ShardLeaderElectionContext Enough replicas found to continue.
   [junit4]   2> 475203 INFO  (coreZkRegister-1082-thread-1-processing-x:collection1 r:core_node1 c:control_collection s:shard1 n:127.0.0.1:33107_) [n:127.0.0.1:33107_ c:control_collection s:shard1 r:core_node1 x:collection1] o.a.s.c.ShardLeaderElectionContext I may be the new leader - try and sync
   [junit4]   2> 475203 INFO  (coreZkRegister-1082-thread-1-processing-x:collection1 r:core_node1 c:control_collection s:shard1 n:127.0.0.1:33107_) [n:127.0.0.1:33107_ c:control_collection s:shard1 r:core_node1 x:collection1] o.a.s.c.SyncStrategy Sync replicas to http://127.0.0.1:33107/collection1/
   [junit4]   2> 475203 INFO  (coreZkRegister-1082-thread-1-processing-x:collection1 r:core_node1 c:control_collection s:shard1 n:127.0.0.1:33107_) [n:127.0.0.1:33107_ c:control_collection s:shard1 r:core_node1 x:collection1] o.a.s.c.SyncStrategy Sync Success - now sync replicas to me
   [junit4]   2> 475203 INFO  (coreZkRegister-1082-thread-1-processing-x:collection1 r:core_node1 c:control_collection s:shard1 n:127.0.0.1:33107_) [n:127.0.0.1:33107_ c:control_collection s:shard1 r:core_node1 x:collection1] o.a.s.c.SyncStrategy http://127.0.0.1:33107/collection1/ has no replicas
   [junit4]   2> 475203 INFO  (coreZkRegister-1082-thread-1-processing-x:collection1 r:core_node1 c:control_collection s:shard1 n:127.0.0.1:33107_) [n:127.0.0.1:33107_ c:control_collection s:shard1 r:core_node1 x:collection1] o.a.s.c.ShardLeaderElectionContext I am the new leader: http://127.0.0.1:33107/collection1/ shard1
   [junit4]   2> 475203 INFO  (coreZkRegister-1082-thread-1-processing-x:collection1 r:core_node1 c:control_collection s:shard1 n:127.0.0.1:33107_) [n:127.0.0.1:33107_ c:control_collection s:shard1 r:core_node1 x:collection1] o.a.s.c.c.SolrZkClient makePath: /collections/control_collection/leaders/shard1
   [junit4]   2> 475206 INFO  (zkCallback-564-thread-1-processing-n:127.0.0.1:33107_) [n:127.0.0.1:33107_    ] o.a.s.c.DistributedQueue NodeChildrenChanged fired on path /overseer/queue state SyncConnected
   [junit4]   2> 475207 INFO  (OverseerStateUpdate-95131940745838596-127.0.0.1:33107_-n_0000000000) [n:127.0.0.1:33107_    ] o.a.s.c.Overseer processMessage: queueSize: 1, message = {
   [junit4]   2>   "operation":"leader",
   [junit4]   2>   "shard":"shard1",
   [junit4]   2>   "collection":"control_collection",
   [junit4]   2>   "base_url":"http://127.0.0.1:33107",
   [junit4]   2>   "core":"collection1",
   [junit4]   2>   "state":"active"} current state version: 2
   [junit4]   2> 475310 INFO  (zkCallback-564-thread-1-processing-n:127.0.0.1:33107_) [n:127.0.0.1:33107_    ] o.a.s.c.c.ZkStateReader A cluster state change: WatchedEvent state:SyncConnected type:NodeDataChanged path:/clusterstate.json, has occurred - updating... (live nodes size: 1)
   [junit4]   2> 475312 INFO  (zkCallback-564-thread-1-processing-n:127.0.0.1:33107_) [n:127.0.0.1:33107_    ] o.a.s.c.c.ZkStateReader Updated cluster state version to 3
   [junit4]   2> 475360 INFO  (coreZkRegister-1082-thread-1-processing-x:collection1 r:core_node1 c:control_collection s:shard1 n:127.0.0.1:33107_) [n:127.0.0.1:33107_ c:control_collection s:shard1 r:core_node1 x:collection1] o.a.s.c.ZkController We are http://127.0.0.1:33107/collection1/ and leader is http://127.0.0.1:33107/collection1/
   [junit4]   2> 475360 INFO  (coreZkRegister-1082-thread-1-processing-x:collection1 r:core_node1 c:control_collection s:shard1 n:127.0.0.1:33107_) [n:127.0.0.1:33107_ c:control_collection s:shard1 r:core_node1 x:collection1] o.a.s.c.ZkController No LogReplay needed for core=collection1 baseURL=http://127.0.0.1:33107
   [junit4]   2> 475360 INFO  (coreZkRegister-1082-thread-1-processing-x:collection1 r:core_node1 c:control_collection s:shard1 n:127.0.0.1:33107_) [n:127.0.0.1:33107_ c:control_collection s:shard1 r:core_node1 x:collection1] o.a.s.c.ZkController I am the leader, no recovery necessary
   [junit4]   2> 475360 INFO  (coreZkRegister-1082-thread-1-processing-x:collection1 r:core_node1 c:control_collection s:shard1 n:127.0.0.1:33107_) [n:127.0.0.1:33107_ c:control_collection s:shard1 r:core_node1 x:collection1] o.a.s.c.ZkController publishing state=active
   [junit4]   2> 475360 INFO  (coreZkRegister-1082-thread-1-processing-x:collection1 r:core_node1 c:control_collection s:shard1 n:127.0.0.1:33107_) [n:127.0.0.1:33107_ c:control_collection s:shard1 r:core_node1 x:collection1] o.a.s.c.ZkController numShards not found on descriptor - reading it from system property
   [junit4]   2> 475361 INFO  (zkCallback-564-thread-1-processing-n:127.0.0.1:33107_) [n:127.0.0.1:33107_    ] o.a.s.c.DistributedQueue NodeChildrenChanged fired on path /overseer/queue state SyncConnected
   [junit4]   2> 475362 INFO  (OverseerStateUpdate-95131940745838596-127.0.0.1:33107_-n_0000000000) [n:127.0.0.1:33107_    ] o.a.s.c.Overseer processMessage: queueSize: 1, message = {
   [junit4]   2>   "core":"collection1",
   [junit4]   2>   "roles":null,
   [junit4]   2>   "state":"active",
   [junit4]   2>   "base_url":"http://127.0.0.1:33107",
   [junit4]   2>   "core_node_name":"core_node1",
   [junit4]   2>   "collection":"control_collection",
   [junit4]   2>   "operation":"state",
   [junit4]   2>   "numShards":"1",
   [junit4]   2>   "shard":"shard1",
   [junit4]   2>   "node_name":"127.0.0.1:33107_"} current state version: 3
   [junit4]   2> 475363 INFO  (OverseerStateUpdate-95131940745838596-127.0.0.1:33107_-n_0000000000) [n:127.0.0.1:33107_    ] o.a.s.c.o.ReplicaMutator Update state numShards=1 message={
   [junit4]   2>   "core":"collection1",
   [junit4]   2>   "roles":null,
   [junit4]   2>   "state":"active",
   [junit4]   2>   "base_url":"http://127.0.0.1:33107",
   [junit4]   2>   "core_node_name":"core_node1",
   [junit4]   2>   "collection":"control_collection",
   [junit4]   2>   "operation":"state",
   [junit4]   2>   "numShards":"1",
   [junit4]   2>   "shard":"shard1",
   [junit4]   2>   "node_name":"127.0.0.1:33107_"}
   [junit4]   2> 475466 INFO  (zkCallback-564-thread-1-processing-n:127.0.0.1:33107_) [n:127.0.0.1:33107_    ] o.a.s.c.c.ZkStateReader A cluster state change: WatchedEvent state:SyncConnected type:NodeDataChanged path:/clusterstate.json, has occurred - updating... (live nodes size: 1)
   [junit4]   2> 475467 INFO  (zkCallback-564-thread-1-processing-n:127.0.0.1:33107_) [n:127.0.0.1:33107_    ] o.a.s.c.c.ZkStateReader Updated cluster state version to 4
   [junit4]   2> 475471 INFO  (TEST-HttpPartitionTest.test-seed#[7913028C5C0B35D8]) [    ] o.a.s.c.c.SolrZkClient Using default ZkCredentialsProvider
   [junit4]   2> 475473 INFO  (TEST-HttpPartitionTest.test-seed#[7913028C5C0B35D8]) [    ] o.a.s.c.c.ConnectionManager Waiting for client to connect to ZooKeeper
   [junit4]   2> 475476 INFO  (zkCallback-566-thread-1) [    ] o.a.s.c.c.ConnectionManager Watcher org.apache.solr.common.cloud.ConnectionManager@1d43fa08 name:ZooKeeperConnection Watcher:127.0.0.1:45447/solr got event WatchedEvent state:SyncConnected type:None path:null path:null type:None
   [junit4]   2> 475476 INFO  (TEST-HttpPartitionTest.test-seed#[7913028C5C0B35D8]) [    ] o.a.s.c.c.ConnectionManager Client is connected to ZooKeeper
   [junit4]   2> 475476 INFO  (TEST-HttpPartitionTest.test-seed#[7913028C5C0B35D8]) [    ] o.a.s.c.c.SolrZkClient Using default ZkACLProvider
   [junit4]   2> 475476 INFO  (TEST-HttpPartitionTest.test-seed#[7913028C5C0B35D8]) [    ] o.a.s.c.c.ZkStateReader Updating cluster state from ZooKeeper... 
   [junit4]   2> 475479 INFO  (TEST-HttpPartitionTest.test-seed#[7913028C5C0B35D8]) [    ] o.a.s.c.ChaosMonkey monkey: init - expire sessions:false cause connection loss:false
   [junit4]   2> 475826 INFO  (TEST-HttpPartitionTest.test-seed#[7913028C5C0B35D8]) [    ] o.a.s.SolrTestCaseJ4 Writing core.properties file to /x1/jenkins/jenkins-slave/workspace/Lucene-Solr-Tests-5.3-Java7/solr/build/solr-core/test/J0/temp/solr.cloud.HttpPartitionTest_7913028C5C0B35D8-001/shard-1-001/cores/collection1
   [junit4]   2> 475827 INFO  (TEST-HttpPartitionTest.test-seed#[7913028C5C0B35D8]) [    ] o.a.s.c.AbstractFullDistribZkTestBase create jetty 1 in directory /x1/jenkins/jenkins-slave/workspace/Lucene-Solr-Tests-5.3-Java7/solr/build/solr-core/test/J0/temp/solr.cloud.HttpPartitionTest_7913028C5C0B35D8-001/shard-1-001
   [junit4]   2> 475828 INFO  (TEST-HttpPartitionTest.test-seed#[7913028C5C0B35D8]) [    ] o.e.j.s.Server jetty-9.2.11.v20150529
   [junit4]   2> 475831 INFO  (TEST-HttpPartitionTest.test-seed#[7913028C5C0B35D8]) [    ] o.e.j.s.h.ContextHandler Started o.e.j.s.ServletContextHandler@5fb80bef{/,null,AVAILABLE}
   [junit4]   2> 475831 INFO  (TEST-HttpPartitionTest.test-seed#[7913028C5C0B35D8]) [    ] o.e.j.s.ServerConnector Started ServerConnector@2c17a901{HTTP/1.1}{127.0.0.1:58412}
   [junit4]   2> 475832 INFO  (TEST-HttpPartitionTest.test-seed#[7913028C5C0B35D8]) [    ] o.e.j.s.Server Started @478895ms
   [junit4]   2> 475832 INFO  (TEST-HttpPartitionTest.test-seed#[7913028C5C0B35D8]) [    ] o.a.s.c.s.e.JettySolrRunner Jetty properties: {hostPort=57204, solr.data.dir=/x1/jenkins/jenkins-slave/workspace/Lucene-Solr-Tests-5.3-Java7/solr/build/solr-core/test/J0/temp/solr.cloud.HttpPartitionTest_7913028C5C0B35D8-001/tempDir-001/jetty1, coreRootDirectory=/x1/jenkins/jenkins-slave/workspace/Lucene-Solr-Tests-5.3-Java7/solr/build/solr-core/test/J0/temp/solr.cloud.HttpPartitionTest_7913028C5C0B35D8-001/shard-1-001/cores, solrconfig=solrconfig.xml, hostContext=/}
   [junit4]   2> 475833 INFO  (TEST-HttpPartitionTest.test-seed#[7913028C5C0B35D8]) [    ] o.a.s.s.SolrDispatchFilter SolrDispatchFilter.init(): sun.misc.Launcher$AppClassLoader@7b3cb2c6
   [junit4]   2> 475833 INFO  (TEST-HttpPartitionTest.test-seed#[7913028C5C0B35D8]) [    ] o.a.s.c.SolrResourceLoader new SolrResourceLoader for directory: '/x1/jenkins/jenkins-slave/workspace/Lucene-Solr-Tests-5.3-Java7/solr/build/solr-core/test/J0/temp/solr.cloud.HttpPartitionTest_7913028C5C0B35D8-001/shard-1-001/'
   [junit4]   2> 475880 INFO  (TEST-HttpPartitionTest.test-seed#[7913028C5C0B35D8]) [    ] o.a.s.c.c.SolrZkClient Using default ZkCredentialsProvider
   [junit4]   2> 475909 INFO  (TEST-HttpPartitionTest.test-seed#[7913028C5C0B35D8]) [    ] o.a.s.c.c.ConnectionManager Waiting for client to connect to ZooKeeper
   [junit4]   2> 475913 INFO  (zkCallback-567-thread-1) [    ] o.a.s.c.c.ConnectionManager Watcher org.apache.solr.common.cloud.ConnectionManager@1ecfd430 name:ZooKeeperConnection Watcher:127.0.0.1:45447/solr got event WatchedEvent state:SyncConnected type:None path:null path:null type:None
   [junit4]   2> 475913 INFO  (TEST-HttpPartitionTest.test-seed#[7913028C5C0B35D8]) [    ] o.a.s.c.c.ConnectionManager Client is connected to ZooKeeper
   [junit4]   2> 475914 INFO  (TEST-HttpPartitionTest.test-seed#[7913028C5C0B35D8]) [    ] o.a.s.c.c.SolrZkClient Using default ZkACLProvider
   [junit4]   2> 475921 INFO  (TEST-HttpPartitionTest.test-seed#[7913028C5C0B35D8]) [    ] o.a.s.s.SolrDispatchFilter Loading solr.xml from SolrHome (not found in ZooKeeper)
   [junit4]   2> 475922 INFO  (TEST-HttpPartitionTest.test-seed#[7913028C5C0B35D8]) [    ] o.a.s.c.SolrXmlConfig Loading container configuration from /x1/jenkins/jenkins-slave/workspace/Lucene-Solr-Tests-5.3-Java7/solr/build/solr-core/test/J0/temp/solr.cloud.HttpPartitionTest_7913028C5C0B35D8-001/shard-1-001/solr.xml
   [junit4]   2> 475938 INFO  (TEST-HttpPartitionTest.test-seed#[7913028C5C0B35D8]) [    ] o.a.s.c.CoresLocator Config-defined core root directory: /x1/jenkins/jenkins-slave/workspace/Lucene-Solr-Tests-5.3-Java7/solr/build/solr-core/test/J0/temp/solr.cloud.HttpPartitionTest_7913028C5C0B35D8-001/shard-1-001/cores
   [junit4]   2> 475938 INFO  (TEST-HttpPartitionTest.test-seed#[7913028C5C0B35D8]) [    ] o.a.s.c.CoreContainer New CoreContainer 1129256266
   [junit4]   2> 475938 INFO  (TEST-HttpPartitionTest.test-seed#[7913028C5C0B35D8]) [    ] o.a.s.c.CoreContainer Loading cores into CoreContainer [instanceDir=/x1/jenkins/jenkins-slave/workspace/Lucene-Solr-Tests-5.3-Java7/solr/build/solr-core/test/J0/temp/solr.cloud.HttpPartitionTest_7913028C5C0B35D8-001/shard-1-001/]
   [junit4]   2> 475938 INFO  (TEST-HttpPartitionTest.test-seed#[7913028C5C0B35D8]) [    ] o.a.s.c.CoreContainer loading shared library: /x1/jenkins/jenkins-slave/workspace/Lucene-Solr-Tests-5.3-Java7/solr/build/solr-core/test/J0/temp/solr.cloud.HttpPartitionTest_7913028C5C0B35D8-001/shard-1-001/lib
   [junit4]   2> 475938 WARN  (TEST-HttpPartitionTest.test-seed#[7913028C5C0B35D8]) [    ] o.a.s.c.SolrResourceLoader Can't find (or read) directory to add to classloader: lib (resolved as: /x1/jenkins/jenkins-slave/workspace/Lucene-Solr-Tests-5.3-Java7/solr/build/solr-core/test/J0/temp/solr.cloud.HttpPartitionTest_7913028C5C0B35D8-001/shard-1-001/lib).
   [junit4]   2> 475962 INFO  (TEST-HttpPartitionTest.test-seed#[7913028C5C0B35D8]) [    ] o.a.s.h.c.HttpShardHandlerFactory created with socketTimeout : 90000,urlScheme : ,connTimeout : 15000,maxConnectionsPerHost : 20,maxConnections : 10000,corePoolSize : 0,maximumPoolSize : 2147483647,maxThreadIdleTime : 5,sizeOfQueue : -1,fairnessPolicy : false,useRetries : false,
   [junit4]   2> 475963 INFO  (TEST-HttpPartitionTest.test-seed#[7913028C5C0B35D8]) [    ] o.a.s.u.UpdateShardHandler Creating UpdateShardHandler HTTP client with params: socketTimeout=340000&connTimeout=45000&retry=true
   [junit4]   2> 475964 INFO  (TEST-HttpPartitionTest.test-seed#[7913028C5C0B35D8]) [    ] o.a.s.l.LogWatcher SLF4J impl is org.slf4j.impl.Log4jLoggerFactory
   [junit4]   2> 475964 INFO  (TEST-HttpPartitionTest.test-seed#[7913028C5C0B35D8]) [    ] o.a.s.l.LogWatcher Registering Log Listener [Log4j (org.slf4j.impl.Log4jLoggerFactory)]
   [junit4]   2> 475964 INFO  (TEST-HttpPartitionTest.test-seed#[7913028C5C0B35D8]) [    ] o.a.s.c.ZkContainer Zookeeper client=127.0.0.1:45447/solr
   [junit4]   2> 475964 INFO  (TEST-HttpPartitionTest.test-seed#[7913028C5C0B35D8]) [    ] o.a.s.c.ZkController zkHost includes chroot
   [junit4]   2> 475965 INFO  (TEST-HttpPartitionTest.test-seed#[7913028C5C0B35D8]) [    ] o.a.s.c.c.SolrZkClient Using default ZkCredentialsProvider
   [junit4]   2> 475966 INFO  (TEST-HttpPartitionTest.test-seed#[7913028C5C0B35D8]) [    ] o.a.s.c.c.ConnectionManager Waiting for client to connect to ZooKeeper
   [junit4]   2> 475968 INFO  (zkCallback-569-thread-1) [    ] o.a.s.c.c.ConnectionManager Watcher org.apache.solr.common.cloud.ConnectionManager@49a621d name:ZooKeeperConnection Watcher:127.0.0.1:45447 got event WatchedEvent state:SyncConnected type:None path:null path:null type:None
   [junit4]   2> 475970 INFO  (TEST-HttpPartitionTest.test-seed#[7913028C5C0B35D8]) [    ] o.a.s.c.c.ConnectionManager Client is connected to ZooKeeper
   [junit4]   2> 475970 INFO  (TEST-HttpPartitionTest.test-seed#[7913028C5C0B35D8]) [    ] o.a.s.c.c.SolrZkClient Using default ZkACLProvider
   [junit4]   2> 476007 INFO  (TEST-HttpPartitionTest.test-seed#[7913028C5C0B35D8]) [n:127.0.0.1:57204_    ] o.a.s.c.c.ConnectionManager Waiting for client to connect to ZooKeeper
   [junit4]   2> 476008 INFO  (zkCallback-570-thread-1-processing-n:127.0.0.1:57204_) [n:127.0.0.1:57204_    ] o.a.s.c.c.ConnectionManager Watcher org.apache.solr.common.cloud.ConnectionManager@1c8ea1a4 name:ZooKeeperConnection Watcher:127.0.0.1:45447/solr got event WatchedEvent state:SyncConnected type:None path:null path:null type:None
   [junit4]   2> 476008 INFO  (TEST-HttpPartitionTest.test-seed#[7913028C5C0B35D8]) [n:127.0.0.1:57204_    ] o.a.s.c.c.ConnectionManager Client is connected to ZooKeeper
   [junit4]   2> 476013 INFO  (TEST-HttpPartitionTest.test-seed#[7913028C5C0B35D8]) [n:127.0.0.1:57204_    ] o.a.s.c.c.ZkStateReader Updating cluster state from ZooKeeper... 
   [junit4]   2> 477018 INFO  (TEST-HttpPartitionTest.test-seed#[7913028C5C0B35D8]) [n:127.0.0.1:57204_    ] o.a.s.c.ZkController Register node as live in ZooKeeper:/live_nodes/127.0.0.1:57204_
   [junit4]   2> 477018 INFO  (TEST-HttpPartitionTest.test-seed#[7913028C5C0B35D8]) [n:127.0.0.1:57204_    ] o.a.s.c.c.SolrZkClient makePath: /live_nodes/127.0.0.1:57204_
   [junit4]   2> 477026 INFO  (TEST-HttpPartitionTest.test-seed#[7913028C5C0B35D8]) [n:127.0.0.1:57204_    ] o.a.s.c.Overseer Overseer (id=null) closing
   [junit4]   2> 477026 INFO  (TEST-HttpPartitionTest.test-seed#[7913028C5C0B35D8]) [n:127.0.0.1:57204_    ] o.a.s.c.LeaderElector Joined leadership election with path: /overseer_elect/election/95131940745838600-127.0.0.1:57204_-n_0000000001
   [junit4]   2> 477027 INFO  (TEST-HttpPartitionTest.test-seed#[7913028C5C0B35D8]) [n:127.0.0.1:57204_    ] o.a.s.c.LeaderElector Watching path /overseer_elect/election/95131940745838596-127.0.0.1:33107_-n_0000000000 to know if I could be the leader
   [junit4]   2> 477042 INFO  (TEST-HttpPartitionTest.test-seed#[7913028C5C0B35D8]) [n:127.0.0.1:57204_    ] o.a.s.c.CoreContainer Security conf doesn't exist. Skipping setup for authorization module.
   [junit4]   2> 477042 INFO  (TEST-HttpPartitionTest.test-seed#[7913028C5C0B35D8]) [n:127.0.0.1:57204_    ] o.a.s.c.CoreContainer No authentication plugin used.
   [junit4]   2> 477043 INFO  (TEST-HttpPartitionTest.test-seed#[7913028C5C0B35D8]) [n:127.0.0.1:57204_    ] o.a.s.c.CoresLocator Looking for core definitions underneath /x1/jenkins/jenkins-slave/workspace/Lucene-Solr-Tests-5.3-Java7/solr/build/solr-core/test/J0/temp/solr.cloud.HttpPartitionTest_7913028C5C0B35D8-001/shard-1-001/cores
   [junit4]   2> 477043 INFO  (TEST-HttpPartitionTest.test-seed#[7913028C5C0B35D8]) [n:127.0.0.1:57204_    ] o.a.s.c.SolrCore Created CoreDescriptor: {coreNodeName=, shard=, absoluteInstDir=/x1/jenkins/jenkins-slave/workspace/Lucene-Solr-Tests-5.3-Java7/solr/build/solr-core/test/J0/temp/solr.cloud.HttpPartitionTest_7913028C5C0B35D8-001/shard-1-001/cores/collection1/, dataDir=data/, config=solrconfig.xml, configSetProperties=configsetprops.json, schema=schema.xml, loadOnStartup=true, name=collection1, transient=false, collection=collection1, instanceDir=/x1/jenkins/jenkins-slave/workspace/Lucene-Solr-Tests-5.3-Java7/solr/build/solr-core/test/J0/temp/solr.cloud.HttpPartitionTest_7913028C5C0B35D8-001/shard-1-001/cores/collection1}
   [junit4]   2> 477044 INFO  (TEST-HttpPartitionTest.test-seed#[7913028C5C0B35D8]) [n:127.0.0.1:57204_    ] o.a.s.c.CoresLocator Found core collection1 in /x1/jenkins/jenkins-slave/workspace/Lucene-Solr-Tests-5.3-Java7/solr/build/solr-core/test/J0/temp/solr.cloud.HttpPartitionTest_7913028C5C0B35D8-001/shard-1-001/cores/collection1/
   [junit4]   2> 477044 INFO  (TEST-HttpPartitionTest.test-seed#[7913028C5C0B35D8]) [n:127.0.0.1:57204_    ] o.a.s.c.CoresLocator Found 1 core definitions
   [junit4]   2> 477098 INFO  (coreLoadExecutor-1099-thread-1-processing-n:127.0.0.1:57204_) [n:127.0.0.1:57204_ c:collection1   x:collection1] o.a.s.c.ZkController publishing state=down
   [junit4]   2> 477099 INFO  (coreLoadExecutor-1099-thread-1-processing-n:127.0.0.1:57204_) [n:127.0.0.1:57204_ c:collection1   x:collection1] o.a.s.c.ZkController numShards not found on descriptor - reading it from system property
   [junit4]   2> 477100 INFO  (zkCallback-564-thread-1-processing-n:127.0.0.1:33107_) [n:127.0.0.1:33107_    ] o.a.s.c.DistributedQueue NodeChildrenChanged fired on path /overseer/queue state SyncConnected
   [junit4]   2> 477100 INFO  (OverseerStateUpdate-95131940745838596-127.0.0.1:33107_-n_0000000000) [n:127.0.0.1:33107_    ] o.a.s.c.Overseer processMessage: queueSize: 1, message = {
   [junit4]   2>   "core":"collection1",
   [junit4]   2>   "roles":null,
   [junit4]   2>   "state":"down",
   [junit4]   2>   "base_url":"http://127.0.0.1:57204",
   [junit4]   2>   "collection":"collection1",
   [junit4]   2>   "operation":"state",
   [junit4]   2>   "numShards":"2",
   [junit4]   2>   "shard":null,
   [junit4]   2>   "node_name":"127.0.0.1:57204_"} current state version: 4
   [junit4]   2> 477101 INFO  (OverseerStateUpdate-95131940745838596-127.0.0.1:33107_-n_0000000000) [n:127.0.0.1:33107_    ] o.a.s.c.o.ReplicaMutator Update state numShards=2 message={
   [junit4]   2>   "core":"collection1",
   [junit4]   2>   "roles":null,
   [junit4]   2>   "state":"down",
   [junit4]   2>   "base_url":"http://127.0.0.1:57204",
   [junit4]   2>   "collection":"collection1",
   [junit4]   2>   "operation":"state",
   [junit4]   2>   "numShards":"2",
   [junit4]   2>   "shard":null,
   [junit4]   2>   "node_name":"127.0.0.1:57204_"}
   [junit4]   2> 477101 INFO  (OverseerStateUpdate-95131940745838596-127.0.0.1:33107_-n_0000000000) [n:127.0.0.1:33107_    ] o.a.s.c.o.ClusterStateMutator building a new cName: collection1
   [junit4]   2> 477101 INFO  (OverseerStateUpdate-95131940745838596-127.0.0.1:33107_-n_0000000000) [n:127.0.0.1:33107_    ] o.a.s.c.o.ReplicaMutator Assigning new node to shard shard=shard1
   [junit4]   2> 477102 INFO  (TEST-HttpPartitionTest.test-seed#[7913028C5C0B35D8]) [n:127.0.0.1:57204_    ] o.a.s.s.SolrDispatchFilter user.dir=/x1/jenkins/jenkins-slave/workspace/Lucene-Solr-Tests-5.3-Java7/solr/build/solr-core/test/J0
   [junit4]   2> 477102 INFO  (coreLoadExecutor-1099-thread-1-processing-n:127.0.0.1:57204_) [n:127.0.0.1:57204_ c:collection1   x:collection1] o.a.s.c.ZkController look for our core node name
   [junit4]   2> 477102 INFO  (TEST-HttpPartitionTest.test-seed#[7913028C5C0B35D8]) [n:127.0.0.1:57204_    ] o.a.s.s.SolrDispatchFilter SolrDispatchFilter.init() done
   [junit4]   2> 477103 INFO  (zkCallback-566-thread-1) [    ] o.a.s.c.c.ZkStateReader A cluster state change: WatchedEvent state:SyncConnected type:NodeDataChanged path:/clusterstate.json, has occurred - updating... (live nodes size: 2)
   [junit4]   2> 477103 INFO  (zkCallback-564-thread-1-processing-n:127.0.0.1:33107_) [n:127.0.0.1:33107_    ] o.a.s.c.c.ZkStateReader A cluster state change: WatchedEvent state:SyncConnected type:NodeDataChanged path:/clusterstate.json, has occurred - updating... (live nodes size: 2)
   [junit4]   2> 477103 INFO  (zkCallback-570-thread-1-processing-n:127.0.0.1:57204_) [n:127.0.0.1:57204_    ] o.a.s.c.c.ZkStateReader A cluster state change: WatchedEvent state:SyncConnected type:NodeDataChanged path:/clusterstate.json, has occurred - updating... (live nodes size: 2)
   [junit4]   2> 477104 INFO  (zkCallback-564-thread-1-processing-n:127.0.0.1:33107_) [n:127.0.0.1:33107_    ] o.a.s.c.c.ZkStateReader Updated cluster state version to 5
   [junit4]   2> 477113 INFO  (zkCallback-566-thread-1) [    ] o.a.s.c.c.ZkStateReader Updated cluster state version to 5
   [junit4]   2> 477113 INFO  (zkCallback-570-thread-1-processing-n:127.0.0.1:57204_) [n:127.0.0.1:57204_    ] o.a.s.c.c.ZkStateReader Updated cluster state version to 5
   [junit4]   2> 478107 INFO  (coreLoadExecutor-1099-thread-1-processing-n:127.0.0.1:57204_) [n:127.0.0.1:57204_ c:collection1   x:collection1] o.a.s.c.ZkController waiting to find shard id in clusterstate for collection1
   [junit4]   2> 478107 INFO  (coreLoadExecutor-1099-thread-1-processing-n:127.0.0.1:57204_) [n:127.0.0.1:57204_ c:collection1   x:collection1] o.a.s.c.ZkController Check for collection zkNode:collection1
   [junit4]   2> 478108 INFO  (coreLoadExecutor-1099-thread-1-processing-n:127.0.0.1:57204_) [n:127.0.0.1:57204_ c:collection1   x:collection1] o.a.s.c.ZkController Collection zkNode exists
   [junit4]   2> 478108 INFO  (coreLoadExecutor-1099-thread-1-processing-n:127.0.0.1:57204_) [n:127.0.0.1:57204_ c:collection1   x:collection1] o.a.s.c.c.ZkStateReader Load collection config from:/collections/collection1
   [junit4]   2> 478109 INFO  (coreLoadExecutor-1099-thread-1-processing-n:127.0.0.1:57204_) [n:127.0.0.1:57204_ c:collection1   x:collection1] o.a.s.c.c.ZkStateReader path=/collections/collection1 configName=conf1 specified config exists in ZooKeeper
   [junit4]   2> 478109 INFO  (coreLoadExecutor-1099-thread-1-processing-n:127.0.0.1:57204_) [n:127.0.0.1:57204_ c:collection1   x:collection1] o.a.s.c.SolrResourceLoader new SolrResourceLoader for directory: '/x1/jenkins/jenkins-slave/workspace/Lucene-Solr-Tests-5.3-Java7/solr/build/solr-core/test/J0/temp/solr.cloud.HttpPartitionTest_7913028C5C0B35D8-001/shard-1-001/cores/collection1/'
   [junit4]   2> 478178 INFO  (coreLoadExecutor-1099-thread-1-processing-n:127.0.0.1:57204_) [n:127.0.0.1:57204_ c:collection1   x:collection1] o.a.s.c.Config loaded config solrconfig.xml with version 0 
   [junit4]   2> 478185 INFO  (coreLoadExecutor-1099-thread-1-processing-n:127.0.0.1:57204_) [n:127.0.0.1:57204_ c:collection1   x:collection1] o.a.s.c.SolrConfig current version of requestparams : -1
   [junit4]   2> 478198 INFO  (coreLoadExecutor-1099-thread-1-processing-n:127.0.0.1:57204_) [n:127.0.0.1:57204_ c:collection1   x:collection1] o.a.s.c.SolrConfig Using Lucene MatchVersion: 5.3.2
   [junit4]   2> 478230 INFO  (coreLoadExecutor-1099-thread-1-processing-n:127.0.0.1:57204_) [n:127.0.0.1:57204_ c:collection1   x:collection1] o.a.s.c.Config Loaded SolrConfig: solrconfig.xml
   [junit4]   2> 478231 INFO  (coreLoadExecutor-1099-thread-1-processing-n:127.0.0.1:57204_) [n:127.0.0.1:57204_ c:collection1   x:collection1] o.a.s.s.IndexSchema Reading Solr Schema from /configs/conf1/schema.xml
   [junit4]   2> 478237 INFO  (coreLoadExecutor-1099-thread-1-processing-n:127.0.0.1:57204_) [n:127.0.0.1:57204_ c:collection1   x:collection1] o.a.s.s.IndexSchema [collection1] Schema name=test
   [junit4]   2> 478709 INFO  (coreLoadExecutor-1099-thread-1-processing-n:127.0.0.1:57204_) [n:127.0.0.1:57204_ c:collection1   x:collection1] o.a.s.s.OpenExchangeRatesOrgProvider Initialized with rates=open-exchange-rates.json, refreshInterval=1440.
   [junit4]   2> 478723 INFO  (coreLoadExecutor-1099-thread-1-processing-n:127.0.0.1:57204_) [n:127.0.0.1:57204_ c:collection1   x:collection1] o.a.s.s.IndexSchema default search field in schema is text
   [junit4]   2> 478725 INFO  (coreLoadExecutor-1099-thread-1-processing-n:127.0.0.1:57204_) [n:127.0.0.1:57204_ c:collection1   x:collection1] o.a.s.s.IndexSchema unique key field: id
   [junit4]   2> 478746 INFO  (coreLoadExecutor-1099-thread-1-processing-n:127.0.0.1:57204_) [n:127.0.0.1:57204_ c:collection1   x:collection1] o.a.s.s.FileExchangeRateProvider Reloading exchange rates from file currency.xml
   [junit4]   2> 478758 INFO  (coreLoadExecutor-1099-thread-1-processing-n:127.0.0.1:57204_) [n:127.0.0.1:57204_ c:collection1   x:collection1] o.a.s.s.FileExchangeRateProvider Reloading exchange rates from file currency.xml
   [junit4]   2> 478761 INFO  (coreLoadExecutor-1099-thread-1-processing-n:127.0.0.1:57204_) [n:127.0.0.1:57204_ c:collection1   x:collection1] o.a.s.s.OpenExchangeRatesOrgProvider Reloading exchange rates from open-exchange-rates.json
   [junit4]   2> 478762 WARN  (coreLoadExecutor-1099-thread-1-processing-n:127.0.0.1:57204_) [n:127.0.0.1:57204_ c:collection1   x:collection1] o.a.s.s.OpenExchangeRatesOrgProvider Unknown key IMPORTANT NOTE
   [junit4]   2> 478762 WARN  (coreLoadExecutor-1099-thread-1-processing-n:127.0.0.1:57204_) [n:127.0.0.1:57204_ c:collection1   x:collection1] o.a.s.s.OpenExchangeRatesOrgProvider Expected key, got STRING
   [junit4]   2> 478762 INFO  (coreLoadExecutor-1099-thread-1-processing-n:127.0.0.1:57204_) [n:127.0.0.1:57204_ c:collection1   x:collection1] o.a.s.s.OpenExchangeRatesOrgProvider Reloading exchange rates from open-exchange-rates.json
   [junit4]   2> 478763 WARN  (coreLoadExecutor-1099-thread-1-processing-n:127.0.0.1:57204_) [n:127.0.0.1:57204_ c:collection1   x:collection1] o.a.s.s.OpenExchangeRatesOrgProvider Unknown key IMPORTANT NOTE
   [junit4]   2> 478763 WARN  (coreLoadExecutor-1099-thread-1-processing-n:127.0.0.1:57204_) [n:127.0.0.1:57204_ c:collection1   x:collection1] o.a.s.s.OpenExchangeRatesOrgProvider Expected key, got STRING
   [junit4]   2> 478764 INFO  (coreLoadExecutor-1099-thread-1-processing-n:127.0.0.1:57204_) [n:127.0.0.1:57204_ c:collection1   x:collection1] o.a.s.c.ConfigSetProperties Did not find ConfigSet properties, assuming default properties: Can't find resource 'configsetprops.json' in classpath or '/configs/conf1', cwd=/x1/jenkins/jenkins-slave/workspace/Lucene-Solr-Tests-5.3-Java7/solr/build/solr-core/test/J0
   [junit4]   2> 478764 INFO  (coreLoadExecutor-1099-thread-1-processing-n:127.0.0.1:57204_) [n:127.0.0.1:57204_ c:collection1   x:collection1] o.a.s.c.CoreContainer Creating SolrCore 'collection1' using configuration from collection collection1
   [junit4]   2> 478764 INFO  (coreLoadExecutor-1099-thread-1-processing-n:127.0.0.1:57204_) [n:127.0.0.1:57204_ c:collection1 s:shard1 r:core_node1 x:collection1] o.a.s.c.SolrCore org.apache.solr.core.MockDirectoryFactory
   [junit4]   2> 478765 INFO  (coreLoadExecutor-1099-thread-1-processing-n:127.0.0.1:57204_) [n:127.0.0.1:57204_ c:collection1 s:shard1 r:core_node1 x:collection1] o.a.s.c.SolrCore [[collection1] ] Opening new SolrCore at [/x1/jenkins/jenkins-slave/workspace/Lucene-Solr-Tests-5.3-Java7/solr/build/solr-core/test/J0/temp/solr.cloud.HttpPartitionTest_7913028C5C0B35D8-001/shard-1-001/cores/collection1/], dataDir=[null]
   [junit4]   2> 478765 INFO  (coreLoadExecutor-1099-thread-1-processing-n:127.0.0.1:57204_) [n:127.0.0.1:57204_ c:collection1 s:shard1 r:core_node1 x:collection1] o.a.s.c.JmxMonitoredMap JMX monitoring is enabled. Adding Solr mbeans to JMX Server: com.sun.jmx.mbeanserver.JmxMBeanServer@413c6f94
   [junit4]   2> 478766 INFO  (coreLoadExecutor-1099-thread-1-processing-n:127.0.0.1:57204_) [n:127.0.0.1:57204_ c:collection1 s:shard1 r:core_node1 x:collection1] o.a.s.c.CachingDirectoryFactory return new directory for /x1/jenkins/jenkins-slave/workspace/Lucene-Solr-Tests-5.3-Java7/solr/build/solr-core/test/J0/temp/solr.cloud.HttpPartitionTest_7913028C5C0B35D8-001/shard-1-001/cores/collection1/data
   [junit4]   2> 478766 INFO  (coreLoadExecutor-1099-thread-1-processing-n:127.0.0.1:57204_) [n:127.0.0.1:57204_ c:collection1 s:shard1 r:core_node1 x:collection1] o.a.s.c.SolrCore New index directory detected: old=null new=/x1/jenkins/jenkins-slave/workspace/Lucene-Solr-Tests-5.3-Java7/solr/build/solr-core/test/J0/temp/solr.cloud.HttpPartitionTest_7913028C5C0B35D8-001/shard-1-001/cores/collection1/data/index/
   [junit4]   2> 478766 WARN  (coreLoadExecutor-1099-thread-1-processing-n:127.0.0.1:57204_) [n:127.0.0.1:57204_ c:collection1 s:shard1 r:core_node1 x:collection1] o.a.s.c.SolrCore [collection1] Solr index directory '/x1/jenkins/jenkins-slave/workspace/Lucene-Solr-Tests-5.3-Java7/solr/build/solr-core/test/J0/temp/solr.cloud.HttpPartitionTest_7913028C5C0B35D8-001/shard-1-001/cores/collection1/data/index' doesn't exist. Creating new index...
   [junit4]   2> 478767 INFO  (coreLoadExecutor-1099-thread-1-processing-n:127.0.0.1:57204_) [n:127.0.0.1:57204_ c:collection1 s:shard1 r:core_node1 x:collection1] o.a.s.c.CachingDirectoryFactory return new directory for /x1/jenkins/jenkins-slave/workspace/Lucene-Solr-Tests-5.3-Java7/solr/build/solr-core/test/J0/temp/solr.cloud.HttpPartitionTest_7913028C5C0B35D8-001/shard-1-001/cores/collection1/data/index
   [junit4]   2> 478767 INFO  (coreLoadExecutor-1099-thread-1-processing-n:127.0.0.1:57204_) [n:127.0.0.1:57204_ c:collection1 s:shard1 r:core_node1 x:collection1] o.a.s.u.RandomMergePolicy RandomMergePolicy wrapping class org.apache.lucene.index.TieredMergePolicy: [TieredMergePolicy: maxMergeAtOnce=30, maxMergeAtOnceExplicit=19, maxMergedSegmentMB=85.345703125, floorSegmentMB=0.5078125, forceMergeDeletesPctAllowed=27.474077925868915, segmentsPerTier=23.0, maxCFSSegmentSizeMB=8.796093022207999E12, noCFSRatio=0.6240372334468764
   [junit4]   2> 478768 INFO  (coreLoadExecutor-1099-thread-1-processing-n:127.0.0.1:57204_) [n:127.0.0.1:57204_ c:collection1 s:shard1 r:core_node1 x:collection1] o.a.s.c.SolrCore SolrDeletionPolicy.onCommit: commits: num=1
   [junit4]   2> 	commit{dir=MockDirectoryWrapper(RAMDirectory@69f09994 lockFactory=org.apache.lucene.store.SingleInstanceLockFactory@32f2f9e2),segFN=segments_1,generation=1}
   [junit4]   2> 478768 INFO  (coreLoadExecutor-1099-thread-1-processing-n:127.0.0.1:57204_) [n:127.0.0.1:57204_ c:collection1 s:shard1 r:core_node1 x:collection1] o.a.s.c.SolrCore newest commit generation = 1
   [junit4]   2> 478774 INFO  (coreLoadExecutor-1099-thread-1-processing-n:127.0.0.1:57204_) [n:127.0.0.1:57204_ c:collection1 s:shard1 r:core_node1 x:collection1] o.a.s.u.p.UpdateRequestProcessorChain creating updateRequestProcessorChain "nodistrib"
   [junit4]   2> 478775 INFO  (coreLoadExecutor-1099-thread-1-processing-n:127.0.0.1:57204_) [n:127.0.0.1:57204_ c:collection1 s:shard1 r:core_node1 x:collection1] o.a.s.u.p.UpdateRequestProcessorChain creating updateRequestProcessorChain "dedupe"
   [junit4]   2> 478775 INFO  (coreLoadExecutor-1099-thread-1-processing-n:127.0.0.1:57204_) [n:127.0.0.1:57204_ c:collection1 s:shard1 r:core_node1 x:collection1] o.a.s.u.p.UpdateRequestProcessorChain inserting DistributedUpdateProcessorFactory into updateRequestProcessorChain "dedupe"
   [junit4]   2> 478775 INFO  (coreLoadExecutor-1099-thread-1-processing-n:127.0.0.1:57204_) [n:127.0.0.1:57204_ c:collection1 s:shard1 r:core_node1 x:collection1] o.a.s.u.p.UpdateRequestProcessorChain creating updateRequestProcessorChain "stored_sig"
   [junit4]   2> 478775 INFO  (coreLoadExecutor-1099-thread-1-processing-n:127.0.0.1:57204_) [n:127.0.0.1:57204_ c:collection1 s:shard1 r:core_node1 x:collection1] o.a.s.u.p.UpdateRequestProcessorChain inserting DistributedUpdateProcessorFactory into updateRequestProcessorChain "stored_sig"
   [junit4]   2> 478775 INFO  (coreLoadExecutor-1099-thread-1-processing-n:127.0.0.1:57204_) [n:127.0.0.1:57204_ c:collection1 s:shard1 r:core_node1 x:collection1] o.a.s.u.p.UpdateRequestProcessorChain creating updateRequestProcessorChain "distrib-dup-test-chain-explicit"
   [junit4]   2> 478776 INFO  (coreLoadExecutor-1099-thread-1-processing-n:127.0.0.1:57204_) [n:127.0.0.1:57204_ c:collection1 s:shard1 r:core_node1 x:collection1] o.a.s.u.p.UpdateRequestProcessorChain creating updateRequestProcessorChain "distrib-dup-test-chain-implicit"
   [junit4]   2> 478776 INFO  (coreLoadExecutor-1099-thread-1-processing-n:127.0.0.1:57204_) [n:127.0.0.1:57204_ c:collection1 s:shard1 r:core_node1 x:collection1] o.a.s.u.p.UpdateRequestProcessorChain inserting DistributedUpdateProcessorFactory into updateRequestProcessorChain "distrib-dup-test-chain-implicit"
   [junit4]   2> 478776 INFO  (coreLoadExecutor-1099-thread-1-processing-n:127.0.0.1:57204_) [n:127.0.0.1:57204_ c:collection1 s:shard1 r:core_node1 x:collection1] o.a.s.c.SolrCore no updateRequestProcessorChain defined as default, creating implicit default
   [junit4]   2> 478779 INFO  (coreLoadExecutor-1099-thread-1-processing-n:127.0.0.1:57204_) [n:127.0.0.1:57204_ c:collection1 s:shard1 r:core_node1 x:collection1] o.a.s.h.l.XMLLoader xsltCacheLifetimeSeconds=60
   [junit4]   2> 478781 INFO  (coreLoadExecutor-1099-thread-1-processing-n:127.0.0.1:57204_) [n:127.0.0.1:57204_ c:collection1 s:shard1 r:core_node1 x:collection1] o.a.s.h.l.XMLLoader xsltCacheLifetimeSeconds=60
   [junit4]   2> 478783 INFO  (coreLoadExecutor-1099-thread-1-processing-n:127.0.0.1:57204_) [n:127.0.0.1:57204_ c:collection1 s:shard1 r:core_node1 x:collection1] o.a.s.h.l.XMLLoader xsltCacheLifetimeSeconds=60
   [junit4]   2> 478784 INFO  (coreLoadExecutor-1099-thread-1-processing-n:127.0.0.1:57204_) [n:127.0.0.1:57204_ c:collection1 s:shard1 r:core_node1 x:collection1] o.a.s.h.l.XMLLoader xsltCacheLifetimeSeconds=60
   [junit4]   2> 478780 INFO  (OldIndexDirectoryCleanupThreadForCore-collection1) [n:127.0.0.1:57204_ c:collection1 s:shard1 r:core_node1 x:collection1] o.a.s.c.SolrCore Looking for old index directories to cleanup for core collection1 in /x1/jenkins/jenkins-slave/workspace/Lucene-Solr-Tests-5.3-Java7/solr/build/solr-core/test/J0/temp/solr.cloud.HttpPartitionTest_7913028C5C0B35D8-001/shard-1-001/cores/collection1/data/
   [junit4]   2> 478786 WARN  (OldIndexDirectoryCleanupThreadForCore-collection1) [n:127.0.0.1:57204_ c:collection1 s:shard1 r:core_node1 x:collection1] o.a.s.c.DirectoryFactory /x1/jenkins/jenkins-slave/workspace/Lucene-Solr-Tests-5.3-Java7/solr/build/solr-core/test/J0/temp/solr.cloud.HttpPartitionTest_7913028C5C0B35D8-001/shard-1-001/cores/collection1/data/ does not point to a valid data directory; skipping clean-up of old index directories.
   [junit4]   2> 478791 INFO  (coreLoadExecutor-1099-thread-1-processing-n:127.0.0.1:57204_) [n:127.0.0.1:57204_ c:collection1 s:shard1 r:core_node1 x:collection1] o.a.s.c.RequestHandlers Registered paths: /admin/properties,/config,/admin/segments,/get,/admin/system,standard,/replication,/admin/luke,/update/csv,/admin/threads,/admin/file,/admin/mbeans,/schema,/admin/logging,/admin/plugins,/update/json/docs,/admin/ping,/update,/update/json
   [junit4]   2> 478793 INFO  (coreLoadExecutor-1099-thread-1-processing-n:127.0.0.1:57204_) [n:127.0.0.1:57204_ c:collection1 s:shard1 r:core_node1 x:collection1] o.a.s.c.SolrCore Using default statsCache cache: org.apache.solr.search.stats.LocalStatsCache
   [junit4]   2> 478793 INFO  (coreLoadExecutor-1099-thread-1-processing-n:127.0.0.1:57204_) [n:127.0.0.1:57204_ c:collection1 s:shard1 r:core_node1 x:collection1] o.a.s.u.UpdateHandler Using UpdateLog implementation: org.apache.solr.update.UpdateLog
   [junit4]   2> 478793 INFO  (co

[...truncated too long message...]

127.0.0.1:35364/
   [junit4]   2> 615399 WARN  (TEST-HttpPartitionTest.test-seed#[7913028C5C0B35D8]) [n:127.0.0.1:39641_ c:collection1 s:shard1 r:core_node3 x:collection1] o.a.s.c.SocketProxy Closing 9 connections to: http://127.0.0.1:57204/, target: http://127.0.0.1:58412/
   [junit4]   2> 615399 WARN  (TEST-HttpPartitionTest.test-seed#[7913028C5C0B35D8]) [n:127.0.0.1:39641_ c:collection1 s:shard1 r:core_node3 x:collection1] o.a.s.c.SocketProxy Closing 7 connections to: http://127.0.0.1:33107/, target: http://127.0.0.1:38198/
   [junit4]   2> 615399 WARN  (TEST-HttpPartitionTest.test-seed#[7913028C5C0B35D8]) [n:127.0.0.1:39641_ c:collection1 s:shard1 r:core_node3 x:collection1] o.a.s.c.SocketProxy Closing 16 connections to: http://127.0.0.1:58105/, target: http://127.0.0.1:47669/
   [junit4]   2> 615401 INFO  (SUITE-HttpPartitionTest-seed#[7913028C5C0B35D8]-worker) [n:127.0.0.1:39641_ c:collection1 s:shard1 r:core_node3 x:collection1] o.a.s.SolrTestCaseJ4 ###deleteCore
   [junit4]   2> ObjectTracker found 1 object(s) that were not released!!! [TransactionLog]
   [junit4]   2> org.apache.solr.common.util.ObjectReleaseTracker$ObjectTrackerException
   [junit4]   2> 	at org.apache.solr.common.util.ObjectReleaseTracker.track(ObjectReleaseTracker.java:34)
   [junit4]   2> 	at org.apache.solr.update.TransactionLog.<init>(TransactionLog.java:183)
   [junit4]   2> 	at org.apache.solr.update.TransactionLog.<init>(TransactionLog.java:141)
   [junit4]   2> 	at org.apache.solr.update.UpdateLog.ensureLog(UpdateLog.java:863)
   [junit4]   2> 	at org.apache.solr.update.UpdateLog.add(UpdateLog.java:424)
   [junit4]   2> 	at org.apache.solr.update.UpdateLog.add(UpdateLog.java:410)
   [junit4]   2> 	at org.apache.solr.update.DirectUpdateHandler2.addDoc0(DirectUpdateHandler2.java:258)
   [junit4]   2> 	at org.apache.solr.update.DirectUpdateHandler2.addDoc(DirectUpdateHandler2.java:163)
   [junit4]   2> 	at org.apache.solr.update.processor.RunUpdateProcessor.processAdd(RunUpdateProcessorFactory.java:69)
   [junit4]   2> 	at org.apache.solr.update.processor.UpdateRequestProcessor.processAdd(UpdateRequestProcessor.java:51)
   [junit4]   2> 	at org.apache.solr.update.processor.DistributedUpdateProcessor.doLocalAdd(DistributedUpdateProcessor.java:955)
   [junit4]   2> 	at org.apache.solr.update.processor.DistributedUpdateProcessor.versionAdd(DistributedUpdateProcessor.java:1110)
   [junit4]   2> 	at org.apache.solr.update.processor.DistributedUpdateProcessor.processAdd(DistributedUpdateProcessor.java:706)
   [junit4]   2> 	at org.apache.solr.update.processor.LogUpdateProcessor.processAdd(LogUpdateProcessorFactory.java:104)
   [junit4]   2> 	at org.apache.solr.handler.loader.JavabinLoader$1.update(JavabinLoader.java:101)
   [junit4]   2> 	at org.apache.solr.client.solrj.request.JavaBinUpdateRequestCodec$1.readOuterMostDocIterator(JavaBinUpdateRequestCodec.java:179)
   [junit4]   2> 	at org.apache.solr.client.solrj.request.JavaBinUpdateRequestCodec$1.readIterator(JavaBinUpdateRequestCodec.java:135)
   [junit4]   2> 	at org.apache.solr.common.util.JavaBinCodec.readVal(JavaBinCodec.java:249)
   [junit4]   2> 	at org.apache.solr.client.solrj.request.JavaBinUpdateRequestCodec$1.readNamedList(JavaBinUpdateRequestCodec.java:121)
   [junit4]   2> 	at org.apache.solr.common.util.JavaBinCodec.readVal(JavaBinCodec.java:214)
   [junit4]   2> 	at org.apache.solr.common.util.JavaBinCodec.unmarshal(JavaBinCodec.java:134)
   [junit4]   2> 	at org.apache.solr.client.solrj.request.JavaBinUpdateRequestCodec.unmarshal(JavaBinUpdateRequestCodec.java:186)
   [junit4]   2> 	at org.apache.solr.handler.loader.JavabinLoader.parseAndLoadDocs(JavabinLoader.java:111)
   [junit4]   2> 	at org.apache.solr.handler.loader.JavabinLoader.load(JavabinLoader.java:58)
   [junit4]   2> 	at org.apache.solr.handler.UpdateRequestHandler$1.load(UpdateRequestHandler.java:98)
   [junit4]   2> 	at org.apache.solr.handler.ContentStreamHandlerBase.handleRequestBody(ContentStreamHandlerBase.java:74)
   [junit4]   2> 	at org.apache.solr.handler.RequestHandlerBase.handleRequest(RequestHandlerBase.java:143)
   [junit4]   2> 	at org.apache.solr.core.SolrCore.execute(SolrCore.java:2068)
   [junit4]   2> 	at org.apache.solr.servlet.HttpSolrCall.execute(HttpSolrCall.java:672)
   [junit4]   2> 	at org.apache.solr.servlet.HttpSolrCall.call(HttpSolrCall.java:463)
   [junit4]   2> 	at org.apache.solr.servlet.SolrDispatchFilter.doFilter(SolrDispatchFilter.java:215)
   [junit4]   2> 	at org.apache.solr.servlet.SolrDispatchFilter.doFilter(SolrDispatchFilter.java:179)
   [junit4]   2> 	at org.eclipse.jetty.servlet.ServletHandler$CachedChain.doFilter(ServletHandler.java:1652)
   [junit4]   2> 	at org.apache.solr.client.solrj.embedded.JettySolrRunner$DebugFilter.doFilter(JettySolrRunner.java:109)
   [junit4]   2> 	at org.eclipse.jetty.servlet.ServletHandler$CachedChain.doFilter(ServletHandler.java:1652)
   [junit4]   2> 	at org.eclipse.jetty.servlets.UserAgentFilter.doFilter(UserAgentFilter.java:83)
   [junit4]   2> 	at org.eclipse.jetty.servlets.GzipFilter.doFilter(GzipFilter.java:300)
   [junit4]   2> 	at org.eclipse.jetty.servlet.ServletHandler$CachedChain.doFilter(ServletHandler.java:1652)
   [junit4]   2> 	at org.eclipse.jetty.servlet.ServletHandler.doHandle(ServletHandler.java:585)
   [junit4]   2> 	at org.eclipse.jetty.server.session.SessionHandler.doHandle(SessionHandler.java:221)
   [junit4]   2> 	at org.eclipse.jetty.server.handler.ContextHandler.doHandle(ContextHandler.java:1127)
   [junit4]   2> 	at org.eclipse.jetty.servlet.ServletHandler.doScope(ServletHandler.java:515)
   [junit4]   2> 	at org.eclipse.jetty.server.session.SessionHandler.doScope(SessionHandler.java:185)
   [junit4]   2> 	at org.eclipse.jetty.server.handler.ContextHandler.doScope(ContextHandler.java:1061)
   [junit4]   2> 	at org.eclipse.jetty.server.handler.ScopedHandler.handle(ScopedHandler.java:141)
   [junit4]   2> 	at org.eclipse.jetty.server.handler.HandlerWrapper.handle(HandlerWrapper.java:97)
   [junit4]   2> 	at org.eclipse.jetty.server.Server.handle(Server.java:499)
   [junit4]   2> 	at org.eclipse.jetty.server.HttpChannel.handle(HttpChannel.java:310)
   [junit4]   2> 	at org.eclipse.jetty.server.HttpConnection.onFillable(HttpConnection.java:257)
   [junit4]   2> 	at org.eclipse.jetty.io.AbstractConnection$2.run(AbstractConnection.java:540)
   [junit4]   2> 	at org.eclipse.jetty.util.thread.QueuedThreadPool.runJob(QueuedThreadPool.java:635)
   [junit4]   2> 	at org.eclipse.jetty.util.thread.QueuedThreadPool$3.run(QueuedThreadPool.java:555)
   [junit4]   2> 	at java.lang.Thread.run(Thread.java:745)
   [junit4]   2> 
   [junit4]   2> Dec 31, 2015 9:46:00 PM com.carrotsearch.randomizedtesting.ThreadLeakControl checkThreadLeaks
   [junit4]   2> WARNING: Will linger awaiting termination of 1 leaked thread(s).
   [junit4]   2> NOTE: test params are: codec=CheapBastard, sim=DefaultSimilarity, locale=el_CY, timezone=Europe/Kaliningrad
   [junit4]   2> NOTE: Linux 3.13.0-52-generic amd64/Oracle Corporation 1.7.0_80 (64-bit)/cpus=4,threads=1,free=107481072,total=425721856
   [junit4]   2> NOTE: All tests run in this JVM: [TestCloudSchemaless, DistributedSpellCheckComponentTest, UpdateRequestProcessorFactoryTest, TestFaceting, HighlighterTest, TestMergePolicyConfig, TestFieldSortValues, SimpleCollectionCreateDeleteTest, HdfsNNFailoverTest, FastVectorHighlighterTest, URLClassifyProcessorTest, AliasIntegrationTest, TestCSVLoader, TestIndexingPerformance, VersionInfoTest, TestSolrDeletionPolicy1, TestBlobHandler, BasicZkTest, PreAnalyzedUpdateProcessorTest, SmileWriterTest, SolrCoreTest, MigrateRouteKeyTest, TestDynamicLoading, DateFieldTest, BlockCacheTest, SolrRequestParserTest, IndexBasedSpellCheckerTest, TestStressUserVersions, DistributedQueueTest, UUIDUpdateProcessorFallbackTest, TestBinaryField, DefaultValueUpdateProcessorTest, OverseerStatusTest, TestInitParams, SignatureUpdateProcessorFactoryTest, HttpPartitionTest]
   [junit4]   2> NOTE: reproduce with: ant test  -Dtestcase=HttpPartitionTest -Dtests.seed=7913028C5C0B35D8 -Dtests.multiplier=2 -Dtests.slow=true -Dtests.locale=el_CY -Dtests.timezone=Europe/Kaliningrad -Dtests.asserts=true -Dtests.file.encoding=UTF-8
   [junit4] ERROR   0.00s J0 | HttpPartitionTest (suite) <<<
   [junit4]    > Throwable #1: java.lang.AssertionError: ObjectTracker found 1 object(s) that were not released!!! [TransactionLog]
   [junit4]    > 	at __randomizedtesting.SeedInfo.seed([7913028C5C0B35D8]:0)
   [junit4]    > 	at org.apache.solr.SolrTestCaseJ4.afterClass(SolrTestCaseJ4.java:236)
   [junit4]    > 	at java.lang.Thread.run(Thread.java:745)
   [junit4] Completed [113/533] on J0 in 144.33s, 1 test, 1 failure <<< FAILURES!

[...truncated 1292 lines...]
BUILD FAILED
/x1/jenkins/jenkins-slave/workspace/Lucene-Solr-Tests-5.3-Java7/build.xml:726: The following error occurred while executing this line:
/x1/jenkins/jenkins-slave/workspace/Lucene-Solr-Tests-5.3-Java7/build.xml:670: The following error occurred while executing this line:
/x1/jenkins/jenkins-slave/workspace/Lucene-Solr-Tests-5.3-Java7/build.xml:59: The following error occurred while executing this line:
/x1/jenkins/jenkins-slave/workspace/Lucene-Solr-Tests-5.3-Java7/solr/build.xml:230: The following error occurred while executing this line:
/x1/jenkins/jenkins-slave/workspace/Lucene-Solr-Tests-5.3-Java7/solr/common-build.xml:524: The following error occurred while executing this line:
/x1/jenkins/jenkins-slave/workspace/Lucene-Solr-Tests-5.3-Java7/lucene/common-build.xml:1449: The following error occurred while executing this line:
/x1/jenkins/jenkins-slave/workspace/Lucene-Solr-Tests-5.3-Java7/lucene/common-build.xml:1003: There were test failures: 533 suites, 2103 tests, 1 suite-level error, 42 ignored (30 assumptions)

Total time: 59 minutes 58 seconds
Build step 'Invoke Ant' marked build as failure
Archiving artifacts
Recording test results
Email was triggered for: Failure - Any
Sending email for trigger: Failure - Any



Mime
View raw message