lucene-dev mailing list archives

Site index · List index
Message view « Date » · « Thread »
Top « Date » · « Thread »
From Policeman Jenkins Server <jenk...@thetaphi.de>
Subject [JENKINS] Lucene-Solr-trunk-Linux (32bit/jdk1.8.0_66) - Build # 14818 - Still Failing!
Date Sat, 07 Nov 2015 07:37:27 GMT
Build: http://jenkins.thetaphi.de/job/Lucene-Solr-trunk-Linux/14818/
Java: 32bit/jdk1.8.0_66 -server -XX:+UseParallelGC

2 tests failed.
FAILED:  org.apache.solr.cloud.ChaosMonkeyNothingIsSafeTest.test

Error Message:
document count mismatch.  control=149 sum(shards)=148 cloudClient=148

Stack Trace:
java.lang.AssertionError: document count mismatch.  control=149 sum(shards)=148 cloudClient=148
	at __randomizedtesting.SeedInfo.seed([704935DE55851596:F81D0A04FB79786E]:0)
	at org.junit.Assert.fail(Assert.java:93)
	at org.apache.solr.cloud.AbstractFullDistribZkTestBase.checkShardConsistency(AbstractFullDistribZkTestBase.java:1298)
	at org.apache.solr.cloud.ChaosMonkeyNothingIsSafeTest.test(ChaosMonkeyNothingIsSafeTest.java:233)
	at sun.reflect.NativeMethodAccessorImpl.invoke0(Native Method)
	at sun.reflect.NativeMethodAccessorImpl.invoke(NativeMethodAccessorImpl.java:62)
	at sun.reflect.DelegatingMethodAccessorImpl.invoke(DelegatingMethodAccessorImpl.java:43)
	at java.lang.reflect.Method.invoke(Method.java:497)
	at com.carrotsearch.randomizedtesting.RandomizedRunner.invoke(RandomizedRunner.java:1660)
	at com.carrotsearch.randomizedtesting.RandomizedRunner$8.evaluate(RandomizedRunner.java:866)
	at com.carrotsearch.randomizedtesting.RandomizedRunner$9.evaluate(RandomizedRunner.java:902)
	at com.carrotsearch.randomizedtesting.RandomizedRunner$10.evaluate(RandomizedRunner.java:916)
	at org.apache.solr.BaseDistributedSearchTestCase$ShardsRepeatRule$ShardsFixedStatement.callStatement(BaseDistributedSearchTestCase.java:963)
	at org.apache.solr.BaseDistributedSearchTestCase$ShardsRepeatRule$ShardsStatement.evaluate(BaseDistributedSearchTestCase.java:938)
	at com.carrotsearch.randomizedtesting.rules.SystemPropertiesRestoreRule$1.evaluate(SystemPropertiesRestoreRule.java:57)
	at org.apache.lucene.util.TestRuleSetupTeardownChained$1.evaluate(TestRuleSetupTeardownChained.java:50)
	at org.apache.lucene.util.AbstractBeforeAfterRule$1.evaluate(AbstractBeforeAfterRule.java:46)
	at org.apache.lucene.util.TestRuleThreadAndTestName$1.evaluate(TestRuleThreadAndTestName.java:49)
	at org.apache.lucene.util.TestRuleIgnoreAfterMaxFailures$1.evaluate(TestRuleIgnoreAfterMaxFailures.java:65)
	at org.apache.lucene.util.TestRuleMarkFailure$1.evaluate(TestRuleMarkFailure.java:48)
	at com.carrotsearch.randomizedtesting.rules.StatementAdapter.evaluate(StatementAdapter.java:36)
	at com.carrotsearch.randomizedtesting.ThreadLeakControl$StatementRunner.run(ThreadLeakControl.java:367)
	at com.carrotsearch.randomizedtesting.ThreadLeakControl.forkTimeoutingTask(ThreadLeakControl.java:809)
	at com.carrotsearch.randomizedtesting.ThreadLeakControl$3.evaluate(ThreadLeakControl.java:460)
	at com.carrotsearch.randomizedtesting.RandomizedRunner.runSingleTest(RandomizedRunner.java:875)
	at com.carrotsearch.randomizedtesting.RandomizedRunner$5.evaluate(RandomizedRunner.java:777)
	at com.carrotsearch.randomizedtesting.RandomizedRunner$6.evaluate(RandomizedRunner.java:811)
	at com.carrotsearch.randomizedtesting.RandomizedRunner$7.evaluate(RandomizedRunner.java:822)
	at com.carrotsearch.randomizedtesting.rules.StatementAdapter.evaluate(StatementAdapter.java:36)
	at com.carrotsearch.randomizedtesting.rules.SystemPropertiesRestoreRule$1.evaluate(SystemPropertiesRestoreRule.java:57)
	at org.apache.lucene.util.AbstractBeforeAfterRule$1.evaluate(AbstractBeforeAfterRule.java:46)
	at com.carrotsearch.randomizedtesting.rules.StatementAdapter.evaluate(StatementAdapter.java:36)
	at org.apache.lucene.util.TestRuleStoreClassName$1.evaluate(TestRuleStoreClassName.java:42)
	at com.carrotsearch.randomizedtesting.rules.NoShadowingOrOverridesOnMethodsRule$1.evaluate(NoShadowingOrOverridesOnMethodsRule.java:40)
	at com.carrotsearch.randomizedtesting.rules.NoShadowingOrOverridesOnMethodsRule$1.evaluate(NoShadowingOrOverridesOnMethodsRule.java:40)
	at com.carrotsearch.randomizedtesting.rules.StatementAdapter.evaluate(StatementAdapter.java:36)
	at com.carrotsearch.randomizedtesting.rules.StatementAdapter.evaluate(StatementAdapter.java:36)
	at com.carrotsearch.randomizedtesting.rules.StatementAdapter.evaluate(StatementAdapter.java:36)
	at org.apache.lucene.util.TestRuleAssertionsRequired$1.evaluate(TestRuleAssertionsRequired.java:54)
	at org.apache.lucene.util.TestRuleMarkFailure$1.evaluate(TestRuleMarkFailure.java:48)
	at org.apache.lucene.util.TestRuleIgnoreAfterMaxFailures$1.evaluate(TestRuleIgnoreAfterMaxFailures.java:65)
	at org.apache.lucene.util.TestRuleIgnoreTestSuites$1.evaluate(TestRuleIgnoreTestSuites.java:55)
	at com.carrotsearch.randomizedtesting.rules.StatementAdapter.evaluate(StatementAdapter.java:36)
	at com.carrotsearch.randomizedtesting.ThreadLeakControl$StatementRunner.run(ThreadLeakControl.java:367)
	at java.lang.Thread.run(Thread.java:745)


FAILED:  org.apache.solr.cloud.CollectionsAPIDistributedZkTest.test

Error Message:
Error from server at http://127.0.0.1:47640/awholynewcollection_0: Expected mime type application/octet-stream but got text/html. <html> <head> <meta http-equiv="Content-Type" content="text/html;charset=ISO-8859-1"/> <title>Error 500 </title> </head> <body> <h2>HTTP ERROR: 500</h2> <p>Problem accessing /awholynewcollection_0/select. Reason: <pre>    {trace=java.lang.NullPointerException  at org.apache.solr.servlet.HttpSolrCall.getCoreByCollection(HttpSolrCall.java:786)  at org.apache.solr.servlet.HttpSolrCall.init(HttpSolrCall.java:270)  at org.apache.solr.servlet.HttpSolrCall.call(HttpSolrCall.java:415)  at org.apache.solr.servlet.SolrDispatchFilter.doFilter(SolrDispatchFilter.java:220)  at org.apache.solr.servlet.SolrDispatchFilter.doFilter(SolrDispatchFilter.java:179)  at org.eclipse.jetty.servlet.ServletHandler$CachedChain.doFilter(ServletHandler.java:1652)  at org.apache.solr.client.solrj.embedded.JettySolrRunner$DebugFilter.doFilter(JettySolrRunner.java:109)  at org.eclipse.jetty.servlet.ServletHandler$CachedChain.doFilter(ServletHandler.java:1652)  at org.eclipse.jetty.servlets.UserAgentFilter.doFilter(UserAgentFilter.java:83)  at org.eclipse.jetty.servlets.GzipFilter.doFilter(GzipFilter.java:364)  at org.eclipse.jetty.servlet.ServletHandler$CachedChain.doFilter(ServletHandler.java:1652)  at org.eclipse.jetty.servlet.ServletHandler.doHandle(ServletHandler.java:585)  at org.eclipse.jetty.server.session.SessionHandler.doHandle(SessionHandler.java:221)  at org.eclipse.jetty.server.handler.ContextHandler.doHandle(ContextHandler.java:1127)  at org.eclipse.jetty.servlet.ServletHandler.doScope(ServletHandler.java:515)  at org.eclipse.jetty.server.session.SessionHandler.doScope(SessionHandler.java:185)  at org.eclipse.jetty.server.handler.ContextHandler.doScope(ContextHandler.java:1061)  at org.eclipse.jetty.server.handler.ScopedHandler.handle(ScopedHandler.java:141)  at org.eclipse.jetty.server.handler.HandlerWrapper.handle(HandlerWrapper.java:97)  at org.eclipse.jetty.server.Server.handle(Server.java:499)  at org.eclipse.jetty.server.HttpChannel.handle(HttpChannel.java:310)  at org.eclipse.jetty.server.HttpConnection.onFillable(HttpConnection.java:257)  at org.eclipse.jetty.io.AbstractConnection$2.run(AbstractConnection.java:540)  at org.eclipse.jetty.util.thread.QueuedThreadPool.runJob(QueuedThreadPool.java:635)  at org.eclipse.jetty.util.thread.QueuedThreadPool$3.run(QueuedThreadPool.java:555)  at java.lang.Thread.run(Thread.java:745) ,code=500}</pre></p> <hr /><i><small>Powered by Jetty://</small></i> </body> </html> 

Stack Trace:
org.apache.solr.client.solrj.impl.HttpSolrClient$RemoteSolrException: Error from server at http://127.0.0.1:47640/awholynewcollection_0: Expected mime type application/octet-stream but got text/html. <html>
<head>
<meta http-equiv="Content-Type" content="text/html;charset=ISO-8859-1"/>
<title>Error 500 </title>
</head>
<body>
<h2>HTTP ERROR: 500</h2>
<p>Problem accessing /awholynewcollection_0/select. Reason:
<pre>    {trace=java.lang.NullPointerException
	at org.apache.solr.servlet.HttpSolrCall.getCoreByCollection(HttpSolrCall.java:786)
	at org.apache.solr.servlet.HttpSolrCall.init(HttpSolrCall.java:270)
	at org.apache.solr.servlet.HttpSolrCall.call(HttpSolrCall.java:415)
	at org.apache.solr.servlet.SolrDispatchFilter.doFilter(SolrDispatchFilter.java:220)
	at org.apache.solr.servlet.SolrDispatchFilter.doFilter(SolrDispatchFilter.java:179)
	at org.eclipse.jetty.servlet.ServletHandler$CachedChain.doFilter(ServletHandler.java:1652)
	at org.apache.solr.client.solrj.embedded.JettySolrRunner$DebugFilter.doFilter(JettySolrRunner.java:109)
	at org.eclipse.jetty.servlet.ServletHandler$CachedChain.doFilter(ServletHandler.java:1652)
	at org.eclipse.jetty.servlets.UserAgentFilter.doFilter(UserAgentFilter.java:83)
	at org.eclipse.jetty.servlets.GzipFilter.doFilter(GzipFilter.java:364)
	at org.eclipse.jetty.servlet.ServletHandler$CachedChain.doFilter(ServletHandler.java:1652)
	at org.eclipse.jetty.servlet.ServletHandler.doHandle(ServletHandler.java:585)
	at org.eclipse.jetty.server.session.SessionHandler.doHandle(SessionHandler.java:221)
	at org.eclipse.jetty.server.handler.ContextHandler.doHandle(ContextHandler.java:1127)
	at org.eclipse.jetty.servlet.ServletHandler.doScope(ServletHandler.java:515)
	at org.eclipse.jetty.server.session.SessionHandler.doScope(SessionHandler.java:185)
	at org.eclipse.jetty.server.handler.ContextHandler.doScope(ContextHandler.java:1061)
	at org.eclipse.jetty.server.handler.ScopedHandler.handle(ScopedHandler.java:141)
	at org.eclipse.jetty.server.handler.HandlerWrapper.handle(HandlerWrapper.java:97)
	at org.eclipse.jetty.server.Server.handle(Server.java:499)
	at org.eclipse.jetty.server.HttpChannel.handle(HttpChannel.java:310)
	at org.eclipse.jetty.server.HttpConnection.onFillable(HttpConnection.java:257)
	at org.eclipse.jetty.io.AbstractConnection$2.run(AbstractConnection.java:540)
	at org.eclipse.jetty.util.thread.QueuedThreadPool.runJob(QueuedThreadPool.java:635)
	at org.eclipse.jetty.util.thread.QueuedThreadPool$3.run(QueuedThreadPool.java:555)
	at java.lang.Thread.run(Thread.java:745)
,code=500}</pre></p>
<hr /><i><small>Powered by Jetty://</small></i>
</body>
</html>

	at __randomizedtesting.SeedInfo.seed([704935DE55851596:F81D0A04FB79786E]:0)
	at org.apache.solr.client.solrj.impl.HttpSolrClient.executeMethod(HttpSolrClient.java:543)
	at org.apache.solr.client.solrj.impl.HttpSolrClient.request(HttpSolrClient.java:241)
	at org.apache.solr.client.solrj.impl.HttpSolrClient.request(HttpSolrClient.java:230)
	at org.apache.solr.client.solrj.SolrRequest.process(SolrRequest.java:150)
	at org.apache.solr.client.solrj.SolrClient.query(SolrClient.java:943)
	at org.apache.solr.client.solrj.SolrClient.query(SolrClient.java:958)
	at org.apache.solr.cloud.AbstractFullDistribZkTestBase.waitForNon403or404or503(AbstractFullDistribZkTestBase.java:1754)
	at org.apache.solr.cloud.CollectionsAPIDistributedZkTest.testCollectionsAPI(CollectionsAPIDistributedZkTest.java:665)
	at org.apache.solr.cloud.CollectionsAPIDistributedZkTest.test(CollectionsAPIDistributedZkTest.java:167)
	at sun.reflect.NativeMethodAccessorImpl.invoke0(Native Method)
	at sun.reflect.NativeMethodAccessorImpl.invoke(NativeMethodAccessorImpl.java:62)
	at sun.reflect.DelegatingMethodAccessorImpl.invoke(DelegatingMethodAccessorImpl.java:43)
	at java.lang.reflect.Method.invoke(Method.java:497)
	at com.carrotsearch.randomizedtesting.RandomizedRunner.invoke(RandomizedRunner.java:1660)
	at com.carrotsearch.randomizedtesting.RandomizedRunner$8.evaluate(RandomizedRunner.java:866)
	at com.carrotsearch.randomizedtesting.RandomizedRunner$9.evaluate(RandomizedRunner.java:902)
	at com.carrotsearch.randomizedtesting.RandomizedRunner$10.evaluate(RandomizedRunner.java:916)
	at org.apache.solr.BaseDistributedSearchTestCase$ShardsRepeatRule$ShardsFixedStatement.callStatement(BaseDistributedSearchTestCase.java:963)
	at org.apache.solr.BaseDistributedSearchTestCase$ShardsRepeatRule$ShardsStatement.evaluate(BaseDistributedSearchTestCase.java:938)
	at com.carrotsearch.randomizedtesting.rules.SystemPropertiesRestoreRule$1.evaluate(SystemPropertiesRestoreRule.java:57)
	at org.apache.lucene.util.TestRuleSetupTeardownChained$1.evaluate(TestRuleSetupTeardownChained.java:50)
	at org.apache.lucene.util.AbstractBeforeAfterRule$1.evaluate(AbstractBeforeAfterRule.java:46)
	at org.apache.lucene.util.TestRuleThreadAndTestName$1.evaluate(TestRuleThreadAndTestName.java:49)
	at org.apache.lucene.util.TestRuleIgnoreAfterMaxFailures$1.evaluate(TestRuleIgnoreAfterMaxFailures.java:65)
	at org.apache.lucene.util.TestRuleMarkFailure$1.evaluate(TestRuleMarkFailure.java:48)
	at com.carrotsearch.randomizedtesting.rules.StatementAdapter.evaluate(StatementAdapter.java:36)
	at com.carrotsearch.randomizedtesting.ThreadLeakControl$StatementRunner.run(ThreadLeakControl.java:367)
	at com.carrotsearch.randomizedtesting.ThreadLeakControl.forkTimeoutingTask(ThreadLeakControl.java:809)
	at com.carrotsearch.randomizedtesting.ThreadLeakControl$3.evaluate(ThreadLeakControl.java:460)
	at com.carrotsearch.randomizedtesting.RandomizedRunner.runSingleTest(RandomizedRunner.java:875)
	at com.carrotsearch.randomizedtesting.RandomizedRunner$5.evaluate(RandomizedRunner.java:777)
	at com.carrotsearch.randomizedtesting.RandomizedRunner$6.evaluate(RandomizedRunner.java:811)
	at com.carrotsearch.randomizedtesting.RandomizedRunner$7.evaluate(RandomizedRunner.java:822)
	at com.carrotsearch.randomizedtesting.rules.StatementAdapter.evaluate(StatementAdapter.java:36)
	at com.carrotsearch.randomizedtesting.rules.SystemPropertiesRestoreRule$1.evaluate(SystemPropertiesRestoreRule.java:57)
	at org.apache.lucene.util.AbstractBeforeAfterRule$1.evaluate(AbstractBeforeAfterRule.java:46)
	at com.carrotsearch.randomizedtesting.rules.StatementAdapter.evaluate(StatementAdapter.java:36)
	at org.apache.lucene.util.TestRuleStoreClassName$1.evaluate(TestRuleStoreClassName.java:42)
	at com.carrotsearch.randomizedtesting.rules.NoShadowingOrOverridesOnMethodsRule$1.evaluate(NoShadowingOrOverridesOnMethodsRule.java:40)
	at com.carrotsearch.randomizedtesting.rules.NoShadowingOrOverridesOnMethodsRule$1.evaluate(NoShadowingOrOverridesOnMethodsRule.java:40)
	at com.carrotsearch.randomizedtesting.rules.StatementAdapter.evaluate(StatementAdapter.java:36)
	at com.carrotsearch.randomizedtesting.rules.StatementAdapter.evaluate(StatementAdapter.java:36)
	at com.carrotsearch.randomizedtesting.rules.StatementAdapter.evaluate(StatementAdapter.java:36)
	at org.apache.lucene.util.TestRuleAssertionsRequired$1.evaluate(TestRuleAssertionsRequired.java:54)
	at org.apache.lucene.util.TestRuleMarkFailure$1.evaluate(TestRuleMarkFailure.java:48)
	at org.apache.lucene.util.TestRuleIgnoreAfterMaxFailures$1.evaluate(TestRuleIgnoreAfterMaxFailures.java:65)
	at org.apache.lucene.util.TestRuleIgnoreTestSuites$1.evaluate(TestRuleIgnoreTestSuites.java:55)
	at com.carrotsearch.randomizedtesting.rules.StatementAdapter.evaluate(StatementAdapter.java:36)
	at com.carrotsearch.randomizedtesting.ThreadLeakControl$StatementRunner.run(ThreadLeakControl.java:367)
	at java.lang.Thread.run(Thread.java:745)




Build Log:
[...truncated 9313 lines...]
   [junit4] Suite: org.apache.solr.cloud.ChaosMonkeyNothingIsSafeTest
   [junit4]   2> Creating dataDir: /home/jenkins/workspace/Lucene-Solr-trunk-Linux/solr/build/solr-core/test/J1/temp/solr.cloud.ChaosMonkeyNothingIsSafeTest_704935DE55851596-001/init-core-data-001
   [junit4]   2> 0    INFO  (SUITE-ChaosMonkeyNothingIsSafeTest-seed#[704935DE55851596]-worker) [    ] o.a.s.BaseDistributedSearchTestCase Setting hostContext system property: /
   [junit4]   2> 23   INFO  (TEST-ChaosMonkeyNothingIsSafeTest.test-seed#[704935DE55851596]) [    ] o.a.s.c.ZkTestServer STARTING ZK TEST SERVER
   [junit4]   2> 25   INFO  (Thread-1) [    ] o.a.s.c.ZkTestServer client port:0.0.0.0/0.0.0.0:0
   [junit4]   2> 25   INFO  (Thread-1) [    ] o.a.s.c.ZkTestServer Starting server
   [junit4]   2> 125  INFO  (TEST-ChaosMonkeyNothingIsSafeTest.test-seed#[704935DE55851596]) [    ] o.a.s.c.ZkTestServer start zk server on port:51172
   [junit4]   2> 147  INFO  (TEST-ChaosMonkeyNothingIsSafeTest.test-seed#[704935DE55851596]) [    ] o.a.s.c.c.SolrZkClient Using default ZkCredentialsProvider
   [junit4]   2> 205  INFO  (TEST-ChaosMonkeyNothingIsSafeTest.test-seed#[704935DE55851596]) [    ] o.a.s.c.c.ConnectionManager Waiting for client to connect to ZooKeeper
   [junit4]   2> 285  INFO  (zkCallback-1-thread-1) [    ] o.a.s.c.c.ConnectionManager Watcher org.apache.solr.common.cloud.ConnectionManager@1e8d29d name:ZooKeeperConnection Watcher:127.0.0.1:51172 got event WatchedEvent state:SyncConnected type:None path:null path:null type:None
   [junit4]   2> 287  INFO  (TEST-ChaosMonkeyNothingIsSafeTest.test-seed#[704935DE55851596]) [    ] o.a.s.c.c.ConnectionManager Client is connected to ZooKeeper
   [junit4]   2> 289  INFO  (TEST-ChaosMonkeyNothingIsSafeTest.test-seed#[704935DE55851596]) [    ] o.a.s.c.c.SolrZkClient Using default ZkACLProvider
   [junit4]   2> 291  INFO  (TEST-ChaosMonkeyNothingIsSafeTest.test-seed#[704935DE55851596]) [    ] o.a.s.c.c.SolrZkClient makePath: /solr
   [junit4]   2> 308  INFO  (TEST-ChaosMonkeyNothingIsSafeTest.test-seed#[704935DE55851596]) [    ] o.a.s.c.c.SolrZkClient Using default ZkCredentialsProvider
   [junit4]   2> 309  INFO  (TEST-ChaosMonkeyNothingIsSafeTest.test-seed#[704935DE55851596]) [    ] o.a.s.c.c.ConnectionManager Waiting for client to connect to ZooKeeper
   [junit4]   2> 311  INFO  (zkCallback-2-thread-1) [    ] o.a.s.c.c.ConnectionManager Watcher org.apache.solr.common.cloud.ConnectionManager@1a048f4 name:ZooKeeperConnection Watcher:127.0.0.1:51172/solr got event WatchedEvent state:SyncConnected type:None path:null path:null type:None
   [junit4]   2> 311  INFO  (TEST-ChaosMonkeyNothingIsSafeTest.test-seed#[704935DE55851596]) [    ] o.a.s.c.c.ConnectionManager Client is connected to ZooKeeper
   [junit4]   2> 311  INFO  (TEST-ChaosMonkeyNothingIsSafeTest.test-seed#[704935DE55851596]) [    ] o.a.s.c.c.SolrZkClient Using default ZkACLProvider
   [junit4]   2> 316  INFO  (TEST-ChaosMonkeyNothingIsSafeTest.test-seed#[704935DE55851596]) [    ] o.a.s.c.c.SolrZkClient makePath: /collections/collection1
   [junit4]   2> 319  INFO  (TEST-ChaosMonkeyNothingIsSafeTest.test-seed#[704935DE55851596]) [    ] o.a.s.c.c.SolrZkClient makePath: /collections/collection1/shards
   [junit4]   2> 322  INFO  (TEST-ChaosMonkeyNothingIsSafeTest.test-seed#[704935DE55851596]) [    ] o.a.s.c.c.SolrZkClient makePath: /collections/control_collection
   [junit4]   2> 324  INFO  (TEST-ChaosMonkeyNothingIsSafeTest.test-seed#[704935DE55851596]) [    ] o.a.s.c.c.SolrZkClient makePath: /collections/control_collection/shards
   [junit4]   2> 327  INFO  (TEST-ChaosMonkeyNothingIsSafeTest.test-seed#[704935DE55851596]) [    ] o.a.s.c.AbstractZkTestCase put /home/jenkins/workspace/Lucene-Solr-trunk-Linux/solr/core/src/test-files/solr/collection1/conf/solrconfig-tlog.xml to /configs/conf1/solrconfig.xml
   [junit4]   2> 338  INFO  (TEST-ChaosMonkeyNothingIsSafeTest.test-seed#[704935DE55851596]) [    ] o.a.s.c.c.SolrZkClient makePath: /configs/conf1/solrconfig.xml
   [junit4]   2> 343  INFO  (TEST-ChaosMonkeyNothingIsSafeTest.test-seed#[704935DE55851596]) [    ] o.a.s.c.AbstractZkTestCase put /home/jenkins/workspace/Lucene-Solr-trunk-Linux/solr/core/src/test-files/solr/collection1/conf/schema15.xml to /configs/conf1/schema.xml
   [junit4]   2> 343  INFO  (TEST-ChaosMonkeyNothingIsSafeTest.test-seed#[704935DE55851596]) [    ] o.a.s.c.c.SolrZkClient makePath: /configs/conf1/schema.xml
   [junit4]   2> 346  INFO  (TEST-ChaosMonkeyNothingIsSafeTest.test-seed#[704935DE55851596]) [    ] o.a.s.c.AbstractZkTestCase put /home/jenkins/workspace/Lucene-Solr-trunk-Linux/solr/core/src/test-files/solr/collection1/conf/solrconfig.snippet.randomindexconfig.xml to /configs/conf1/solrconfig.snippet.randomindexconfig.xml
   [junit4]   2> 347  INFO  (TEST-ChaosMonkeyNothingIsSafeTest.test-seed#[704935DE55851596]) [    ] o.a.s.c.c.SolrZkClient makePath: /configs/conf1/solrconfig.snippet.randomindexconfig.xml
   [junit4]   2> 349  INFO  (TEST-ChaosMonkeyNothingIsSafeTest.test-seed#[704935DE55851596]) [    ] o.a.s.c.AbstractZkTestCase put /home/jenkins/workspace/Lucene-Solr-trunk-Linux/solr/core/src/test-files/solr/collection1/conf/stopwords.txt to /configs/conf1/stopwords.txt
   [junit4]   2> 349  INFO  (TEST-ChaosMonkeyNothingIsSafeTest.test-seed#[704935DE55851596]) [    ] o.a.s.c.c.SolrZkClient makePath: /configs/conf1/stopwords.txt
   [junit4]   2> 352  INFO  (TEST-ChaosMonkeyNothingIsSafeTest.test-seed#[704935DE55851596]) [    ] o.a.s.c.AbstractZkTestCase put /home/jenkins/workspace/Lucene-Solr-trunk-Linux/solr/core/src/test-files/solr/collection1/conf/protwords.txt to /configs/conf1/protwords.txt
   [junit4]   2> 352  INFO  (TEST-ChaosMonkeyNothingIsSafeTest.test-seed#[704935DE55851596]) [    ] o.a.s.c.c.SolrZkClient makePath: /configs/conf1/protwords.txt
   [junit4]   2> 354  INFO  (TEST-ChaosMonkeyNothingIsSafeTest.test-seed#[704935DE55851596]) [    ] o.a.s.c.AbstractZkTestCase put /home/jenkins/workspace/Lucene-Solr-trunk-Linux/solr/core/src/test-files/solr/collection1/conf/currency.xml to /configs/conf1/currency.xml
   [junit4]   2> 355  INFO  (TEST-ChaosMonkeyNothingIsSafeTest.test-seed#[704935DE55851596]) [    ] o.a.s.c.c.SolrZkClient makePath: /configs/conf1/currency.xml
   [junit4]   2> 357  INFO  (TEST-ChaosMonkeyNothingIsSafeTest.test-seed#[704935DE55851596]) [    ] o.a.s.c.AbstractZkTestCase put /home/jenkins/workspace/Lucene-Solr-trunk-Linux/solr/core/src/test-files/solr/collection1/conf/enumsConfig.xml to /configs/conf1/enumsConfig.xml
   [junit4]   2> 358  INFO  (TEST-ChaosMonkeyNothingIsSafeTest.test-seed#[704935DE55851596]) [    ] o.a.s.c.c.SolrZkClient makePath: /configs/conf1/enumsConfig.xml
   [junit4]   2> 361  INFO  (TEST-ChaosMonkeyNothingIsSafeTest.test-seed#[704935DE55851596]) [    ] o.a.s.c.AbstractZkTestCase put /home/jenkins/workspace/Lucene-Solr-trunk-Linux/solr/core/src/test-files/solr/collection1/conf/open-exchange-rates.json to /configs/conf1/open-exchange-rates.json
   [junit4]   2> 361  INFO  (TEST-ChaosMonkeyNothingIsSafeTest.test-seed#[704935DE55851596]) [    ] o.a.s.c.c.SolrZkClient makePath: /configs/conf1/open-exchange-rates.json
   [junit4]   2> 364  INFO  (TEST-ChaosMonkeyNothingIsSafeTest.test-seed#[704935DE55851596]) [    ] o.a.s.c.AbstractZkTestCase put /home/jenkins/workspace/Lucene-Solr-trunk-Linux/solr/core/src/test-files/solr/collection1/conf/mapping-ISOLatin1Accent.txt to /configs/conf1/mapping-ISOLatin1Accent.txt
   [junit4]   2> 364  INFO  (TEST-ChaosMonkeyNothingIsSafeTest.test-seed#[704935DE55851596]) [    ] o.a.s.c.c.SolrZkClient makePath: /configs/conf1/mapping-ISOLatin1Accent.txt
   [junit4]   2> 367  INFO  (TEST-ChaosMonkeyNothingIsSafeTest.test-seed#[704935DE55851596]) [    ] o.a.s.c.AbstractZkTestCase put /home/jenkins/workspace/Lucene-Solr-trunk-Linux/solr/core/src/test-files/solr/collection1/conf/old_synonyms.txt to /configs/conf1/old_synonyms.txt
   [junit4]   2> 367  INFO  (TEST-ChaosMonkeyNothingIsSafeTest.test-seed#[704935DE55851596]) [    ] o.a.s.c.c.SolrZkClient makePath: /configs/conf1/old_synonyms.txt
   [junit4]   2> 369  INFO  (TEST-ChaosMonkeyNothingIsSafeTest.test-seed#[704935DE55851596]) [    ] o.a.s.c.AbstractZkTestCase put /home/jenkins/workspace/Lucene-Solr-trunk-Linux/solr/core/src/test-files/solr/collection1/conf/synonyms.txt to /configs/conf1/synonyms.txt
   [junit4]   2> 369  INFO  (TEST-ChaosMonkeyNothingIsSafeTest.test-seed#[704935DE55851596]) [    ] o.a.s.c.c.SolrZkClient makePath: /configs/conf1/synonyms.txt
   [junit4]   2> 440  INFO  (TEST-ChaosMonkeyNothingIsSafeTest.test-seed#[704935DE55851596]) [    ] o.a.s.SolrTestCaseJ4 Writing core.properties file to /home/jenkins/workspace/Lucene-Solr-trunk-Linux/solr/build/solr-core/test/J1/temp/solr.cloud.ChaosMonkeyNothingIsSafeTest_704935DE55851596-001/control-001/cores/collection1
   [junit4]   2> 463  INFO  (TEST-ChaosMonkeyNothingIsSafeTest.test-seed#[704935DE55851596]) [    ] o.e.j.u.log Logging initialized @2249ms
   [junit4]   2> 590  INFO  (TEST-ChaosMonkeyNothingIsSafeTest.test-seed#[704935DE55851596]) [    ] o.e.j.s.Server jetty-9.2.13.v20150730
   [junit4]   2> 639  INFO  (TEST-ChaosMonkeyNothingIsSafeTest.test-seed#[704935DE55851596]) [    ] o.e.j.s.h.ContextHandler Started o.e.j.s.ServletContextHandler@6361a7{/,null,AVAILABLE}
   [junit4]   2> 649  INFO  (TEST-ChaosMonkeyNothingIsSafeTest.test-seed#[704935DE55851596]) [    ] o.e.j.s.ServerConnector Started ServerConnector@1954070{HTTP/1.1}{127.0.0.1:41023}
   [junit4]   2> 649  INFO  (TEST-ChaosMonkeyNothingIsSafeTest.test-seed#[704935DE55851596]) [    ] o.e.j.s.Server Started @2437ms
   [junit4]   2> 649  INFO  (TEST-ChaosMonkeyNothingIsSafeTest.test-seed#[704935DE55851596]) [    ] o.a.s.c.s.e.JettySolrRunner Jetty properties: {solr.data.dir=/home/jenkins/workspace/Lucene-Solr-trunk-Linux/solr/build/solr-core/test/J1/temp/solr.cloud.ChaosMonkeyNothingIsSafeTest_704935DE55851596-001/tempDir-001/control/data, hostContext=/, hostPort=41023, coreRootDirectory=/home/jenkins/workspace/Lucene-Solr-trunk-Linux/solr/build/solr-core/test/J1/../../../../../../../../../home/jenkins/workspace/Lucene-Solr-trunk-Linux/solr/build/solr-core/test/J1/temp/solr.cloud.ChaosMonkeyNothingIsSafeTest_704935DE55851596-001/control-001/cores}
   [junit4]   2> 654  INFO  (TEST-ChaosMonkeyNothingIsSafeTest.test-seed#[704935DE55851596]) [    ] o.a.s.s.SolrDispatchFilter SolrDispatchFilter.init(): sun.misc.Launcher$AppClassLoader@e2f2a
   [junit4]   2> 672  INFO  (TEST-ChaosMonkeyNothingIsSafeTest.test-seed#[704935DE55851596]) [    ] o.a.s.c.SolrResourceLoader new SolrResourceLoader for directory: '/home/jenkins/workspace/Lucene-Solr-trunk-Linux/solr/build/solr-core/test/J1/../../../../../../../../../home/jenkins/workspace/Lucene-Solr-trunk-Linux/solr/build/solr-core/test/J1/temp/solr.cloud.ChaosMonkeyNothingIsSafeTest_704935DE55851596-001/control-001/'
   [junit4]   2> 676  INFO  (TEST-ChaosMonkeyNothingIsSafeTest.test-seed#[704935DE55851596]) [    ] o.a.s.c.SolrResourceLoader JNDI not configured for solr (NoInitialContextEx)
   [junit4]   2> 676  INFO  (TEST-ChaosMonkeyNothingIsSafeTest.test-seed#[704935DE55851596]) [    ] o.a.s.c.SolrResourceLoader solr home defaulted to 'solr/' (could not find system property or JNDI)
   [junit4]   2> 805  INFO  (TEST-ChaosMonkeyNothingIsSafeTest.test-seed#[704935DE55851596]) [    ] o.a.s.c.c.SolrZkClient Using default ZkCredentialsProvider
   [junit4]   2> 806  INFO  (TEST-ChaosMonkeyNothingIsSafeTest.test-seed#[704935DE55851596]) [    ] o.a.s.c.c.ConnectionManager Waiting for client to connect to ZooKeeper
   [junit4]   2> 808  INFO  (zkCallback-3-thread-1) [    ] o.a.s.c.c.ConnectionManager Watcher org.apache.solr.common.cloud.ConnectionManager@b102 name:ZooKeeperConnection Watcher:127.0.0.1:51172/solr got event WatchedEvent state:SyncConnected type:None path:null path:null type:None
   [junit4]   2> 808  INFO  (TEST-ChaosMonkeyNothingIsSafeTest.test-seed#[704935DE55851596]) [    ] o.a.s.c.c.ConnectionManager Client is connected to ZooKeeper
   [junit4]   2> 808  INFO  (TEST-ChaosMonkeyNothingIsSafeTest.test-seed#[704935DE55851596]) [    ] o.a.s.c.c.SolrZkClient Using default ZkACLProvider
   [junit4]   2> 810  INFO  (TEST-ChaosMonkeyNothingIsSafeTest.test-seed#[704935DE55851596]) [    ] o.a.s.s.SolrDispatchFilter Loading solr.xml from SolrHome (not found in ZooKeeper)
   [junit4]   2> 812  INFO  (TEST-ChaosMonkeyNothingIsSafeTest.test-seed#[704935DE55851596]) [    ] o.a.s.c.SolrXmlConfig Loading container configuration from /home/jenkins/workspace/Lucene-Solr-trunk-Linux/solr/build/solr-core/test/J1/../../../../../../../../../home/jenkins/workspace/Lucene-Solr-trunk-Linux/solr/build/solr-core/test/J1/temp/solr.cloud.ChaosMonkeyNothingIsSafeTest_704935DE55851596-001/control-001/solr.xml
   [junit4]   2> 920  INFO  (TEST-ChaosMonkeyNothingIsSafeTest.test-seed#[704935DE55851596]) [    ] o.a.s.c.CoresLocator Config-defined core root directory: /home/jenkins/workspace/Lucene-Solr-trunk-Linux/solr/build/solr-core/test/J1/../../../../../../../../../home/jenkins/workspace/Lucene-Solr-trunk-Linux/solr/build/solr-core/test/J1/temp/solr.cloud.ChaosMonkeyNothingIsSafeTest_704935DE55851596-001/control-001/cores
   [junit4]   2> 966  INFO  (TEST-ChaosMonkeyNothingIsSafeTest.test-seed#[704935DE55851596]) [    ] o.a.s.c.CoreContainer New CoreContainer 4344303
   [junit4]   2> 966  INFO  (TEST-ChaosMonkeyNothingIsSafeTest.test-seed#[704935DE55851596]) [    ] o.a.s.c.CoreContainer Loading cores into CoreContainer [instanceDir=/home/jenkins/workspace/Lucene-Solr-trunk-Linux/solr/build/solr-core/test/J1/../../../../../../../../../home/jenkins/workspace/Lucene-Solr-trunk-Linux/solr/build/solr-core/test/J1/temp/solr.cloud.ChaosMonkeyNothingIsSafeTest_704935DE55851596-001/control-001/]
   [junit4]   2> 966  INFO  (TEST-ChaosMonkeyNothingIsSafeTest.test-seed#[704935DE55851596]) [    ] o.a.s.c.CoreContainer loading shared library: /home/jenkins/workspace/Lucene-Solr-trunk-Linux/solr/build/solr-core/test/J1/../../../../../../../../../home/jenkins/workspace/Lucene-Solr-trunk-Linux/solr/build/solr-core/test/J1/temp/solr.cloud.ChaosMonkeyNothingIsSafeTest_704935DE55851596-001/control-001/lib
   [junit4]   2> 967  WARN  (TEST-ChaosMonkeyNothingIsSafeTest.test-seed#[704935DE55851596]) [    ] o.a.s.c.SolrResourceLoader Can't find (or read) directory to add to classloader: lib (resolved as: /home/jenkins/workspace/Lucene-Solr-trunk-Linux/solr/build/solr-core/test/J1/../../../../../../../../../home/jenkins/workspace/Lucene-Solr-trunk-Linux/solr/build/solr-core/test/J1/temp/solr.cloud.ChaosMonkeyNothingIsSafeTest_704935DE55851596-001/control-001/lib).
   [junit4]   2> 1008 INFO  (TEST-ChaosMonkeyNothingIsSafeTest.test-seed#[704935DE55851596]) [    ] o.a.s.h.c.HttpShardHandlerFactory created with socketTimeout : 90000,urlScheme : ,connTimeout : 15000,maxConnectionsPerHost : 20,maxConnections : 10000,corePoolSize : 0,maximumPoolSize : 2147483647,maxThreadIdleTime : 5,sizeOfQueue : -1,fairnessPolicy : false,useRetries : false,
   [junit4]   2> 1206 INFO  (TEST-ChaosMonkeyNothingIsSafeTest.test-seed#[704935DE55851596]) [    ] o.a.s.u.UpdateShardHandler Creating UpdateShardHandler HTTP client with params: socketTimeout=340000&connTimeout=45000&retry=true
   [junit4]   2> 1210 INFO  (TEST-ChaosMonkeyNothingIsSafeTest.test-seed#[704935DE55851596]) [    ] o.a.s.l.LogWatcher SLF4J impl is org.slf4j.impl.Log4jLoggerFactory
   [junit4]   2> 1211 INFO  (TEST-ChaosMonkeyNothingIsSafeTest.test-seed#[704935DE55851596]) [    ] o.a.s.l.LogWatcher Registering Log Listener [Log4j (org.slf4j.impl.Log4jLoggerFactory)]
   [junit4]   2> 1213 INFO  (TEST-ChaosMonkeyNothingIsSafeTest.test-seed#[704935DE55851596]) [    ] o.a.s.c.ZkContainer Zookeeper client=127.0.0.1:51172/solr
   [junit4]   2> 1224 INFO  (TEST-ChaosMonkeyNothingIsSafeTest.test-seed#[704935DE55851596]) [    ] o.a.s.c.ZkController zkHost includes chroot
   [junit4]   2> 1224 INFO  (TEST-ChaosMonkeyNothingIsSafeTest.test-seed#[704935DE55851596]) [    ] o.a.s.c.c.SolrZkClient Using default ZkCredentialsProvider
   [junit4]   2> 1225 INFO  (TEST-ChaosMonkeyNothingIsSafeTest.test-seed#[704935DE55851596]) [    ] o.a.s.c.c.ConnectionManager Waiting for client to connect to ZooKeeper
   [junit4]   2> 1227 INFO  (zkCallback-5-thread-1) [    ] o.a.s.c.c.ConnectionManager Watcher org.apache.solr.common.cloud.ConnectionManager@146a754 name:ZooKeeperConnection Watcher:127.0.0.1:51172 got event WatchedEvent state:SyncConnected type:None path:null path:null type:None
   [junit4]   2> 1227 INFO  (TEST-ChaosMonkeyNothingIsSafeTest.test-seed#[704935DE55851596]) [    ] o.a.s.c.c.ConnectionManager Client is connected to ZooKeeper
   [junit4]   2> 1227 INFO  (TEST-ChaosMonkeyNothingIsSafeTest.test-seed#[704935DE55851596]) [    ] o.a.s.c.c.SolrZkClient Using default ZkACLProvider
   [junit4]   2> 1233 INFO  (TEST-ChaosMonkeyNothingIsSafeTest.test-seed#[704935DE55851596]) [n:127.0.0.1:41023_    ] o.a.s.c.c.ConnectionManager Waiting for client to connect to ZooKeeper
   [junit4]   2> 1235 INFO  (zkCallback-6-thread-1-processing-n:127.0.0.1:41023_) [n:127.0.0.1:41023_    ] o.a.s.c.c.ConnectionManager Watcher org.apache.solr.common.cloud.ConnectionManager@1e06676 name:ZooKeeperConnection Watcher:127.0.0.1:51172/solr got event WatchedEvent state:SyncConnected type:None path:null path:null type:None
   [junit4]   2> 1236 INFO  (TEST-ChaosMonkeyNothingIsSafeTest.test-seed#[704935DE55851596]) [n:127.0.0.1:41023_    ] o.a.s.c.c.ConnectionManager Client is connected to ZooKeeper
   [junit4]   2> 1241 INFO  (TEST-ChaosMonkeyNothingIsSafeTest.test-seed#[704935DE55851596]) [n:127.0.0.1:41023_    ] o.a.s.c.c.SolrZkClient makePath: /overseer/queue
   [junit4]   2> 1249 INFO  (TEST-ChaosMonkeyNothingIsSafeTest.test-seed#[704935DE55851596]) [n:127.0.0.1:41023_    ] o.a.s.c.c.SolrZkClient makePath: /overseer/collection-queue-work
   [junit4]   2> 1253 INFO  (TEST-ChaosMonkeyNothingIsSafeTest.test-seed#[704935DE55851596]) [n:127.0.0.1:41023_    ] o.a.s.c.c.SolrZkClient makePath: /overseer/collection-map-running
   [junit4]   2> 1259 INFO  (TEST-ChaosMonkeyNothingIsSafeTest.test-seed#[704935DE55851596]) [n:127.0.0.1:41023_    ] o.a.s.c.c.SolrZkClient makePath: /overseer/collection-map-completed
   [junit4]   2> 1264 INFO  (TEST-ChaosMonkeyNothingIsSafeTest.test-seed#[704935DE55851596]) [n:127.0.0.1:41023_    ] o.a.s.c.c.SolrZkClient makePath: /overseer/collection-map-failure
   [junit4]   2> 1275 INFO  (TEST-ChaosMonkeyNothingIsSafeTest.test-seed#[704935DE55851596]) [n:127.0.0.1:41023_    ] o.a.s.c.c.SolrZkClient makePath: /live_nodes
   [junit4]   2> 1277 INFO  (TEST-ChaosMonkeyNothingIsSafeTest.test-seed#[704935DE55851596]) [n:127.0.0.1:41023_    ] o.a.s.c.c.SolrZkClient makePath: /aliases.json
   [junit4]   2> 1279 INFO  (TEST-ChaosMonkeyNothingIsSafeTest.test-seed#[704935DE55851596]) [n:127.0.0.1:41023_    ] o.a.s.c.c.SolrZkClient makePath: /clusterstate.json
   [junit4]   2> 1281 INFO  (TEST-ChaosMonkeyNothingIsSafeTest.test-seed#[704935DE55851596]) [n:127.0.0.1:41023_    ] o.a.s.c.c.SolrZkClient makePath: /security.json
   [junit4]   2> 1283 INFO  (TEST-ChaosMonkeyNothingIsSafeTest.test-seed#[704935DE55851596]) [n:127.0.0.1:41023_    ] o.a.s.c.ZkController Register node as live in ZooKeeper:/live_nodes/127.0.0.1:41023_
   [junit4]   2> 1285 INFO  (TEST-ChaosMonkeyNothingIsSafeTest.test-seed#[704935DE55851596]) [n:127.0.0.1:41023_    ] o.a.s.c.c.SolrZkClient makePath: /live_nodes/127.0.0.1:41023_
   [junit4]   2> 1291 INFO  (TEST-ChaosMonkeyNothingIsSafeTest.test-seed#[704935DE55851596]) [n:127.0.0.1:41023_    ] o.a.s.c.c.SolrZkClient makePath: /overseer_elect
   [junit4]   2> 1293 INFO  (TEST-ChaosMonkeyNothingIsSafeTest.test-seed#[704935DE55851596]) [n:127.0.0.1:41023_    ] o.a.s.c.c.SolrZkClient makePath: /overseer_elect/election
   [junit4]   2> 1295 INFO  (TEST-ChaosMonkeyNothingIsSafeTest.test-seed#[704935DE55851596]) [n:127.0.0.1:41023_    ] o.a.s.c.Overseer Overseer (id=null) closing
   [junit4]   2> 1296 INFO  (TEST-ChaosMonkeyNothingIsSafeTest.test-seed#[704935DE55851596]) [n:127.0.0.1:41023_    ] o.a.s.c.LeaderElector Joined leadership election with path: /overseer_elect/election/94822740769112068-127.0.0.1:41023_-n_0000000000
   [junit4]   2> 1301 INFO  (TEST-ChaosMonkeyNothingIsSafeTest.test-seed#[704935DE55851596]) [n:127.0.0.1:41023_    ] o.a.s.c.OverseerElectionContext I am going to be the leader 127.0.0.1:41023_
   [junit4]   2> 1301 INFO  (TEST-ChaosMonkeyNothingIsSafeTest.test-seed#[704935DE55851596]) [n:127.0.0.1:41023_    ] o.a.s.c.c.SolrZkClient makePath: /overseer_elect/leader
   [junit4]   2> 1308 INFO  (TEST-ChaosMonkeyNothingIsSafeTest.test-seed#[704935DE55851596]) [n:127.0.0.1:41023_    ] o.a.s.c.Overseer Overseer (id=94822740769112068-127.0.0.1:41023_-n_0000000000) starting
   [junit4]   2> 1318 INFO  (TEST-ChaosMonkeyNothingIsSafeTest.test-seed#[704935DE55851596]) [n:127.0.0.1:41023_    ] o.a.s.c.c.SolrZkClient makePath: /overseer/queue-work
   [junit4]   2> 1353 INFO  (TEST-ChaosMonkeyNothingIsSafeTest.test-seed#[704935DE55851596]) [n:127.0.0.1:41023_    ] o.a.s.c.OverseerAutoReplicaFailoverThread Starting OverseerAutoReplicaFailoverThread autoReplicaFailoverWorkLoopDelay=10000 autoReplicaFailoverWaitAfterExpiration=30000 autoReplicaFailoverBadNodeExpiration=60000
   [junit4]   2> 1404 INFO  (OverseerCollectionConfigSetProcessor-94822740769112068-127.0.0.1:41023_-n_0000000000) [n:127.0.0.1:41023_    ] o.a.s.c.OverseerTaskProcessor Process current queue of overseer operations
   [junit4]   2> 1404 INFO  (TEST-ChaosMonkeyNothingIsSafeTest.test-seed#[704935DE55851596]) [n:127.0.0.1:41023_    ] o.a.s.c.c.ZkStateReader Updating cluster state from ZooKeeper... 
   [junit4]   2> 1420 INFO  (OverseerStateUpdate-94822740769112068-127.0.0.1:41023_-n_0000000000) [n:127.0.0.1:41023_    ] o.a.s.c.Overseer Starting to work on the main queue
   [junit4]   2> 1535 INFO  (TEST-ChaosMonkeyNothingIsSafeTest.test-seed#[704935DE55851596]) [n:127.0.0.1:41023_    ] o.a.s.c.CoreContainer Security conf doesn't exist. Skipping setup for authorization module.
   [junit4]   2> 1535 INFO  (TEST-ChaosMonkeyNothingIsSafeTest.test-seed#[704935DE55851596]) [n:127.0.0.1:41023_    ] o.a.s.c.CoreContainer No authentication plugin used.
   [junit4]   2> 1601 INFO  (TEST-ChaosMonkeyNothingIsSafeTest.test-seed#[704935DE55851596]) [n:127.0.0.1:41023_    ] o.a.s.c.CoresLocator Looking for core definitions underneath /home/jenkins/workspace/Lucene-Solr-trunk-Linux/solr/build/solr-core/test/J1/../../../../../../../../../home/jenkins/workspace/Lucene-Solr-trunk-Linux/solr/build/solr-core/test/J1/temp/solr.cloud.ChaosMonkeyNothingIsSafeTest_704935DE55851596-001/control-001/cores
   [junit4]   2> 1650 INFO  (TEST-ChaosMonkeyNothingIsSafeTest.test-seed#[704935DE55851596]) [n:127.0.0.1:41023_    ] o.a.s.c.SolrCore Created CoreDescriptor: {name=collection1, config=solrconfig.xml, transient=false, schema=schema.xml, loadOnStartup=true, configSetProperties=configsetprops.json, instanceDir=/home/jenkins/workspace/Lucene-Solr-trunk-Linux/solr/build/solr-core/test/J1/../../../../../../../../../home/jenkins/workspace/Lucene-Solr-trunk-Linux/solr/build/solr-core/test/J1/temp/solr.cloud.ChaosMonkeyNothingIsSafeTest_704935DE55851596-001/control-001/cores/collection1, collection=control_collection, absoluteInstDir=/home/jenkins/workspace/Lucene-Solr-trunk-Linux/solr/build/solr-core/test/J1/../../../../../../../../../home/jenkins/workspace/Lucene-Solr-trunk-Linux/solr/build/solr-core/test/J1/temp/solr.cloud.ChaosMonkeyNothingIsSafeTest_704935DE55851596-001/control-001/cores/collection1/, coreNodeName=, dataDir=data/, shard=}
   [junit4]   2> 1651 INFO  (TEST-ChaosMonkeyNothingIsSafeTest.test-seed#[704935DE55851596]) [n:127.0.0.1:41023_    ] o.a.s.c.CoresLocator Found core collection1 in /home/jenkins/workspace/Lucene-Solr-trunk-Linux/solr/build/solr-core/test/J1/../../../../../../../../../home/jenkins/workspace/Lucene-Solr-trunk-Linux/solr/build/solr-core/test/J1/temp/solr.cloud.ChaosMonkeyNothingIsSafeTest_704935DE55851596-001/control-001/cores/collection1/
   [junit4]   2> 1651 INFO  (TEST-ChaosMonkeyNothingIsSafeTest.test-seed#[704935DE55851596]) [n:127.0.0.1:41023_    ] o.a.s.c.CoresLocator Found 1 core definitions
   [junit4]   2> 1654 INFO  (coreLoadExecutor-7-thread-1-processing-n:127.0.0.1:41023_) [n:127.0.0.1:41023_ c:control_collection   x:collection1] o.a.s.c.ZkController publishing state=down
   [junit4]   2> 1654 INFO  (coreLoadExecutor-7-thread-1-processing-n:127.0.0.1:41023_) [n:127.0.0.1:41023_ c:control_collection   x:collection1] o.a.s.c.ZkController numShards not found on descriptor - reading it from system property
   [junit4]   2> 1660 INFO  (TEST-ChaosMonkeyNothingIsSafeTest.test-seed#[704935DE55851596]) [n:127.0.0.1:41023_    ] o.a.s.s.SolrDispatchFilter user.dir=/home/jenkins/workspace/Lucene-Solr-trunk-Linux/solr/build/solr-core/test/J1
   [junit4]   2> 1660 INFO  (TEST-ChaosMonkeyNothingIsSafeTest.test-seed#[704935DE55851596]) [n:127.0.0.1:41023_    ] o.a.s.s.SolrDispatchFilter SolrDispatchFilter.init() done
   [junit4]   2> 1661 INFO  (OverseerStateUpdate-94822740769112068-127.0.0.1:41023_-n_0000000000) [n:127.0.0.1:41023_    ] o.a.s.c.Overseer processMessage: queueSize: 1, message = {
   [junit4]   2>   "core":"collection1",
   [junit4]   2>   "roles":null,
   [junit4]   2>   "base_url":"http://127.0.0.1:41023",
   [junit4]   2>   "node_name":"127.0.0.1:41023_",
   [junit4]   2>   "numShards":"1",
   [junit4]   2>   "state":"down",
   [junit4]   2>   "shard":null,
   [junit4]   2>   "collection":"control_collection",
   [junit4]   2>   "operation":"state"} current state version: 0
   [junit4]   2> 1663 INFO  (coreLoadExecutor-7-thread-1-processing-n:127.0.0.1:41023_) [n:127.0.0.1:41023_ c:control_collection   x:collection1] o.a.s.c.ZkController look for our core node name
   [junit4]   2> 1672 INFO  (OverseerStateUpdate-94822740769112068-127.0.0.1:41023_-n_0000000000) [n:127.0.0.1:41023_    ] o.a.s.c.o.ReplicaMutator Update state numShards=1 message={
   [junit4]   2>   "core":"collection1",
   [junit4]   2>   "roles":null,
   [junit4]   2>   "base_url":"http://127.0.0.1:41023",
   [junit4]   2>   "node_name":"127.0.0.1:41023_",
   [junit4]   2>   "numShards":"1",
   [junit4]   2>   "state":"down",
   [junit4]   2>   "shard":null,
   [junit4]   2>   "collection":"control_collection",
   [junit4]   2>   "operation":"state"}
   [junit4]   2> 1675 INFO  (OverseerStateUpdate-94822740769112068-127.0.0.1:41023_-n_0000000000) [n:127.0.0.1:41023_    ] o.a.s.c.o.ClusterStateMutator building a new cName: control_collection
   [junit4]   2> 1685 INFO  (OverseerStateUpdate-94822740769112068-127.0.0.1:41023_-n_0000000000) [n:127.0.0.1:41023_    ] o.a.s.c.o.ReplicaMutator Assigning new node to shard shard=shard1
   [junit4]   2> 1693 INFO  (zkCallback-6-thread-1-processing-n:127.0.0.1:41023_) [n:127.0.0.1:41023_    ] o.a.s.c.c.ZkStateReader A cluster state change: WatchedEvent state:SyncConnected type:NodeDataChanged path:/clusterstate.json, has occurred - updating... (live nodes size: 1)
   [junit4]   2> 2663 INFO  (coreLoadExecutor-7-thread-1-processing-n:127.0.0.1:41023_) [n:127.0.0.1:41023_ c:control_collection   x:collection1] o.a.s.c.ZkController waiting to find shard id in clusterstate for collection1
   [junit4]   2> 2664 INFO  (coreLoadExecutor-7-thread-1-processing-n:127.0.0.1:41023_) [n:127.0.0.1:41023_ c:control_collection   x:collection1] o.a.s.c.ZkController Check for collection zkNode:control_collection
   [junit4]   2> 2664 INFO  (coreLoadExecutor-7-thread-1-processing-n:127.0.0.1:41023_) [n:127.0.0.1:41023_ c:control_collection   x:collection1] o.a.s.c.ZkController Collection zkNode exists
   [junit4]   2> 2664 INFO  (coreLoadExecutor-7-thread-1-processing-n:127.0.0.1:41023_) [n:127.0.0.1:41023_ c:control_collection   x:collection1] o.a.s.c.c.ZkStateReader Load collection config from:/collections/control_collection
   [junit4]   2> 2665 INFO  (coreLoadExecutor-7-thread-1-processing-n:127.0.0.1:41023_) [n:127.0.0.1:41023_ c:control_collection   x:collection1] o.a.s.c.c.ZkStateReader path=/collections/control_collection configName=conf1 specified config exists in ZooKeeper
   [junit4]   2> 2666 INFO  (coreLoadExecutor-7-thread-1-processing-n:127.0.0.1:41023_) [n:127.0.0.1:41023_ c:control_collection   x:collection1] o.a.s.c.SolrResourceLoader new SolrResourceLoader for directory: '/home/jenkins/workspace/Lucene-Solr-trunk-Linux/solr/build/solr-core/test/J1/../../../../../../../../../home/jenkins/workspace/Lucene-Solr-trunk-Linux/solr/build/solr-core/test/J1/temp/solr.cloud.ChaosMonkeyNothingIsSafeTest_704935DE55851596-001/control-001/cores/collection1/'
   [junit4]   2> 2666 INFO  (coreLoadExecutor-7-thread-1-processing-n:127.0.0.1:41023_) [n:127.0.0.1:41023_ c:control_collection   x:collection1] o.a.s.c.SolrResourceLoader JNDI not configured for solr (NoInitialContextEx)
   [junit4]   2> 2667 INFO  (coreLoadExecutor-7-thread-1-processing-n:127.0.0.1:41023_) [n:127.0.0.1:41023_ c:control_collection   x:collection1] o.a.s.c.SolrResourceLoader solr home defaulted to 'solr/' (could not find system property or JNDI)
   [junit4]   2> 2686 INFO  (coreLoadExecutor-7-thread-1-processing-n:127.0.0.1:41023_) [n:127.0.0.1:41023_ c:control_collection   x:collection1] o.a.s.c.Config loaded config solrconfig.xml with version 0 
   [junit4]   2> 2763 INFO  (coreLoadExecutor-7-thread-1-processing-n:127.0.0.1:41023_) [n:127.0.0.1:41023_ c:control_collection   x:collection1] o.a.s.c.SolrConfig current version of requestparams : -1
   [junit4]   2> 2785 INFO  (coreLoadExecutor-7-thread-1-processing-n:127.0.0.1:41023_) [n:127.0.0.1:41023_ c:control_collection   x:collection1] o.a.s.c.SolrConfig Using Lucene MatchVersion: 6.0.0
   [junit4]   2> 2840 INFO  (coreLoadExecutor-7-thread-1-processing-n:127.0.0.1:41023_) [n:127.0.0.1:41023_ c:control_collection   x:collection1] o.a.s.c.Config Loaded SolrConfig: solrconfig.xml
   [junit4]   2> 2848 INFO  (coreLoadExecutor-7-thread-1-processing-n:127.0.0.1:41023_) [n:127.0.0.1:41023_ c:control_collection   x:collection1] o.a.s.s.IndexSchema Reading Solr Schema from /configs/conf1/schema.xml
   [junit4]   2> 2908 INFO  (coreLoadExecutor-7-thread-1-processing-n:127.0.0.1:41023_) [n:127.0.0.1:41023_ c:control_collection   x:collection1] o.a.s.s.IndexSchema [collection1] Schema name=test
   [junit4]   2> 3216 INFO  (coreLoadExecutor-7-thread-1-processing-n:127.0.0.1:41023_) [n:127.0.0.1:41023_ c:control_collection   x:collection1] o.a.s.s.IndexSchema default search field in schema is text
   [junit4]   2> 3218 INFO  (coreLoadExecutor-7-thread-1-processing-n:127.0.0.1:41023_) [n:127.0.0.1:41023_ c:control_collection   x:collection1] o.a.s.s.IndexSchema unique key field: id
   [junit4]   2> 3224 INFO  (coreLoadExecutor-7-thread-1-processing-n:127.0.0.1:41023_) [n:127.0.0.1:41023_ c:control_collection   x:collection1] o.a.s.s.FileExchangeRateProvider Reloading exchange rates from file currency.xml
   [junit4]   2> 3230 INFO  (coreLoadExecutor-7-thread-1-processing-n:127.0.0.1:41023_) [n:127.0.0.1:41023_ c:control_collection   x:collection1] o.a.s.s.FileExchangeRateProvider Reloading exchange rates from file currency.xml
   [junit4]   2> 3414 INFO  (coreLoadExecutor-7-thread-1-processing-n:127.0.0.1:41023_) [n:127.0.0.1:41023_ c:control_collection   x:collection1] o.a.s.c.ConfigSetProperties Did not find ConfigSet properties, assuming default properties: Can't find resource 'configsetprops.json' in classpath or '/configs/conf1', cwd=/home/jenkins/workspace/Lucene-Solr-trunk-Linux/solr/build/solr-core/test/J1
   [junit4]   2> 3415 INFO  (coreLoadExecutor-7-thread-1-processing-n:127.0.0.1:41023_) [n:127.0.0.1:41023_ c:control_collection   x:collection1] o.a.s.c.CoreContainer Creating SolrCore 'collection1' using configuration from collection control_collection
   [junit4]   2> 3416 INFO  (coreLoadExecutor-7-thread-1-processing-n:127.0.0.1:41023_) [n:127.0.0.1:41023_ c:control_collection s:shard1 r:core_node1 x:collection1] o.a.s.c.SolrCore solr.StandardDirectoryFactory
   [junit4]   2> 3433 INFO  (coreLoadExecutor-7-thread-1-processing-n:127.0.0.1:41023_) [n:127.0.0.1:41023_ c:control_collection s:shard1 r:core_node1 x:collection1] o.a.s.c.SolrCore [[collection1] ] Opening new SolrCore at [/home/jenkins/workspace/Lucene-Solr-trunk-Linux/solr/build/solr-core/test/J1/../../../../../../../../../home/jenkins/workspace/Lucene-Solr-trunk-Linux/solr/build/solr-core/test/J1/temp/solr.cloud.ChaosMonkeyNothingIsSafeTest_704935DE55851596-001/control-001/cores/collection1/], dataDir=[null]
   [junit4]   2> 3436 INFO  (coreLoadExecutor-7-thread-1-processing-n:127.0.0.1:41023_) [n:127.0.0.1:41023_ c:control_collection s:shard1 r:core_node1 x:collection1] o.a.s.c.JmxMonitoredMap JMX monitoring is enabled. Adding Solr mbeans to JMX Server: com.sun.jmx.mbeanserver.JmxMBeanServer@13eee8d
   [junit4]   2> 3467 INFO  (coreLoadExecutor-7-thread-1-processing-n:127.0.0.1:41023_) [n:127.0.0.1:41023_ c:control_collection s:shard1 r:core_node1 x:collection1] o.a.s.c.CachingDirectoryFactory return new directory for /home/jenkins/workspace/Lucene-Solr-trunk-Linux/solr/build/solr-core/test/J1/temp/solr.cloud.ChaosMonkeyNothingIsSafeTest_704935DE55851596-001/control-001/cores/collection1/data
   [junit4]   2> 3468 INFO  (coreLoadExecutor-7-thread-1-processing-n:127.0.0.1:41023_) [n:127.0.0.1:41023_ c:control_collection s:shard1 r:core_node1 x:collection1] o.a.s.c.SolrCore New index directory detected: old=null new=/home/jenkins/workspace/Lucene-Solr-trunk-Linux/solr/build/solr-core/test/J1/temp/solr.cloud.ChaosMonkeyNothingIsSafeTest_704935DE55851596-001/control-001/cores/collection1/data/index/
   [junit4]   2> 3469 WARN  (coreLoadExecutor-7-thread-1-processing-n:127.0.0.1:41023_) [n:127.0.0.1:41023_ c:control_collection s:shard1 r:core_node1 x:collection1] o.a.s.c.SolrCore [collection1] Solr index directory '/home/jenkins/workspace/Lucene-Solr-trunk-Linux/solr/build/solr-core/test/J1/temp/solr.cloud.ChaosMonkeyNothingIsSafeTest_704935DE55851596-001/control-001/cores/collection1/data/index' doesn't exist. Creating new index...
   [junit4]   2> 3485 INFO  (coreLoadExecutor-7-thread-1-processing-n:127.0.0.1:41023_) [n:127.0.0.1:41023_ c:control_collection s:shard1 r:core_node1 x:collection1] o.a.s.c.CachingDirectoryFactory return new directory for /home/jenkins/workspace/Lucene-Solr-trunk-Linux/solr/build/solr-core/test/J1/temp/solr.cloud.ChaosMonkeyNothingIsSafeTest_704935DE55851596-001/control-001/cores/collection1/data/index
   [junit4]   2> 3612 INFO  (coreLoadExecutor-7-thread-1-processing-n:127.0.0.1:41023_) [n:127.0.0.1:41023_ c:control_collection s:shard1 r:core_node1 x:collection1] o.a.s.u.RandomMergePolicy RandomMergePolicy wrapping class org.apache.lucene.index.LogByteSizeMergePolicy: [LogByteSizeMergePolicy: minMergeSize=1677721, mergeFactor=37, maxMergeSize=2147483648, maxMergeSizeForForcedMerge=9223372036854775807, calibrateSizeByDeletes=true, maxMergeDocs=2147483647, maxCFSSegmentSizeMB=8.796093022207999E12, noCFSRatio=0.4659935243525656]
   [junit4]   2> 3997 INFO  (coreLoadExecutor-7-thread-1-processing-n:127.0.0.1:41023_) [n:127.0.0.1:41023_ c:control_collection s:shard1 r:core_node1 x:collection1] o.a.s.c.SolrCore SolrDeletionPolicy.onCommit: commits: num=1
   [junit4]   2> 	commit{dir=/home/jenkins/workspace/Lucene-Solr-trunk-Linux/solr/build/solr-core/test/J1/temp/solr.cloud.ChaosMonkeyNothingIsSafeTest_704935DE55851596-001/control-001/cores/collection1/data/index,segFN=segments_1,generation=1}
   [junit4]   2> 3997 INFO  (coreLoadExecutor-7-thread-1-processing-n:127.0.0.1:41023_) [n:127.0.0.1:41023_ c:control_collection s:shard1 r:core_node1 x:collection1] o.a.s.c.SolrCore newest commit generation = 1
   [junit4]   2> 3999 INFO  (OldIndexDirectoryCleanupThreadForCore-collection1) [n:127.0.0.1:41023_ c:control_collection s:shard1 r:core_node1 x:collection1] o.a.s.c.SolrCore Looking for old index directories to cleanup for core collection1 in /home/jenkins/workspace/Lucene-Solr-trunk-Linux/solr/build/solr-core/test/J1/temp/solr.cloud.ChaosMonkeyNothingIsSafeTest_704935DE55851596-001/control-001/cores/collection1/data/
   [junit4]   2> 4137 INFO  (coreLoadExecutor-7-thread-1-processing-n:127.0.0.1:41023_) [n:127.0.0.1:41023_ c:control_collection s:shard1 r:core_node1 x:collection1] o.a.s.u.p.UpdateRequestProcessorChain creating updateRequestProcessorChain "nodistrib"
   [junit4]   2> 4151 INFO  (coreLoadExecutor-7-thread-1-processing-n:127.0.0.1:41023_) [n:127.0.0.1:41023_ c:control_collection s:shard1 r:core_node1 x:collection1] o.a.s.u.p.UpdateRequestProcessorChain creating updateRequestProcessorChain "dedupe"
   [junit4]   2> 4154 INFO  (coreLoadExecutor-7-thread-1-processing-n:127.0.0.1:41023_) [n:127.0.0.1:41023_ c:control_collection s:shard1 r:core_node1 x:collection1] o.a.s.u.p.UpdateRequestProcessorChain inserting DistributedUpdateProcessorFactory into updateRequestProcessorChain "dedupe"
   [junit4]   2> 4154 INFO  (coreLoadExecutor-7-thread-1-processing-n:127.0.0.1:41023_) [n:127.0.0.1:41023_ c:control_collection s:shard1 r:core_node1 x:collection1] o.a.s.u.p.UpdateRequestProcessorChain creating updateRequestProcessorChain "stored_sig"
   [junit4]   2> 4154 INFO  (coreLoadExecutor-7-thread-1-processing-n:127.0.0.1:41023_) [n:127.0.0.1:41023_ c:control_collection s:shard1 r:core_node1 x:collection1] o.a.s.u.p.UpdateRequestProcessorChain inserting DistributedUpdateProcessorFactory into updateRequestProcessorChain "stored_sig"
   [junit4]   2> 4154 INFO  (coreLoadExecutor-7-thread-1-processing-n:127.0.0.1:41023_) [n:127.0.0.1:41023_ c:control_collection s:shard1 r:core_node1 x:collection1] o.a.s.u.p.UpdateRequestProcessorChain creating updateRequestProcessorChain "distrib-dup-test-chain-explicit"
   [junit4]   2> 4168 INFO  (coreLoadExecutor-7-thread-1-processing-n:127.0.0.1:41023_) [n:127.0.0.1:41023_ c:control_collection s:shard1 r:core_node1 x:collection1] o.a.s.u.p.UpdateRequestProcessorChain creating updateRequestProcessorChain "distrib-dup-test-chain-implicit"
   [junit4]   2> 4168 INFO  (coreLoadExecutor-7-thread-1-processing-n:127.0.0.1:41023_) [n:127.0.0.1:41023_ c:control_collection s:shard1 r:core_node1 x:collection1] o.a.s.u.p.UpdateRequestProcessorChain inserting DistributedUpdateProcessorFactory into updateRequestProcessorChain "distrib-dup-test-chain-implicit"
   [junit4]   2> 4168 INFO  (coreLoadExecutor-7-thread-1-processing-n:127.0.0.1:41023_) [n:127.0.0.1:41023_ c:control_collection s:shard1 r:core_node1 x:collection1] o.a.s.c.SolrCore no updateRequestProcessorChain defined as default, creating implicit default
   [junit4]   2> 4180 WARN  (coreLoadExecutor-7-thread-1-processing-n:127.0.0.1:41023_) [n:127.0.0.1:41023_ c:control_collection s:shard1 r:core_node1 x:collection1] o.a.s.c.RequestHandlers INVALID paramSet a in requestHandler {type = requestHandler,name = /dump,class = DumpRequestHandler,args = {defaults={a=A,b=B}}}
   [junit4]   2> 4207 INFO  (coreLoadExecutor-7-thread-1-processing-n:127.0.0.1:41023_) [n:127.0.0.1:41023_ c:control_collection s:shard1 r:core_node1 x:collection1] o.a.s.h.l.XMLLoader xsltCacheLifetimeSeconds=60
   [junit4]   2> 4212 INFO  (coreLoadExecutor-7-thread-1-processing-n:127.0.0.1:41023_) [n:127.0.0.1:41023_ c:control_collection s:shard1 r:core_node1 x:collection1] o.a.s.h.l.XMLLoader xsltCacheLifetimeSeconds=60
   [junit4]   2> 4213 INFO  (coreLoadExecutor-7-thread-1-processing-n:127.0.0.1:41023_) [n:127.0.0.1:41023_ c:control_collection s:shard1 r:core_node1 x:collection1] o.a.s.h.l.XMLLoader xsltCacheLifetimeSeconds=60
   [junit4]   2> 4214 INFO  (coreLoadExecutor-7-thread-1-processing-n:127.0.0.1:41023_) [n:127.0.0.1:41023_ c:control_collection s:shard1 r:core_node1 x:collection1] o.a.s.h.l.XMLLoader xsltCacheLifetimeSeconds=60
   [junit4]   2> 4236 INFO  (coreLoadExecutor-7-thread-1-processing-n:127.0.0.1:41023_) [n:127.0.0.1:41023_ c:control_collection s:shard1 r:core_node1 x:collection1] o.a.s.c.RequestHandlers Registered paths: /admin/mbeans,standard,/dump,/update/csv,/update/json/docs,/admin/luke,/admin/segments,/get,/admin/system,/replication,/admin/properties,/config,/schema,/admin/plugins,/admin/logging,/update/json,/admin/threads,/admin/ping,/update,/admin/file
   [junit4]   2> 4237 INFO  (coreLoadExecutor-7-thread-1-processing-n:127.0.0.1:41023_) [n:127.0.0.1:41023_ c:control_collection s:shard1 r:core_node1 x:collection1] o.a.s.c.SolrCore Using default statsCache cache: org.apache.solr.search.stats.LocalStatsCache
   [junit4]   2> 4251 INFO  (coreLoadExecutor-7-thread-1-processing-n:127.0.0.1:41023_) [n:127.0.0.1:41023_ c:control_collection s:shard1 r:core_node1 x:collection1] o.a.s.u.UpdateHandler Using UpdateLog implementation: org.apache.solr.update.UpdateLog
   [junit4]   2> 4251 INFO  (coreLoadExecutor-7-thread-1-processing-n:127.0.0.1:41023_) [n:127.0.0.1:41023_ c:control_collection s:shard1 r:core_node1 x:collection1] o.a.s.u.UpdateLog Initializing UpdateLog: dataDir= defaultSyncLevel=FLUSH numRecordsToKeep=100 maxNumLogsToKeep=10 numVersionBuckets=65536
   [junit4]   2> 4262 INFO  (coreLoadExecutor-7-thread-1-processing-n:127.0.0.1:41023_) [n:127.0.0.1:41023_ c:control_collection s:shard1 r:core_node1 x:collection1] o.a.s.c.SolrCore Hard AutoCommit: disabled
   [junit4]   2> 4262 INFO  (coreLoadExecutor-7-thread-1-processing-n:127.0.0.1:41023_) [n:127.0.0.1:41023_ c:control_collection s:shard1 r:core_node1 x:collection1] o.a.s.c.SolrCore Soft AutoCommit: disabled
   [junit4]   2> 4263 INFO  (coreLoadExecutor-7-thread-1-processing-n:127.0.0.1:41023_) [n:127.0.0.1:41023_ c:control_collection s:shard1 r:core_node1 x:collection1] o.a.s.u.RandomMergePolicy RandomMergePolicy wrapping class org.apache.lucene.index.TieredMergePolicy: [TieredMergePolicy: maxMergeAtOnce=26, maxMergeAtOnceExplicit=41, maxMergedSegmentMB=44.59765625, floorSegmentMB=1.6591796875, forceMergeDeletesPctAllowed=23.556272165511714, segmentsPerTier=36.0, maxCFSSegmentSizeMB=8.796093022207999E12, noCFSRatio=0.0
   [junit4]   2> 4267 INFO  (coreLoadExecutor-7-thread-1-processing-n:127.0.0.1:41023_) [n:127.0.0.1:41023_ c:control_collection s:shard1 r:core_node1 x:collection1] o.a.s.c.SolrCore SolrDeletionPolicy.onInit: commits: num=1
   [junit4]   2> 	commit{dir=/home/jenkins/workspace/Lucene-Solr-trunk-Linux/solr/build/solr-core/test/J1/temp/solr.cloud.ChaosMonkeyNothingIsSafeTest_704935DE55851596-001/control-001/cores/collection1/data/index,segFN=segments_1,generation=1}
   [junit4]   2> 4267 INFO  (coreLoadExecutor-7-thread-1-processing-n:127.0.0.1:41023_) [n:127.0.0.1:41023_ c:control_collection s:shard1 r:core_node1 x:collection1] o.a.s.c.SolrCore newest commit generation = 1
   [junit4]   2> 4281 INFO  (coreLoadExecutor-7-thread-1-processing-n:127.0.0.1:41023_) [n:127.0.0.1:41023_ c:control_collection s:shard1 r:core_node1 x:collection1] o.a.s.s.SolrIndexSearcher Opening Searcher@1070409[collection1] main
   [junit4]   2> 4288 INFO  (coreLoadExecutor-7-thread-1-processing-n:127.0.0.1:41023_) [n:127.0.0.1:41023_ c:control_collection s:shard1 r:core_node1 x:collection1] o.a.s.c.c.ZkStateReader Load collection config from:/collections/control_collection
   [junit4]   2> 4289 INFO  (coreLoadExecutor-7-thread-1-processing-n:127.0.0.1:41023_) [n:127.0.0.1:41023_ c:control_collection s:shard1 r:core_node1 x:collection1] o.a.s.c.c.ZkStateReader path=/collections/control_collection configName=conf1 specified config exists in ZooKeeper
   [junit4]   2> 4289 INFO  (coreLoadExecutor-7-thread-1-processing-n:127.0.0.1:41023_) [n:127.0.0.1:41023_ c:control_collection s:shard1 r:core_node1 x:collection1] o.a.s.r.ManagedResourceStorage Setting up ZooKeeper-based storage for the RestManager with znodeBase: /configs/conf1
   [junit4]   2> 4291 INFO  (coreLoadExecutor-7-thread-1-processing-n:127.0.0.1:41023_) [n:127.0.0.1:41023_ c:control_collection s:shard1 r:core_node1 x:collection1] o.a.s.r.ManagedResourceStorage Configured ZooKeeperStorageIO with znodeBase: /configs/conf1
   [junit4]   2> 4291 INFO  (coreLoadExecutor-7-thread-1-processing-n:127.0.0.1:41023_) [n:127.0.0.1:41023_ c:control_collection s:shard1 r:core_node1 x:collection1] o.a.s.r.RestManager Initializing RestManager with initArgs: {}
   [junit4]   2> 4306 INFO  (coreLoadExecutor-7-thread-1-processing-n:127.0.0.1:41023_) [n:127.0.0.1:41023_ c:control_collection s:shard1 r:core_node1 x:collection1] o.a.s.r.ManagedResourceStorage Reading _rest_managed.json using ZooKeeperStorageIO:path=/configs/conf1
   [junit4]   2> 4307 INFO  (coreLoadExecutor-7-thread-1-processing-n:127.0.0.1:41023_) [n:127.0.0.1:41023_ c:control_collection s:shard1 r:core_node1 x:collection1] o.a.s.r.ManagedResourceStorage No data found for znode /configs/conf1/_rest_managed.json
   [junit4]   2> 4312 INFO  (coreLoadExecutor-7-thread-1-processing-n:127.0.0.1:41023_) [n:127.0.0.1:41023_ c:control_collection s:shard1 r:core_node1 x:collection1] o.a.s.r.ManagedResourceStorage Loaded null at path _rest_managed.json using ZooKeeperStorageIO:path=/configs/conf1
   [junit4]   2> 4312 INFO  (coreLoadExecutor-7-thread-1-processing-n:127.0.0.1:41023_) [n:127.0.0.1:41023_ c:control_collection s:shard1 r:core_node1 x:collection1] o.a.s.r.RestManager Initializing 0 registered ManagedResources
   [junit4]   2> 4329 INFO  (coreLoadExecutor-7-thread-1-processing-n:127.0.0.1:41023_) [n:127.0.0.1:41023_ c:control_collection s:shard1 r:core_node1 x:collection1] o.a.s.h.ReplicationHandler Commits will be reserved for  10000
   [junit4]   2> 4331 INFO  (searcherExecutor-8-thread-1-processing-n:127.0.0.1:41023_ x:collection1 s:shard1 c:control_collection r:core_node1) [n:127.0.0.1:41023_ c:control_collection s:shard1 r:core_node1 x:collection1] o.a.s.c.SolrCore [collection1] Registered new searcher Searcher@1070409[collection1] main{ExitableDirectoryReader(UninvertingDirectoryReader())}
   [junit4]   2> 4331 INFO  (coreLoadExecutor-7-thread-1-processing-n:127.0.0.1:41023_) [n:127.0.0.1:41023_ c:control_collection s:shard1 r:core_node1 x:collection1] o.a.s.u.UpdateLog Looking up max value of version field to seed version buckets
   [junit4]   2> 4332 INFO  (coreLoadExecutor-7-thread-1-processing-n:127.0.0.1:41023_) [n:127.0.0.1:41023_ c:control_collection s:shard1 r:core_node1 x:collection1] o.a.s.u.VersionInfo Refreshing highest value of _version_ for 65536 version buckets from index
   [junit4]   2> 4332 INFO  (coreLoadExecutor-7-thread-1-processing-n:127.0.0.1:41023_) [n:127.0.0.1:41023_ c:control_collection s:shard1 r:core_node1 x:collection1] o.a.s.u.VersionInfo No terms found for _version_, cannot seed version bucket highest value from index
   [junit4]   2> 4332 INFO  (coreLoadExecutor-7-thread-1-processing-n:127.0.0.1:41023_) [n:127.0.0.1:41023_ c:control_collection s:shard1 r:core_node1 x:collection1] o.a.s.u.UpdateLog Could not find max version in index or recent updates, using new clock 1517163856773775360
   [junit4]   2> 4338 INFO  (coreLoadExecutor-7-thread-1-processing-n:127.0.0.1:41023_) [n:127.0.0.1:41023_ c:control_collection s:shard1 r:core_node1 x:collection1] o.a.s.u.UpdateLog Took 5.0ms to seed version buckets with highest version 1517163856773775360
   [junit4]   2> 4340 INFO  (coreLoadExecutor-7-thread-1-processing-n:127.0.0.1:41023_) [n:127.0.0.1:41023_ c:control_collection s:shard1 r:core_node1 x:collection1] o.a.s.c.ZkController watch zkdir /configs/conf1
   [junit4]   2> 4341 INFO  (coreLoadExecutor-7-thread-1-processing-n:127.0.0.1:41023_) [n:127.0.0.1:41023_ c:control_collection s:shard1 r:core_node1 x:collection1] o.a.s.c.CoreContainer registering core: collection1
   [junit4]   2> 4342 INFO  (coreZkRegister-1-thread-1-processing-n:127.0.0.1:41023_ x:collection1 s:shard1 c:control_collection r:core_node1) [n:127.0.0.1:41023_ c:control_collection s:shard1 r:core_node1 x:collection1] o.a.s.c.ZkController Register replica - core:collection1 address:http://127.0.0.1:41023 collection:control_collection shard:shard1
   [junit4]   2> 4349 INFO  (coreZkRegister-1-thread-1-processing-n:127.0.0.1:41023_ x:collection1 s:shard1 c:control_collection r:core_node1) [n:127.0.0.1:41023_ c:control_collection s:shard1 r:core_node1 x:collection1] o.a.s.c.c.SolrZkClient makePath: /collections/control_collection/leader_elect/shard1/election
   [junit4]   2> 4352 INFO  (coreZkRegister-1-thread-1-processing-n:127.0.0.1:41023_ x:collection1 s:shard1 c:control_collection r:core_node1) [n:127.0.0.1:41023_ c:control_collection s:shard1 r:core_node1 x:collection1] o.a.s.c.LeaderElector Joined leadership election with path: /collections/control_collection/leader_elect/shard1/election/94822740769112068-core_node1-n_0000000000
   [junit4]   2> 4352 INFO  (coreZkRegister-1-thread-1-processing-n:127.0.0.1:41023_ x:collection1 s:shard1 c:control_collection r:core_node1) [n:127.0.0.1:41023_ c:control_collection s:shard1 r:core_node1 x:collection1] o.a.s.c.ShardLeaderElectionContext Running the leader process for shard shard1
   [junit4]   2> 4355 INFO  (OverseerStateUpdate-94822740769112068-127.0.0.1:41023_-n_0000000000) [n:127.0.0.1:41023_    ] o.a.s.c.Overseer processMessage: queueSize: 1, message = {
   [junit4]   2>   "operation":"leader",
   [junit4]   2>   "shard":"shard1",
   [junit4]   2>   "collection":"control_collection"} current state version: 1
   [junit4]   2> 4356 INFO  (coreZkRegister-1-thread-1-processing-n:127.0.0.1:41023_ x:collection1 s:shard1 c:control_collection r:core_node1) [n:127.0.0.1:41023_ c:control_collection s:shard1 r:core_node1 x:collection1] o.a.s.c.ShardLeaderElectionContext Enough replicas found to continue.
   [junit4]   2> 4357 INFO  (coreZkRegister-1-thread-1-processing-n:127.0.0.1:41023_ x:collection1 s:shard1 c:control_collection r:core_node1) [n:127.0.0.1:41023_ c:control_collection s:shard1 r:core_node1 x:collection1] o.a.s.c.ShardLeaderElectionContext I may be the new leader - try and sync
   [junit4]   2> 4358 INFO  (coreZkRegister-1-thread-1-processing-n:127.0.0.1:41023_ x:collection1 s:shard1 c:control_collection r:core_node1) [n:127.0.0.1:41023_ c:control_collection s:shard1 r:core_node1 x:collection1] o.a.s.c.SyncStrategy Sync replicas to http://127.0.0.1:41023/collection1/
   [junit4]   2> 4358 INFO  (coreZkRegister-1-thread-1-processing-n:127.0.0.1:41023_ x:collection1 s:shard1 c:control_collection r:core_node1) [n:127.0.0.1:41023_ c:control_collection s:shard1 r:core_node1 x:collection1] o.a.s.c.SyncStrategy Sync Success - now sync replicas to me
   [junit4]   2> 4358 INFO  (coreZkRegister-1-thread-1-processing-n:127.0.0.1:41023_ x:collection1 s:shard1 c:control_collection r:core_node1) [n:127.0.0.1:41023_ c:control_collection s:shard1 r:core_node1 x:collection1] o.a.s.c.SyncStrategy http://127.0.0.1:41023/collection1/ has no replicas
   [junit4]   2> 4358 INFO  (coreZkRegister-1-thread-1-processing-n:127.0.0.1:41023_ x:collection1 s:shard1 c:control_collection r:core_node1) [n:127.0.0.1:41023_ c:control_collection s:shard1 r:core_node1 x:collection1] o.a.s.c.ShardLeaderElectionContext I am the new leader: http://127.0.0.1:41023/collection1/ shard1
   [junit4]   2> 4370 INFO  (coreZkRegister-1-thread-1-processing-n:127.0.0.1:41023_ x:collection1 s:shard1 c:control_collection r:core_node1) [n:127.0.0.1:41023_ c:control_collection s:shard1 r:core_node1 x:collection1] o.a.s.c.c.SolrZkClient makePath: /collections/control_collection/leaders/shard1
   [junit4]   2> 4371 INFO  (zkCallback-6-thread-1-processing-n:127.0.0.1:41023_) [n:127.0.0.1:41023_    ] o.a.s.c.c.ZkStateReader A cluster state change: WatchedEvent state:SyncConnected type:NodeDataChanged path:/clusterstate.json, has occurred - updating... (live nodes size: 1)
   [junit4]   2> 4375 INFO  (coreZkRegister-1-thread-1-processing-n:127.0.0.1:41023_ x:collection1 s:shard1 c:control_collection r:core_node1) [n:127.0.0.1:41023_ c:control_collection s:shard1 r:core_node1 x:collection1] o.a.s.c.ShardLeaderElectionContextBase Creating leader registration node
   [junit4]   2> 4390 INFO  (OverseerStateUpdate-94822740769112068-127.0.0.1:41023_-n_0000000000) [n:127.0.0.1:41023_    ] o.a.s.c.Overseer processMessage: queueSize: 1, message = {
   [junit4]   2>   "operation":"state",
   [junit4]   2>   "state":"active",
   [junit4]   2>   "shard":"shard1",
   [junit4]   2>   "collection":"control_collection",
   [junit4]   2>   "base_url":"http://127.0.0.1:41023",
   [junit4]   2>   "node_name":"127.0.0.1:41023_",
   [junit4]   2>   "core_node_name":"core_node1",
   [junit4]   2>   "core":"collection1"} current state version: 2
   [junit4]   2> 4391 INFO  (OverseerStateUpdate-94822740769112068-127.0.0.1:41023_-n_0000000000) [n:127.0.0.1:41023_    ] o.a.s.c.o.ReplicaMutator Update state numShards=null message={
   [junit4]   2>   "operation":"state",
   [junit4]   2>   "state":"active",
   [junit4]   2>   "shard":"shard1",
   [junit4]   2>   "collection":"control_collection",
   [junit4]   2>   "base_url":"http://127.0.0.1:41023",
   [junit4]   2>   "node_name":"127.0.0.1:41023_",
   [junit4]   2>   "core_node_name":"core_node1",
   [junit4]   2>   "core":"collection1"}
   [junit4]   2> 4393 INFO  (OverseerStateUpdate-94822740769112068-127.0.0.1:41023_-n_0000000000) [n:127.0.0.1:41023_    ] o.a.s.c.Overseer processMessage: queueSize: 1, message = {
   [junit4]   2>   "operation":"leader",
   [junit4]   2>   "shard":"shard1",
   [junit4]   2>   "collection":"control_collection",
   [junit4]   2>   "base_url":"http://127.0.0.1:41023",
   [junit4]   2>   "core":"collection1"} current state version: 2
   [junit4]   2> 4497 INFO  (zkCallback-6-thread-2-processing-n:127.0.0.1:41023_) [n:127.0.0.1:41023_    ] o.a.s.c.c.ZkStateReader A cluster state change: WatchedEvent state:SyncConnected type:NodeDataChanged path:/clusterstate.json, has occurred - updating... (live nodes size: 1)
   [junit4]   2> 4543 INFO  (coreZkRegister-1-thread-1-processing-n:127.0.0.1:41023_ x:collection1 s:shard1 c:control_collection r:core_node1) [n:127.0.0.1:41023_ c:control_collection s:shard1 r:core_node1 x:collection1] o.a.s.c.ZkController We are http://127.0.0.1:41023/collection1/ and leader is http://127.0.0.1:41023/collection1/
   [junit4]   2> 4544 INFO  (coreZkRegister-1-thread-1-processing-n:127.0.0.1:41023_ x:collection1 s:shard1 c:control_collection r:core_node1) [n:127.0.0.1:41023_ c:control_collection s:shard1 r:core_node1 x:collection1] o.a.s.c.ZkController No LogReplay needed for core=collection1 baseURL=http://127.0.0.1:41023
   [junit4]   2> 4544 INFO  (coreZkRegister-1-thread-1-processing-n:127.0.0.1:41023_ x:collection1 s:shard1 c:control_collection r:core_node1) [n:127.0.0.1:41023_ c:control_collection s:shard1 r:core_node1 x:collection1] o.a.s.c.ZkController I am the leader, no recovery necessary
   [junit4]   2> 4544 INFO  (coreZkRegister-1-thread-1-processing-n:127.0.0.1:41023_ x:collection1 s:shard1 c:control_collection r:core_node1) [n:127.0.0.1:41023_ c:control_collection s:shard1 r:core_node1 x:collection1] o.a.s.c.ZkController publishing state=active
   [junit4]   2> 4544 INFO  (coreZkRegister-1-thread-1-processing-n:127.0.0.1:41023_ x:collection1 s:shard1 c:control_collection r:core_node1) [n:127.0.0.1:41023_ c:control_collection s:shard1 r:core_node1 x:collection1] o.a.s.c.ZkController numShards not found on descriptor - reading it from system property
   [junit4]   2> 4547 INFO  (OverseerStateUpdate-94822740769112068-127.0.0.1:41023_-n_0000000000) [n:127.0.0.1:41023_    ] o.a.s.c.Overseer processMessage: queueSize: 1, message = {
   [junit4]   2>   "core":"collection1",
   [junit4]   2>   "core_node_name":"core_node1",
   [junit4]   2>   "roles":null,
   [junit4]   2>   "base_url":"http://127.0.0.1:41023",
   [junit4]   2>   "node_name":"127.0.0.1:41023_",
   [junit4]   2>   "numShards":"1",
   [junit4]   2>   "state":"active",
   [junit4]   2>   "shard":"shard1",
   [junit4]   2>   "collection":"control_collection",
   [junit4]   2>   "operation":"state"} current state version: 3
   [junit4]   2> 4548 INFO  (OverseerStateUpdate-94822740769112068-127.0.0.1:41023_-n_0000000000) [n:127.0.0.1:41023_    ] o.a.s.c.o.ReplicaMutator Update state numShards=1 message={
   [junit4]   2>   "core":"collection1",
   [junit4]   2>   "core_node_name":"core_node1",
   [junit4]   2>   "roles":null,
   [junit4]   2>   "base_url":"http://127.0.0.1:41023",
   [junit4]   2>   "node_name":"127.0.0.1:41023_",
   [junit4]   2>   "numShards":"1",
   [junit4]   2>   "state":"active",
   [junit4]   2>   "shard":"shard1",
   [junit4]   2>   "collection":"control_collection",
   [junit4]   2>   "operation":"state"}
   [junit4]   2> 4652 INFO  (zkCallback-6-thread-1-processing-n:127.0.0.1:41023_) [n:127.0.0.1:41023_    ] o.a.s.c.c.ZkStateReader A cluster state change: WatchedEvent state:SyncConnected type:NodeDataChanged path:/clusterstate.json, has occurred - updating... (live nodes size: 1)
   [junit4]   2> 4681 INFO  (TEST-ChaosMonkeyNothingIsSafeTest.test-seed#[704935DE55851596]) [    ] o.a.s.c.c.SolrZkClient Using default ZkCredentialsProvider
   [junit4]   2> 4682 INFO  (TEST-ChaosMonkeyNothingIsSafeTest.test-seed#[704935DE55851596]) [    ] o.a.s.c.c.ConnectionManager Waiting for client to connect to ZooKeeper
   [junit4]   2> 4684 INFO  (zkCallback-8-thread-1) [    ] o.a.s.c.c.ConnectionManager Watcher org.apache.solr.common.cloud.ConnectionManager@40d695 name:ZooKeeperConnection Watcher:127.0.0.1:51172/solr got event WatchedEvent state:SyncConnected type:None path:null path:null type:None
   [junit4]   2> 4684 INFO  (TEST-ChaosMonkeyNothingIsSafeTest.test-seed#[704935DE55851596]) [    ] o.a.s.c.c.ConnectionManager Client is connected to ZooKeeper
   [junit4]   2> 4684 INFO  (TEST-ChaosMonkeyNothingIsSafeTest.test-seed#[704935DE55851596]) [    ] o.a.s.c.c.SolrZkClient Using default ZkACLProvider
   [junit4]   2> 4684 INFO  (TEST-ChaosMonkeyNothingIsSafeTest.test-seed#[704935DE55851596]) [    ] o.a.s.c.c.ZkStateReader Updating cluster state from ZooKeeper... 
   [junit4]   2> 4697 INFO  (TEST-ChaosMonkeyNothingIsSafeTest.test-seed#[704935DE55851596]) [    ] o.a.s.c.ChaosMonkey monkey: init - expire sessions:false cause connection loss:false
   [junit4]   2> 4697 INFO  (TEST-ChaosMonkeyNothingIsSafeTest.test-seed#[704935DE55851596]) [    ] o.a.s.c.AbstractFullDistribZkTestBase Creating collection1 with stateFormat=2
   [junit4]   2> 4697 INFO  (TEST-ChaosMonkeyNothingIsSafeTest.test-seed#[704935DE55851596]) [    ] o.a.s.c.c.SolrZkClient Using default ZkCredentialsProvider
   [junit4]   2> 4702 INFO  (TEST-ChaosMonkeyNothingIsSafeTest.test-seed#[704935DE55851596]) [    ] o.a.s.c.c.ConnectionManager Waiting for client to connect to ZooKeeper
   [junit4]   2> 4710 INFO  (zkCallback-9-thread-1) [    ] o.a.s.c.c.ConnectionManager Watcher org.apache.solr.common.cloud.ConnectionManager@105772e name:ZooKeeperConnection Watcher:127.0.0.1:51172/solr got event WatchedEvent state:SyncConnected type:None path:null path:null type:None
   [junit4]   2> 4710 INFO  (TEST-ChaosMonkeyNothingIsSafeTest.test-seed#[704935DE55851596]) [    ] o.a.s.c.c.ConnectionManager Client is connected to ZooKeeper
   [junit4]   2> 4711 INFO  (TEST-ChaosMonkeyNothingIsSafeTest.test-seed#[704935DE55851596]) [    ] o.a.s.c.c.SolrZkClient Using default ZkACLProvider
   [junit4]   2> 4716 INFO  (OverseerStateUpdate-94822740769112068-127.0.0.1:41023_-n_0000000000) [n:127.0.0.1:41023_    ] o.a.s.c.Overseer processMessage: queueSize: 1, message = {
   [junit4]   2>   "operation":"create",
   [junit4]   2>   "name":"collection1",
   [junit4]   2>   "numShards":"2",
   [junit4]   2>   "stateFormat":"2"} current state version: 4
   [junit4]   2> 4717 INFO  (OverseerStateUpdate-94822740769112068-127.0.0.1:41023_-n_0000000000) [n:127.0.0.1:41023_    ] o.a.s.c.o.ClusterStateMutator building a new cName: collection1
   [junit4]   2> 4787 INFO  (TEST-ChaosMonkeyNothingIsSafeTest.test-seed#[704935DE55851596]) [    ] o.a.s.SolrTestCaseJ4 Writing core.properties file to /home/jenkins/workspace/Lucene-Solr-trunk-Linux/solr/build/solr-core/test/J1/temp/solr.cloud.ChaosMonkeyNothingIsSafeTest_704935DE55851596-001/shard-1-001/cores/collection1
   [junit4]   2> 4788 INFO  (TEST-ChaosMonkeyNothingIsSafeTest.test-seed#[704935DE55851596]) [    ] o.a.s.c.AbstractFullDistribZkTestBase create jetty 1 in directory /home/jenkins/workspace/Lucene-Solr-trunk-Linux/solr/build/solr-core/test/J1/temp/solr.cloud.ChaosMonkeyNothingIsSafeTest_704935DE55851596-001/shard-1-001
   [junit4]   2> 4789 INFO  (TEST-ChaosMonkeyNothingIsSafeTest.test-seed#[704935DE55851596]) [    ] o.e.j.s.Server jetty-9.2.13.v20150730
   [junit4]   2> 4791 INFO  (TEST-ChaosMonkeyNothingIsSafeTest.test-seed#[704935DE55851596]) [    ] o.e.j.s.h.ContextHandler Started o.e.j.s.ServletContextHandler@1815baf{/,null,AVAILABLE}
   [junit4]   2> 4798 INFO  (TEST-ChaosMonkeyNothingIsSafeTest.test-seed#[704935DE55851596]) [    ] o.e.j.s.ServerConnector Started ServerConnector@e89831{HTTP/1.1}{127.0.0.1:49392}
   [junit4]   2> 4798 INFO  (TEST-ChaosMonkeyNothingIsSafeTest.test-seed#[704935DE55851596]) [    ] o.e.j.s.Server Started @6586ms
   [junit4]   2> 4798 INFO  (TEST-ChaosMonkeyNothingIsSafeTest.test-seed#[704935DE55851596]) [    ] o.a.s.c.s.e.JettySolrRunner Jetty properties: {solr.data.dir=/home/jenkins/workspace/Lucene-Solr-trunk-Linux/solr/build/solr-core/test/J1/temp/solr.cloud.ChaosMonkeyNothingIsSafeTest_704935DE55851596-001/tempDir-001/jetty1, solrconfig=solrconfig.xml, hostContext=/, hostPort=49392, coreRootDirectory=/home/jenkins/workspace/Lucene-Solr-trunk-Linux/solr/build/solr-core/test/J1/../../../../../../../../../home/jenkins/workspace/Lucene-Solr-trunk-Linux/solr/build/solr-core/test/J1/temp/solr.cloud.ChaosMonkeyNothingIsSafeTest_704935DE55851596-001/shard-1-001/cores}
   [junit4]   2> 4799 INFO  (TEST-ChaosMonkeyNothingIsSafeTest.test-seed#[704935DE55851596]) [    ] o.a.s.s.SolrDispatchFilter SolrDispatchFilter.init(): sun.misc.Launcher$AppClassLoader@e2f2a
   [junit4]   2> 4799 INFO  (TEST-ChaosMonkeyNothingIsSafeTest.test-seed#[704935DE55851596]) [    ] o.a.s.c.SolrResourceLoader new SolrResourceLoader for directory: '/home/jenkins/workspace/Lucene-Solr-trunk-Linux/solr/build/solr-core/test/J1/../../../../../../../../../home/jenkins/workspace/Lucene-Solr-trunk-Linux/solr/build/solr-core/test/J1/temp/solr.cloud.ChaosMonkeyNothingIsSafeTest_704935DE55851596-001/shard-1-001/'
   [junit4]   2> 4799 INFO  (TEST-ChaosMonkeyNothingIsSafeTest.test-seed#[704935DE55851596]) [    ] o.a.s.c.SolrResourceLoader JNDI not configured for solr (NoInitialContextEx)
   [junit4]   2> 4799 INFO  (TEST-ChaosMonkeyNothingIsSafeTest.test-seed#[704935DE55851596]) [    ] o.a.s.c.SolrResourceLoader solr home defaulted to 'solr/' (could not find system property or JNDI)
   [junit4]   2> 4816 INFO  (TEST-ChaosMonkeyNothingIsSafeTest.test-seed#[704935DE55851596]) [    ] o.a.s.c.c.SolrZkClient Using default ZkCredentialsProvider
   [junit4]   2> 4820 INFO  (TEST-ChaosMonkeyNothingIsSafeTest.test-seed#[704935DE55851596]) [    ] o.a.s.c.c.ConnectionManager Waiting for client to connect to ZooKeeper
   [junit4]   2> 4823 INFO  (OverseerStateUpdate-94822740769112068-127.0.0.1:41023_-n_0000000000) [n:127.0.0.1:41023_    ] o.a.s.c.o.ZkStateWriter going to create_collection /collections/collection1/state.json
   [junit4]   2> 4845 INFO  (zkCallback-10-thread-1) [    ] o.a.s.c.c.ConnectionManager Watcher org.apache.solr.common.cloud.ConnectionManager@1bd936c name:ZooKeeperConnection Watcher:127.0.0.1:51172/solr got event WatchedEvent state:SyncConnected type:None path:null path:null type:None
   [junit4]   2> 4845 INFO  (TEST-ChaosMonkeyNothingIsSafeTest.test-seed#[704935DE55851596]) [    ] o.a.s.c.c.ConnectionManager Client is connected to ZooKeeper
   [junit4]   2> 4847 INFO  (TEST-ChaosMonkeyNothingIsSafeTest.test-seed#[704935DE55851596]) [    ] o.a.s.c.c.SolrZkClient Using default ZkACLProvider
   [junit4]   2> 4851 INFO  (TEST-ChaosMonkeyNothingIsSafeTest.test-seed#[704935DE55851596]) [    ] o.a.s.s.SolrDispatchFilter Loading solr.xml from SolrHome (not found in ZooKeeper)
   [junit4]   2> 4851 INFO  (TEST-ChaosMonkeyNothingIsSafeTest.test-seed#[704935DE55851596]) [    ] o.a.s.c.SolrXmlConfig Loading container configuration from /home/jenkins/workspace/Lucene-Solr-trunk-Linux/solr/build/solr-core/test/J1/../../../../../../../../../home/jenkins/workspace/Lucene-Solr-trunk-Linux/solr/build/solr-core/test/J1/temp/solr.cloud.ChaosMonkeyNothingIsSafeTest_704935DE55851596-001/shard-1-001/solr.xml
   [junit4]   2> 4880 INFO  (TEST-ChaosMonkeyNothingIsSafeTest.test-seed#[704935DE55851596]) [    ] o.a.s.c.CoresLocator Config-defined core root directory: /home/jenkins/workspace/Lucene-Solr-trunk-Linux/solr/build/solr-core/test/J1/../../../../../../../../../home/jenkins/workspace/Lucene-Solr-trunk-Linux/solr/build/solr-core/test/J1/temp/solr.cloud.ChaosMonkeyNothingIsSafeTest_704935DE55851596-001/shard-1-001/cores
   [junit4]   2> 4881 INFO  (TEST-ChaosMonkeyNothingIsSafeTest.test-seed#[704935DE55851596]) [    ] o.a.s.c.CoreContainer New CoreContainer 22820950
   [junit4]   2> 4881 INFO  (TEST-ChaosMonkeyNothingIsSafeTest.test-seed#[704935DE55851596]) [    ] o.a.s.c.CoreContainer Loading cores into CoreContainer [instanceDir=/home/jenkins/workspace/Lucene-Solr-trunk-Linux/solr/build/solr-core/test/J1/../../../../../../../../../home/jenkins/workspace/Lucene-Solr-trunk-Linux/solr/build/solr-core/test/J1/temp/solr.cloud.ChaosMonkeyNothingIsSafeTest_704935DE55851596-001/shard-1-001/]
   [junit4]   2> 4881 INFO  (TEST-ChaosMonkeyNothingIsSafeTest.test-seed#[704935DE55851596]) [    ] o.a.s.c.CoreContainer loading shared library: /home/jenkins/workspace/Lucene-Solr-trunk-Linux/solr/build/solr-core/test/J1/../../../../../../../../../home/jenkins/workspace/Lucene-Solr-trunk-Linux/solr/build/solr-core/test/J1/temp/solr.cloud.ChaosMonkeyNothingIsSafeTest_704935DE55851596-001/shard-1-001/lib
   [junit4]   2> 4881 WARN  (TEST-ChaosMonkeyNothingIsSafeTest.test-seed#[704935DE55851596]) [    ] o.a.s.c.SolrResourceLoader Can't find (or read) directory to add to classloader: lib (resolved as: /home/jenkins/workspace/Lucene-Solr-trunk-Linux/solr/build/solr-core/test/J1/../../../../../../../../../home/jenkins/workspace/Lucene-Solr-trunk-Linux/solr/build/solr-core/test/J1/temp/solr.cloud.ChaosMonkeyNothingIsSafeTest_704935DE55851596-001/shard-1-001/lib).
   [junit4]   2> 4897 INFO  (TEST-ChaosMonkeyNothingIsSafeTest.test-seed#[704935DE55851596]) [    ] o.a.s.h.c.HttpShardHandlerFactory created with socketTimeout : 90000,urlScheme : ,connTimeout : 15000,maxConnectionsPerHost : 20,maxConnections : 10000,corePoolSize : 0,maximumPoolSize : 2147483647,maxThreadIdleTime : 5,sizeOfQueue : -1,fairnessPolicy : false,useRetries : false,
   [junit4]   2> 4899 INFO  (TEST-ChaosMonkeyNothingIsSafeTest.test-seed#[704935DE55851596]) [    ] o.a.s.u.UpdateShardHandler Creating UpdateShardHandler HTTP client with params: socketTimeout=340000&connTimeout=45000&retry=true
   [junit4]   2> 4899 INFO  (TEST-ChaosMonkeyNothingIsSafeTest.test-seed#[704935DE55851596]) [    ] o.a.s.l.LogWatcher SLF4J impl is org.slf4j.impl.Log4jLoggerFactory
   [junit4]   2> 4899 INFO  (TEST-ChaosMonkeyNothingIsSafeTest.test-seed#[704935DE55851596]) [    ] o.a.s.l.LogWatcher Registering Log Listener [Log4j (org.slf4j.impl.Log4jLoggerFactory)]
   [junit4]   2> 4899 INFO  (TEST-ChaosMonkeyNothingIsSafeTest.test-seed#[704935DE55851596]) [    ] o.a.s.c.ZkContainer Zookeeper client=127.0.0.1:51172/solr
   [junit4]   2> 4899 INFO  (TEST-ChaosMonkeyNothingIsSafeTest.test-seed#[704935DE55851596]) [    ] o.a.s.c.ZkController zkHost includes chroot
   [junit4]   2> 4900 INFO  (TEST-ChaosMonkeyNothingIsSafeTest.test-seed#[704935DE55851596]) [    ] o.a.s.c.c.SolrZkClient Using default ZkCredentialsProvider
   [junit4]   2> 4912 INFO  (TEST-ChaosMonkeyNothingIsSafeTest.test-seed#[704935DE55851596]) [    ] o.a.s.c.c.ConnectionManager Waiting for client to connect to ZooKeeper
   [junit4]   2> 4914 INFO  (zkCallback-12-thread-1) [    ] o.a.s.c.c.ConnectionManager Watcher org.apache.solr.common.cloud.ConnectionManager@16ea9f2 name:ZooKeeperConnection Watcher:127.0.0.1:51172 got event WatchedEvent state:SyncConnected type:None path:null path:null type:None
   [junit4]   2> 4914 INFO  (TEST-ChaosMonkeyNothingIsSafeTest.test-seed#[704935DE55851596]) [    ] o.a.s.c.c.ConnectionManager Client is connected to ZooKeeper
   [junit4]   2> 4915 INFO  (TEST-ChaosMonkeyNothingIsSafeTest.test-seed#[704935DE55851596]) [    ] o.a.s.c.c.SolrZkClient Using default ZkACLProvider
   [junit4]   2> 4919 INFO  (TEST-ChaosMonkeyNothingIsSafeTest.test-seed#[704935DE55851596]) [n:127.0.0.1:49392_    ] o.a.s.c.c.ConnectionManager Waiting for client to connect to ZooKeeper
   [junit4]   2> 4921 INFO  (zkCallback-13-thread-1-processing-n:127.0.0.1:49392_) [n:127.0.0.1:49392_    ] o.a.s.c.c.ConnectionManager Watcher org.apache.solr.common.cloud.ConnectionManager@a6737b name:ZooKeeperConnection Watcher:127.0.0.1:51172/solr got event WatchedEvent state:SyncConnected type:None path:null path:null type:None
   [junit4]   2> 4921 INFO  (TEST-ChaosMonkeyNothingIsSafeTest.test-seed#[704935DE55851596]) [n:127.0.0.1:49392_    ] o.a.s.c.c.ConnectionManager Client is connected to ZooKeeper
   [junit4]   2> 4926 INFO  (TEST-ChaosMonkeyNothingIsSafeTest.test-seed#[704935DE55851596]) [n:127.0.0.1:49392_    ] o.a.s.c.c.ZkStateReader Updating cluster state from ZooKeeper... 
   [junit4]   2> 5933 INFO  (TEST-ChaosMonkeyNothingIsSafeTest.test-seed#[704935DE55851596]) [n:127.0.0.1:49392_    ] o.a.s.c.ZkController Register node as live in ZooKeeper:/live_nodes/127.0.0.1:49392_
   [junit4]   2> 5934 INFO  (TEST-ChaosMonkeyNothingIsSafeTest.test-seed#[704935DE55851596]) [n:127.0.0.1:49392_    ] o.a.s.c.c.SolrZkClient makePath: /live_nodes/127.0.0.1:49392_
   [junit4]   2> 5935 INFO  (zkCallback-8-thread-1) [    ] o.a.s.c.c.ZkStateReader A live node change: WatchedEvent state:SyncConnected type:NodeChildrenChanged path:/live_nodes, has occurred - updating... (live nodes size: 1)
   [junit4]   2> 5935 INFO  (zkCallback-13-thread-1-processing-n:127.0.0.1:49392_) [n:127.0.0.1:49392_    ] o.a.s.c.c.ZkStateReader A live node change: WatchedEvent state:SyncConnected type:NodeChildrenChanged path:/live_nodes, has occurred - updating... (live nodes size: 1)
   [junit4]   2> 5935 INFO  (zkCallback-6-thread-1-processing-n:127.0.0.1:41023_) [n:127.0.0.1:41023_    ] o.a.s.c.c.ZkStateReader A live node change: WatchedEvent state:SyncConnected type:NodeChildrenChanged path:/live_nodes, has occurred - updating... (live nodes size: 1)
   [junit4]   2> 5936 INFO  (TEST-ChaosMonkeyNothingIsSafeTest.test-seed#[704935DE55851596]) [n:127.0.0.1:49392_    ] o.a.s.c.Overseer Overseer (id=null) closing
   [junit4]   2> 5937 INFO  (TEST-ChaosMonkeyNothingIsSafeTest.test-seed#[704935DE55851596]) [n:127.0.0.1:49392_    ] o.a.s.c.LeaderElector Joined leadership election with path: /overseer_elect/election/94822740769112073-127.0.0.1:49392_-n_0000000001
   [junit4]   2> 5938 INFO  (TEST-ChaosMonkeyNothingIsSafeTest.test-seed#[704935DE55851596]) [n:127.0.0.1:49392_    ] o.a.s.c.LeaderElector Watching path /overseer_elect/election/94822740769112068-127.0.0.1:41023_-n_0000000000 to know if I could be the leader
   [junit4]   2> 5963 INFO  (TEST-ChaosMonkeyNothingIsSafeTest.test-seed#[704935DE55851596]) [n:127.0.0.1:49392_    ] o.a.s.c.CoreContainer Security conf doesn't exist. Skipping setup for authorization module.
   [junit4]   2> 5963 INFO  (TEST-ChaosMonkeyNothingIsSafeTest.test-seed#[704935DE55851596]) [n:127.0.0.1:49392_    ] o.a.s.c.CoreContainer No authentication plugin used.
   [junit4]   2> 5964 INFO  (TEST-ChaosMonkeyNothingIsSafeTest.test-seed#[704935DE55851596]) [n:127.0.0.1:49392_    ] o.a.s.c.CoresLocator Looking for core definitions underneath /home/jenkins/workspace/Lucene-Solr-trunk-Linux/solr/build/solr-core/test/J1/../../../../../../../../../home/jenkins/workspace/Lucene-Solr-trunk-Linux/solr/build/solr-core/test/J1/temp/solr.cloud.ChaosMonkeyNothingIsSafeTest_704935DE55851596-001/shard-1-001/cores
   [junit4]   2> 5964 INFO  (TEST-ChaosMonkeyNothingIsSafeTest.test-seed#[704935DE55851596]) [n:127.0.0.1:49392_    ] o.a.s.c.SolrCore Created CoreDescriptor: {name=collection1, config=solrconfig.xml, transient=false, schema=schema.xml, loadOnStartup=true, configSetProperties=configsetprops.json, instanceDir=/home/jenkins/workspace/Lucene-Solr-trunk-Linux/solr/build/solr-core/test/J1/../../../../../../../../../home/jenkins/workspace/Lucene-Solr-trunk-Linux/solr/build/solr-core/test/J1/temp/solr.cloud.ChaosMonkeyNothingIsSafeTest_704935DE55851596-001/shard-1-001/cores/collection1, collection=collection1, absoluteInstDir=/home/jenkins/workspace/Lucene-Solr-trunk-Linux/solr/build/solr-core/test/J1/../../../../../../../../../home/jenkins/workspace/Lucene-Solr-trunk-Linux/solr/build/solr-core/test/J1/temp/solr.cloud.ChaosMonkeyNothingIsSafeTest_704935DE55851596-001/shard-1-001/cores/collection1/, coreNodeName=, dataDir=data/, shard=}
   [junit4]   2> 5964 INFO  (TEST-ChaosMonkeyNothingIsSafeTest.test-seed#[704935DE55851596]) [n:127.0.0.1:49392_    ] o.a.s.c.CoresLocator Found core collection1 in /home/jenkins/workspace/Lucene-Solr-trunk-Linux/solr/build/solr-core/test/J1/../../../../../../../../../home/jenkins/workspace/Lucene-Solr-trunk-Linux/solr/build/solr-core/test/J1/temp/solr.cloud.ChaosMonkeyNothingIsSafeTest_704935DE55851596-001/shard-1-001/cores/collection1/
   [junit4]   2> 5965 INFO  (TEST-ChaosMonkeyNothingIsSafeTest.test-seed#[704935DE55851596]) [n:127.0.0.1:49392_    ] o.a.s.c.CoresLocator Found 1 core definitions
   [junit4]   2> 5966 INFO  (TEST-ChaosMonkeyNothingIsSafeTest.test-seed#[704935DE55851596]) [n:127.0.0.1:49392_    ] o.a.s.s.SolrDispatchFilter user.dir=/home/jenkins/workspace/Lucene-Solr-trunk-Linux/solr/build/solr-core/test/J1
   [junit4]   2> 5966 INFO  (TEST-ChaosMonkeyNothingIsSafeTest.test-seed#[704935DE55851596]) [n:127.0.0.1:49392_    ] o.a.s.s.SolrDispatchFilter SolrDispatchFilter.init() done
   [junit4]   2> 5967 INFO  (coreLoadExecutor-18-thread-1-processing-n:127.0.0.1:49392_) [n:127.0.0.1:49392_ c:collection1   x:collection1] o.a.s.c.ZkController publishing state=down
   [junit4]   2> 5967 INFO  (coreLoadExecutor-18-thread-1-processing-n:127.0.0.1:49392_) [n:127.0.0.1:49392_ c:collection1   x:collection1] o.a.s.c.ZkController numShards not found on descriptor - reading it from system property
   [junit4]   2> 5972 INFO  (coreLoadExecutor-18-thread-1-processing-n:127.0.0.1:49392_) [n:127.0.0.1:49392_ c:collection1   x:collection1] o.a.s.c.ZkController Registering watch for collection collection1
   [junit4]   2> 5972 INFO  (coreLoadExecutor-18-thread-1-processing-n:127.0.0.1:49392_) [n:127.0.0.1:49392_ c:collection1   x:collection1] o.a.s.c.c.ZkStateReader addZkWatch collection

[...truncated too long message...]

679_ c:awholynewcollection_0 s:shard3 r:core_node9 x:awholynewcollection_0_shard3_replica3] o.a.s.c.ZkTestServer connecting to 127.0.0.1:38785 38785
   [junit4]   2> 222001 INFO  (Thread-670) [    ] o.a.s.c.ZkTestServer connecting to 127.0.0.1:38785 38785
   [junit4]   2> 222002 WARN  (Thread-670) [    ] o.a.s.c.ZkTestServer Watch limit violations: 
   [junit4]   2> Maximum concurrent create/delete watches above limit:
   [junit4]   2> 
   [junit4]   2> 	9	/solr/aliases.json
   [junit4]   2> 	6	/solr/security.json
   [junit4]   2> 	6	/solr/configs/conf1
   [junit4]   2> 
   [junit4]   2> Maximum concurrent data watches above limit:
   [junit4]   2> 
   [junit4]   2> 	22	/solr/collections/awholynewcollection_0/state.json
   [junit4]   2> 	14	/solr/collections/collection1/state.json
   [junit4]   2> 	9	/solr/clusterstate.json
   [junit4]   2> 	5	/solr/collections/nodes_used_collection/state.json
   [junit4]   2> 	2	/solr/collections/awholynewcollection_0/leader_elect/shard2/election/94822752470171671-core_node3-n_0000000004
   [junit4]   2> 	2	/solr/collections/awholynewcollection_0/leader_elect/shard1/election/94822752470171666-core_node7-n_0000000000
   [junit4]   2> 	2	/solr/collections/awholynewcollection_0/leader_elect/shard1/election/94822752470171657-core_node11-n_0000000001
   [junit4]   2> 	2	/solr/collections/awholynewcollection_0/leader_elect/shard3/election/94822752470171666-core_node9-n_0000000005
   [junit4]   2> 	2	/solr/overseer_elect/election/94822752470171657-127.0.0.1:38423_-n_0000000001
   [junit4]   2> 
   [junit4]   2> Maximum concurrent children watches above limit:
   [junit4]   2> 
   [junit4]   2> 	9	/solr/collections
   [junit4]   2> 	8	/solr/live_nodes
   [junit4]   2> 	4	/solr/overseer/queue
   [junit4]   2> 	4	/solr/overseer/collection-queue-work
   [junit4]   2> 
   [junit4]   2> NOTE: reproduce with: ant test  -Dtestcase=CollectionsAPIDistributedZkTest -Dtests.method=test -Dtests.seed=704935DE55851596 -Dtests.multiplier=3 -Dtests.slow=true -Dtests.locale=ja_JP -Dtests.timezone=America/Panama -Dtests.asserts=true -Dtests.file.encoding=US-ASCII
   [junit4] ERROR   43.4s J1 | CollectionsAPIDistributedZkTest.test <<<
   [junit4]    > Throwable #1: org.apache.solr.client.solrj.impl.HttpSolrClient$RemoteSolrException: Error from server at http://127.0.0.1:47640/awholynewcollection_0: Expected mime type application/octet-stream but got text/html. <html>
   [junit4]    > <head>
   [junit4]    > <meta http-equiv="Content-Type" content="text/html;charset=ISO-8859-1"/>
   [junit4]    > <title>Error 500 </title>
   [junit4]    > </head>
   [junit4]    > <body>
   [junit4]    > <h2>HTTP ERROR: 500</h2>
   [junit4]    > <p>Problem accessing /awholynewcollection_0/select. Reason:
   [junit4]    > <pre>    {trace=java.lang.NullPointerException
   [junit4]    > 	at org.apache.solr.servlet.HttpSolrCall.getCoreByCollection(HttpSolrCall.java:786)
   [junit4]    > 	at org.apache.solr.servlet.HttpSolrCall.init(HttpSolrCall.java:270)
   [junit4]    > 	at org.apache.solr.servlet.HttpSolrCall.call(HttpSolrCall.java:415)
   [junit4]    > 	at org.apache.solr.servlet.SolrDispatchFilter.doFilter(SolrDispatchFilter.java:220)
   [junit4]    > 	at org.apache.solr.servlet.SolrDispatchFilter.doFilter(SolrDispatchFilter.java:179)
   [junit4]    > 	at org.eclipse.jetty.servlet.ServletHandler$CachedChain.doFilter(ServletHandler.java:1652)
   [junit4]    > 	at org.apache.solr.client.solrj.embedded.JettySolrRunner$DebugFilter.doFilter(JettySolrRunner.java:109)
   [junit4]    > 	at org.eclipse.jetty.servlet.ServletHandler$CachedChain.doFilter(ServletHandler.java:1652)
   [junit4]    > 	at org.eclipse.jetty.servlets.UserAgentFilter.doFilter(UserAgentFilter.java:83)
   [junit4]    > 	at org.eclipse.jetty.servlets.GzipFilter.doFilter(GzipFilter.java:364)
   [junit4]    > 	at org.eclipse.jetty.servlet.ServletHandler$CachedChain.doFilter(ServletHandler.java:1652)
   [junit4]    > 	at org.eclipse.jetty.servlet.ServletHandler.doHandle(ServletHandler.java:585)
   [junit4]    > 	at org.eclipse.jetty.server.session.SessionHandler.doHandle(SessionHandler.java:221)
   [junit4]    > 	at org.eclipse.jetty.server.handler.ContextHandler.doHandle(ContextHandler.java:1127)
   [junit4]    > 	at org.eclipse.jetty.servlet.ServletHandler.doScope(ServletHandler.java:515)
   [junit4]    > 	at org.eclipse.jetty.server.session.SessionHandler.doScope(SessionHandler.java:185)
   [junit4]    > 	at org.eclipse.jetty.server.handler.ContextHandler.doScope(ContextHandler.java:1061)
   [junit4]    > 	at org.eclipse.jetty.server.handler.ScopedHandler.handle(ScopedHandler.java:141)
   [junit4]    > 	at org.eclipse.jetty.server.handler.HandlerWrapper.handle(HandlerWrapper.java:97)
   [junit4]    > 	at org.eclipse.jetty.server.Server.handle(Server.java:499)
   [junit4]    > 	at org.eclipse.jetty.server.HttpChannel.handle(HttpChannel.java:310)
   [junit4]    > 	at org.eclipse.jetty.server.HttpConnection.onFillable(HttpConnection.java:257)
   [junit4]    > 	at org.eclipse.jetty.io.AbstractConnection$2.run(AbstractConnection.java:540)
   [junit4]    > 	at org.eclipse.jetty.util.thread.QueuedThreadPool.runJob(QueuedThreadPool.java:635)
   [junit4]    > 	at org.eclipse.jetty.util.thread.QueuedThreadPool$3.run(QueuedThreadPool.java:555)
   [junit4]    > 	at java.lang.Thread.run(Thread.java:745)
   [junit4]    > ,code=500}</pre></p>
   [junit4]    > <hr /><i><small>Powered by Jetty://</small></i>
   [junit4]    > </body>
   [junit4]    > </html>
   [junit4]    > 	at __randomizedtesting.SeedInfo.seed([704935DE55851596:F81D0A04FB79786E]:0)
   [junit4]    > 	at org.apache.solr.client.solrj.impl.HttpSolrClient.executeMethod(HttpSolrClient.java:543)
   [junit4]    > 	at org.apache.solr.client.solrj.impl.HttpSolrClient.request(HttpSolrClient.java:241)
   [junit4]    > 	at org.apache.solr.client.solrj.impl.HttpSolrClient.request(HttpSolrClient.java:230)
   [junit4]    > 	at org.apache.solr.client.solrj.SolrRequest.process(SolrRequest.java:150)
   [junit4]    > 	at org.apache.solr.client.solrj.SolrClient.query(SolrClient.java:943)
   [junit4]    > 	at org.apache.solr.client.solrj.SolrClient.query(SolrClient.java:958)
   [junit4]    > 	at org.apache.solr.cloud.AbstractFullDistribZkTestBase.waitForNon403or404or503(AbstractFullDistribZkTestBase.java:1754)
   [junit4]    > 	at org.apache.solr.cloud.CollectionsAPIDistributedZkTest.testCollectionsAPI(CollectionsAPIDistributedZkTest.java:665)
   [junit4]    > 	at org.apache.solr.cloud.CollectionsAPIDistributedZkTest.test(CollectionsAPIDistributedZkTest.java:167)
   [junit4]    > 	at org.apache.solr.BaseDistributedSearchTestCase$ShardsRepeatRule$ShardsFixedStatement.callStatement(BaseDistributedSearchTestCase.java:963)
   [junit4]    > 	at org.apache.solr.BaseDistributedSearchTestCase$ShardsRepeatRule$ShardsStatement.evaluate(BaseDistributedSearchTestCase.java:938)
   [junit4]    > 	at java.lang.Thread.run(Thread.java:745)
   [junit4]   2> 222005 INFO  (SUITE-CollectionsAPIDistributedZkTest-seed#[704935DE55851596]-worker) [n:127.0.0.1:42679_ c:awholynewcollection_0 s:shard3 r:core_node9 x:awholynewcollection_0_shard3_replica3] o.a.s.SolrTestCaseJ4 ###deleteCore
   [junit4]   2> NOTE: leaving temporary files on disk at: /home/jenkins/workspace/Lucene-Solr-trunk-Linux/solr/build/solr-core/test/J1/temp/solr.cloud.CollectionsAPIDistributedZkTest_704935DE55851596-001
   [junit4]   2> Nov 07, 2015 7:13:41 AM com.carrotsearch.randomizedtesting.ThreadLeakControl checkThreadLeaks
   [junit4]   2> WARNING: Will linger awaiting termination of 2 leaked thread(s).
   [junit4]   2> NOTE: test params are: codec=FastDecompressionCompressingStoredFields(storedFieldsFormat=CompressingStoredFieldsFormat(compressionMode=FAST_DECOMPRESSION, chunkSize=6, maxDocsPerChunk=150, blockSize=8), termVectorsFormat=CompressingTermVectorsFormat(compressionMode=FAST_DECOMPRESSION, chunkSize=6, blockSize=8)), sim=ClassicSimilarity, locale=ja_JP, timezone=America/Panama
   [junit4]   2> NOTE: Linux 3.19.0-31-generic i386/Oracle Corporation 1.8.0_66 (32-bit)/cpus=12,threads=1,free=56345816,total=417071104
   [junit4]   2> NOTE: All tests run in this JVM: [ChaosMonkeyNothingIsSafeTest, TestCodecSupport, UpdateRequestProcessorFactoryTest, ConcurrentDeleteAndCreateCollectionTest, SuggesterFSTTest, TestSystemIdResolver, TestReRankQParserPlugin, GraphQueryTest, SpatialFilterTest, DistributedFacetPivotSmallAdvancedTest, HLLSerializationTest, TestNamedUpdateProcessors, TestConfigOverlay, CustomCollectionTest, ZkControllerTest, FileUtilsTest, CSVRequestHandlerTest, DistributedFacetPivotSmallTest, ShardRoutingCustomTest, CollectionsAPIDistributedZkTest]
   [junit4] Completed [52/555] on J1 in 43.91s, 1 test, 1 error <<< FAILURES!

[...truncated 1625 lines...]
BUILD FAILED
/home/jenkins/workspace/Lucene-Solr-trunk-Linux/build.xml:775: The following error occurred while executing this line:
/home/jenkins/workspace/Lucene-Solr-trunk-Linux/build.xml:719: The following error occurred while executing this line:
/home/jenkins/workspace/Lucene-Solr-trunk-Linux/build.xml:59: The following error occurred while executing this line:
/home/jenkins/workspace/Lucene-Solr-trunk-Linux/solr/build.xml:233: The following error occurred while executing this line:
/home/jenkins/workspace/Lucene-Solr-trunk-Linux/solr/common-build.xml:516: The following error occurred while executing this line:
/home/jenkins/workspace/Lucene-Solr-trunk-Linux/lucene/common-build.xml:1432: The following error occurred while executing this line:
/home/jenkins/workspace/Lucene-Solr-trunk-Linux/lucene/common-build.xml:987: There were test failures: 555 suites (8 ignored), 2200 tests, 1 error, 1 failure, 105 ignored (67 assumptions) [seed: 704935DE55851596]

Total time: 48 minutes 9 seconds
Build step 'Invoke Ant' marked build as failure
Archiving artifacts
[WARNINGS] Skipping publisher since build result is FAILURE
Recording test results
Email was triggered for: Failure - Any
Sending email for trigger: Failure - Any



Mime
View raw message