lucene-dev mailing list archives

Site index · List index
Message view « Date » · « Thread »
Top « Date » · « Thread »
From Policeman Jenkins Server <jenk...@thetaphi.de>
Subject [JENKINS] Lucene-Solr-5.x-Solaris (64bit/jdk1.8.0) - Build # 166 - Failure!
Date Fri, 06 Nov 2015 03:34:31 GMT
Build: http://jenkins.thetaphi.de/job/Lucene-Solr-5.x-Solaris/166/
Java: 64bit/jdk1.8.0 -XX:-UseCompressedOops -XX:+UseSerialGC

1 tests failed.
FAILED:  org.apache.solr.cloud.AsyncMigrateRouteKeyTest.test

Error Message:
There are still nodes recoverying - waited for 15 seconds

Stack Trace:
java.lang.AssertionError: There are still nodes recoverying - waited for 15 seconds
	at __randomizedtesting.SeedInfo.seed([717A8277658DBF74:F92EBDADCB71D28C]:0)
	at org.junit.Assert.fail(Assert.java:93)
	at org.apache.solr.cloud.AbstractDistribZkTestBase.waitForRecoveriesToFinish(AbstractDistribZkTestBase.java:172)
	at org.apache.solr.cloud.AbstractFullDistribZkTestBase.waitForRecoveriesToFinish(AbstractFullDistribZkTestBase.java:836)
	at org.apache.solr.cloud.AbstractFullDistribZkTestBase.waitForThingsToLevelOut(AbstractFullDistribZkTestBase.java:1393)
	at org.apache.solr.cloud.AsyncMigrateRouteKeyTest.test(AsyncMigrateRouteKeyTest.java:42)
	at sun.reflect.NativeMethodAccessorImpl.invoke0(Native Method)
	at sun.reflect.NativeMethodAccessorImpl.invoke(NativeMethodAccessorImpl.java:62)
	at sun.reflect.DelegatingMethodAccessorImpl.invoke(DelegatingMethodAccessorImpl.java:43)
	at java.lang.reflect.Method.invoke(Method.java:497)
	at com.carrotsearch.randomizedtesting.RandomizedRunner.invoke(RandomizedRunner.java:1660)
	at com.carrotsearch.randomizedtesting.RandomizedRunner$8.evaluate(RandomizedRunner.java:866)
	at com.carrotsearch.randomizedtesting.RandomizedRunner$9.evaluate(RandomizedRunner.java:902)
	at com.carrotsearch.randomizedtesting.RandomizedRunner$10.evaluate(RandomizedRunner.java:916)
	at org.apache.solr.BaseDistributedSearchTestCase$ShardsRepeatRule$ShardsFixedStatement.callStatement(BaseDistributedSearchTestCase.java:963)
	at org.apache.solr.BaseDistributedSearchTestCase$ShardsRepeatRule$ShardsStatement.evaluate(BaseDistributedSearchTestCase.java:938)
	at com.carrotsearch.randomizedtesting.rules.SystemPropertiesRestoreRule$1.evaluate(SystemPropertiesRestoreRule.java:57)
	at org.apache.lucene.util.TestRuleSetupTeardownChained$1.evaluate(TestRuleSetupTeardownChained.java:50)
	at org.apache.lucene.util.AbstractBeforeAfterRule$1.evaluate(AbstractBeforeAfterRule.java:46)
	at org.apache.lucene.util.TestRuleThreadAndTestName$1.evaluate(TestRuleThreadAndTestName.java:49)
	at org.apache.lucene.util.TestRuleIgnoreAfterMaxFailures$1.evaluate(TestRuleIgnoreAfterMaxFailures.java:65)
	at org.apache.lucene.util.TestRuleMarkFailure$1.evaluate(TestRuleMarkFailure.java:48)
	at com.carrotsearch.randomizedtesting.rules.StatementAdapter.evaluate(StatementAdapter.java:36)
	at com.carrotsearch.randomizedtesting.ThreadLeakControl$StatementRunner.run(ThreadLeakControl.java:367)
	at com.carrotsearch.randomizedtesting.ThreadLeakControl.forkTimeoutingTask(ThreadLeakControl.java:809)
	at com.carrotsearch.randomizedtesting.ThreadLeakControl$3.evaluate(ThreadLeakControl.java:460)
	at com.carrotsearch.randomizedtesting.RandomizedRunner.runSingleTest(RandomizedRunner.java:875)
	at com.carrotsearch.randomizedtesting.RandomizedRunner$5.evaluate(RandomizedRunner.java:777)
	at com.carrotsearch.randomizedtesting.RandomizedRunner$6.evaluate(RandomizedRunner.java:811)
	at com.carrotsearch.randomizedtesting.RandomizedRunner$7.evaluate(RandomizedRunner.java:822)
	at com.carrotsearch.randomizedtesting.rules.StatementAdapter.evaluate(StatementAdapter.java:36)
	at com.carrotsearch.randomizedtesting.rules.SystemPropertiesRestoreRule$1.evaluate(SystemPropertiesRestoreRule.java:57)
	at org.apache.lucene.util.AbstractBeforeAfterRule$1.evaluate(AbstractBeforeAfterRule.java:46)
	at com.carrotsearch.randomizedtesting.rules.StatementAdapter.evaluate(StatementAdapter.java:36)
	at org.apache.lucene.util.TestRuleStoreClassName$1.evaluate(TestRuleStoreClassName.java:42)
	at com.carrotsearch.randomizedtesting.rules.NoShadowingOrOverridesOnMethodsRule$1.evaluate(NoShadowingOrOverridesOnMethodsRule.java:40)
	at com.carrotsearch.randomizedtesting.rules.NoShadowingOrOverridesOnMethodsRule$1.evaluate(NoShadowingOrOverridesOnMethodsRule.java:40)
	at com.carrotsearch.randomizedtesting.rules.StatementAdapter.evaluate(StatementAdapter.java:36)
	at com.carrotsearch.randomizedtesting.rules.StatementAdapter.evaluate(StatementAdapter.java:36)
	at com.carrotsearch.randomizedtesting.rules.StatementAdapter.evaluate(StatementAdapter.java:36)
	at org.apache.lucene.util.TestRuleAssertionsRequired$1.evaluate(TestRuleAssertionsRequired.java:54)
	at org.apache.lucene.util.TestRuleMarkFailure$1.evaluate(TestRuleMarkFailure.java:48)
	at org.apache.lucene.util.TestRuleIgnoreAfterMaxFailures$1.evaluate(TestRuleIgnoreAfterMaxFailures.java:65)
	at org.apache.lucene.util.TestRuleIgnoreTestSuites$1.evaluate(TestRuleIgnoreTestSuites.java:55)
	at com.carrotsearch.randomizedtesting.rules.StatementAdapter.evaluate(StatementAdapter.java:36)
	at com.carrotsearch.randomizedtesting.ThreadLeakControl$StatementRunner.run(ThreadLeakControl.java:367)
	at java.lang.Thread.run(Thread.java:745)




Build Log:
[...truncated 10941 lines...]
   [junit4] Suite: org.apache.solr.cloud.AsyncMigrateRouteKeyTest
   [junit4]   2> Creating dataDir: /export/home/jenkins/workspace/Lucene-Solr-5.x-Solaris/solr/build/solr-core/test/J1/temp/solr.cloud.AsyncMigrateRouteKeyTest_717A8277658DBF74-001/init-core-data-001
   [junit4]   2> 1809196 INFO  (SUITE-AsyncMigrateRouteKeyTest-seed#[717A8277658DBF74]-worker) [    ] o.a.s.BaseDistributedSearchTestCase Setting hostContext system property: /
   [junit4]   2> 1809203 INFO  (TEST-AsyncMigrateRouteKeyTest.test-seed#[717A8277658DBF74]) [    ] o.a.s.c.ZkTestServer STARTING ZK TEST SERVER
   [junit4]   2> 1809203 INFO  (Thread-5697) [    ] o.a.s.c.ZkTestServer client port:0.0.0.0/0.0.0.0:0
   [junit4]   2> 1809204 INFO  (Thread-5697) [    ] o.a.s.c.ZkTestServer Starting server
   [junit4]   2> 1809303 INFO  (TEST-AsyncMigrateRouteKeyTest.test-seed#[717A8277658DBF74]) [    ] o.a.s.c.ZkTestServer start zk server on port:53686
   [junit4]   2> 1809303 INFO  (TEST-AsyncMigrateRouteKeyTest.test-seed#[717A8277658DBF74]) [    ] o.a.s.c.c.SolrZkClient Using default ZkCredentialsProvider
   [junit4]   2> 1809304 INFO  (TEST-AsyncMigrateRouteKeyTest.test-seed#[717A8277658DBF74]) [    ] o.a.s.c.c.ConnectionManager Waiting for client to connect to ZooKeeper
   [junit4]   2> 1809327 INFO  (zkCallback-2440-thread-1) [    ] o.a.s.c.c.ConnectionManager Watcher org.apache.solr.common.cloud.ConnectionManager@4cd83062 name:ZooKeeperConnection Watcher:127.0.0.1:53686 got event WatchedEvent state:SyncConnected type:None path:null path:null type:None
   [junit4]   2> 1809328 INFO  (TEST-AsyncMigrateRouteKeyTest.test-seed#[717A8277658DBF74]) [    ] o.a.s.c.c.ConnectionManager Client is connected to ZooKeeper
   [junit4]   2> 1809328 INFO  (TEST-AsyncMigrateRouteKeyTest.test-seed#[717A8277658DBF74]) [    ] o.a.s.c.c.SolrZkClient Using default ZkACLProvider
   [junit4]   2> 1809328 INFO  (TEST-AsyncMigrateRouteKeyTest.test-seed#[717A8277658DBF74]) [    ] o.a.s.c.c.SolrZkClient makePath: /solr
   [junit4]   2> 1809332 INFO  (TEST-AsyncMigrateRouteKeyTest.test-seed#[717A8277658DBF74]) [    ] o.a.s.c.c.SolrZkClient Using default ZkCredentialsProvider
   [junit4]   2> 1809332 INFO  (TEST-AsyncMigrateRouteKeyTest.test-seed#[717A8277658DBF74]) [    ] o.a.s.c.c.ConnectionManager Waiting for client to connect to ZooKeeper
   [junit4]   2> 1809334 INFO  (zkCallback-2441-thread-1) [    ] o.a.s.c.c.ConnectionManager Watcher org.apache.solr.common.cloud.ConnectionManager@7dff5633 name:ZooKeeperConnection Watcher:127.0.0.1:53686/solr got event WatchedEvent state:SyncConnected type:None path:null path:null type:None
   [junit4]   2> 1809335 INFO  (TEST-AsyncMigrateRouteKeyTest.test-seed#[717A8277658DBF74]) [    ] o.a.s.c.c.ConnectionManager Client is connected to ZooKeeper
   [junit4]   2> 1809335 INFO  (TEST-AsyncMigrateRouteKeyTest.test-seed#[717A8277658DBF74]) [    ] o.a.s.c.c.SolrZkClient Using default ZkACLProvider
   [junit4]   2> 1809335 INFO  (TEST-AsyncMigrateRouteKeyTest.test-seed#[717A8277658DBF74]) [    ] o.a.s.c.c.SolrZkClient makePath: /collections/collection1
   [junit4]   2> 1809352 INFO  (TEST-AsyncMigrateRouteKeyTest.test-seed#[717A8277658DBF74]) [    ] o.a.s.c.c.SolrZkClient makePath: /collections/collection1/shards
   [junit4]   2> 1809354 INFO  (TEST-AsyncMigrateRouteKeyTest.test-seed#[717A8277658DBF74]) [    ] o.a.s.c.c.SolrZkClient makePath: /collections/control_collection
   [junit4]   2> 1809356 INFO  (TEST-AsyncMigrateRouteKeyTest.test-seed#[717A8277658DBF74]) [    ] o.a.s.c.c.SolrZkClient makePath: /collections/control_collection/shards
   [junit4]   2> 1809358 INFO  (TEST-AsyncMigrateRouteKeyTest.test-seed#[717A8277658DBF74]) [    ] o.a.s.c.AbstractZkTestCase put /export/home/jenkins/workspace/Lucene-Solr-5.x-Solaris/solr/core/src/test-files/solr/collection1/conf/solrconfig-tlog.xml to /configs/conf1/solrconfig.xml
   [junit4]   2> 1809358 INFO  (TEST-AsyncMigrateRouteKeyTest.test-seed#[717A8277658DBF74]) [    ] o.a.s.c.c.SolrZkClient makePath: /configs/conf1/solrconfig.xml
   [junit4]   2> 1809362 INFO  (TEST-AsyncMigrateRouteKeyTest.test-seed#[717A8277658DBF74]) [    ] o.a.s.c.AbstractZkTestCase put /export/home/jenkins/workspace/Lucene-Solr-5.x-Solaris/solr/core/src/test-files/solr/collection1/conf/schema15.xml to /configs/conf1/schema.xml
   [junit4]   2> 1809363 INFO  (TEST-AsyncMigrateRouteKeyTest.test-seed#[717A8277658DBF74]) [    ] o.a.s.c.c.SolrZkClient makePath: /configs/conf1/schema.xml
   [junit4]   2> 1809366 INFO  (TEST-AsyncMigrateRouteKeyTest.test-seed#[717A8277658DBF74]) [    ] o.a.s.c.AbstractZkTestCase put /export/home/jenkins/workspace/Lucene-Solr-5.x-Solaris/solr/core/src/test-files/solr/collection1/conf/solrconfig.snippet.randomindexconfig.xml to /configs/conf1/solrconfig.snippet.randomindexconfig.xml
   [junit4]   2> 1809367 INFO  (TEST-AsyncMigrateRouteKeyTest.test-seed#[717A8277658DBF74]) [    ] o.a.s.c.c.SolrZkClient makePath: /configs/conf1/solrconfig.snippet.randomindexconfig.xml
   [junit4]   2> 1809369 INFO  (TEST-AsyncMigrateRouteKeyTest.test-seed#[717A8277658DBF74]) [    ] o.a.s.c.AbstractZkTestCase put /export/home/jenkins/workspace/Lucene-Solr-5.x-Solaris/solr/core/src/test-files/solr/collection1/conf/stopwords.txt to /configs/conf1/stopwords.txt
   [junit4]   2> 1809369 INFO  (TEST-AsyncMigrateRouteKeyTest.test-seed#[717A8277658DBF74]) [    ] o.a.s.c.c.SolrZkClient makePath: /configs/conf1/stopwords.txt
   [junit4]   2> 1809373 INFO  (TEST-AsyncMigrateRouteKeyTest.test-seed#[717A8277658DBF74]) [    ] o.a.s.c.AbstractZkTestCase put /export/home/jenkins/workspace/Lucene-Solr-5.x-Solaris/solr/core/src/test-files/solr/collection1/conf/protwords.txt to /configs/conf1/protwords.txt
   [junit4]   2> 1809374 INFO  (TEST-AsyncMigrateRouteKeyTest.test-seed#[717A8277658DBF74]) [    ] o.a.s.c.c.SolrZkClient makePath: /configs/conf1/protwords.txt
   [junit4]   2> 1809378 INFO  (TEST-AsyncMigrateRouteKeyTest.test-seed#[717A8277658DBF74]) [    ] o.a.s.c.AbstractZkTestCase put /export/home/jenkins/workspace/Lucene-Solr-5.x-Solaris/solr/core/src/test-files/solr/collection1/conf/currency.xml to /configs/conf1/currency.xml
   [junit4]   2> 1809378 INFO  (TEST-AsyncMigrateRouteKeyTest.test-seed#[717A8277658DBF74]) [    ] o.a.s.c.c.SolrZkClient makePath: /configs/conf1/currency.xml
   [junit4]   2> 1809381 INFO  (TEST-AsyncMigrateRouteKeyTest.test-seed#[717A8277658DBF74]) [    ] o.a.s.c.AbstractZkTestCase put /export/home/jenkins/workspace/Lucene-Solr-5.x-Solaris/solr/core/src/test-files/solr/collection1/conf/enumsConfig.xml to /configs/conf1/enumsConfig.xml
   [junit4]   2> 1809381 INFO  (TEST-AsyncMigrateRouteKeyTest.test-seed#[717A8277658DBF74]) [    ] o.a.s.c.c.SolrZkClient makePath: /configs/conf1/enumsConfig.xml
   [junit4]   2> 1809384 INFO  (TEST-AsyncMigrateRouteKeyTest.test-seed#[717A8277658DBF74]) [    ] o.a.s.c.AbstractZkTestCase put /export/home/jenkins/workspace/Lucene-Solr-5.x-Solaris/solr/core/src/test-files/solr/collection1/conf/open-exchange-rates.json to /configs/conf1/open-exchange-rates.json
   [junit4]   2> 1809384 INFO  (TEST-AsyncMigrateRouteKeyTest.test-seed#[717A8277658DBF74]) [    ] o.a.s.c.c.SolrZkClient makePath: /configs/conf1/open-exchange-rates.json
   [junit4]   2> 1809386 INFO  (TEST-AsyncMigrateRouteKeyTest.test-seed#[717A8277658DBF74]) [    ] o.a.s.c.AbstractZkTestCase put /export/home/jenkins/workspace/Lucene-Solr-5.x-Solaris/solr/core/src/test-files/solr/collection1/conf/mapping-ISOLatin1Accent.txt to /configs/conf1/mapping-ISOLatin1Accent.txt
   [junit4]   2> 1809386 INFO  (TEST-AsyncMigrateRouteKeyTest.test-seed#[717A8277658DBF74]) [    ] o.a.s.c.c.SolrZkClient makePath: /configs/conf1/mapping-ISOLatin1Accent.txt
   [junit4]   2> 1809389 INFO  (TEST-AsyncMigrateRouteKeyTest.test-seed#[717A8277658DBF74]) [    ] o.a.s.c.AbstractZkTestCase put /export/home/jenkins/workspace/Lucene-Solr-5.x-Solaris/solr/core/src/test-files/solr/collection1/conf/old_synonyms.txt to /configs/conf1/old_synonyms.txt
   [junit4]   2> 1809390 INFO  (TEST-AsyncMigrateRouteKeyTest.test-seed#[717A8277658DBF74]) [    ] o.a.s.c.c.SolrZkClient makePath: /configs/conf1/old_synonyms.txt
   [junit4]   2> 1809393 INFO  (TEST-AsyncMigrateRouteKeyTest.test-seed#[717A8277658DBF74]) [    ] o.a.s.c.AbstractZkTestCase put /export/home/jenkins/workspace/Lucene-Solr-5.x-Solaris/solr/core/src/test-files/solr/collection1/conf/synonyms.txt to /configs/conf1/synonyms.txt
   [junit4]   2> 1809393 INFO  (TEST-AsyncMigrateRouteKeyTest.test-seed#[717A8277658DBF74]) [    ] o.a.s.c.c.SolrZkClient makePath: /configs/conf1/synonyms.txt
   [junit4]   2> 1809585 INFO  (TEST-AsyncMigrateRouteKeyTest.test-seed#[717A8277658DBF74]) [    ] o.a.s.SolrTestCaseJ4 Writing core.properties file to /export/home/jenkins/workspace/Lucene-Solr-5.x-Solaris/solr/build/solr-core/test/J1/temp/solr.cloud.AsyncMigrateRouteKeyTest_717A8277658DBF74-001/control-001/cores/collection1
   [junit4]   2> 1809586 INFO  (TEST-AsyncMigrateRouteKeyTest.test-seed#[717A8277658DBF74]) [    ] o.e.j.s.Server jetty-9.2.13.v20150730
   [junit4]   2> 1809588 INFO  (TEST-AsyncMigrateRouteKeyTest.test-seed#[717A8277658DBF74]) [    ] o.e.j.s.h.ContextHandler Started o.e.j.s.ServletContextHandler@5d8d4e4e{/,null,AVAILABLE}
   [junit4]   2> 1809588 INFO  (TEST-AsyncMigrateRouteKeyTest.test-seed#[717A8277658DBF74]) [    ] o.e.j.s.ServerConnector Started ServerConnector@1e435a96{HTTP/1.1}{127.0.0.1:57341}
   [junit4]   2> 1809589 INFO  (TEST-AsyncMigrateRouteKeyTest.test-seed#[717A8277658DBF74]) [    ] o.e.j.s.Server Started @1813565ms
   [junit4]   2> 1809589 INFO  (TEST-AsyncMigrateRouteKeyTest.test-seed#[717A8277658DBF74]) [    ] o.a.s.c.s.e.JettySolrRunner Jetty properties: {solr.data.dir=/export/home/jenkins/workspace/Lucene-Solr-5.x-Solaris/solr/build/solr-core/test/J1/temp/solr.cloud.AsyncMigrateRouteKeyTest_717A8277658DBF74-001/tempDir-001/control/data, hostContext=/, hostPort=57341, coreRootDirectory=/export/home/jenkins/workspace/Lucene-Solr-5.x-Solaris/solr/build/solr-core/test/J1/temp/solr.cloud.AsyncMigrateRouteKeyTest_717A8277658DBF74-001/control-001/cores}
   [junit4]   2> 1809589 INFO  (TEST-AsyncMigrateRouteKeyTest.test-seed#[717A8277658DBF74]) [    ] o.a.s.s.SolrDispatchFilter SolrDispatchFilter.init(): sun.misc.Launcher$AppClassLoader@659e0bfd
   [junit4]   2> 1809589 INFO  (TEST-AsyncMigrateRouteKeyTest.test-seed#[717A8277658DBF74]) [    ] o.a.s.c.SolrResourceLoader new SolrResourceLoader for directory: '/export/home/jenkins/workspace/Lucene-Solr-5.x-Solaris/solr/build/solr-core/test/J1/temp/solr.cloud.AsyncMigrateRouteKeyTest_717A8277658DBF74-001/control-001/'
   [junit4]   2> 1809589 INFO  (TEST-AsyncMigrateRouteKeyTest.test-seed#[717A8277658DBF74]) [    ] o.a.s.c.SolrResourceLoader JNDI not configured for solr (NoInitialContextEx)
   [junit4]   2> 1809589 INFO  (TEST-AsyncMigrateRouteKeyTest.test-seed#[717A8277658DBF74]) [    ] o.a.s.c.SolrResourceLoader solr home defaulted to 'solr/' (could not find system property or JNDI)
   [junit4]   2> 1809607 INFO  (TEST-AsyncMigrateRouteKeyTest.test-seed#[717A8277658DBF74]) [    ] o.a.s.c.c.SolrZkClient Using default ZkCredentialsProvider
   [junit4]   2> 1809607 INFO  (TEST-AsyncMigrateRouteKeyTest.test-seed#[717A8277658DBF74]) [    ] o.a.s.c.c.ConnectionManager Waiting for client to connect to ZooKeeper
   [junit4]   2> 1809610 INFO  (zkCallback-2442-thread-1) [    ] o.a.s.c.c.ConnectionManager Watcher org.apache.solr.common.cloud.ConnectionManager@1e7852a1 name:ZooKeeperConnection Watcher:127.0.0.1:53686/solr got event WatchedEvent state:SyncConnected type:None path:null path:null type:None
   [junit4]   2> 1809610 INFO  (TEST-AsyncMigrateRouteKeyTest.test-seed#[717A8277658DBF74]) [    ] o.a.s.c.c.ConnectionManager Client is connected to ZooKeeper
   [junit4]   2> 1809611 INFO  (TEST-AsyncMigrateRouteKeyTest.test-seed#[717A8277658DBF74]) [    ] o.a.s.c.c.SolrZkClient Using default ZkACLProvider
   [junit4]   2> 1809614 INFO  (TEST-AsyncMigrateRouteKeyTest.test-seed#[717A8277658DBF74]) [    ] o.a.s.s.SolrDispatchFilter Loading solr.xml from SolrHome (not found in ZooKeeper)
   [junit4]   2> 1809614 INFO  (TEST-AsyncMigrateRouteKeyTest.test-seed#[717A8277658DBF74]) [    ] o.a.s.c.SolrXmlConfig Loading container configuration from /export/home/jenkins/workspace/Lucene-Solr-5.x-Solaris/solr/build/solr-core/test/J1/temp/solr.cloud.AsyncMigrateRouteKeyTest_717A8277658DBF74-001/control-001/solr.xml
   [junit4]   2> 1809618 INFO  (TEST-AsyncMigrateRouteKeyTest.test-seed#[717A8277658DBF74]) [    ] o.a.s.c.CoresLocator Config-defined core root directory: /export/home/jenkins/workspace/Lucene-Solr-5.x-Solaris/solr/build/solr-core/test/J1/temp/solr.cloud.AsyncMigrateRouteKeyTest_717A8277658DBF74-001/control-001/cores
   [junit4]   2> 1809618 INFO  (TEST-AsyncMigrateRouteKeyTest.test-seed#[717A8277658DBF74]) [    ] o.a.s.c.CoreContainer New CoreContainer 1653835944
   [junit4]   2> 1809618 INFO  (TEST-AsyncMigrateRouteKeyTest.test-seed#[717A8277658DBF74]) [    ] o.a.s.c.CoreContainer Loading cores into CoreContainer [instanceDir=/export/home/jenkins/workspace/Lucene-Solr-5.x-Solaris/solr/build/solr-core/test/J1/temp/solr.cloud.AsyncMigrateRouteKeyTest_717A8277658DBF74-001/control-001/]
   [junit4]   2> 1809618 INFO  (TEST-AsyncMigrateRouteKeyTest.test-seed#[717A8277658DBF74]) [    ] o.a.s.c.CoreContainer loading shared library: /export/home/jenkins/workspace/Lucene-Solr-5.x-Solaris/solr/build/solr-core/test/J1/temp/solr.cloud.AsyncMigrateRouteKeyTest_717A8277658DBF74-001/control-001/lib
   [junit4]   2> 1809619 WARN  (TEST-AsyncMigrateRouteKeyTest.test-seed#[717A8277658DBF74]) [    ] o.a.s.c.SolrResourceLoader Can't find (or read) directory to add to classloader: lib (resolved as: /export/home/jenkins/workspace/Lucene-Solr-5.x-Solaris/solr/build/solr-core/test/J1/temp/solr.cloud.AsyncMigrateRouteKeyTest_717A8277658DBF74-001/control-001/lib).
   [junit4]   2> 1809635 INFO  (TEST-AsyncMigrateRouteKeyTest.test-seed#[717A8277658DBF74]) [    ] o.a.s.h.c.HttpShardHandlerFactory created with socketTimeout : 90000,urlScheme : ,connTimeout : 15000,maxConnectionsPerHost : 20,maxConnections : 10000,corePoolSize : 0,maximumPoolSize : 2147483647,maxThreadIdleTime : 5,sizeOfQueue : -1,fairnessPolicy : false,useRetries : false,
   [junit4]   2> 1809636 INFO  (TEST-AsyncMigrateRouteKeyTest.test-seed#[717A8277658DBF74]) [    ] o.a.s.u.UpdateShardHandler Creating UpdateShardHandler HTTP client with params: socketTimeout=340000&connTimeout=45000&retry=true
   [junit4]   2> 1809637 INFO  (TEST-AsyncMigrateRouteKeyTest.test-seed#[717A8277658DBF74]) [    ] o.a.s.l.LogWatcher SLF4J impl is org.slf4j.impl.Log4jLoggerFactory
   [junit4]   2> 1809637 INFO  (TEST-AsyncMigrateRouteKeyTest.test-seed#[717A8277658DBF74]) [    ] o.a.s.l.LogWatcher Registering Log Listener [Log4j (org.slf4j.impl.Log4jLoggerFactory)]
   [junit4]   2> 1809637 INFO  (TEST-AsyncMigrateRouteKeyTest.test-seed#[717A8277658DBF74]) [    ] o.a.s.c.ZkContainer Zookeeper client=127.0.0.1:53686/solr
   [junit4]   2> 1809637 INFO  (TEST-AsyncMigrateRouteKeyTest.test-seed#[717A8277658DBF74]) [    ] o.a.s.c.ZkController zkHost includes chroot
   [junit4]   2> 1809637 INFO  (TEST-AsyncMigrateRouteKeyTest.test-seed#[717A8277658DBF74]) [    ] o.a.s.c.c.SolrZkClient Using default ZkCredentialsProvider
   [junit4]   2> 1809638 INFO  (TEST-AsyncMigrateRouteKeyTest.test-seed#[717A8277658DBF74]) [    ] o.a.s.c.c.ConnectionManager Waiting for client to connect to ZooKeeper
   [junit4]   2> 1809639 INFO  (zkCallback-2444-thread-1) [    ] o.a.s.c.c.ConnectionManager Watcher org.apache.solr.common.cloud.ConnectionManager@506cebd5 name:ZooKeeperConnection Watcher:127.0.0.1:53686 got event WatchedEvent state:SyncConnected type:None path:null path:null type:None
   [junit4]   2> 1809639 INFO  (TEST-AsyncMigrateRouteKeyTest.test-seed#[717A8277658DBF74]) [    ] o.a.s.c.c.ConnectionManager Client is connected to ZooKeeper
   [junit4]   2> 1809640 INFO  (TEST-AsyncMigrateRouteKeyTest.test-seed#[717A8277658DBF74]) [    ] o.a.s.c.c.SolrZkClient Using default ZkACLProvider
   [junit4]   2> 1809643 INFO  (TEST-AsyncMigrateRouteKeyTest.test-seed#[717A8277658DBF74]) [n:127.0.0.1:57341_    ] o.a.s.c.c.ConnectionManager Waiting for client to connect to ZooKeeper
   [junit4]   2> 1809646 INFO  (zkCallback-2445-thread-1-processing-n:127.0.0.1:57341_) [n:127.0.0.1:57341_    ] o.a.s.c.c.ConnectionManager Watcher org.apache.solr.common.cloud.ConnectionManager@5471046b name:ZooKeeperConnection Watcher:127.0.0.1:53686/solr got event WatchedEvent state:SyncConnected type:None path:null path:null type:None
   [junit4]   2> 1809646 INFO  (TEST-AsyncMigrateRouteKeyTest.test-seed#[717A8277658DBF74]) [n:127.0.0.1:57341_    ] o.a.s.c.c.ConnectionManager Client is connected to ZooKeeper
   [junit4]   2> 1809647 INFO  (TEST-AsyncMigrateRouteKeyTest.test-seed#[717A8277658DBF74]) [n:127.0.0.1:57341_    ] o.a.s.c.c.SolrZkClient makePath: /overseer/queue
   [junit4]   2> 1809654 INFO  (TEST-AsyncMigrateRouteKeyTest.test-seed#[717A8277658DBF74]) [n:127.0.0.1:57341_    ] o.a.s.c.c.SolrZkClient makePath: /overseer/collection-queue-work
   [junit4]   2> 1809662 INFO  (TEST-AsyncMigrateRouteKeyTest.test-seed#[717A8277658DBF74]) [n:127.0.0.1:57341_    ] o.a.s.c.c.SolrZkClient makePath: /overseer/collection-map-running
   [junit4]   2> 1809664 INFO  (TEST-AsyncMigrateRouteKeyTest.test-seed#[717A8277658DBF74]) [n:127.0.0.1:57341_    ] o.a.s.c.c.SolrZkClient makePath: /overseer/collection-map-completed
   [junit4]   2> 1809666 INFO  (TEST-AsyncMigrateRouteKeyTest.test-seed#[717A8277658DBF74]) [n:127.0.0.1:57341_    ] o.a.s.c.c.SolrZkClient makePath: /overseer/collection-map-failure
   [junit4]   2> 1809669 INFO  (TEST-AsyncMigrateRouteKeyTest.test-seed#[717A8277658DBF74]) [n:127.0.0.1:57341_    ] o.a.s.c.c.SolrZkClient makePath: /live_nodes
   [junit4]   2> 1809671 INFO  (TEST-AsyncMigrateRouteKeyTest.test-seed#[717A8277658DBF74]) [n:127.0.0.1:57341_    ] o.a.s.c.c.SolrZkClient makePath: /aliases.json
   [junit4]   2> 1809672 INFO  (TEST-AsyncMigrateRouteKeyTest.test-seed#[717A8277658DBF74]) [n:127.0.0.1:57341_    ] o.a.s.c.c.SolrZkClient makePath: /clusterstate.json
   [junit4]   2> 1809673 INFO  (TEST-AsyncMigrateRouteKeyTest.test-seed#[717A8277658DBF74]) [n:127.0.0.1:57341_    ] o.a.s.c.c.SolrZkClient makePath: /security.json
   [junit4]   2> 1809674 INFO  (TEST-AsyncMigrateRouteKeyTest.test-seed#[717A8277658DBF74]) [n:127.0.0.1:57341_    ] o.a.s.c.ZkController Register node as live in ZooKeeper:/live_nodes/127.0.0.1:57341_
   [junit4]   2> 1809675 INFO  (TEST-AsyncMigrateRouteKeyTest.test-seed#[717A8277658DBF74]) [n:127.0.0.1:57341_    ] o.a.s.c.c.SolrZkClient makePath: /live_nodes/127.0.0.1:57341_
   [junit4]   2> 1809676 INFO  (TEST-AsyncMigrateRouteKeyTest.test-seed#[717A8277658DBF74]) [n:127.0.0.1:57341_    ] o.a.s.c.c.SolrZkClient makePath: /overseer_elect
   [junit4]   2> 1809678 INFO  (TEST-AsyncMigrateRouteKeyTest.test-seed#[717A8277658DBF74]) [n:127.0.0.1:57341_    ] o.a.s.c.c.SolrZkClient makePath: /overseer_elect/election
   [junit4]   2> 1809679 INFO  (TEST-AsyncMigrateRouteKeyTest.test-seed#[717A8277658DBF74]) [n:127.0.0.1:57341_    ] o.a.s.c.Overseer Overseer (id=null) closing
   [junit4]   2> 1809679 INFO  (TEST-AsyncMigrateRouteKeyTest.test-seed#[717A8277658DBF74]) [n:127.0.0.1:57341_    ] o.a.s.c.LeaderElector Joined leadership election with path: /overseer_elect/election/94816157108076548-127.0.0.1:57341_-n_0000000000
   [junit4]   2> 1809680 INFO  (TEST-AsyncMigrateRouteKeyTest.test-seed#[717A8277658DBF74]) [n:127.0.0.1:57341_    ] o.a.s.c.OverseerElectionContext I am going to be the leader 127.0.0.1:57341_
   [junit4]   2> 1809680 INFO  (TEST-AsyncMigrateRouteKeyTest.test-seed#[717A8277658DBF74]) [n:127.0.0.1:57341_    ] o.a.s.c.c.SolrZkClient makePath: /overseer_elect/leader
   [junit4]   2> 1809682 INFO  (TEST-AsyncMigrateRouteKeyTest.test-seed#[717A8277658DBF74]) [n:127.0.0.1:57341_    ] o.a.s.c.Overseer Overseer (id=94816157108076548-127.0.0.1:57341_-n_0000000000) starting
   [junit4]   2> 1809684 INFO  (TEST-AsyncMigrateRouteKeyTest.test-seed#[717A8277658DBF74]) [n:127.0.0.1:57341_    ] o.a.s.c.c.SolrZkClient makePath: /overseer/queue-work
   [junit4]   2> 1809690 INFO  (TEST-AsyncMigrateRouteKeyTest.test-seed#[717A8277658DBF74]) [n:127.0.0.1:57341_    ] o.a.s.c.OverseerAutoReplicaFailoverThread Starting OverseerAutoReplicaFailoverThread autoReplicaFailoverWorkLoopDelay=10000 autoReplicaFailoverWaitAfterExpiration=30000 autoReplicaFailoverBadNodeExpiration=60000
   [junit4]   2> 1809691 INFO  (OverseerCollectionConfigSetProcessor-94816157108076548-127.0.0.1:57341_-n_0000000000) [n:127.0.0.1:57341_    ] o.a.s.c.OverseerTaskProcessor Process current queue of overseer operations
   [junit4]   2> 1809691 INFO  (TEST-AsyncMigrateRouteKeyTest.test-seed#[717A8277658DBF74]) [n:127.0.0.1:57341_    ] o.a.s.c.c.ZkStateReader Updating cluster state from ZooKeeper... 
   [junit4]   2> 1809693 INFO  (OverseerStateUpdate-94816157108076548-127.0.0.1:57341_-n_0000000000) [n:127.0.0.1:57341_    ] o.a.s.c.Overseer Starting to work on the main queue
   [junit4]   2> 1809709 INFO  (TEST-AsyncMigrateRouteKeyTest.test-seed#[717A8277658DBF74]) [n:127.0.0.1:57341_    ] o.a.s.c.CoreContainer Security conf doesn't exist. Skipping setup for authorization module.
   [junit4]   2> 1809709 INFO  (TEST-AsyncMigrateRouteKeyTest.test-seed#[717A8277658DBF74]) [n:127.0.0.1:57341_    ] o.a.s.c.CoreContainer No authentication plugin used.
   [junit4]   2> 1809711 INFO  (TEST-AsyncMigrateRouteKeyTest.test-seed#[717A8277658DBF74]) [n:127.0.0.1:57341_    ] o.a.s.c.CoresLocator Looking for core definitions underneath /export/home/jenkins/workspace/Lucene-Solr-5.x-Solaris/solr/build/solr-core/test/J1/temp/solr.cloud.AsyncMigrateRouteKeyTest_717A8277658DBF74-001/control-001/cores
   [junit4]   2> 1809711 INFO  (TEST-AsyncMigrateRouteKeyTest.test-seed#[717A8277658DBF74]) [n:127.0.0.1:57341_    ] o.a.s.c.SolrCore Created CoreDescriptor: {name=collection1, config=solrconfig.xml, transient=false, schema=schema.xml, loadOnStartup=true, configSetProperties=configsetprops.json, instanceDir=/export/home/jenkins/workspace/Lucene-Solr-5.x-Solaris/solr/build/solr-core/test/J1/temp/solr.cloud.AsyncMigrateRouteKeyTest_717A8277658DBF74-001/control-001/cores/collection1, collection=control_collection, absoluteInstDir=/export/home/jenkins/workspace/Lucene-Solr-5.x-Solaris/solr/build/solr-core/test/J1/temp/solr.cloud.AsyncMigrateRouteKeyTest_717A8277658DBF74-001/control-001/cores/collection1/, coreNodeName=, dataDir=data/, shard=}
   [junit4]   2> 1809713 INFO  (TEST-AsyncMigrateRouteKeyTest.test-seed#[717A8277658DBF74]) [n:127.0.0.1:57341_    ] o.a.s.c.CoresLocator Found core collection1 in /export/home/jenkins/workspace/Lucene-Solr-5.x-Solaris/solr/build/solr-core/test/J1/temp/solr.cloud.AsyncMigrateRouteKeyTest_717A8277658DBF74-001/control-001/cores/collection1/
   [junit4]   2> 1809714 INFO  (TEST-AsyncMigrateRouteKeyTest.test-seed#[717A8277658DBF74]) [n:127.0.0.1:57341_    ] o.a.s.c.CoresLocator Found 1 core definitions
   [junit4]   2> 1809720 INFO  (TEST-AsyncMigrateRouteKeyTest.test-seed#[717A8277658DBF74]) [n:127.0.0.1:57341_    ] o.a.s.s.SolrDispatchFilter user.dir=/export/home/jenkins/workspace/Lucene-Solr-5.x-Solaris/solr/build/solr-core/test/J1
   [junit4]   2> 1809720 INFO  (TEST-AsyncMigrateRouteKeyTest.test-seed#[717A8277658DBF74]) [n:127.0.0.1:57341_    ] o.a.s.s.SolrDispatchFilter SolrDispatchFilter.init() done
   [junit4]   2> 1809722 INFO  (coreLoadExecutor-7434-thread-1-processing-n:127.0.0.1:57341_) [n:127.0.0.1:57341_ c:control_collection   x:collection1] o.a.s.c.ZkController publishing state=down
   [junit4]   2> 1809723 INFO  (coreLoadExecutor-7434-thread-1-processing-n:127.0.0.1:57341_) [n:127.0.0.1:57341_ c:control_collection   x:collection1] o.a.s.c.ZkController numShards not found on descriptor - reading it from system property
   [junit4]   2> 1809728 INFO  (OverseerStateUpdate-94816157108076548-127.0.0.1:57341_-n_0000000000) [n:127.0.0.1:57341_    ] o.a.s.c.Overseer processMessage: queueSize: 1, message = {
   [junit4]   2>   "core":"collection1",
   [junit4]   2>   "roles":null,
   [junit4]   2>   "base_url":"http://127.0.0.1:57341",
   [junit4]   2>   "node_name":"127.0.0.1:57341_",
   [junit4]   2>   "numShards":"1",
   [junit4]   2>   "state":"down",
   [junit4]   2>   "shard":null,
   [junit4]   2>   "collection":"control_collection",
   [junit4]   2>   "operation":"state"} current state version: 0
   [junit4]   2> 1809729 INFO  (OverseerStateUpdate-94816157108076548-127.0.0.1:57341_-n_0000000000) [n:127.0.0.1:57341_    ] o.a.s.c.o.ReplicaMutator Update state numShards=1 message={
   [junit4]   2>   "core":"collection1",
   [junit4]   2>   "roles":null,
   [junit4]   2>   "base_url":"http://127.0.0.1:57341",
   [junit4]   2>   "node_name":"127.0.0.1:57341_",
   [junit4]   2>   "numShards":"1",
   [junit4]   2>   "state":"down",
   [junit4]   2>   "shard":null,
   [junit4]   2>   "collection":"control_collection",
   [junit4]   2>   "operation":"state"}
   [junit4]   2> 1809731 INFO  (OverseerStateUpdate-94816157108076548-127.0.0.1:57341_-n_0000000000) [n:127.0.0.1:57341_    ] o.a.s.c.o.ClusterStateMutator building a new cName: control_collection
   [junit4]   2> 1809731 INFO  (coreLoadExecutor-7434-thread-1-processing-n:127.0.0.1:57341_) [n:127.0.0.1:57341_ c:control_collection   x:collection1] o.a.s.c.ZkController look for our core node name
   [junit4]   2> 1809731 INFO  (OverseerStateUpdate-94816157108076548-127.0.0.1:57341_-n_0000000000) [n:127.0.0.1:57341_    ] o.a.s.c.o.ReplicaMutator Assigning new node to shard shard=shard1
   [junit4]   2> 1809738 INFO  (zkCallback-2445-thread-1-processing-n:127.0.0.1:57341_) [n:127.0.0.1:57341_    ] o.a.s.c.c.ZkStateReader A cluster state change: WatchedEvent state:SyncConnected type:NodeDataChanged path:/clusterstate.json, has occurred - updating... (live nodes size: 1)
   [junit4]   2> 1810735 INFO  (coreLoadExecutor-7434-thread-1-processing-n:127.0.0.1:57341_) [n:127.0.0.1:57341_ c:control_collection   x:collection1] o.a.s.c.ZkController waiting to find shard id in clusterstate for collection1
   [junit4]   2> 1810735 INFO  (coreLoadExecutor-7434-thread-1-processing-n:127.0.0.1:57341_) [n:127.0.0.1:57341_ c:control_collection   x:collection1] o.a.s.c.ZkController Check for collection zkNode:control_collection
   [junit4]   2> 1810736 INFO  (coreLoadExecutor-7434-thread-1-processing-n:127.0.0.1:57341_) [n:127.0.0.1:57341_ c:control_collection   x:collection1] o.a.s.c.ZkController Collection zkNode exists
   [junit4]   2> 1810736 INFO  (coreLoadExecutor-7434-thread-1-processing-n:127.0.0.1:57341_) [n:127.0.0.1:57341_ c:control_collection   x:collection1] o.a.s.c.c.ZkStateReader Load collection config from:/collections/control_collection
   [junit4]   2> 1810737 INFO  (coreLoadExecutor-7434-thread-1-processing-n:127.0.0.1:57341_) [n:127.0.0.1:57341_ c:control_collection   x:collection1] o.a.s.c.c.ZkStateReader path=/collections/control_collection configName=conf1 specified config exists in ZooKeeper
   [junit4]   2> 1810737 INFO  (coreLoadExecutor-7434-thread-1-processing-n:127.0.0.1:57341_) [n:127.0.0.1:57341_ c:control_collection   x:collection1] o.a.s.c.SolrResourceLoader new SolrResourceLoader for directory: '/export/home/jenkins/workspace/Lucene-Solr-5.x-Solaris/solr/build/solr-core/test/J1/temp/solr.cloud.AsyncMigrateRouteKeyTest_717A8277658DBF74-001/control-001/cores/collection1/'
   [junit4]   2> 1810737 INFO  (coreLoadExecutor-7434-thread-1-processing-n:127.0.0.1:57341_) [n:127.0.0.1:57341_ c:control_collection   x:collection1] o.a.s.c.SolrResourceLoader JNDI not configured for solr (NoInitialContextEx)
   [junit4]   2> 1810737 INFO  (coreLoadExecutor-7434-thread-1-processing-n:127.0.0.1:57341_) [n:127.0.0.1:57341_ c:control_collection   x:collection1] o.a.s.c.SolrResourceLoader solr home defaulted to 'solr/' (could not find system property or JNDI)
   [junit4]   2> 1811394 INFO  (coreLoadExecutor-7434-thread-1-processing-n:127.0.0.1:57341_) [n:127.0.0.1:57341_ c:control_collection   x:collection1] o.a.s.c.Config loaded config solrconfig.xml with version 0 
   [junit4]   2> 1811403 INFO  (coreLoadExecutor-7434-thread-1-processing-n:127.0.0.1:57341_) [n:127.0.0.1:57341_ c:control_collection   x:collection1] o.a.s.c.SolrConfig current version of requestparams : -1
   [junit4]   2> 1811408 INFO  (coreLoadExecutor-7434-thread-1-processing-n:127.0.0.1:57341_) [n:127.0.0.1:57341_ c:control_collection   x:collection1] o.a.s.c.SolrConfig Using Lucene MatchVersion: 5.4.0
   [junit4]   2> 1811435 INFO  (coreLoadExecutor-7434-thread-1-processing-n:127.0.0.1:57341_) [n:127.0.0.1:57341_ c:control_collection   x:collection1] o.a.s.c.Config Loaded SolrConfig: solrconfig.xml
   [junit4]   2> 1811437 INFO  (coreLoadExecutor-7434-thread-1-processing-n:127.0.0.1:57341_) [n:127.0.0.1:57341_ c:control_collection   x:collection1] o.a.s.s.IndexSchema Reading Solr Schema from /configs/conf1/schema.xml
   [junit4]   2> 1811441 INFO  (coreLoadExecutor-7434-thread-1-processing-n:127.0.0.1:57341_) [n:127.0.0.1:57341_ c:control_collection   x:collection1] o.a.s.s.IndexSchema [collection1] Schema name=test
   [junit4]   2> 1811523 INFO  (coreLoadExecutor-7434-thread-1-processing-n:127.0.0.1:57341_) [n:127.0.0.1:57341_ c:control_collection   x:collection1] o.a.s.s.IndexSchema default search field in schema is text
   [junit4]   2> 1811526 INFO  (coreLoadExecutor-7434-thread-1-processing-n:127.0.0.1:57341_) [n:127.0.0.1:57341_ c:control_collection   x:collection1] o.a.s.s.IndexSchema unique key field: id
   [junit4]   2> 1811529 INFO  (coreLoadExecutor-7434-thread-1-processing-n:127.0.0.1:57341_) [n:127.0.0.1:57341_ c:control_collection   x:collection1] o.a.s.s.FileExchangeRateProvider Reloading exchange rates from file currency.xml
   [junit4]   2> 1811533 INFO  (coreLoadExecutor-7434-thread-1-processing-n:127.0.0.1:57341_) [n:127.0.0.1:57341_ c:control_collection   x:collection1] o.a.s.s.FileExchangeRateProvider Reloading exchange rates from file currency.xml
   [junit4]   2> 1811583 INFO  (coreLoadExecutor-7434-thread-1-processing-n:127.0.0.1:57341_) [n:127.0.0.1:57341_ c:control_collection   x:collection1] o.a.s.c.ConfigSetProperties Did not find ConfigSet properties, assuming default properties: Can't find resource 'configsetprops.json' in classpath or '/configs/conf1', cwd=/export/home/jenkins/workspace/Lucene-Solr-5.x-Solaris/solr/build/solr-core/test/J1
   [junit4]   2> 1811583 INFO  (coreLoadExecutor-7434-thread-1-processing-n:127.0.0.1:57341_) [n:127.0.0.1:57341_ c:control_collection   x:collection1] o.a.s.c.CoreContainer Creating SolrCore 'collection1' using configuration from collection control_collection
   [junit4]   2> 1811583 INFO  (coreLoadExecutor-7434-thread-1-processing-n:127.0.0.1:57341_) [n:127.0.0.1:57341_ c:control_collection s:shard1 r:core_node1 x:collection1] o.a.s.c.SolrCore org.apache.solr.core.MockDirectoryFactory
   [junit4]   2> 1811583 INFO  (coreLoadExecutor-7434-thread-1-processing-n:127.0.0.1:57341_) [n:127.0.0.1:57341_ c:control_collection s:shard1 r:core_node1 x:collection1] o.a.s.c.SolrCore [[collection1] ] Opening new SolrCore at [/export/home/jenkins/workspace/Lucene-Solr-5.x-Solaris/solr/build/solr-core/test/J1/temp/solr.cloud.AsyncMigrateRouteKeyTest_717A8277658DBF74-001/control-001/cores/collection1/], dataDir=[null]
   [junit4]   2> 1811584 INFO  (coreLoadExecutor-7434-thread-1-processing-n:127.0.0.1:57341_) [n:127.0.0.1:57341_ c:control_collection s:shard1 r:core_node1 x:collection1] o.a.s.c.JmxMonitoredMap JMX monitoring is enabled. Adding Solr mbeans to JMX Server: com.sun.jmx.mbeanserver.JmxMBeanServer@36c8a465
   [junit4]   2> 1811584 INFO  (coreLoadExecutor-7434-thread-1-processing-n:127.0.0.1:57341_) [n:127.0.0.1:57341_ c:control_collection s:shard1 r:core_node1 x:collection1] o.a.s.c.CachingDirectoryFactory return new directory for /export/home/jenkins/workspace/Lucene-Solr-5.x-Solaris/solr/build/solr-core/test/J1/temp/solr.cloud.AsyncMigrateRouteKeyTest_717A8277658DBF74-001/control-001/cores/collection1/data
   [junit4]   2> 1811584 INFO  (coreLoadExecutor-7434-thread-1-processing-n:127.0.0.1:57341_) [n:127.0.0.1:57341_ c:control_collection s:shard1 r:core_node1 x:collection1] o.a.s.c.SolrCore New index directory detected: old=null new=/export/home/jenkins/workspace/Lucene-Solr-5.x-Solaris/solr/build/solr-core/test/J1/temp/solr.cloud.AsyncMigrateRouteKeyTest_717A8277658DBF74-001/control-001/cores/collection1/data/index/
   [junit4]   2> 1811584 WARN  (coreLoadExecutor-7434-thread-1-processing-n:127.0.0.1:57341_) [n:127.0.0.1:57341_ c:control_collection s:shard1 r:core_node1 x:collection1] o.a.s.c.SolrCore [collection1] Solr index directory '/export/home/jenkins/workspace/Lucene-Solr-5.x-Solaris/solr/build/solr-core/test/J1/temp/solr.cloud.AsyncMigrateRouteKeyTest_717A8277658DBF74-001/control-001/cores/collection1/data/index' doesn't exist. Creating new index...
   [junit4]   2> 1811585 INFO  (coreLoadExecutor-7434-thread-1-processing-n:127.0.0.1:57341_) [n:127.0.0.1:57341_ c:control_collection s:shard1 r:core_node1 x:collection1] o.a.s.c.CachingDirectoryFactory return new directory for /export/home/jenkins/workspace/Lucene-Solr-5.x-Solaris/solr/build/solr-core/test/J1/temp/solr.cloud.AsyncMigrateRouteKeyTest_717A8277658DBF74-001/control-001/cores/collection1/data/index
   [junit4]   2> 1811585 INFO  (coreLoadExecutor-7434-thread-1-processing-n:127.0.0.1:57341_) [n:127.0.0.1:57341_ c:control_collection s:shard1 r:core_node1 x:collection1] o.a.s.u.RandomMergePolicy RandomMergePolicy wrapping class org.apache.lucene.index.LogDocMergePolicy: [LogDocMergePolicy: minMergeSize=1000, mergeFactor=44, maxMergeSize=9223372036854775807, maxMergeSizeForForcedMerge=9223372036854775807, calibrateSizeByDeletes=false, maxMergeDocs=2147483647, maxCFSSegmentSizeMB=8.796093022207999E12, noCFSRatio=0.6953794627350584]
   [junit4]   2> 1811586 INFO  (coreLoadExecutor-7434-thread-1-processing-n:127.0.0.1:57341_) [n:127.0.0.1:57341_ c:control_collection s:shard1 r:core_node1 x:collection1] o.a.s.c.SolrCore SolrDeletionPolicy.onCommit: commits: num=1
   [junit4]   2> 	commit{dir=MockDirectoryWrapper(RAMDirectory@49e1f6ff lockFactory=org.apache.lucene.store.SingleInstanceLockFactory@4eb305b9),segFN=segments_1,generation=1}
   [junit4]   2> 1811586 INFO  (coreLoadExecutor-7434-thread-1-processing-n:127.0.0.1:57341_) [n:127.0.0.1:57341_ c:control_collection s:shard1 r:core_node1 x:collection1] o.a.s.c.SolrCore newest commit generation = 1
   [junit4]   2> 1811588 INFO  (coreLoadExecutor-7434-thread-1-processing-n:127.0.0.1:57341_) [n:127.0.0.1:57341_ c:control_collection s:shard1 r:core_node1 x:collection1] o.a.s.u.p.UpdateRequestProcessorChain creating updateRequestProcessorChain "nodistrib"
   [junit4]   2> 1811589 INFO  (coreLoadExecutor-7434-thread-1-processing-n:127.0.0.1:57341_) [n:127.0.0.1:57341_ c:control_collection s:shard1 r:core_node1 x:collection1] o.a.s.u.p.UpdateRequestProcessorChain creating updateRequestProcessorChain "dedupe"
   [junit4]   2> 1811589 INFO  (coreLoadExecutor-7434-thread-1-processing-n:127.0.0.1:57341_) [n:127.0.0.1:57341_ c:control_collection s:shard1 r:core_node1 x:collection1] o.a.s.u.p.UpdateRequestProcessorChain inserting DistributedUpdateProcessorFactory into updateRequestProcessorChain "dedupe"
   [junit4]   2> 1811589 INFO  (coreLoadExecutor-7434-thread-1-processing-n:127.0.0.1:57341_) [n:127.0.0.1:57341_ c:control_collection s:shard1 r:core_node1 x:collection1] o.a.s.u.p.UpdateRequestProcessorChain creating updateRequestProcessorChain "stored_sig"
   [junit4]   2> 1811589 INFO  (coreLoadExecutor-7434-thread-1-processing-n:127.0.0.1:57341_) [n:127.0.0.1:57341_ c:control_collection s:shard1 r:core_node1 x:collection1] o.a.s.u.p.UpdateRequestProcessorChain inserting DistributedUpdateProcessorFactory into updateRequestProcessorChain "stored_sig"
   [junit4]   2> 1811589 INFO  (coreLoadExecutor-7434-thread-1-processing-n:127.0.0.1:57341_) [n:127.0.0.1:57341_ c:control_collection s:shard1 r:core_node1 x:collection1] o.a.s.u.p.UpdateRequestProcessorChain creating updateRequestProcessorChain "distrib-dup-test-chain-explicit"
   [junit4]   2> 1811589 INFO  (coreLoadExecutor-7434-thread-1-processing-n:127.0.0.1:57341_) [n:127.0.0.1:57341_ c:control_collection s:shard1 r:core_node1 x:collection1] o.a.s.u.p.UpdateRequestProcessorChain creating updateRequestProcessorChain "distrib-dup-test-chain-implicit"
   [junit4]   2> 1811589 INFO  (coreLoadExecutor-7434-thread-1-processing-n:127.0.0.1:57341_) [n:127.0.0.1:57341_ c:control_collection s:shard1 r:core_node1 x:collection1] o.a.s.u.p.UpdateRequestProcessorChain inserting DistributedUpdateProcessorFactory into updateRequestProcessorChain "distrib-dup-test-chain-implicit"
   [junit4]   2> 1811589 INFO  (coreLoadExecutor-7434-thread-1-processing-n:127.0.0.1:57341_) [n:127.0.0.1:57341_ c:control_collection s:shard1 r:core_node1 x:collection1] o.a.s.c.SolrCore no updateRequestProcessorChain defined as default, creating implicit default
   [junit4]   2> 1811590 WARN  (coreLoadExecutor-7434-thread-1-processing-n:127.0.0.1:57341_) [n:127.0.0.1:57341_ c:control_collection s:shard1 r:core_node1 x:collection1] o.a.s.c.RequestHandlers INVALID paramSet a in requestHandler {type = requestHandler,name = /dump,class = DumpRequestHandler,args = {defaults={a=A,b=B}}}
   [junit4]   2> 1811590 INFO  (OldIndexDirectoryCleanupThreadForCore-collection1) [n:127.0.0.1:57341_ c:control_collection s:shard1 r:core_node1 x:collection1] o.a.s.c.SolrCore Looking for old index directories to cleanup for core collection1 in /export/home/jenkins/workspace/Lucene-Solr-5.x-Solaris/solr/build/solr-core/test/J1/temp/solr.cloud.AsyncMigrateRouteKeyTest_717A8277658DBF74-001/control-001/cores/collection1/data/
   [junit4]   2> 1811591 WARN  (OldIndexDirectoryCleanupThreadForCore-collection1) [n:127.0.0.1:57341_ c:control_collection s:shard1 r:core_node1 x:collection1] o.a.s.c.DirectoryFactory /export/home/jenkins/workspace/Lucene-Solr-5.x-Solaris/solr/build/solr-core/test/J1/temp/solr.cloud.AsyncMigrateRouteKeyTest_717A8277658DBF74-001/control-001/cores/collection1/data/ does not point to a valid data directory; skipping clean-up of old index directories.
   [junit4]   2> 1811599 INFO  (coreLoadExecutor-7434-thread-1-processing-n:127.0.0.1:57341_) [n:127.0.0.1:57341_ c:control_collection s:shard1 r:core_node1 x:collection1] o.a.s.h.l.XMLLoader xsltCacheLifetimeSeconds=60
   [junit4]   2> 1811600 INFO  (coreLoadExecutor-7434-thread-1-processing-n:127.0.0.1:57341_) [n:127.0.0.1:57341_ c:control_collection s:shard1 r:core_node1 x:collection1] o.a.s.h.l.XMLLoader xsltCacheLifetimeSeconds=60
   [junit4]   2> 1811602 INFO  (coreLoadExecutor-7434-thread-1-processing-n:127.0.0.1:57341_) [n:127.0.0.1:57341_ c:control_collection s:shard1 r:core_node1 x:collection1] o.a.s.h.l.XMLLoader xsltCacheLifetimeSeconds=60
   [junit4]   2> 1811603 INFO  (coreLoadExecutor-7434-thread-1-processing-n:127.0.0.1:57341_) [n:127.0.0.1:57341_ c:control_collection s:shard1 r:core_node1 x:collection1] o.a.s.h.l.XMLLoader xsltCacheLifetimeSeconds=60
   [junit4]   2> 1811606 INFO  (coreLoadExecutor-7434-thread-1-processing-n:127.0.0.1:57341_) [n:127.0.0.1:57341_ c:control_collection s:shard1 r:core_node1 x:collection1] o.a.s.c.RequestHandlers Registered paths: /admin/mbeans,standard,/dump,/update/csv,/update/json/docs,/admin/luke,/admin/segments,/get,/admin/system,/replication,/admin/properties,/config,/schema,/admin/plugins,/admin/logging,/update/json,/admin/threads,/admin/ping,/update,/admin/file
   [junit4]   2> 1811607 INFO  (coreLoadExecutor-7434-thread-1-processing-n:127.0.0.1:57341_) [n:127.0.0.1:57341_ c:control_collection s:shard1 r:core_node1 x:collection1] o.a.s.c.SolrCore Using default statsCache cache: org.apache.solr.search.stats.LocalStatsCache
   [junit4]   2> 1811607 INFO  (coreLoadExecutor-7434-thread-1-processing-n:127.0.0.1:57341_) [n:127.0.0.1:57341_ c:control_collection s:shard1 r:core_node1 x:collection1] o.a.s.u.UpdateHandler Using UpdateLog implementation: org.apache.solr.update.UpdateLog
   [junit4]   2> 1811607 INFO  (coreLoadExecutor-7434-thread-1-processing-n:127.0.0.1:57341_) [n:127.0.0.1:57341_ c:control_collection s:shard1 r:core_node1 x:collection1] o.a.s.u.UpdateLog Initializing UpdateLog: dataDir= defaultSyncLevel=FLUSH numRecordsToKeep=100 maxNumLogsToKeep=10 numVersionBuckets=65536
   [junit4]   2> 1811616 INFO  (coreLoadExecutor-7434-thread-1-processing-n:127.0.0.1:57341_) [n:127.0.0.1:57341_ c:control_collection s:shard1 r:core_node1 x:collection1] o.a.s.c.SolrCore Hard AutoCommit: disabled
   [junit4]   2> 1811616 INFO  (coreLoadExecutor-7434-thread-1-processing-n:127.0.0.1:57341_) [n:127.0.0.1:57341_ c:control_collection s:shard1 r:core_node1 x:collection1] o.a.s.c.SolrCore Soft AutoCommit: disabled
   [junit4]   2> 1811617 INFO  (coreLoadExecutor-7434-thread-1-processing-n:127.0.0.1:57341_) [n:127.0.0.1:57341_ c:control_collection s:shard1 r:core_node1 x:collection1] o.a.s.u.RandomMergePolicy RandomMergePolicy wrapping class org.apache.lucene.index.TieredMergePolicy: [TieredMergePolicy: maxMergeAtOnce=39, maxMergeAtOnceExplicit=36, maxMergedSegmentMB=74.119140625, floorSegmentMB=1.2646484375, forceMergeDeletesPctAllowed=27.174002530567133, segmentsPerTier=40.0, maxCFSSegmentSizeMB=8.796093022207999E12, noCFSRatio=1.0
   [junit4]   2> 1811617 INFO  (coreLoadExecutor-7434-thread-1-processing-n:127.0.0.1:57341_) [n:127.0.0.1:57341_ c:control_collection s:shard1 r:core_node1 x:collection1] o.a.s.c.SolrCore SolrDeletionPolicy.onInit: commits: num=1
   [junit4]   2> 	commit{dir=MockDirectoryWrapper(RAMDirectory@49e1f6ff lockFactory=org.apache.lucene.store.SingleInstanceLockFactory@4eb305b9),segFN=segments_1,generation=1}
   [junit4]   2> 1811617 INFO  (coreLoadExecutor-7434-thread-1-processing-n:127.0.0.1:57341_) [n:127.0.0.1:57341_ c:control_collection s:shard1 r:core_node1 x:collection1] o.a.s.c.SolrCore newest commit generation = 1
   [junit4]   2> 1811617 INFO  (coreLoadExecutor-7434-thread-1-processing-n:127.0.0.1:57341_) [n:127.0.0.1:57341_ c:control_collection s:shard1 r:core_node1 x:collection1] o.a.s.s.SolrIndexSearcher Opening Searcher@158207a4[collection1] main
   [junit4]   2> 1811617 INFO  (coreLoadExecutor-7434-thread-1-processing-n:127.0.0.1:57341_) [n:127.0.0.1:57341_ c:control_collection s:shard1 r:core_node1 x:collection1] o.a.s.c.c.ZkStateReader Load collection config from:/collections/control_collection
   [junit4]   2> 1811621 INFO  (coreLoadExecutor-7434-thread-1-processing-n:127.0.0.1:57341_) [n:127.0.0.1:57341_ c:control_collection s:shard1 r:core_node1 x:collection1] o.a.s.c.c.ZkStateReader path=/collections/control_collection configName=conf1 specified config exists in ZooKeeper
   [junit4]   2> 1811621 INFO  (coreLoadExecutor-7434-thread-1-processing-n:127.0.0.1:57341_) [n:127.0.0.1:57341_ c:control_collection s:shard1 r:core_node1 x:collection1] o.a.s.r.ManagedResourceStorage Setting up ZooKeeper-based storage for the RestManager with znodeBase: /configs/conf1
   [junit4]   2> 1811622 INFO  (coreLoadExecutor-7434-thread-1-processing-n:127.0.0.1:57341_) [n:127.0.0.1:57341_ c:control_collection s:shard1 r:core_node1 x:collection1] o.a.s.r.ManagedResourceStorage Configured ZooKeeperStorageIO with znodeBase: /configs/conf1
   [junit4]   2> 1811622 INFO  (coreLoadExecutor-7434-thread-1-processing-n:127.0.0.1:57341_) [n:127.0.0.1:57341_ c:control_collection s:shard1 r:core_node1 x:collection1] o.a.s.r.RestManager Initializing RestManager with initArgs: {}
   [junit4]   2> 1811623 INFO  (coreLoadExecutor-7434-thread-1-processing-n:127.0.0.1:57341_) [n:127.0.0.1:57341_ c:control_collection s:shard1 r:core_node1 x:collection1] o.a.s.r.ManagedResourceStorage Reading _rest_managed.json using ZooKeeperStorageIO:path=/configs/conf1
   [junit4]   2> 1811630 INFO  (coreLoadExecutor-7434-thread-1-processing-n:127.0.0.1:57341_) [n:127.0.0.1:57341_ c:control_collection s:shard1 r:core_node1 x:collection1] o.a.s.r.ManagedResourceStorage No data found for znode /configs/conf1/_rest_managed.json
   [junit4]   2> 1811631 INFO  (coreLoadExecutor-7434-thread-1-processing-n:127.0.0.1:57341_) [n:127.0.0.1:57341_ c:control_collection s:shard1 r:core_node1 x:collection1] o.a.s.r.ManagedResourceStorage Loaded null at path _rest_managed.json using ZooKeeperStorageIO:path=/configs/conf1
   [junit4]   2> 1811631 INFO  (coreLoadExecutor-7434-thread-1-processing-n:127.0.0.1:57341_) [n:127.0.0.1:57341_ c:control_collection s:shard1 r:core_node1 x:collection1] o.a.s.r.RestManager Initializing 0 registered ManagedResources
   [junit4]   2> 1811632 INFO  (coreLoadExecutor-7434-thread-1-processing-n:127.0.0.1:57341_) [n:127.0.0.1:57341_ c:control_collection s:shard1 r:core_node1 x:collection1] o.a.s.h.ReplicationHandler Commits will be reserved for  10000
   [junit4]   2> 1811634 INFO  (searcherExecutor-7435-thread-1-processing-n:127.0.0.1:57341_ x:collection1 s:shard1 c:control_collection r:core_node1) [n:127.0.0.1:57341_ c:control_collection s:shard1 r:core_node1 x:collection1] o.a.s.c.SolrCore [collection1] Registered new searcher Searcher@158207a4[collection1] main{ExitableDirectoryReader(UninvertingDirectoryReader())}
   [junit4]   2> 1811652 INFO  (coreLoadExecutor-7434-thread-1-processing-n:127.0.0.1:57341_) [n:127.0.0.1:57341_ c:control_collection s:shard1 r:core_node1 x:collection1] o.a.s.u.UpdateLog Looking up max value of version field to seed version buckets
   [junit4]   2> 1811652 INFO  (coreLoadExecutor-7434-thread-1-processing-n:127.0.0.1:57341_) [n:127.0.0.1:57341_ c:control_collection s:shard1 r:core_node1 x:collection1] o.a.s.u.VersionInfo Refreshing highest value of _version_ for 65536 version buckets from index
   [junit4]   2> 1811652 INFO  (coreLoadExecutor-7434-thread-1-processing-n:127.0.0.1:57341_) [n:127.0.0.1:57341_ c:control_collection s:shard1 r:core_node1 x:collection1] o.a.s.u.VersionInfo No terms found for _version_, cannot seed version bucket highest value from index
   [junit4]   2> 1811652 INFO  (coreLoadExecutor-7434-thread-1-processing-n:127.0.0.1:57341_) [n:127.0.0.1:57341_ c:control_collection s:shard1 r:core_node1 x:collection1] o.a.s.u.UpdateLog Could not find max version in index or recent updates, using new clock 1517058516283555840
   [junit4]   2> 1811654 INFO  (coreLoadExecutor-7434-thread-1-processing-n:127.0.0.1:57341_) [n:127.0.0.1:57341_ c:control_collection s:shard1 r:core_node1 x:collection1] o.a.s.u.UpdateLog Took 1.0ms to seed version buckets with highest version 1517058516283555840
   [junit4]   2> 1811654 INFO  (coreLoadExecutor-7434-thread-1-processing-n:127.0.0.1:57341_) [n:127.0.0.1:57341_ c:control_collection s:shard1 r:core_node1 x:collection1] o.a.s.c.ZkController watch zkdir /configs/conf1
   [junit4]   2> 1811654 INFO  (coreLoadExecutor-7434-thread-1-processing-n:127.0.0.1:57341_) [n:127.0.0.1:57341_ c:control_collection s:shard1 r:core_node1 x:collection1] o.a.s.c.CoreContainer registering core: collection1
   [junit4]   2> 1811655 INFO  (coreZkRegister-7428-thread-1-processing-n:127.0.0.1:57341_ x:collection1 s:shard1 c:control_collection r:core_node1) [n:127.0.0.1:57341_ c:control_collection s:shard1 r:core_node1 x:collection1] o.a.s.c.ZkController Register replica - core:collection1 address:http://127.0.0.1:57341 collection:control_collection shard:shard1
   [junit4]   2> 1811657 INFO  (coreZkRegister-7428-thread-1-processing-n:127.0.0.1:57341_ x:collection1 s:shard1 c:control_collection r:core_node1) [n:127.0.0.1:57341_ c:control_collection s:shard1 r:core_node1 x:collection1] o.a.s.c.c.SolrZkClient makePath: /collections/control_collection/leader_elect/shard1/election
   [junit4]   2> 1811717 INFO  (coreZkRegister-7428-thread-1-processing-n:127.0.0.1:57341_ x:collection1 s:shard1 c:control_collection r:core_node1) [n:127.0.0.1:57341_ c:control_collection s:shard1 r:core_node1 x:collection1] o.a.s.c.LeaderElector Joined leadership election with path: /collections/control_collection/leader_elect/shard1/election/94816157108076548-core_node1-n_0000000000
   [junit4]   2> 1811718 INFO  (coreZkRegister-7428-thread-1-processing-n:127.0.0.1:57341_ x:collection1 s:shard1 c:control_collection r:core_node1) [n:127.0.0.1:57341_ c:control_collection s:shard1 r:core_node1 x:collection1] o.a.s.c.ShardLeaderElectionContext Running the leader process for shard shard1
   [junit4]   2> 1811722 INFO  (coreZkRegister-7428-thread-1-processing-n:127.0.0.1:57341_ x:collection1 s:shard1 c:control_collection r:core_node1) [n:127.0.0.1:57341_ c:control_collection s:shard1 r:core_node1 x:collection1] o.a.s.c.ShardLeaderElectionContext Enough replicas found to continue.
   [junit4]   2> 1811722 INFO  (coreZkRegister-7428-thread-1-processing-n:127.0.0.1:57341_ x:collection1 s:shard1 c:control_collection r:core_node1) [n:127.0.0.1:57341_ c:control_collection s:shard1 r:core_node1 x:collection1] o.a.s.c.ShardLeaderElectionContext I may be the new leader - try and sync
   [junit4]   2> 1811722 INFO  (coreZkRegister-7428-thread-1-processing-n:127.0.0.1:57341_ x:collection1 s:shard1 c:control_collection r:core_node1) [n:127.0.0.1:57341_ c:control_collection s:shard1 r:core_node1 x:collection1] o.a.s.c.SyncStrategy Sync replicas to http://127.0.0.1:57341/collection1/
   [junit4]   2> 1811722 INFO  (coreZkRegister-7428-thread-1-processing-n:127.0.0.1:57341_ x:collection1 s:shard1 c:control_collection r:core_node1) [n:127.0.0.1:57341_ c:control_collection s:shard1 r:core_node1 x:collection1] o.a.s.c.SyncStrategy Sync Success - now sync replicas to me
   [junit4]   2> 1811722 INFO  (coreZkRegister-7428-thread-1-processing-n:127.0.0.1:57341_ x:collection1 s:shard1 c:control_collection r:core_node1) [n:127.0.0.1:57341_ c:control_collection s:shard1 r:core_node1 x:collection1] o.a.s.c.SyncStrategy http://127.0.0.1:57341/collection1/ has no replicas
   [junit4]   2> 1811722 INFO  (coreZkRegister-7428-thread-1-processing-n:127.0.0.1:57341_ x:collection1 s:shard1 c:control_collection r:core_node1) [n:127.0.0.1:57341_ c:control_collection s:shard1 r:core_node1 x:collection1] o.a.s.c.ShardLeaderElectionContext I am the new leader: http://127.0.0.1:57341/collection1/ shard1
   [junit4]   2> 1811723 INFO  (coreZkRegister-7428-thread-1-processing-n:127.0.0.1:57341_ x:collection1 s:shard1 c:control_collection r:core_node1) [n:127.0.0.1:57341_ c:control_collection s:shard1 r:core_node1 x:collection1] o.a.s.c.c.SolrZkClient makePath: /collections/control_collection/leaders/shard1
   [junit4]   2> 1811725 INFO  (OverseerStateUpdate-94816157108076548-127.0.0.1:57341_-n_0000000000) [n:127.0.0.1:57341_    ] o.a.s.c.Overseer processMessage: queueSize: 1, message = {
   [junit4]   2>   "operation":"leader",
   [junit4]   2>   "shard":"shard1",
   [junit4]   2>   "collection":"control_collection"} current state version: 1
   [junit4]   2> 1811731 INFO  (TEST-AsyncMigrateRouteKeyTest.test-seed#[717A8277658DBF74]) [    ] o.a.s.c.c.SolrZkClient Using default ZkCredentialsProvider
   [junit4]   2> 1811732 INFO  (TEST-AsyncMigrateRouteKeyTest.test-seed#[717A8277658DBF74]) [    ] o.a.s.c.c.ConnectionManager Waiting for client to connect to ZooKeeper
   [junit4]   2> 1811733 INFO  (zkCallback-2447-thread-1) [    ] o.a.s.c.c.ConnectionManager Watcher org.apache.solr.common.cloud.ConnectionManager@176b3278 name:ZooKeeperConnection Watcher:127.0.0.1:53686/solr got event WatchedEvent state:SyncConnected type:None path:null path:null type:None
   [junit4]   2> 1811735 INFO  (coreZkRegister-7428-thread-1-processing-n:127.0.0.1:57341_ x:collection1 s:shard1 c:control_collection r:core_node1) [n:127.0.0.1:57341_ c:control_collection s:shard1 r:core_node1 x:collection1] o.a.s.c.ShardLeaderElectionContextBase Creating leader registration node
   [junit4]   2> 1811735 INFO  (zkCallback-2445-thread-1-processing-n:127.0.0.1:57341_) [n:127.0.0.1:57341_    ] o.a.s.c.c.ZkStateReader A cluster state change: WatchedEvent state:SyncConnected type:NodeDataChanged path:/clusterstate.json, has occurred - updating... (live nodes size: 1)
   [junit4]   2> 1811737 INFO  (TEST-AsyncMigrateRouteKeyTest.test-seed#[717A8277658DBF74]) [    ] o.a.s.c.c.ConnectionManager Client is connected to ZooKeeper
   [junit4]   2> 1811738 INFO  (TEST-AsyncMigrateRouteKeyTest.test-seed#[717A8277658DBF74]) [    ] o.a.s.c.c.SolrZkClient Using default ZkACLProvider
   [junit4]   2> 1811738 INFO  (TEST-AsyncMigrateRouteKeyTest.test-seed#[717A8277658DBF74]) [    ] o.a.s.c.c.ZkStateReader Updating cluster state from ZooKeeper... 
   [junit4]   2> 1811741 INFO  (TEST-AsyncMigrateRouteKeyTest.test-seed#[717A8277658DBF74]) [    ] o.a.s.c.ChaosMonkey monkey: init - expire sessions:false cause connection loss:false
   [junit4]   2> 1811759 INFO  (OverseerStateUpdate-94816157108076548-127.0.0.1:57341_-n_0000000000) [n:127.0.0.1:57341_    ] o.a.s.c.Overseer processMessage: queueSize: 2, message = {
   [junit4]   2>   "operation":"state",
   [junit4]   2>   "state":"active",
   [junit4]   2>   "shard":"shard1",
   [junit4]   2>   "collection":"control_collection",
   [junit4]   2>   "base_url":"http://127.0.0.1:57341",
   [junit4]   2>   "node_name":"127.0.0.1:57341_",
   [junit4]   2>   "core_node_name":"core_node1",
   [junit4]   2>   "core":"collection1"} current state version: 2
   [junit4]   2> 1811759 INFO  (OverseerStateUpdate-94816157108076548-127.0.0.1:57341_-n_0000000000) [n:127.0.0.1:57341_    ] o.a.s.c.o.ReplicaMutator Update state numShards=null message={
   [junit4]   2>   "operation":"state",
   [junit4]   2>   "state":"active",
   [junit4]   2>   "shard":"shard1",
   [junit4]   2>   "collection":"control_collection",
   [junit4]   2>   "base_url":"http://127.0.0.1:57341",
   [junit4]   2>   "node_name":"127.0.0.1:57341_",
   [junit4]   2>   "core_node_name":"core_node1",
   [junit4]   2>   "core":"collection1"}
   [junit4]   2> 1811762 INFO  (OverseerStateUpdate-94816157108076548-127.0.0.1:57341_-n_0000000000) [n:127.0.0.1:57341_    ] o.a.s.c.Overseer processMessage: queueSize: 2, message = {
   [junit4]   2>   "operation":"leader",
   [junit4]   2>   "shard":"shard1",
   [junit4]   2>   "collection":"control_collection",
   [junit4]   2>   "base_url":"http://127.0.0.1:57341",
   [junit4]   2>   "core":"collection1"} current state version: 2
   [junit4]   2> 1811865 INFO  (zkCallback-2445-thread-1-processing-n:127.0.0.1:57341_) [n:127.0.0.1:57341_    ] o.a.s.c.c.ZkStateReader A cluster state change: WatchedEvent state:SyncConnected type:NodeDataChanged path:/clusterstate.json, has occurred - updating... (live nodes size: 1)
   [junit4]   2> 1811865 INFO  (zkCallback-2447-thread-1) [    ] o.a.s.c.c.ZkStateReader A cluster state change: WatchedEvent state:SyncConnected type:NodeDataChanged path:/clusterstate.json, has occurred - updating... (live nodes size: 1)
   [junit4]   2> 1811909 INFO  (coreZkRegister-7428-thread-1-processing-n:127.0.0.1:57341_ x:collection1 s:shard1 c:control_collection r:core_node1) [n:127.0.0.1:57341_ c:control_collection s:shard1 r:core_node1 x:collection1] o.a.s.c.ZkController We are http://127.0.0.1:57341/collection1/ and leader is http://127.0.0.1:57341/collection1/
   [junit4]   2> 1811909 INFO  (coreZkRegister-7428-thread-1-processing-n:127.0.0.1:57341_ x:collection1 s:shard1 c:control_collection r:core_node1) [n:127.0.0.1:57341_ c:control_collection s:shard1 r:core_node1 x:collection1] o.a.s.c.ZkController No LogReplay needed for core=collection1 baseURL=http://127.0.0.1:57341
   [junit4]   2> 1811909 INFO  (coreZkRegister-7428-thread-1-processing-n:127.0.0.1:57341_ x:collection1 s:shard1 c:control_collection r:core_node1) [n:127.0.0.1:57341_ c:control_collection s:shard1 r:core_node1 x:collection1] o.a.s.c.ZkController I am the leader, no recovery necessary
   [junit4]   2> 1811909 INFO  (coreZkRegister-7428-thread-1-processing-n:127.0.0.1:57341_ x:collection1 s:shard1 c:control_collection r:core_node1) [n:127.0.0.1:57341_ c:control_collection s:shard1 r:core_node1 x:collection1] o.a.s.c.ZkController publishing state=active
   [junit4]   2> 1811909 INFO  (coreZkRegister-7428-thread-1-processing-n:127.0.0.1:57341_ x:collection1 s:shard1 c:control_collection r:core_node1) [n:127.0.0.1:57341_ c:control_collection s:shard1 r:core_node1 x:collection1] o.a.s.c.ZkController numShards not found on descriptor - reading it from system property
   [junit4]   2> 1811912 INFO  (OverseerStateUpdate-94816157108076548-127.0.0.1:57341_-n_0000000000) [n:127.0.0.1:57341_    ] o.a.s.c.Overseer processMessage: queueSize: 1, message = {
   [junit4]   2>   "core":"collection1",
   [junit4]   2>   "core_node_name":"core_node1",
   [junit4]   2>   "roles":null,
   [junit4]   2>   "base_url":"http://127.0.0.1:57341",
   [junit4]   2>   "node_name":"127.0.0.1:57341_",
   [junit4]   2>   "numShards":"2",
   [junit4]   2>   "state":"active",
   [junit4]   2>   "shard":"shard1",
   [junit4]   2>   "collection":"control_collection",
   [junit4]   2>   "operation":"state"} current state version: 3
   [junit4]   2> 1811914 INFO  (OverseerStateUpdate-94816157108076548-127.0.0.1:57341_-n_0000000000) [n:127.0.0.1:57341_    ] o.a.s.c.o.ReplicaMutator Update state numShards=2 message={
   [junit4]   2>   "core":"collection1",
   [junit4]   2>   "core_node_name":"core_node1",
   [junit4]   2>   "roles":null,
   [junit4]   2>   "base_url":"http://127.0.0.1:57341",
   [junit4]   2>   "node_name":"127.0.0.1:57341_",
   [junit4]   2>   "numShards":"2",
   [junit4]   2>   "state":"active",
   [junit4]   2>   "shard":"shard1",
   [junit4]   2>   "collection":"control_collection",
   [junit4]   2>   "operation":"state"}
   [junit4]   2> 1812018 INFO  (zkCallback-2445-thread-1-processing-n:127.0.0.1:57341_) [n:127.0.0.1:57341_    ] o.a.s.c.c.ZkStateReader A cluster state change: WatchedEvent state:SyncConnected type:NodeDataChanged path:/clusterstate.json, has occurred - updating... (live nodes size: 1)
   [junit4]   2> 1812018 INFO  (zkCallback-2447-thread-1) [    ] o.a.s.c.c.ZkStateReader A cluster state change: WatchedEvent state:SyncConnected type:NodeDataChanged path:/clusterstate.json, has occurred - updating... (live nodes size: 1)
   [junit4]   2> 1812096 INFO  (TEST-AsyncMigrateRouteKeyTest.test-seed#[717A8277658DBF74]) [    ] o.a.s.SolrTestCaseJ4 Writing core.properties file to /export/home/jenkins/workspace/Lucene-Solr-5.x-Solaris/solr/build/solr-core/test/J1/temp/solr.cloud.AsyncMigrateRouteKeyTest_717A8277658DBF74-001/shard-1-001/cores/collection1
   [junit4]   2> 1812097 INFO  (TEST-AsyncMigrateRouteKeyTest.test-seed#[717A8277658DBF74]) [    ] o.a.s.c.AbstractFullDistribZkTestBase create jetty 1 in directory /export/home/jenkins/workspace/Lucene-Solr-5.x-Solaris/solr/build/solr-core/test/J1/temp/solr.cloud.AsyncMigrateRouteKeyTest_717A8277658DBF74-001/shard-1-001
   [junit4]   2> 1812099 INFO  (TEST-AsyncMigrateRouteKeyTest.test-seed#[717A8277658DBF74]) [    ] o.e.j.s.Server jetty-9.2.13.v20150730
   [junit4]   2> 1812103 INFO  (TEST-AsyncMigrateRouteKeyTest.test-seed#[717A8277658DBF74]) [    ] o.e.j.s.h.ContextHandler Started o.e.j.s.ServletContextHandler@5f6bb34e{/,null,AVAILABLE}
   [junit4]   2> 1812104 INFO  (TEST-AsyncMigrateRouteKeyTest.test-seed#[717A8277658DBF74]) [    ] o.e.j.s.ServerConnector Started ServerConnector@152eb1f7{HTTP/1.1}{127.0.0.1:47631}
   [junit4]   2> 1812104 INFO  (TEST-AsyncMigrateRouteKeyTest.test-seed#[717A8277658DBF74]) [    ] o.e.j.s.Server Started @1816082ms
   [junit4]   2> 1812104 INFO  (TEST-AsyncMigrateRouteKeyTest.test-seed#[717A8277658DBF74]) [    ] o.a.s.c.s.e.JettySolrRunner Jetty properties: {solr.data.dir=/export/home/jenkins/workspace/Lucene-Solr-5.x-Solaris/solr/build/solr-core/test/J1/temp/solr.cloud.AsyncMigrateRouteKeyTest_717A8277658DBF74-001/tempDir-001/jetty1, solrconfig=solrconfig.xml, hostContext=/, hostPort=47631, coreRootDirectory=/export/home/jenkins/workspace/Lucene-Solr-5.x-Solaris/solr/build/solr-core/test/J1/temp/solr.cloud.AsyncMigrateRouteKeyTest_717A8277658DBF74-001/shard-1-001/cores}
   [junit4]   2> 1812104 INFO  (TEST-AsyncMigrateRouteKeyTest.test-seed#[717A8277658DBF74]) [    ] o.a.s.s.SolrDispatchFilter SolrDispatchFilter.init(): sun.misc.Launcher$AppClassLoader@659e0bfd
   [junit4]   2> 1812105 INFO  (TEST-AsyncMigrateRouteKeyTest.test-seed#[717A8277658DBF74]) [    ] o.a.s.c.SolrResourceLoader new SolrResourceLoader for directory: '/export/home/jenkins/workspace/Lucene-Solr-5.x-Solaris/solr/build/solr-core/test/J1/temp/solr.cloud.AsyncMigrateRouteKeyTest_717A8277658DBF74-001/shard-1-001/'
   [junit4]   2> 1812105 INFO  (TEST-AsyncMigrateRouteKeyTest.test-seed#[717A8277658DBF74]) [    ] o.a.s.c.SolrResourceLoader JNDI not configured for solr (NoInitialContextEx)
   [junit4]   2> 1812105 INFO  (TEST-AsyncMigrateRouteKeyTest.test-seed#[717A8277658DBF74]) [    ] o.a.s.c.SolrResourceLoader solr home defaulted to 'solr/' (could not find system property or JNDI)
   [junit4]   2> 1812176 INFO  (TEST-AsyncMigrateRouteKeyTest.test-seed#[717A8277658DBF74]) [    ] o.a.s.c.c.SolrZkClient Using default ZkCredentialsProvider
   [junit4]   2> 1812177 INFO  (TEST-AsyncMigrateRouteKeyTest.test-seed#[717A8277658DBF74]) [    ] o.a.s.c.c.ConnectionManager Waiting for client to connect to ZooKeeper
   [junit4]   2> 1812179 INFO  (zkCallback-2448-thread-1) [    ] o.a.s.c.c.ConnectionManager Watcher org.apache.solr.common.cloud.ConnectionManager@44b5c392 name:ZooKeeperConnection Watcher:127.0.0.1:53686/solr got event WatchedEvent state:SyncConnected type:None path:null path:null type:None
   [junit4]   2> 1812179 INFO  (TEST-AsyncMigrateRouteKeyTest.test-seed#[717A8277658DBF74]) [    ] o.a.s.c.c.ConnectionManager Client is connected to ZooKeeper
   [junit4]   2> 1812180 INFO  (TEST-AsyncMigrateRouteKeyTest.test-seed#[717A8277658DBF74]) [    ] o.a.s.c.c.SolrZkClient Using default ZkACLProvider
   [junit4]   2> 1812182 INFO  (TEST-AsyncMigrateRouteKeyTest.test-seed#[717A8277658DBF74]) [    ] o.a.s.s.SolrDispatchFilter Loading solr.xml from SolrHome (not found in ZooKeeper)
   [junit4]   2> 1812183 INFO  (TEST-AsyncMigrateRouteKeyTest.test-seed#[717A8277658DBF74]) [    ] o.a.s.c.SolrXmlConfig Loading container configuration from /export/home/jenkins/workspace/Lucene-Solr-5.x-Solaris/solr/build/solr-core/test/J1/temp/solr.cloud.AsyncMigrateRouteKeyTest_717A8277658DBF74-001/shard-1-001/solr.xml
   [junit4]   2> 1812189 INFO  (TEST-AsyncMigrateRouteKeyTest.test-seed#[717A8277658DBF74]) [    ] o.a.s.c.CoresLocator Config-defined core root directory: /export/home/jenkins/workspace/Lucene-Solr-5.x-Solaris/solr/build/solr-core/test/J1/temp/solr.cloud.AsyncMigrateRouteKeyTest_717A8277658DBF74-001/shard-1-001/cores
   [junit4]   2> 1812189 INFO  (TEST-AsyncMigrateRouteKeyTest.test-seed#[717A8277658DBF74]) [    ] o.a.s.c.CoreContainer New CoreContainer 1499163254
   [junit4]   2> 1812189 INFO  (TEST-AsyncMigrateRouteKeyTest.test-seed#[717A8277658DBF74]) [    ] o.a.s.c.CoreContainer Loading cores into CoreContainer [instanceDir=/export/home/jenkins/workspace/Lucene-Solr-5.x-Solaris/solr/build/solr-core/test/J1/temp/solr.cloud.AsyncMigrateRouteKeyTest_717A8277658DBF74-001/shard-1-001/]
   [junit4]   2> 1812189 INFO  (TEST-AsyncMigrateRouteKeyTest.test-seed#[717A8277658DBF74]) [    ] o.a.s.c.CoreContainer loading shared library: /export/home/jenkins/workspace/Lucene-Solr-5.x-Solaris/solr/build/solr-core/test/J1/temp/solr.cloud.AsyncMigrateRouteKeyTest_717A8277658DBF74-001/shard-1-001/lib
   [junit4]   2> 1812189 WARN  (TEST-AsyncMigrateRouteKeyTest.test-seed#[717A8277658DBF74]) [    ] o.a.s.c.SolrResourceLoader Can't find (or read) directory to add to classloader: lib (resolved as: /export/home/jenkins/workspace/Lucene-Solr-5.x-Solaris/solr/build/solr-core/test/J1/temp/solr.cloud.AsyncMigrateRouteKeyTest_717A8277658DBF74-001/shard-1-001/lib).
   [junit4]   2> 1812218 INFO  (TEST-AsyncMigrateRouteKeyTest.test-seed#[717A8277658DBF74]) [    ] o.a.s.h.c.HttpShardHandlerFactory created with socketTimeout : 90000,urlScheme : ,connTimeout : 15000,maxConnectionsPerHost : 20,maxConnections : 10000,corePoolSize : 0,maximumPoolSize : 2147483647,maxThreadIdleTime : 5,sizeOfQueue : -1,fairnessPolicy : false,useRetries : false,
   [junit4]   2> 1812220 INFO  (TEST-AsyncMigrateRouteKeyTest.test-seed#[717A8277658DBF74]) [    ] o.a.s.u.UpdateShardHandler Creating UpdateShardHandler HTTP client with params: socketTimeout=340000&connTimeout=45000&retry=true
   [junit4]   2> 1812223 INFO  (TEST-AsyncMigrateRouteKeyTest.test-seed#[717A8277658DBF74]) [    ] o.a.s.l.LogWatcher SLF4J impl is org.slf4j.impl.Log4jLoggerFactory
   [junit4]   2> 1812223 INFO  (TEST-AsyncMigrateRouteKeyTest.test-seed#[717A8277658DBF74]) [    ] o.a.s.l.LogWatcher Registering Log Listener [Log4j (org.slf4j.impl.Log4jLoggerFactory)]
   [junit4]   2> 1812223 INFO  (TEST-AsyncMigrateRouteKeyTest.test-seed#[717A8277658DBF74]) [    ] o.a.s.c.ZkContainer Zookeeper client=127.0.0.1:53686/solr
   [junit4]   2> 1812223 INFO  (TEST-AsyncMigrateRouteKeyTest.test-seed#[717A8277658DBF74]) [    ] o.a.s.c.ZkController zkHost includes chroot
   [junit4]   2> 1812223 INFO  (TEST-AsyncMigrateRouteKeyTest.test-seed#[717A8277658DBF74]) [    ] o.a.s.c.c.SolrZkClient Using default ZkCredentialsProvider
   [junit4]   2> 1812223 INFO  (TEST-AsyncMigrateRouteKeyTest.test-seed#[717A8277658DBF74]) [    ] o.a.s.c.c.ConnectionManager Waiting for client to connect to ZooKeeper
   [junit4]   2> 1812226 INFO  (zkCallback-2450-thread-1) [    ] o.a.s.c.c.ConnectionManager Watcher org.apache.solr.common.cloud.ConnectionManager@5fa6746f name:ZooKeeperConnection Watcher:127.0.0.1:53686 got event WatchedEvent state:SyncConnected type:None path:null path:null type:None
   [junit4]   2> 1812226 INFO  (TEST-AsyncMigrateRouteKeyTest.test-seed#[717A8277658DBF74]) [    ] o.a.s.c.c.ConnectionManager Client is connected to ZooKeeper
   [junit4]   2> 1812226 INFO  (TEST-AsyncMigrateRouteKeyTest.test-seed#[717A8277658DBF74]) [    ] o.a.s.c.c.SolrZkClient Using default ZkACLProvider
   [junit4]   2> 1812228 INFO  (TEST-AsyncMigrateRouteKeyTest.test-seed#[717A8277658DBF74]) [n:127.0.0.1:47631_    ] o.a.s.c.c.ConnectionManager Waiting for client to connect to ZooKeeper
   [junit4]   2> 1812230 INFO  (zkCallback-2451-thread-1-processing-n:127.0.0.1:47631_) [n:127.0.0.1:47631_    ] o.a.s.c.c.ConnectionManager Watcher org.apache.solr.common.cloud.ConnectionManager@12e6e534 name:ZooKeeperConnection Watcher:127.0.0.1:53686/solr got event WatchedEvent state:SyncConnected type:None path:null path:null type:None
   [junit4]   2> 1812230 INFO  (TEST-AsyncMigrateRouteKeyTest.test-seed#[717A8277658DBF74]) [n:127.0.0.1:47631_    ] o.a.s.c.c.ConnectionManager Client is connected to ZooKeeper
   [junit4]   2> 1812240 INFO  (TEST-AsyncMigrateRouteKeyTest.test-seed#[717A8277658DBF74]) [n:127.0.0.1:47631_    ] o.a.s.c.c.ZkStateReader Updating cluster state from ZooKeeper... 
   [junit4]   2> 1813256 INFO  (TEST-AsyncMigrateRouteKeyTest.test-seed#[717A8277658DBF74]) [n:127.0.0.1:47631_    ] o.a.s.c.ZkController Register node as live in ZooKeeper:/live_nodes/127.0.0.1:47631_
   [junit4]   2> 1813257 INFO  (TEST-AsyncMigrateRouteKeyTest.test-seed#[717A8277658DBF74]) [n:127.0.0.1:47631_    ] o.a.s.c.c.SolrZkClient makePath: /live_nodes/127.0.0.1:47631_
   [junit4]   2> 1813258 INFO  (zkCallback-2447-thread-1) [    ] o.a.s.c.c.ZkStateReader A live node change: WatchedEvent state:SyncConnected type:NodeChildrenChanged path:/live_nodes, has occurred - updating... (live nodes size: 1)
   [junit4]   2> 1813258 INFO  (zkCallback-2445-thread-1-processing-n:127.0.0.1:57341_) [n:127.0.0.1:57341_    ] o.a.s.c.c.ZkStateReader A live node change: WatchedEvent state:SyncConnected type:NodeChildrenChanged path:/live_nodes, has occurred - updating... (live nodes size: 1)
   [junit4]   2> 1813259 INFO  (zkCallback-2451-thread-1-processing-n:127.0.0.1:47631_) [n:127.0.0.1:47631_    ] o.a.s.c.c.ZkStateReader A live node change: WatchedEvent state:SyncConnected type:NodeChildrenChanged path:/live_nodes, has occurred - updating... (live nodes size: 1)
   [junit4]   2> 1813261 INFO  (TEST-AsyncMigrateRouteKeyTest.test-seed#[717A8277658DBF74]) [n:127.0.0.1:47631_    ] o.a.s.c.Overseer Overseer (id=null) closing
   [junit4]   2> 1813261 INFO  (TEST-AsyncMigrateRouteKeyTest.test-seed#[717A8277658DBF74]) [n:127.0.0.1:47631_    ] o.a.s.c.LeaderElector Joined leadership election with path: /overseer_elect/election/94816157108076552-127.0.0.1:47631_-n_0000000001
   [junit4]   2> 1813262 INFO  (TEST-AsyncMigrateRouteKeyTest.test-seed#[717A8277658DBF74]) [n:127.0.0.1:47631_    ] o.a.s.c.LeaderElector Watching path /overseer_elect/election/94816157108076548-127.0.0.1:57341_-n_0000000000 to know if I could be the leader
   [junit4]   2> 1813274 INFO  (TEST-AsyncMigrateRouteKeyTest.test-seed#[717A8277658DBF74]) [n:127.0.0.1:47631_    ] o.a.s.c.CoreContainer Security conf doesn't exist. Skipping setup for authorization module.
   [junit4]   2> 1813274 INFO  (TEST-AsyncMigrateRouteKeyTest.test-seed#[717A8277658DBF74]) [n:127.0.0.1:47631_    ] o.a.s.c.CoreContainer No authentication plugin used.
   [junit4]   2> 1813275 INFO  (TEST-AsyncMigrateRouteKeyTest.test-seed#[717A8277658DBF74]) [n:127.0.0.1:47631_    ] o.a.s.c.CoresLocator Looking for core definitions underneath /export/home/jenkins/workspace/Lucene-Solr-5.x-Solaris/solr/build/solr-core/test/J1/temp/solr.cloud.AsyncMigrateRouteKeyTest_717A8277658DBF74-001/shard-1-001/cores
   [junit4]   2> 1813276 INFO  (TEST-AsyncMigrateRouteKeyTest.test-seed#[717A8277658DBF74]) [n:127.0.0.1:47631_    ] o.a.s.c.SolrCore Created CoreDescriptor: {name=collection1, config=solrconfig.xml, transient=false, schema=schema.xml, loadOnStartup=true, configSetProperties=configsetprops.json, instanceDir=/export/home/jenkins/workspace/Lucene-Solr-5.x-Solaris/solr/build/solr-core/test/J1/temp/solr.cloud.AsyncMigrateRouteKeyTest_717A8277658DBF74-001/shard-1-001/cores/collection1, collection=collection1, absoluteInstDir=/export/home/jenkins/workspace/Lucene-Solr-5.x-Solaris/solr/build/solr-core/test/J1/temp/solr.cloud.AsyncMigrateRouteKeyTest_717A8277658DBF74-001/shard-1-001/cores/collection1/, coreNodeName=, dataDir=data/, shard=}
   [junit4]   2> 1813276 INFO  (TEST-AsyncMigrateRouteKeyTest.test-seed#[717A8277658DBF74]) [n:127.0.0.1:47631_    ] o.a.s.c.CoresLocator Found core collection1 in /export/home/jenkins/workspace/Lucene-Solr-5.x-Solaris/solr/build/solr-core/test/J1/temp/solr.cloud.AsyncMigrateRouteKeyTest_717A8277658DBF74-001/shard-1-001/cores/collection1/
   [junit4]   2> 1813276 INFO  (TEST-AsyncMigrateRouteKeyTest.test-seed#[717A8277658DBF74]) [n:127.0.0.1:47631_    ] o.a.s.c.CoresLocator Found 1 core definitions
   [junit4]   2> 1813278 INFO  (TEST-AsyncMigrateRouteKeyTest.test-seed#[717A8277658DBF74]) [n:127.0.0.1:47631_    ] o.a.s.s.SolrDispatchFilter user.dir=/export/home/jenkins/workspace/Lucene-Solr-5.x-Solaris/solr/build/solr-core/test/J1
   [junit4]   2> 1813278 INFO  (TEST-AsyncMigrateRouteKeyTest.test-seed#[717A8277658DBF74]) [n:127.0.0.1:47631_    ] o.a.s.s.SolrDispatchFilter SolrDispatchFilter.init() done
   [junit4]   2> 1813278 INFO  (coreLoadExecutor-7445-thread-1-processing-n:127.0.0.1:47631_) [n:127.0.0.1:47631_ c:collection1   x:collection1] o.a.s.c.ZkController publishing state=down
   [junit4]   2> 1813278 INFO  (coreLoadExecutor-7445-thread-1-processing-n:127.0.0.1:47631_) [n:127.0.0.1:47631_ c:collection1   x:collection1] o.a.s.c.ZkController numShards not found on descriptor - reading it from system property
   [junit4]   2> 1813280 INFO  (OverseerStateUpdate-94816157108076548-127.0.0.1:57341_-n_0000000000) [n:127.0.0.1:57341_    ] o.a.s.c.Overseer processMessage: queueSize: 1, message = {
   [junit4]   2>   "core":"collection1",
   [junit4]   2>   "roles":null,
   [junit4]   2>   "base_url":"http://127.0.0.1:47631",
   [junit4]   2>   "node_name":"127.0.0.1:47631_",
   [junit4]   2>   "numShards":"2",
   [junit4]   2>   "state":"down",
   [junit4]   2>   "shard":null,
   [junit4]   2>   "collection":"collection1",
   [junit4]   2>   "operation":"state"} current state version: 4
   [junit4]   2> 1813280 INFO  (coreLoadExecutor-7445-thread-1-processing-n:127.0.0.1:47631_) [n:127.0.0.1:47631_ c:collection1   x:collection1] o.a.s.c.ZkController look for our core node name
   [junit4]   2> 1813281 INFO  (OverseerStateUpdate-94816157108076548-127.0.0.1:57341_-n_0000000000) [n:127.0.0.1:57341_    ] o.a.s.c.o.ReplicaMutator Update state numShards=2 message={
   [junit4]   2>   "core":"collection1",
   [junit4]   2>   "roles":null,
   [junit4]   2>   "base_url":"http://127.0.0.1:47631",
   [junit4]   2>   "node_name":"127.0.0.1:47631_",
   [junit4]   2>   "numShards":"2",
   [junit4]   2>   "state":"down",
   [junit4]   2>   "shard":null,
   [junit4]   2>   "collection":"collection1",
   [junit4]   2>   "operation":"state"}
   [junit4]   2> 1813281 INFO  (OverseerStateUpdate-94816157108076548-127.0.0.1:57341_-n_0000000000) [n:127.0.0.1:57341_    ] o.a.s.c.o.ClusterStateMutator building a new cName: collection1
   [junit4]   2> 1813281 INFO  (OverseerStateUpdate-94816157108076548-127.0.0.1:57341_-n_0000000000) [n:127.0.0.1:57341_    ] o.a.s.c.o.ReplicaMutator Assigning new node to shard shard=shard2
   [junit4]   2> 1813384 INFO  (zkCallback-2445-thread-1-processing-n:127.0.0.1:57341_) [n:127.0.0.1:57341_    ] o.a.s.c.c.ZkStateReader A cluster state change: WatchedEvent state:SyncConnected type:NodeDataChanged path:/clusterstate.json, has occurred - updating... (live nodes size: 2)
   [junit4]   2> 1813384 INFO  (zkCallback-2447-thread-1) [    ] o.a.s.c.c.ZkStateReader A cluster state change: WatchedEvent state:SyncConnected type:NodeDataChanged path:/clusterstate.json, has occurred - updating... (live nodes size: 2)
   [junit4]   2> 1813384 INFO  (zkCallback-2451-thread-1-processing-n:127.0.0.1:47631_) [n:127.0.0.1:47631_    ] o.a.s.c.c.ZkStateReader A cluster state change: WatchedEvent state:SyncConnected type:NodeDataChanged path:/clusterstate.json, has occurred - updating... (live nodes size: 2)
   [junit4]   2> 1814282 INFO  (coreLoadExecutor-7445-thread-1-processing-n:127.0.0.1:47631_) [n:127.0.0.1:47631_ c:collection1   x:collection1] o.a.s.c.ZkController waiting to find shard id in clusterstate for collection1
   [junit4]   2> 1814282 INFO  (coreLoadExecutor-7445-thread-1-processing-n:127.0.0.1:47631_) [n:127.0.0.1:47631_ c:collection1   x:collection1] o.a.s.c.ZkController Check for collection zkNode:collection1
   [junit4]   2> 1814283 INFO  (coreLoadExecutor-7445-thread-1-processing-n:127.0.0.1:47631_) [n:127.0.0.1:47631_ c:collection1   x:collection1] o.a.s.c.ZkController Collection zkNode exists
   [junit4]   2> 1814283 INFO  (coreLoadExecutor-7445-thread-1-processing-n:127.0.0.1:47631_) [n:127.0.0.1:47631_ c:collection1   x:collection1] o.a.s.c.c.ZkStateReader Load collection config from:/collections/collection1
   [junit4]   2> 1814284 INFO  (coreLoadExecutor-7445-thread-1-processing-n:127.0.0.1:47631_) [n:127.0.0.1:47631_ c:collection1   x:collection1] o.a.s.c.c.ZkStateReader path=/collections/collection1 configName=conf1 specified config exists in ZooKeeper
   [junit4]   2> 1814284 INFO  (coreLoadExecutor-7445-thread-1-processing-n:127.0.0.1:47631_) [n:127.0.0.1:47631_ c:collection1   x:collection1] o.a.s.c.SolrResourceLoader new SolrResourceLoader for directory: '/export/home/jenkins/workspace/Lucene-Solr-5.x-Solaris/solr/build/solr-core/test/J1/temp/solr.cloud.AsyncMigrateRouteKeyTest_717A8277658DBF74-001/shard-1-001/cores/collection1/'
   [junit4]   2> 1814284 INFO  (coreLoadExecutor-7445-thread-1-processing-n:127.0.0.1:47631_) [n:127.0.0.1:47631_ c:collection1   x:collection1] o.a.s.c.SolrResourceLoader JNDI not configured for solr (NoInitialContextEx)
   [junit4]   2> 1814284 INFO  (coreLoadExecutor-7445-thread-1-processing-n:127.0.0.1:47631_) [n:127.0.0.1:47631_ c:collection1   x:collection1] o.a.s.c.SolrResourceLoader solr home defaulted to 'solr/' (could not find system property or JNDI)
   [junit4]   2> 1814299 INFO  (coreLoadExecutor-7445-thread-1-processing-n:127.0.0.1:47631_) [n:127.0.0.1:47631_ c:collection1   x:collection1] o.a.s.c.Config loaded config solrconfig.xml with version 0 
   [junit4]   2> 1814304 INFO  (coreLoadExecutor-7445-thread-1-processing-n:127.0.0.1:47631_) [n:127.0.0.1:47631_ c:collection1   x:collection1] o.a.s.c.SolrConfig current version of requestparams : -1
   [junit4]   2> 1814307 INFO  (coreLoadExecutor-7445-thread-1-processing-n:127.0.0.1:47631_) [n:127.0.0.1:47631_ c:collection1   x:collection1] o.a.s.c.SolrConfig Using Lucene MatchVersion: 5.4.0
   [junit4]   2> 1814343 INFO  (coreLoadExecutor-7445-thread-1-processing-n:127.0.0.1:47631_) [n:127.0.0.1:47631_ c:collection1   x:collection1] o.a.s.c.Config Loaded SolrConfig: solrconfig.xml
   [junit4]   2> 1814344 INFO  (coreLoadExecutor-7445-thread-1-processing-n:127.0.0.1:47631_) [n:127.0.0.1:47631_ c:collection1   x:collection1] o.a.s.s.IndexSchema Reading Solr Schema from /configs/conf1/schema.xml
   [junit4]   2> 1814348 INFO  (coreLoadExecutor-7445-thread-1-processing-n:127.0.0.1:47631_) [n:127.0.0.1:47631_ c:collection1   x:collection1] o.a.s.s.IndexSchema [collection1] Schema name=test
   [junit4]   2> 1814420 INFO  (coreLoadExecutor-7445-thread-1-processing-n:127.0.0.1:47631_) [n:127.0.0.1:47631_ c:collection1   x:collection1] o.a.s.s.IndexSchema default search field in schema is text
   [junit4]   2> 1814420 INFO  (coreLoadExecutor-7445-thread-1-processing-n:127.0.0.1:47631_) [n:127.0.0.1:47631_ c:collection1   x:collection1] o.a.s.s.IndexSchema unique key field: id
   [junit4]   2> 1814421 INFO  (coreLoadExecutor-7445-thread-1-processing-n:127.0.0.1:47631_) [n:127.0.0.1:47631_ c:collection1   x:collection1] o.a.s.s.FileExchangeRateProvider Reloading exchange rates from file currency.xml
   [junit4]   2> 1814424 INFO  (coreLoadExecutor-7445-thread-1-processing-n:127.0.0.1:47631_) [n:127.0.0.1:47631_ c:collection1   x:collection1] o.a.s.s.FileExchangeRateProvider Reloading exchange rates from file currency.xml
   [junit4]   2> 1814452 INFO  (coreLoadExecutor-7445-thread-1-processing-n:127.0.0.1:47631_) [n:127.0.0.1:47631_ c:collection1   x:collection1] o.a.s.c.ConfigSetProperties Did not find ConfigSet properties, assuming default properties: Can't find resource 'configsetprops.json' in classpath or '/configs/conf1', cwd=/export/home/jenkins/workspace/Lucene-Solr-5.x-Solaris/solr/build/solr-core/test/J1
   [junit4]   2> 1814452 INFO  (coreLoadExecutor-7445-thread-1-processing-n:127.0.0.1:47631_) [n:127.0.0.1:47631_ c:collection1   x:collection1] o.a.s.c.CoreContainer Creating SolrCore 'collection1' using configuration from collection collection1
   [junit4]   2> 1814452 INFO  (coreLoadExecutor-7445-thread-1-processing-n:127.0.0.1:47631_) [n:127.0.0.1:47631_ c:collection1 s:shard2 r:core_node1 x:collection1] o.a.s.c.SolrCore org.apache.solr.core.MockDirectoryFactory
   [junit4]   2> 1814452 INFO  (coreLoadExecutor-7445-thread-1-processing-n:127.0.0.1:47631_) [n:127.0.0.1:47631_ c:collection1 s:shard2 r:core_node1 x:collection1] o.a.s.c.SolrCore [[collection1] ] Opening new SolrCore at [/export/home/jenkins/workspace/Lucene-Solr-5.x-Solaris/solr/build/solr-core/test/J1/temp/solr.cloud.AsyncMigrateRouteKeyTest_717A8277658DBF74-001/shard-1-001/cores/collection1/], dataDir=[null]
   [junit4]   2> 1814453 INFO  (coreLoadExecutor-7445-thread-1-processing-n:127.0.0.1:47631_) [n:127.0.0.1:47631_ c:collection1 s:shard2 r:core_node1 x:collection1] o.a.s.c.JmxMonitoredMap JMX monitoring is enabled. Adding Solr mbeans to JMX Server: com.sun.jmx.mbeanserver.JmxMBeanServer@36c8a465
   [junit4]   2> 1814453 INFO  (coreLoadExecutor-7445-thread-1-processing-n:127.0.0.1:47631_) [n:127.0.0.1:47631_ c:collection1 s:shard2 r:core_node1 x:collection1] o.a.s.c.CachingDirectoryFactory return new directory for /export/home/jenkins/workspace/Lucene-Solr-5.x-Solaris/solr/build/solr-core/test/J1/temp/solr.cloud.AsyncMigrateRouteKeyTest_717A8277658DBF74-001/shard-1-001/cores/collection1/data
   [junit4]   2> 1814453 INFO  (coreLoadExecutor-7445-thread-1-processing-n:127.0.0.1:47631_) [n:127.0.0.1:47631_ c:collection1 s:shard2 r:core_node1 x:collection1] o.a.s.c.SolrCore New index directory detected: old=null new=/export/home/jenkins/workspace/Lucene-Solr-5.x-Solaris/solr/build/solr-core/test/J1/temp/solr.cloud.AsyncMigrateRouteKeyTest_717A8277658DBF74-001/shard-1-001/cores/collection1/data/index/
   [junit4]   2> 1814453 WARN  (coreLoadExecutor-7445-thread-1-processing-n:127.0.0.1:47631_) [n:127.0.0.1:47631_ c:collection1 s:shard2 r:core_node1 x:collection1] o.a.s.c.SolrCore [collection1] Solr index directory '/export/home/jenkins/workspace/Lucene-Solr-5.x-Solaris/solr/build/solr-core/test/J1/temp/solr.cloud.AsyncMigrateRouteKeyTest_717A8277658DBF74-001/shard-1-001/cores/collection1/data/index' doesn't exist. Creating new index...
   [junit4]   2> 1814454 INFO  (coreLoadExecutor-7445-thread-1-processing-n:127.0.0.1:47631_) [n:127.0.0.1:47631_ c:collection1 s:shard2 r:core_node1 x:collection1] o.a.s.c.CachingDirectoryFactory return new directory for /export/home/jenkins/workspace/Lucene-Solr-5.x-Solaris/solr/build/solr-core/test/J1/temp/solr.cloud.AsyncMigrateRouteKeyTest_717A8277658DBF74-001/shard-1-001/cores/collection1/data/index
   [junit4]   2> 1814454 INFO  (coreLoadExecutor-7445-thread-1-processing-n:127.0.0.1:47631_) [n:127.0.0.1:47631_ c:collection1 s:shard2 r:core_node1 x:collection1] o.a.s.u.RandomMergePolicy RandomMergePolicy wrapping class org.apache.lucene.index.LogDocMergePolicy: [LogDocMergePolicy: minMergeSize=1000, mergeFactor=44, maxMergeSize=9223372036854775807, maxMergeSizeForForcedMerge=9223372036854775807, calibrateSizeByDeletes=false, maxMergeDocs=2147483647, maxCFSSegmentSizeMB=8.796093022207999E12, noCFSRatio=0.6953794627350584]
   [junit4]   2> 1814454 INFO  (coreLoadExecutor-7445-thread-1-processing-n:127.0.0.1:47631_) [n:127.0.0.1:47631_ c:collection1 s:shard2 r:core_node1 x:collection1] o.a.s.c.SolrCore SolrDeletionPolicy.onCommit: commits: num=1
   [junit4]   2> 	commit{dir=MockDirectoryWrapper(RAMDirectory@4958ff1e lockFactory=org.apache.lucene.store.SingleInstanceLockFactory@3531f050),segFN=segments_1,generation=1}
   [junit4]   2> 1814454 INFO  (coreLoadExecutor-7445-thread-1-processing-n:127.0.0.1:47631_) [n:127.0.0.1:47631_ c:collection1 s:shard2 r:core_node1 x:collection1] o.a.s.c.SolrCore newest commit generation = 1
   [junit4]   2> 1814455 INFO  (OldIndexDirectoryCleanupThreadForCore-collection1) [n:127.0.0.1:47631_ c:collection1 s:shard2 r:core_node1 x:collection1] o.a.s.c.SolrCore Looking for old index directories to cleanup for core collection1 in /export/home/jenkins/workspace/Lucene-Solr-5.x-Solaris/solr/build/solr-core/test/J1/temp/solr.cloud.AsyncMigrateRouteKeyTest_717A8277658DBF74-001/shard-1-001/cores/collection1/data/
   [junit4]   2> 1814455 WARN  (OldIndexDirectoryCleanupThreadForCore-collection1) [n:127.0.0.1:47631_ c:collection1 s:shard2 r:core_node1 x:collection1] o.a.s.c.DirectoryFactory /export/home/jenkins/workspace/Lucene-Solr-5.x-Solaris/solr/build/solr-core/test/J1/temp/solr.cloud.AsyncMigrateRouteKeyTest_717A8277658DBF74-001/shard-1-001/cores/collection1/data/ does not point to a valid data directory; skipping clean-up of old index directories.
   [junit4]   2> 1814458 INFO  (coreLoadExecutor-7445-thread-1-processing-n:127.0.0.1:47631_) [n:127.0.0.1:47631_ c:collection1 s:shard2 r:core_node1 x:collection1] o.a.s.u.p.UpdateRequestProcessorChain creating updateRequestProcessorChain "nodistrib"
   [junit4]   2> 1814458 INFO  (coreLoadExecutor-7445-thread-1-processing-n:127.0.0.1:47631_) [n:127.0.0.1:47631_ c:collection1 s:shard2 r:core_node1 x:collection1] o.a.s.u.p.UpdateRequestProcessorChain creating updateRequestProcessorChain "dedupe"
   [junit4]   2> 1814458 INFO  (coreLoadExecutor-7445-thread-1-processing-n:127.0.0.1:47631_) [n:127.0.0.1:47631_ c:collection1 s:shard2 r:core_node1 x:collection1] o.a.s.u.p.UpdateRequestProcessorChain inserting DistributedUpdateProcessorFactory into updateRequestProcessorChain "dedupe"
   [junit4]   2> 1814458 INFO  (coreLoadExecutor-7445-thread-1-processing-n:127.0.0.1:47631_) [n:127.0.0.1:47631_ c:collection1 s:shard2 r:core_node1 x:collection1] o.a.s.u.p.UpdateRequestProcessorChain creating updateRequestProcessorChain "stored_sig"
   [junit4]   2> 1814458 INFO  (coreLoadExecutor-7445-thread-1-processing-n:127.0.0.1:47631_) [n:127.0.0.1:47631_ c:collection1 s:shard2 r:core_node1 x:collection1] o.a.s.u.p.UpdateRequestProcessorChain inserting DistributedUpdateProcessorFactory into updateRequestProcessorChain "stored_sig"
   [junit4]   2> 1814458 INFO  (coreLoadExecutor-7445-thread-1-processing-n:127.0.0.1:47631_) [n:127.0.0.1:47631_ c:collection1 s:shard2 r:core_node1 x:collection1] o.a.s.u.p

[...truncated too long message...]

hread-5697) [    ] o.a.s.c.ZkTestServer connecting to 127.0.0.1:53686 53686
   [junit4]   2> 1848922 WARN  (Thread-5697) [    ] o.a.s.c.ZkTestServer Watch limit violations: 
   [junit4]   2> Maximum concurrent create/delete watches above limit:
   [junit4]   2> 
   [junit4]   2> 	6	/solr/aliases.json
   [junit4]   2> 	5	/solr/security.json
   [junit4]   2> 	5	/solr/configs/conf1
   [junit4]   2> 
   [junit4]   2> Maximum concurrent data watches above limit:
   [junit4]   2> 
   [junit4]   2> 	6	/solr/clusterstate.json
   [junit4]   2> 
   [junit4]   2> Maximum concurrent children watches above limit:
   [junit4]   2> 
   [junit4]   2> 	6	/solr/live_nodes
   [junit4]   2> 	6	/solr/collections
   [junit4]   2> 	2	/solr/overseer/collection-queue-work
   [junit4]   2> 
   [junit4]   2> NOTE: reproduce with: ant test  -Dtestcase=AsyncMigrateRouteKeyTest -Dtests.method=test -Dtests.seed=717A8277658DBF74 -Dtests.slow=true -Dtests.locale=fr_BE -Dtests.timezone=Pacific/Pago_Pago -Dtests.asserts=true -Dtests.file.encoding=ISO-8859-1
   [junit4] FAILURE 39.7s J1 | AsyncMigrateRouteKeyTest.test <<<
   [junit4]    > Throwable #1: java.lang.AssertionError: There are still nodes recoverying - waited for 15 seconds
   [junit4]    > 	at __randomizedtesting.SeedInfo.seed([717A8277658DBF74:F92EBDADCB71D28C]:0)
   [junit4]    > 	at org.apache.solr.cloud.AbstractDistribZkTestBase.waitForRecoveriesToFinish(AbstractDistribZkTestBase.java:172)
   [junit4]    > 	at org.apache.solr.cloud.AbstractFullDistribZkTestBase.waitForRecoveriesToFinish(AbstractFullDistribZkTestBase.java:836)
   [junit4]    > 	at org.apache.solr.cloud.AbstractFullDistribZkTestBase.waitForThingsToLevelOut(AbstractFullDistribZkTestBase.java:1393)
   [junit4]    > 	at org.apache.solr.cloud.AsyncMigrateRouteKeyTest.test(AsyncMigrateRouteKeyTest.java:42)
   [junit4]    > 	at org.apache.solr.BaseDistributedSearchTestCase$ShardsRepeatRule$ShardsFixedStatement.callStatement(BaseDistributedSearchTestCase.java:963)
   [junit4]    > 	at org.apache.solr.BaseDistributedSearchTestCase$ShardsRepeatRule$ShardsStatement.evaluate(BaseDistributedSearchTestCase.java:938)
   [junit4]    > 	at java.lang.Thread.run(Thread.java:745)
   [junit4]   2> 1848928 INFO  (SUITE-AsyncMigrateRouteKeyTest-seed#[717A8277658DBF74]-worker) [n:127.0.0.1:41731_ c:collection1 s:shard1 r:core_node4 x:collection1] o.a.s.SolrTestCaseJ4 ###deleteCore
   [junit4]   2> NOTE: leaving temporary files on disk at: /export/home/jenkins/workspace/Lucene-Solr-5.x-Solaris/solr/build/solr-core/test/J1/temp/solr.cloud.AsyncMigrateRouteKeyTest_717A8277658DBF74-001
   [junit4]   2> Nov 06, 2015 3:16:20 AM com.carrotsearch.randomizedtesting.ThreadLeakControl checkThreadLeaks
   [junit4]   2> WARNING: Will linger awaiting termination of 1 leaked thread(s).
   [junit4]   2> NOTE: test params are: codec=Lucene54, sim=DefaultSimilarity, locale=fr_BE, timezone=Pacific/Pago_Pago
   [junit4]   2> NOTE: SunOS 5.11 amd64/Oracle Corporation 1.8.0_66 (64-bit)/cpus=3,threads=1,free=229882712,total=518979584
   [junit4]   2> NOTE: All tests run in this JVM: [TestFuzzyAnalyzedSuggestions, TestLeaderInitiatedRecoveryThread, LukeRequestHandlerTest, SolrCmdDistributorTest, ConvertedLegacyTest, TestBM25SimilarityFactory, MinimalSchemaTest, TestManagedSchemaDynamicFieldResource, RAMDirectoryFactoryTest, OutputWriterTest, TestFreeTextSuggestions, CollectionTooManyReplicasTest, TestBinaryField, TestTrie, SolrIndexSplitterTest, TestSolrQueryParser, TestCollectionAPI, DeleteLastCustomShardedReplicaTest, SignatureUpdateProcessorFactoryTest, TestSolrConfigHandler, PreAnalyzedFieldTest, BinaryUpdateRequestHandlerTest, TestRecovery, TestDistributedGrouping, FieldAnalysisRequestHandlerTest, TestSolrCLIRunExample, NumericFieldsTest, FieldMutatingUpdateProcessorTest, SimpleCollectionCreateDeleteTest, TestRemoveLastDynamicCopyField, BJQParserTest, HLLUtilTest, TestCustomSort, RollingRestartTest, TestBlendedInfixSuggestions, CoreMergeIndexesAdminHandlerTest, CursorMarkTest, TestWriterPerf, RankQueryTest, TestIndexingPerformance, SolrPluginUtilsTest, CoreAdminHandlerTest, TestDefaultSearchFieldResource, WordBreakSolrSpellCheckerTest, TestSimpleQParserPlugin, HdfsChaosMonkeyNothingIsSafeTest, TestRealTimeGet, TestManagedResourceStorage, TestAtomicUpdateErrorCases, SolrTestCaseJ4Test, UniqFieldsUpdateProcessorFactoryTest, StatsComponentTest, SynonymTokenizerTest, BasicAuthIntegrationTest, HdfsLockFactoryTest, DefaultValueUpdateProcessorTest, MigrateRouteKeyTest, BasicDistributedZk2Test, TestSolrConfigHandlerCloud, FullSolrCloudDistribCmdsTest, TestSchemaVersionResource, SpellPossibilityIteratorTest, CollectionsAPIDistributedZkTest, FullHLLTest, TestRandomMergePolicy, TestCryptoKeys, TestBinaryResponseWriter, ShowFileRequestHandlerTest, DirectSolrConnectionTest, LeaderInitiatedRecoveryOnShardRestartTest, TestCoreDiscovery, MultiTermTest, TestFoldingMultitermQuery, PrimUtilsTest, ConnectionManagerTest, SmileWriterTest, DistributedFacetPivotSmallTest, DeleteInactiveReplicaTest, TestCrossCoreJoin, TestFieldTypeResource, ActionThrottleTest, LoggingHandlerTest, ResponseHeaderTest, TestOrdValues, TestCollationField, DeleteReplicaTest, FileBasedSpellCheckerTest, SliceStateTest, CoreAdminCreateDiscoverTest, TestFieldResource, DistanceFunctionTest, QueryParsingTest, TestStressUserVersions, DistributedVersionInfoTest, TestCloudInspectUtil, TestOmitPositions, InfoHandlerTest, BitVectorTest, TestDistributedMissingSort, ClusterStateTest, CopyFieldTest, TestDistribIDF, TestMinMaxOnMultiValuedField, TestSchemaManager, CollectionReloadTest, FacetPivotSmallTest, DistributedTermsComponentTest, CleanupOldIndexTest, OpenExchangeRatesOrgProviderTest, SpellingQueryConverterTest, HdfsRecoverLeaseTest, TestAddFieldRealTimeGet, TestDocBasedVersionConstraints, SuggesterWFSTTest, TestDistributedStatsComponentCardinality, TestQueryTypes, ReplicationFactorTest, TestShardHandlerFactory, CollectionsAPIAsyncDistributedZkTest, TestObjectReleaseTracker, TimeZoneUtilsTest, ConcurrentDeleteAndCreateCollectionTest, TestPHPSerializedResponseWriter, TestSolrIndexConfig, CoreAdminRequestStatusTest, ZkSolrClientTest, HLLSerializationTest, DistributedDebugComponentTest, TermVectorComponentDistributedTest, TestReloadAndDeleteDocs, TestFastOutputStream, SuggesterTSTTest, SimpleMLTQParserTest, BasicDistributedZkTest, OpenCloseCoreStressTest, LeaderElectionIntegrationTest, TestReplicationHandler, AutoCommitTest, TestJoin, TestReload, HardAutoCommitTest, TestRangeQuery, TestCoreContainer, SimpleFacetsTest, TestSolr4Spatial, SpellCheckComponentTest, QueryElevationComponentTest, PeerSyncTest, BadIndexSchemaTest, TestSort, TestFiltering, TestFunctionQuery, BasicFunctionalityTest, DirectUpdateHandlerTest, TestBadConfig, TestIndexSearcher, CurrencyFieldOpenExchangeTest, CurrencyFieldXmlFileTest, SimplePostToolTest, AnalysisAfterCoreReloadTest, SpellCheckCollatorTest, SuggesterFSTTest, SolrRequestParserTest, SuggesterTest, TestStressLucene, SpatialFilterTest, TestCSVLoader, NoCacheHeaderTest, SchemaVersionSpecificBehaviorTest, SolrCoreCheckLockOnStartupTest, TestUpdate, DirectUpdateHandlerOptimizeTest, StatelessScriptUpdateProcessorFactoryTest, SortByFunctionTest, DocValuesMultiTest, TestSolrDeletionPolicy1, SolrInfoMBeanTest, XsltUpdateRequestHandlerTest, DebugComponentTest, CacheHeaderTest, TestSurroundQueryParser, DisMaxRequestHandlerTest, TestQueryUtils, TestReversedWildcardFilterFactory, TermsComponentTest, RequestHandlersTest, DocumentBuilderTest, TestValueSourceCache, TermVectorComponentTest, MoreLikeThisHandlerTest, IndexSchemaRuntimeFieldTest, UpdateRequestProcessorFactoryTest, JSONWriterTest, TestCSVResponseWriter, TestAnalyzedSuggestions, TestPartialUpdateDeduplication, PingRequestHandlerTest, SearchHandlerTest, TestQuerySenderListener, TestQuerySenderNoQuery, BadComponentTest, TestMergePolicyConfig, TestSolrDeletionPolicy2, SampleTest, TestDocSet, TestSolrCoreProperties, NotRequiredUniqueKeyTest, TestLuceneMatchVersion, TestCharFilters, TestCodecSupport, EchoParamsTest, TestSweetSpotSimilarityFactory, TestPerFieldSimilarity, TestLMJelinekMercerSimilarityFactory, TestDefaultSimilarityFactory, TestFastWriter, ScriptEngineTest, URLClassifyProcessorTest, DateMathParserTest, TestSuggestSpellingConverter, DOMUtilTest, TestSolrJ, TestLRUCache, TestUtils, TestDocumentBuilder, UUIDFieldTest, CircularListTest, DistributedMLTComponentTest, CursorPagingTest, DistributedIntervalFacetingTest, TestCursorMarkWithoutUniqueKey, TestSimpleTrackingShardHandler, TestEmbeddedSolrServerConstructors, TestJettySolrRunner, AssignTest, AsyncMigrateRouteKeyTest]
   [junit4] Completed [397/545] on J1 in 40.27s, 1 test, 1 failure <<< FAILURES!

[...truncated 477 lines...]
BUILD FAILED
/export/home/jenkins/workspace/Lucene-Solr-5.x-Solaris/build.xml:785: The following error occurred while executing this line:
/export/home/jenkins/workspace/Lucene-Solr-5.x-Solaris/build.xml:729: The following error occurred while executing this line:
/export/home/jenkins/workspace/Lucene-Solr-5.x-Solaris/build.xml:59: The following error occurred while executing this line:
/export/home/jenkins/workspace/Lucene-Solr-5.x-Solaris/solr/build.xml:233: The following error occurred while executing this line:
/export/home/jenkins/workspace/Lucene-Solr-5.x-Solaris/solr/common-build.xml:526: The following error occurred while executing this line:
/export/home/jenkins/workspace/Lucene-Solr-5.x-Solaris/lucene/common-build.xml:1452: The following error occurred while executing this line:
/export/home/jenkins/workspace/Lucene-Solr-5.x-Solaris/lucene/common-build.xml:1006: There were test failures: 545 suites (7 ignored), 2156 tests, 1 failure, 51 ignored (37 assumptions) [seed: 717A8277658DBF74]

Total time: 72 minutes 25 seconds
Build step 'Invoke Ant' marked build as failure
Archiving artifacts
[WARNINGS] Skipping publisher since build result is FAILURE
Recording test results
Email was triggered for: Failure - Any
Sending email for trigger: Failure - Any



Mime
View raw message