lucene-dev mailing list archives

Site index · List index
Message view « Date » · « Thread »
Top « Date » · « Thread »
From Policeman Jenkins Server <jenk...@thetaphi.de>
Subject [JENKINS] Lucene-Solr-5.x-MacOSX (64bit/jdk1.7.0) - Build # 2818 - Failure!
Date Sun, 15 Nov 2015 14:10:21 GMT
Build: http://jenkins.thetaphi.de/job/Lucene-Solr-5.x-MacOSX/2818/
Java: 64bit/jdk1.7.0 -XX:+UseCompressedOops -XX:+UseG1GC

1 tests failed.
FAILED:  org.apache.solr.handler.TestReplicationHandler.doTestIndexAndConfigAliasReplication

Error Message:
[/Users/jenkins/workspace/Lucene-Solr-5.x-MacOSX/solr/build/solr-core/test/J1/temp/solr.handler.TestReplicationHandler_9478FB20054B12A5-001/solr-instance-006/./collection1/data/index.20151115044254118, /Users/jenkins/workspace/Lucene-Solr-5.x-MacOSX/solr/build/solr-core/test/J1/temp/solr.handler.TestReplicationHandler_9478FB20054B12A5-001/solr-instance-006/./collection1/data/index.20151115044253781, /Users/jenkins/workspace/Lucene-Solr-5.x-MacOSX/solr/build/solr-core/test/J1/temp/solr.handler.TestReplicationHandler_9478FB20054B12A5-001/solr-instance-006/./collection1/data] expected:<2> but was:<3>

Stack Trace:
java.lang.AssertionError: [/Users/jenkins/workspace/Lucene-Solr-5.x-MacOSX/solr/build/solr-core/test/J1/temp/solr.handler.TestReplicationHandler_9478FB20054B12A5-001/solr-instance-006/./collection1/data/index.20151115044254118, /Users/jenkins/workspace/Lucene-Solr-5.x-MacOSX/solr/build/solr-core/test/J1/temp/solr.handler.TestReplicationHandler_9478FB20054B12A5-001/solr-instance-006/./collection1/data/index.20151115044253781, /Users/jenkins/workspace/Lucene-Solr-5.x-MacOSX/solr/build/solr-core/test/J1/temp/solr.handler.TestReplicationHandler_9478FB20054B12A5-001/solr-instance-006/./collection1/data] expected:<2> but was:<3>
	at __randomizedtesting.SeedInfo.seed([9478FB20054B12A5:630B1578C3A3BD43]:0)
	at org.junit.Assert.fail(Assert.java:93)
	at org.junit.Assert.failNotEquals(Assert.java:647)
	at org.junit.Assert.assertEquals(Assert.java:128)
	at org.junit.Assert.assertEquals(Assert.java:472)
	at org.apache.solr.handler.TestReplicationHandler.checkForSingleIndex(TestReplicationHandler.java:811)
	at org.apache.solr.handler.TestReplicationHandler.doTestIndexAndConfigAliasReplication(TestReplicationHandler.java:1241)
	at sun.reflect.NativeMethodAccessorImpl.invoke0(Native Method)
	at sun.reflect.NativeMethodAccessorImpl.invoke(NativeMethodAccessorImpl.java:57)
	at sun.reflect.DelegatingMethodAccessorImpl.invoke(DelegatingMethodAccessorImpl.java:43)
	at java.lang.reflect.Method.invoke(Method.java:606)
	at com.carrotsearch.randomizedtesting.RandomizedRunner.invoke(RandomizedRunner.java:1660)
	at com.carrotsearch.randomizedtesting.RandomizedRunner$8.evaluate(RandomizedRunner.java:866)
	at com.carrotsearch.randomizedtesting.RandomizedRunner$9.evaluate(RandomizedRunner.java:902)
	at com.carrotsearch.randomizedtesting.RandomizedRunner$10.evaluate(RandomizedRunner.java:916)
	at com.carrotsearch.randomizedtesting.rules.SystemPropertiesRestoreRule$1.evaluate(SystemPropertiesRestoreRule.java:57)
	at org.apache.lucene.util.TestRuleSetupTeardownChained$1.evaluate(TestRuleSetupTeardownChained.java:50)
	at org.apache.lucene.util.AbstractBeforeAfterRule$1.evaluate(AbstractBeforeAfterRule.java:46)
	at org.apache.lucene.util.TestRuleThreadAndTestName$1.evaluate(TestRuleThreadAndTestName.java:49)
	at org.apache.lucene.util.TestRuleIgnoreAfterMaxFailures$1.evaluate(TestRuleIgnoreAfterMaxFailures.java:65)
	at org.apache.lucene.util.TestRuleMarkFailure$1.evaluate(TestRuleMarkFailure.java:48)
	at com.carrotsearch.randomizedtesting.rules.StatementAdapter.evaluate(StatementAdapter.java:36)
	at com.carrotsearch.randomizedtesting.ThreadLeakControl$StatementRunner.run(ThreadLeakControl.java:367)
	at com.carrotsearch.randomizedtesting.ThreadLeakControl.forkTimeoutingTask(ThreadLeakControl.java:809)
	at com.carrotsearch.randomizedtesting.ThreadLeakControl$3.evaluate(ThreadLeakControl.java:460)
	at com.carrotsearch.randomizedtesting.RandomizedRunner.runSingleTest(RandomizedRunner.java:875)
	at com.carrotsearch.randomizedtesting.RandomizedRunner$5.evaluate(RandomizedRunner.java:777)
	at com.carrotsearch.randomizedtesting.RandomizedRunner$6.evaluate(RandomizedRunner.java:811)
	at com.carrotsearch.randomizedtesting.RandomizedRunner$7.evaluate(RandomizedRunner.java:822)
	at com.carrotsearch.randomizedtesting.rules.StatementAdapter.evaluate(StatementAdapter.java:36)
	at com.carrotsearch.randomizedtesting.rules.SystemPropertiesRestoreRule$1.evaluate(SystemPropertiesRestoreRule.java:57)
	at org.apache.lucene.util.AbstractBeforeAfterRule$1.evaluate(AbstractBeforeAfterRule.java:46)
	at com.carrotsearch.randomizedtesting.rules.StatementAdapter.evaluate(StatementAdapter.java:36)
	at org.apache.lucene.util.TestRuleStoreClassName$1.evaluate(TestRuleStoreClassName.java:42)
	at com.carrotsearch.randomizedtesting.rules.NoShadowingOrOverridesOnMethodsRule$1.evaluate(NoShadowingOrOverridesOnMethodsRule.java:40)
	at com.carrotsearch.randomizedtesting.rules.NoShadowingOrOverridesOnMethodsRule$1.evaluate(NoShadowingOrOverridesOnMethodsRule.java:40)
	at com.carrotsearch.randomizedtesting.rules.StatementAdapter.evaluate(StatementAdapter.java:36)
	at com.carrotsearch.randomizedtesting.rules.StatementAdapter.evaluate(StatementAdapter.java:36)
	at com.carrotsearch.randomizedtesting.rules.StatementAdapter.evaluate(StatementAdapter.java:36)
	at org.apache.lucene.util.TestRuleAssertionsRequired$1.evaluate(TestRuleAssertionsRequired.java:54)
	at org.apache.lucene.util.TestRuleMarkFailure$1.evaluate(TestRuleMarkFailure.java:48)
	at org.apache.lucene.util.TestRuleIgnoreAfterMaxFailures$1.evaluate(TestRuleIgnoreAfterMaxFailures.java:65)
	at org.apache.lucene.util.TestRuleIgnoreTestSuites$1.evaluate(TestRuleIgnoreTestSuites.java:55)
	at com.carrotsearch.randomizedtesting.rules.StatementAdapter.evaluate(StatementAdapter.java:36)
	at com.carrotsearch.randomizedtesting.ThreadLeakControl$StatementRunner.run(ThreadLeakControl.java:367)
	at java.lang.Thread.run(Thread.java:745)




Build Log:
[...truncated 10497 lines...]
   [junit4] Suite: org.apache.solr.handler.TestReplicationHandler
   [junit4]   2> Creating dataDir: /Users/jenkins/workspace/Lucene-Solr-5.x-MacOSX/solr/build/solr-core/test/J1/temp/solr.handler.TestReplicationHandler_9478FB20054B12A5-001/init-core-data-001
   [junit4]   2> 1796863 INFO  (TEST-TestReplicationHandler.doTestReplicateAfterStartup-seed#[9478FB20054B12A5]) [    ] o.a.s.SolrTestCaseJ4 ###Starting doTestReplicateAfterStartup
   [junit4]   2> 1796864 INFO  (TEST-TestReplicationHandler.doTestReplicateAfterStartup-seed#[9478FB20054B12A5]) [    ] o.a.s.SolrTestCaseJ4 Writing core.properties file to /Users/jenkins/workspace/Lucene-Solr-5.x-MacOSX/solr/build/solr-core/test/J1/temp/solr.handler.TestReplicationHandler_9478FB20054B12A5-001/solr-instance-001/collection1
   [junit4]   2> 1796879 INFO  (TEST-TestReplicationHandler.doTestReplicateAfterStartup-seed#[9478FB20054B12A5]) [    ] o.e.j.s.Server jetty-9.2.13.v20150730
   [junit4]   2> 1796884 INFO  (TEST-TestReplicationHandler.doTestReplicateAfterStartup-seed#[9478FB20054B12A5]) [    ] o.e.j.s.h.ContextHandler Started o.e.j.s.ServletContextHandler@456b80b2{/solr,null,AVAILABLE}
   [junit4]   2> 1796884 INFO  (TEST-TestReplicationHandler.doTestReplicateAfterStartup-seed#[9478FB20054B12A5]) [    ] o.e.j.s.ServerConnector Started ServerConnector@14ce49b9{HTTP/1.1}{127.0.0.1:60156}
   [junit4]   2> 1796884 INFO  (TEST-TestReplicationHandler.doTestReplicateAfterStartup-seed#[9478FB20054B12A5]) [    ] o.e.j.s.Server Started @1802783ms
   [junit4]   2> 1796884 INFO  (TEST-TestReplicationHandler.doTestReplicateAfterStartup-seed#[9478FB20054B12A5]) [    ] o.a.s.c.s.e.JettySolrRunner Jetty properties: {hostContext=/solr, hostPort=60156, solr.data.dir=/Users/jenkins/workspace/Lucene-Solr-5.x-MacOSX/solr/build/solr-core/test/J1/temp/solr.handler.TestReplicationHandler_9478FB20054B12A5-001/solr-instance-001/collection1/data}
   [junit4]   2> 1796885 INFO  (TEST-TestReplicationHandler.doTestReplicateAfterStartup-seed#[9478FB20054B12A5]) [    ] o.a.s.s.SolrDispatchFilter SolrDispatchFilter.init(): sun.misc.Launcher$AppClassLoader@a2c6f70
   [junit4]   2> 1796885 INFO  (TEST-TestReplicationHandler.doTestReplicateAfterStartup-seed#[9478FB20054B12A5]) [    ] o.a.s.c.SolrResourceLoader new SolrResourceLoader for directory: '/Users/jenkins/workspace/Lucene-Solr-5.x-MacOSX/solr/build/solr-core/test/J1/temp/solr.handler.TestReplicationHandler_9478FB20054B12A5-001/solr-instance-001/'
   [junit4]   2> 1796885 INFO  (TEST-TestReplicationHandler.doTestReplicateAfterStartup-seed#[9478FB20054B12A5]) [    ] o.a.s.c.SolrResourceLoader JNDI not configured for solr (NoInitialContextEx)
   [junit4]   2> 1796885 INFO  (TEST-TestReplicationHandler.doTestReplicateAfterStartup-seed#[9478FB20054B12A5]) [    ] o.a.s.c.SolrResourceLoader solr home defaulted to 'solr/' (could not find system property or JNDI)
   [junit4]   2> 1796913 INFO  (TEST-TestReplicationHandler.doTestReplicateAfterStartup-seed#[9478FB20054B12A5]) [    ] o.a.s.c.SolrXmlConfig Loading container configuration from /Users/jenkins/workspace/Lucene-Solr-5.x-MacOSX/solr/build/solr-core/test/J1/temp/solr.handler.TestReplicationHandler_9478FB20054B12A5-001/solr-instance-001/solr.xml
   [junit4]   2> 1796950 INFO  (TEST-TestReplicationHandler.doTestReplicateAfterStartup-seed#[9478FB20054B12A5]) [    ] o.a.s.c.CoresLocator Config-defined core root directory: /Users/jenkins/workspace/Lucene-Solr-5.x-MacOSX/solr/build/solr-core/test/J1/temp/solr.handler.TestReplicationHandler_9478FB20054B12A5-001/solr-instance-001/.
   [junit4]   2> 1796950 INFO  (TEST-TestReplicationHandler.doTestReplicateAfterStartup-seed#[9478FB20054B12A5]) [    ] o.a.s.c.CoreContainer New CoreContainer 566840302
   [junit4]   2> 1796950 INFO  (TEST-TestReplicationHandler.doTestReplicateAfterStartup-seed#[9478FB20054B12A5]) [    ] o.a.s.c.CoreContainer Loading cores into CoreContainer [instanceDir=/Users/jenkins/workspace/Lucene-Solr-5.x-MacOSX/solr/build/solr-core/test/J1/temp/solr.handler.TestReplicationHandler_9478FB20054B12A5-001/solr-instance-001/]
   [junit4]   2> 1796950 INFO  (TEST-TestReplicationHandler.doTestReplicateAfterStartup-seed#[9478FB20054B12A5]) [    ] o.a.s.c.CoreContainer loading shared library: /Users/jenkins/workspace/Lucene-Solr-5.x-MacOSX/solr/build/solr-core/test/J1/temp/solr.handler.TestReplicationHandler_9478FB20054B12A5-001/solr-instance-001/lib
   [junit4]   2> 1796951 WARN  (TEST-TestReplicationHandler.doTestReplicateAfterStartup-seed#[9478FB20054B12A5]) [    ] o.a.s.c.SolrResourceLoader Can't find (or read) directory to add to classloader: lib (resolved as: /Users/jenkins/workspace/Lucene-Solr-5.x-MacOSX/solr/build/solr-core/test/J1/temp/solr.handler.TestReplicationHandler_9478FB20054B12A5-001/solr-instance-001/lib).
   [junit4]   2> 1796966 INFO  (TEST-TestReplicationHandler.doTestReplicateAfterStartup-seed#[9478FB20054B12A5]) [    ] o.a.s.h.c.HttpShardHandlerFactory created with socketTimeout : 90000,urlScheme : ,connTimeout : 15000,maxConnectionsPerHost : 20,maxConnections : 10000,corePoolSize : 0,maximumPoolSize : 2147483647,maxThreadIdleTime : 5,sizeOfQueue : -1,fairnessPolicy : false,useRetries : false,
   [junit4]   2> 1796970 INFO  (TEST-TestReplicationHandler.doTestReplicateAfterStartup-seed#[9478FB20054B12A5]) [    ] o.a.s.u.UpdateShardHandler Creating UpdateShardHandler HTTP client with params: socketTimeout=340000&connTimeout=45000&retry=true
   [junit4]   2> 1796972 INFO  (TEST-TestReplicationHandler.doTestReplicateAfterStartup-seed#[9478FB20054B12A5]) [    ] o.a.s.l.LogWatcher SLF4J impl is org.slf4j.impl.Log4jLoggerFactory
   [junit4]   2> 1796972 INFO  (TEST-TestReplicationHandler.doTestReplicateAfterStartup-seed#[9478FB20054B12A5]) [    ] o.a.s.l.LogWatcher Registering Log Listener [Log4j (org.slf4j.impl.Log4jLoggerFactory)]
   [junit4]   2> 1796972 INFO  (TEST-TestReplicationHandler.doTestReplicateAfterStartup-seed#[9478FB20054B12A5]) [    ] o.a.s.c.CoreContainer Security conf doesn't exist. Skipping setup for authorization module.
   [junit4]   2> 1796972 INFO  (TEST-TestReplicationHandler.doTestReplicateAfterStartup-seed#[9478FB20054B12A5]) [    ] o.a.s.c.CoreContainer No authentication plugin used.
   [junit4]   2> 1796978 INFO  (TEST-TestReplicationHandler.doTestReplicateAfterStartup-seed#[9478FB20054B12A5]) [    ] o.a.s.c.CoresLocator Looking for core definitions underneath /Users/jenkins/workspace/Lucene-Solr-5.x-MacOSX/solr/build/solr-core/test/J1/temp/solr.handler.TestReplicationHandler_9478FB20054B12A5-001/solr-instance-001/.
   [junit4]   2> 1796983 INFO  (TEST-TestReplicationHandler.doTestReplicateAfterStartup-seed#[9478FB20054B12A5]) [    ] o.a.s.c.SolrCore Created CoreDescriptor: {instanceDir=/Users/jenkins/workspace/Lucene-Solr-5.x-MacOSX/solr/build/solr-core/test/J1/temp/solr.handler.TestReplicationHandler_9478FB20054B12A5-001/solr-instance-001/./collection1, transient=false, absoluteInstDir=/Users/jenkins/workspace/Lucene-Solr-5.x-MacOSX/solr/build/solr-core/test/J1/temp/solr.handler.TestReplicationHandler_9478FB20054B12A5-001/solr-instance-001/./collection1/, configSetProperties=configsetprops.json, dataDir=data/, config=solrconfig.xml, schema=schema.xml, loadOnStartup=true, name=collection1}
   [junit4]   2> 1796983 INFO  (TEST-TestReplicationHandler.doTestReplicateAfterStartup-seed#[9478FB20054B12A5]) [    ] o.a.s.c.CoresLocator Found core collection1 in /Users/jenkins/workspace/Lucene-Solr-5.x-MacOSX/solr/build/solr-core/test/J1/temp/solr.handler.TestReplicationHandler_9478FB20054B12A5-001/solr-instance-001/./collection1/
   [junit4]   2> 1796983 INFO  (TEST-TestReplicationHandler.doTestReplicateAfterStartup-seed#[9478FB20054B12A5]) [    ] o.a.s.c.CoresLocator Found 1 core definitions
   [junit4]   2> 1796992 INFO  (coreLoadExecutor-5219-thread-1) [    ] o.a.s.c.SolrResourceLoader new SolrResourceLoader for directory: '/Users/jenkins/workspace/Lucene-Solr-5.x-MacOSX/solr/build/solr-core/test/J1/temp/solr.handler.TestReplicationHandler_9478FB20054B12A5-001/solr-instance-001/./collection1/'
   [junit4]   2> 1796992 INFO  (coreLoadExecutor-5219-thread-1) [    ] o.a.s.c.SolrResourceLoader JNDI not configured for solr (NoInitialContextEx)
   [junit4]   2> 1796992 INFO  (coreLoadExecutor-5219-thread-1) [    ] o.a.s.c.SolrResourceLoader solr home defaulted to 'solr/' (could not find system property or JNDI)
   [junit4]   2> 1797010 INFO  (TEST-TestReplicationHandler.doTestReplicateAfterStartup-seed#[9478FB20054B12A5]) [    ] o.a.s.s.SolrDispatchFilter user.dir=/Users/jenkins/workspace/Lucene-Solr-5.x-MacOSX/solr/build/solr-core/test/J1
   [junit4]   2> 1797011 INFO  (TEST-TestReplicationHandler.doTestReplicateAfterStartup-seed#[9478FB20054B12A5]) [    ] o.a.s.s.SolrDispatchFilter SolrDispatchFilter.init() done
   [junit4]   2> 1797024 INFO  (coreLoadExecutor-5219-thread-1) [    ] o.a.s.c.SolrConfig current version of requestparams : -1
   [junit4]   2> 1797044 INFO  (coreLoadExecutor-5219-thread-1) [    ] o.a.s.c.SolrConfig Using Lucene MatchVersion: 5.4.0
   [junit4]   2> 1797085 INFO  (coreLoadExecutor-5219-thread-1) [    ] o.a.s.c.Config Loaded SolrConfig: solrconfig.xml
   [junit4]   2> 1797086 INFO  (coreLoadExecutor-5219-thread-1) [    ] o.a.s.s.IndexSchema Reading Solr Schema from /Users/jenkins/workspace/Lucene-Solr-5.x-MacOSX/solr/build/solr-core/test/J1/temp/solr.handler.TestReplicationHandler_9478FB20054B12A5-001/solr-instance-001/./collection1/conf/schema.xml
   [junit4]   2> 1797092 INFO  (coreLoadExecutor-5219-thread-1) [    ] o.a.s.s.IndexSchema [collection1] Schema name=test
   [junit4]   2> 1797107 INFO  (coreLoadExecutor-5219-thread-1) [    ] o.a.s.s.IndexSchema unique key field: id
   [junit4]   2> 1797110 INFO  (coreLoadExecutor-5219-thread-1) [    ] o.a.s.c.ConfigSetProperties Did not find ConfigSet properties, assuming default properties: Can't find resource 'configsetprops.json' in classpath or '/Users/jenkins/workspace/Lucene-Solr-5.x-MacOSX/solr/build/solr-core/test/J1/temp/solr.handler.TestReplicationHandler_9478FB20054B12A5-001/solr-instance-001/./collection1/conf'
   [junit4]   2> 1797111 INFO  (coreLoadExecutor-5219-thread-1) [    ] o.a.s.c.CoreContainer Creating SolrCore 'collection1' using configuration from instancedir /Users/jenkins/workspace/Lucene-Solr-5.x-MacOSX/solr/build/solr-core/test/J1/temp/solr.handler.TestReplicationHandler_9478FB20054B12A5-001/solr-instance-001/./collection1
   [junit4]   2> 1797111 INFO  (coreLoadExecutor-5219-thread-1) [    x:collection1] o.a.s.c.SolrCore org.apache.solr.core.MockDirectoryFactory
   [junit4]   2> 1797111 INFO  (coreLoadExecutor-5219-thread-1) [    x:collection1] o.a.s.c.SolrCore [[collection1] ] Opening new SolrCore at [/Users/jenkins/workspace/Lucene-Solr-5.x-MacOSX/solr/build/solr-core/test/J1/temp/solr.handler.TestReplicationHandler_9478FB20054B12A5-001/solr-instance-001/./collection1/], dataDir=[null]
   [junit4]   2> 1797111 INFO  (coreLoadExecutor-5219-thread-1) [    x:collection1] o.a.s.c.SolrCore JMX monitoring not detected for core: collection1
   [junit4]   2> 1797112 INFO  (coreLoadExecutor-5219-thread-1) [    x:collection1] o.a.s.c.CachingDirectoryFactory return new directory for /Users/jenkins/workspace/Lucene-Solr-5.x-MacOSX/solr/build/solr-core/test/J1/temp/solr.handler.TestReplicationHandler_9478FB20054B12A5-001/solr-instance-001/./collection1/data
   [junit4]   2> 1797112 INFO  (coreLoadExecutor-5219-thread-1) [    x:collection1] o.a.s.c.SolrCore New index directory detected: old=null new=/Users/jenkins/workspace/Lucene-Solr-5.x-MacOSX/solr/build/solr-core/test/J1/temp/solr.handler.TestReplicationHandler_9478FB20054B12A5-001/solr-instance-001/./collection1/data/index/
   [junit4]   2> 1797112 WARN  (coreLoadExecutor-5219-thread-1) [    x:collection1] o.a.s.c.SolrCore [collection1] Solr index directory '/Users/jenkins/workspace/Lucene-Solr-5.x-MacOSX/solr/build/solr-core/test/J1/temp/solr.handler.TestReplicationHandler_9478FB20054B12A5-001/solr-instance-001/./collection1/data/index' doesn't exist. Creating new index...
   [junit4]   2> 1797112 INFO  (coreLoadExecutor-5219-thread-1) [    x:collection1] o.a.s.c.CachingDirectoryFactory return new directory for /Users/jenkins/workspace/Lucene-Solr-5.x-MacOSX/solr/build/solr-core/test/J1/temp/solr.handler.TestReplicationHandler_9478FB20054B12A5-001/solr-instance-001/./collection1/data/index
   [junit4]   2> 1797112 INFO  (coreLoadExecutor-5219-thread-1) [    x:collection1] o.a.s.u.RandomMergePolicy RandomMergePolicy wrapping class org.apache.lucene.index.TieredMergePolicy: [TieredMergePolicy: maxMergeAtOnce=12, maxMergeAtOnceExplicit=16, maxMergedSegmentMB=88.05859375, floorSegmentMB=1.2021484375, forceMergeDeletesPctAllowed=21.68733320144119, segmentsPerTier=15.0, maxCFSSegmentSizeMB=8.796093022207999E12, noCFSRatio=0.0
   [junit4]   2> 1797113 INFO  (coreLoadExecutor-5219-thread-1) [    x:collection1] o.a.s.c.SolrCore SolrDeletionPolicy.onCommit: commits: num=1
   [junit4]   2> 	commit{dir=MockDirectoryWrapper(RAMDirectory@6b19cf lockFactory=org.apache.lucene.store.SingleInstanceLockFactory@776b653f),segFN=segments_1,generation=1}
   [junit4]   2> 1797113 INFO  (coreLoadExecutor-5219-thread-1) [    x:collection1] o.a.s.c.SolrCore newest commit generation = 1
   [junit4]   2> 1797114 INFO  (OldIndexDirectoryCleanupThreadForCore-collection1) [    x:collection1] o.a.s.c.SolrCore Looking for old index directories to cleanup for core collection1 in /Users/jenkins/workspace/Lucene-Solr-5.x-MacOSX/solr/build/solr-core/test/J1/temp/solr.handler.TestReplicationHandler_9478FB20054B12A5-001/solr-instance-001/./collection1/data/
   [junit4]   2> 1797117 INFO  (coreLoadExecutor-5219-thread-1) [    x:collection1] o.a.s.c.SolrCore no updateRequestProcessorChain defined as default, creating implicit default
   [junit4]   2> 1797128 INFO  (coreLoadExecutor-5219-thread-1) [    x:collection1] o.a.s.h.l.XMLLoader xsltCacheLifetimeSeconds=60
   [junit4]   2> 1797131 INFO  (coreLoadExecutor-5219-thread-1) [    x:collection1] o.a.s.h.l.XMLLoader xsltCacheLifetimeSeconds=60
   [junit4]   2> 1797133 INFO  (coreLoadExecutor-5219-thread-1) [    x:collection1] o.a.s.h.l.XMLLoader xsltCacheLifetimeSeconds=60
   [junit4]   2> 1797135 INFO  (coreLoadExecutor-5219-thread-1) [    x:collection1] o.a.s.h.l.XMLLoader xsltCacheLifetimeSeconds=60
   [junit4]   2> 1797152 INFO  (coreLoadExecutor-5219-thread-1) [    x:collection1] o.a.s.c.PluginBag requestHandler : 'lazy' created with startup=lazy 
   [junit4]   2> 1797152 INFO  (coreLoadExecutor-5219-thread-1) [    x:collection1] o.a.s.c.RequestHandlers Registered paths: /admin/segments,/admin/ping,/admin/luke,lazy,defaults,standard,/admin/file,/update/json,/schema,/update,/update/csv,/admin/logging,/update/json/docs,/replication,/config,/get,/admin/threads,/admin/plugins,/admin/mbeans,/admin/properties,/admin/system
   [junit4]   2> 1797153 INFO  (coreLoadExecutor-5219-thread-1) [    x:collection1] o.a.s.c.SolrCore Using default statsCache cache: org.apache.solr.search.stats.LocalStatsCache
   [junit4]   2> 1797153 INFO  (coreLoadExecutor-5219-thread-1) [    x:collection1] o.a.s.c.SolrCore Hard AutoCommit: disabled
   [junit4]   2> 1797153 INFO  (coreLoadExecutor-5219-thread-1) [    x:collection1] o.a.s.c.SolrCore Soft AutoCommit: disabled
   [junit4]   2> 1797154 INFO  (coreLoadExecutor-5219-thread-1) [    x:collection1] o.a.s.u.RandomMergePolicy RandomMergePolicy wrapping class org.apache.lucene.index.TieredMergePolicy: [TieredMergePolicy: maxMergeAtOnce=50, maxMergeAtOnceExplicit=17, maxMergedSegmentMB=40.498046875, floorSegmentMB=2.00390625, forceMergeDeletesPctAllowed=20.145742417588103, segmentsPerTier=22.0, maxCFSSegmentSizeMB=8.796093022207999E12, noCFSRatio=0.1067098211106913
   [junit4]   2> 1797154 INFO  (coreLoadExecutor-5219-thread-1) [    x:collection1] o.a.s.c.SolrCore SolrDeletionPolicy.onInit: commits: num=1
   [junit4]   2> 	commit{dir=MockDirectoryWrapper(RAMDirectory@6b19cf lockFactory=org.apache.lucene.store.SingleInstanceLockFactory@776b653f),segFN=segments_1,generation=1}
   [junit4]   2> 1797154 INFO  (coreLoadExecutor-5219-thread-1) [    x:collection1] o.a.s.c.SolrCore newest commit generation = 1
   [junit4]   2> 1797155 INFO  (coreLoadExecutor-5219-thread-1) [    x:collection1] o.a.s.s.SolrIndexSearcher Opening Searcher@5b16ed32[collection1] main
   [junit4]   2> 1797155 INFO  (coreLoadExecutor-5219-thread-1) [    x:collection1] o.a.s.r.ManagedResourceStorage File-based storage initialized to use dir: /Users/jenkins/workspace/Lucene-Solr-5.x-MacOSX/solr/build/solr-core/test/J1/temp/solr.handler.TestReplicationHandler_9478FB20054B12A5-001/solr-instance-001/./collection1/conf
   [junit4]   2> 1797155 INFO  (coreLoadExecutor-5219-thread-1) [    x:collection1] o.a.s.r.RestManager Initializing RestManager with initArgs: {storageDir=/Users/jenkins/workspace/Lucene-Solr-5.x-MacOSX/solr/build/solr-core/test/J1/temp/solr.handler.TestReplicationHandler_9478FB20054B12A5-001/solr-instance-001/./collection1/conf}
   [junit4]   2> 1797155 INFO  (coreLoadExecutor-5219-thread-1) [    x:collection1] o.a.s.r.ManagedResourceStorage Reading _rest_managed.json using file:dir=/Users/jenkins/workspace/Lucene-Solr-5.x-MacOSX/solr/build/solr-core/test/J1/temp/solr.handler.TestReplicationHandler_9478FB20054B12A5-001/solr-instance-001/./collection1/conf
   [junit4]   2> 1797156 INFO  (coreLoadExecutor-5219-thread-1) [    x:collection1] o.a.s.r.RestManager Initializing 0 registered ManagedResources
   [junit4]   2> 1797156 INFO  (coreLoadExecutor-5219-thread-1) [    x:collection1] o.a.s.h.ReplicationHandler Replication enabled for following config files: schema.xml,xslt/dummy.xsl
   [junit4]   2> 1797156 INFO  (coreLoadExecutor-5219-thread-1) [    x:collection1] o.a.s.h.ReplicationHandler Commits will be reserved for  10000
   [junit4]   2> 1797156 INFO  (coreLoadExecutor-5219-thread-1) [    x:collection1] o.a.s.c.CoreContainer registering core: collection1
   [junit4]   2> 1797156 INFO  (searcherExecutor-5220-thread-1-processing-x:collection1) [    x:collection1] o.a.s.c.SolrCore [collection1] Registered new searcher Searcher@5b16ed32[collection1] main{ExitableDirectoryReader(UninvertingDirectoryReader())}
   [junit4]   2> 1797514 INFO  (TEST-TestReplicationHandler.doTestReplicateAfterStartup-seed#[9478FB20054B12A5]) [    ] o.a.s.SolrTestCaseJ4 Writing core.properties file to /Users/jenkins/workspace/Lucene-Solr-5.x-MacOSX/solr/build/solr-core/test/J1/temp/solr.handler.TestReplicationHandler_9478FB20054B12A5-001/solr-instance-002/collection1
   [junit4]   2> 1797526 INFO  (TEST-TestReplicationHandler.doTestReplicateAfterStartup-seed#[9478FB20054B12A5]) [    ] o.e.j.s.Server jetty-9.2.13.v20150730
   [junit4]   2> 1797531 INFO  (TEST-TestReplicationHandler.doTestReplicateAfterStartup-seed#[9478FB20054B12A5]) [    ] o.e.j.s.h.ContextHandler Started o.e.j.s.ServletContextHandler@6ba2e91f{/solr,null,AVAILABLE}
   [junit4]   2> 1797531 INFO  (TEST-TestReplicationHandler.doTestReplicateAfterStartup-seed#[9478FB20054B12A5]) [    ] o.e.j.s.ServerConnector Started ServerConnector@1477296e{HTTP/1.1}{127.0.0.1:60161}
   [junit4]   2> 1797532 INFO  (TEST-TestReplicationHandler.doTestReplicateAfterStartup-seed#[9478FB20054B12A5]) [    ] o.e.j.s.Server Started @1803431ms
   [junit4]   2> 1797532 INFO  (TEST-TestReplicationHandler.doTestReplicateAfterStartup-seed#[9478FB20054B12A5]) [    ] o.a.s.c.s.e.JettySolrRunner Jetty properties: {solr.data.dir=/Users/jenkins/workspace/Lucene-Solr-5.x-MacOSX/solr/build/solr-core/test/J1/temp/solr.handler.TestReplicationHandler_9478FB20054B12A5-001/solr-instance-002/collection1/data, hostPort=60161, hostContext=/solr}
   [junit4]   2> 1797532 INFO  (TEST-TestReplicationHandler.doTestReplicateAfterStartup-seed#[9478FB20054B12A5]) [    ] o.a.s.s.SolrDispatchFilter SolrDispatchFilter.init(): sun.misc.Launcher$AppClassLoader@a2c6f70
   [junit4]   2> 1797532 INFO  (TEST-TestReplicationHandler.doTestReplicateAfterStartup-seed#[9478FB20054B12A5]) [    ] o.a.s.c.SolrResourceLoader new SolrResourceLoader for directory: '/Users/jenkins/workspace/Lucene-Solr-5.x-MacOSX/solr/build/solr-core/test/J1/temp/solr.handler.TestReplicationHandler_9478FB20054B12A5-001/solr-instance-002/'
   [junit4]   2> 1797532 INFO  (TEST-TestReplicationHandler.doTestReplicateAfterStartup-seed#[9478FB20054B12A5]) [    ] o.a.s.c.SolrResourceLoader JNDI not configured for solr (NoInitialContextEx)
   [junit4]   2> 1797532 INFO  (TEST-TestReplicationHandler.doTestReplicateAfterStartup-seed#[9478FB20054B12A5]) [    ] o.a.s.c.SolrResourceLoader solr home defaulted to 'solr/' (could not find system property or JNDI)
   [junit4]   2> 1797564 INFO  (TEST-TestReplicationHandler.doTestReplicateAfterStartup-seed#[9478FB20054B12A5]) [    ] o.a.s.c.SolrXmlConfig Loading container configuration from /Users/jenkins/workspace/Lucene-Solr-5.x-MacOSX/solr/build/solr-core/test/J1/temp/solr.handler.TestReplicationHandler_9478FB20054B12A5-001/solr-instance-002/solr.xml
   [junit4]   2> 1797595 INFO  (TEST-TestReplicationHandler.doTestReplicateAfterStartup-seed#[9478FB20054B12A5]) [    ] o.a.s.c.CoresLocator Config-defined core root directory: /Users/jenkins/workspace/Lucene-Solr-5.x-MacOSX/solr/build/solr-core/test/J1/temp/solr.handler.TestReplicationHandler_9478FB20054B12A5-001/solr-instance-002/.
   [junit4]   2> 1797595 INFO  (TEST-TestReplicationHandler.doTestReplicateAfterStartup-seed#[9478FB20054B12A5]) [    ] o.a.s.c.CoreContainer New CoreContainer 1112138219
   [junit4]   2> 1797595 INFO  (TEST-TestReplicationHandler.doTestReplicateAfterStartup-seed#[9478FB20054B12A5]) [    ] o.a.s.c.CoreContainer Loading cores into CoreContainer [instanceDir=/Users/jenkins/workspace/Lucene-Solr-5.x-MacOSX/solr/build/solr-core/test/J1/temp/solr.handler.TestReplicationHandler_9478FB20054B12A5-001/solr-instance-002/]
   [junit4]   2> 1797595 INFO  (TEST-TestReplicationHandler.doTestReplicateAfterStartup-seed#[9478FB20054B12A5]) [    ] o.a.s.c.CoreContainer loading shared library: /Users/jenkins/workspace/Lucene-Solr-5.x-MacOSX/solr/build/solr-core/test/J1/temp/solr.handler.TestReplicationHandler_9478FB20054B12A5-001/solr-instance-002/lib
   [junit4]   2> 1797595 WARN  (TEST-TestReplicationHandler.doTestReplicateAfterStartup-seed#[9478FB20054B12A5]) [    ] o.a.s.c.SolrResourceLoader Can't find (or read) directory to add to classloader: lib (resolved as: /Users/jenkins/workspace/Lucene-Solr-5.x-MacOSX/solr/build/solr-core/test/J1/temp/solr.handler.TestReplicationHandler_9478FB20054B12A5-001/solr-instance-002/lib).
   [junit4]   2> 1797608 INFO  (TEST-TestReplicationHandler.doTestReplicateAfterStartup-seed#[9478FB20054B12A5]) [    ] o.a.s.h.c.HttpShardHandlerFactory created with socketTimeout : 90000,urlScheme : ,connTimeout : 15000,maxConnectionsPerHost : 20,maxConnections : 10000,corePoolSize : 0,maximumPoolSize : 2147483647,maxThreadIdleTime : 5,sizeOfQueue : -1,fairnessPolicy : false,useRetries : false,
   [junit4]   2> 1797612 INFO  (TEST-TestReplicationHandler.doTestReplicateAfterStartup-seed#[9478FB20054B12A5]) [    ] o.a.s.u.UpdateShardHandler Creating UpdateShardHandler HTTP client with params: socketTimeout=340000&connTimeout=45000&retry=true
   [junit4]   2> 1797612 INFO  (TEST-TestReplicationHandler.doTestReplicateAfterStartup-seed#[9478FB20054B12A5]) [    ] o.a.s.l.LogWatcher SLF4J impl is org.slf4j.impl.Log4jLoggerFactory
   [junit4]   2> 1797612 INFO  (TEST-TestReplicationHandler.doTestReplicateAfterStartup-seed#[9478FB20054B12A5]) [    ] o.a.s.l.LogWatcher Registering Log Listener [Log4j (org.slf4j.impl.Log4jLoggerFactory)]
   [junit4]   2> 1797613 INFO  (TEST-TestReplicationHandler.doTestReplicateAfterStartup-seed#[9478FB20054B12A5]) [    ] o.a.s.c.CoreContainer Security conf doesn't exist. Skipping setup for authorization module.
   [junit4]   2> 1797613 INFO  (TEST-TestReplicationHandler.doTestReplicateAfterStartup-seed#[9478FB20054B12A5]) [    ] o.a.s.c.CoreContainer No authentication plugin used.
   [junit4]   2> 1797614 INFO  (TEST-TestReplicationHandler.doTestReplicateAfterStartup-seed#[9478FB20054B12A5]) [    ] o.a.s.c.CoresLocator Looking for core definitions underneath /Users/jenkins/workspace/Lucene-Solr-5.x-MacOSX/solr/build/solr-core/test/J1/temp/solr.handler.TestReplicationHandler_9478FB20054B12A5-001/solr-instance-002/.
   [junit4]   2> 1797617 INFO  (TEST-TestReplicationHandler.doTestReplicateAfterStartup-seed#[9478FB20054B12A5]) [    ] o.a.s.c.SolrCore Created CoreDescriptor: {configSetProperties=configsetprops.json, instanceDir=/Users/jenkins/workspace/Lucene-Solr-5.x-MacOSX/solr/build/solr-core/test/J1/temp/solr.handler.TestReplicationHandler_9478FB20054B12A5-001/solr-instance-002/./collection1, config=solrconfig.xml, transient=false, loadOnStartup=true, absoluteInstDir=/Users/jenkins/workspace/Lucene-Solr-5.x-MacOSX/solr/build/solr-core/test/J1/temp/solr.handler.TestReplicationHandler_9478FB20054B12A5-001/solr-instance-002/./collection1/, dataDir=data/, name=collection1, schema=schema.xml}
   [junit4]   2> 1797617 INFO  (TEST-TestReplicationHandler.doTestReplicateAfterStartup-seed#[9478FB20054B12A5]) [    ] o.a.s.c.CoresLocator Found core collection1 in /Users/jenkins/workspace/Lucene-Solr-5.x-MacOSX/solr/build/solr-core/test/J1/temp/solr.handler.TestReplicationHandler_9478FB20054B12A5-001/solr-instance-002/./collection1/
   [junit4]   2> 1797617 INFO  (TEST-TestReplicationHandler.doTestReplicateAfterStartup-seed#[9478FB20054B12A5]) [    ] o.a.s.c.CoresLocator Found 1 core definitions
   [junit4]   2> 1797618 INFO  (coreLoadExecutor-5229-thread-1) [    ] o.a.s.c.SolrResourceLoader new SolrResourceLoader for directory: '/Users/jenkins/workspace/Lucene-Solr-5.x-MacOSX/solr/build/solr-core/test/J1/temp/solr.handler.TestReplicationHandler_9478FB20054B12A5-001/solr-instance-002/./collection1/'
   [junit4]   2> 1797618 INFO  (TEST-TestReplicationHandler.doTestReplicateAfterStartup-seed#[9478FB20054B12A5]) [    ] o.a.s.s.SolrDispatchFilter user.dir=/Users/jenkins/workspace/Lucene-Solr-5.x-MacOSX/solr/build/solr-core/test/J1
   [junit4]   2> 1797619 INFO  (TEST-TestReplicationHandler.doTestReplicateAfterStartup-seed#[9478FB20054B12A5]) [    ] o.a.s.s.SolrDispatchFilter SolrDispatchFilter.init() done
   [junit4]   2> 1797619 INFO  (coreLoadExecutor-5229-thread-1) [    ] o.a.s.c.SolrResourceLoader JNDI not configured for solr (NoInitialContextEx)
   [junit4]   2> 1797619 INFO  (coreLoadExecutor-5229-thread-1) [    ] o.a.s.c.SolrResourceLoader solr home defaulted to 'solr/' (could not find system property or JNDI)
   [junit4]   2> 1797655 INFO  (coreLoadExecutor-5229-thread-1) [    ] o.a.s.c.SolrConfig current version of requestparams : -1
   [junit4]   2> 1797675 INFO  (coreLoadExecutor-5229-thread-1) [    ] o.a.s.c.SolrConfig Using Lucene MatchVersion: 5.4.0
   [junit4]   2> 1797722 INFO  (coreLoadExecutor-5229-thread-1) [    ] o.a.s.c.Config Loaded SolrConfig: solrconfig.xml
   [junit4]   2> 1797722 INFO  (coreLoadExecutor-5229-thread-1) [    ] o.a.s.s.IndexSchema Reading Solr Schema from /Users/jenkins/workspace/Lucene-Solr-5.x-MacOSX/solr/build/solr-core/test/J1/temp/solr.handler.TestReplicationHandler_9478FB20054B12A5-001/solr-instance-002/./collection1/conf/schema.xml
   [junit4]   2> 1797726 INFO  (coreLoadExecutor-5229-thread-1) [    ] o.a.s.s.IndexSchema [collection1] Schema name=test
   [junit4]   2> 1797738 INFO  (coreLoadExecutor-5229-thread-1) [    ] o.a.s.s.IndexSchema unique key field: id
   [junit4]   2> 1797741 INFO  (coreLoadExecutor-5229-thread-1) [    ] o.a.s.c.ConfigSetProperties Did not find ConfigSet properties, assuming default properties: Can't find resource 'configsetprops.json' in classpath or '/Users/jenkins/workspace/Lucene-Solr-5.x-MacOSX/solr/build/solr-core/test/J1/temp/solr.handler.TestReplicationHandler_9478FB20054B12A5-001/solr-instance-002/./collection1/conf'
   [junit4]   2> 1797741 INFO  (coreLoadExecutor-5229-thread-1) [    ] o.a.s.c.CoreContainer Creating SolrCore 'collection1' using configuration from instancedir /Users/jenkins/workspace/Lucene-Solr-5.x-MacOSX/solr/build/solr-core/test/J1/temp/solr.handler.TestReplicationHandler_9478FB20054B12A5-001/solr-instance-002/./collection1
   [junit4]   2> 1797742 INFO  (coreLoadExecutor-5229-thread-1) [    x:collection1] o.a.s.c.SolrCore org.apache.solr.core.MockDirectoryFactory
   [junit4]   2> 1797742 INFO  (coreLoadExecutor-5229-thread-1) [    x:collection1] o.a.s.c.SolrCore [[collection1] ] Opening new SolrCore at [/Users/jenkins/workspace/Lucene-Solr-5.x-MacOSX/solr/build/solr-core/test/J1/temp/solr.handler.TestReplicationHandler_9478FB20054B12A5-001/solr-instance-002/./collection1/], dataDir=[null]
   [junit4]   2> 1797742 INFO  (coreLoadExecutor-5229-thread-1) [    x:collection1] o.a.s.c.SolrCore JMX monitoring not detected for core: collection1
   [junit4]   2> 1797742 INFO  (coreLoadExecutor-5229-thread-1) [    x:collection1] o.a.s.c.CachingDirectoryFactory return new directory for /Users/jenkins/workspace/Lucene-Solr-5.x-MacOSX/solr/build/solr-core/test/J1/temp/solr.handler.TestReplicationHandler_9478FB20054B12A5-001/solr-instance-002/./collection1/data
   [junit4]   2> 1797743 INFO  (coreLoadExecutor-5229-thread-1) [    x:collection1] o.a.s.c.SolrCore New index directory detected: old=null new=/Users/jenkins/workspace/Lucene-Solr-5.x-MacOSX/solr/build/solr-core/test/J1/temp/solr.handler.TestReplicationHandler_9478FB20054B12A5-001/solr-instance-002/./collection1/data/index/
   [junit4]   2> 1797743 WARN  (coreLoadExecutor-5229-thread-1) [    x:collection1] o.a.s.c.SolrCore [collection1] Solr index directory '/Users/jenkins/workspace/Lucene-Solr-5.x-MacOSX/solr/build/solr-core/test/J1/temp/solr.handler.TestReplicationHandler_9478FB20054B12A5-001/solr-instance-002/./collection1/data/index' doesn't exist. Creating new index...
   [junit4]   2> 1797743 INFO  (coreLoadExecutor-5229-thread-1) [    x:collection1] o.a.s.c.CachingDirectoryFactory return new directory for /Users/jenkins/workspace/Lucene-Solr-5.x-MacOSX/solr/build/solr-core/test/J1/temp/solr.handler.TestReplicationHandler_9478FB20054B12A5-001/solr-instance-002/./collection1/data/index
   [junit4]   2> 1797744 INFO  (coreLoadExecutor-5229-thread-1) [    x:collection1] o.a.s.u.RandomMergePolicy RandomMergePolicy wrapping class org.apache.lucene.index.TieredMergePolicy: [TieredMergePolicy: maxMergeAtOnce=12, maxMergeAtOnceExplicit=16, maxMergedSegmentMB=88.05859375, floorSegmentMB=1.2021484375, forceMergeDeletesPctAllowed=21.68733320144119, segmentsPerTier=15.0, maxCFSSegmentSizeMB=8.796093022207999E12, noCFSRatio=0.0
   [junit4]   2> 1797744 INFO  (coreLoadExecutor-5229-thread-1) [    x:collection1] o.a.s.c.SolrCore SolrDeletionPolicy.onCommit: commits: num=1
   [junit4]   2> 	commit{dir=MockDirectoryWrapper(RAMDirectory@6a38efba lockFactory=org.apache.lucene.store.SingleInstanceLockFactory@4002d2d1),segFN=segments_1,generation=1}
   [junit4]   2> 1797744 INFO  (coreLoadExecutor-5229-thread-1) [    x:collection1] o.a.s.c.SolrCore newest commit generation = 1
   [junit4]   2> 1797745 INFO  (OldIndexDirectoryCleanupThreadForCore-collection1) [    x:collection1] o.a.s.c.SolrCore Looking for old index directories to cleanup for core collection1 in /Users/jenkins/workspace/Lucene-Solr-5.x-MacOSX/solr/build/solr-core/test/J1/temp/solr.handler.TestReplicationHandler_9478FB20054B12A5-001/solr-instance-002/./collection1/data/
   [junit4]   2> 1797748 INFO  (coreLoadExecutor-5229-thread-1) [    x:collection1] o.a.s.c.SolrCore no updateRequestProcessorChain defined as default, creating implicit default
   [junit4]   2> 1797761 INFO  (coreLoadExecutor-5229-thread-1) [    x:collection1] o.a.s.h.l.XMLLoader xsltCacheLifetimeSeconds=60
   [junit4]   2> 1797763 INFO  (coreLoadExecutor-5229-thread-1) [    x:collection1] o.a.s.h.l.XMLLoader xsltCacheLifetimeSeconds=60
   [junit4]   2> 1797765 INFO  (coreLoadExecutor-5229-thread-1) [    x:collection1] o.a.s.h.l.XMLLoader xsltCacheLifetimeSeconds=60
   [junit4]   2> 1797767 INFO  (coreLoadExecutor-5229-thread-1) [    x:collection1] o.a.s.h.l.XMLLoader xsltCacheLifetimeSeconds=60
   [junit4]   2> 1797771 INFO  (coreLoadExecutor-5229-thread-1) [    x:collection1] o.a.s.c.PluginBag requestHandler : 'lazy' created with startup=lazy 
   [junit4]   2> 1797771 INFO  (coreLoadExecutor-5229-thread-1) [    x:collection1] o.a.s.c.RequestHandlers Registered paths: /admin/segments,/admin/ping,/admin/luke,lazy,defaults,standard,/admin/file,/update/json,/schema,/update,/update/csv,/admin/logging,/update/json/docs,/replication,/config,/get,/admin/threads,/admin/plugins,/admin/mbeans,/admin/properties,/admin/system
   [junit4]   2> 1797773 INFO  (coreLoadExecutor-5229-thread-1) [    x:collection1] o.a.s.c.SolrCore Using default statsCache cache: org.apache.solr.search.stats.LocalStatsCache
   [junit4]   2> 1797775 INFO  (coreLoadExecutor-5229-thread-1) [    x:collection1] o.a.s.c.SolrCore Hard AutoCommit: disabled
   [junit4]   2> 1797775 INFO  (coreLoadExecutor-5229-thread-1) [    x:collection1] o.a.s.c.SolrCore Soft AutoCommit: disabled
   [junit4]   2> 1797775 INFO  (coreLoadExecutor-5229-thread-1) [    x:collection1] o.a.s.u.RandomMergePolicy RandomMergePolicy wrapping class org.apache.lucene.index.TieredMergePolicy: [TieredMergePolicy: maxMergeAtOnce=50, maxMergeAtOnceExplicit=17, maxMergedSegmentMB=40.498046875, floorSegmentMB=2.00390625, forceMergeDeletesPctAllowed=20.145742417588103, segmentsPerTier=22.0, maxCFSSegmentSizeMB=8.796093022207999E12, noCFSRatio=0.1067098211106913
   [junit4]   2> 1797775 INFO  (coreLoadExecutor-5229-thread-1) [    x:collection1] o.a.s.c.SolrCore SolrDeletionPolicy.onInit: commits: num=1
   [junit4]   2> 	commit{dir=MockDirectoryWrapper(RAMDirectory@6a38efba lockFactory=org.apache.lucene.store.SingleInstanceLockFactory@4002d2d1),segFN=segments_1,generation=1}
   [junit4]   2> 1797775 INFO  (coreLoadExecutor-5229-thread-1) [    x:collection1] o.a.s.c.SolrCore newest commit generation = 1
   [junit4]   2> 1797776 INFO  (coreLoadExecutor-5229-thread-1) [    x:collection1] o.a.s.s.SolrIndexSearcher Opening Searcher@4b401a8e[collection1] main
   [junit4]   2> 1797776 INFO  (coreLoadExecutor-5229-thread-1) [    x:collection1] o.a.s.r.ManagedResourceStorage File-based storage initialized to use dir: /Users/jenkins/workspace/Lucene-Solr-5.x-MacOSX/solr/build/solr-core/test/J1/temp/solr.handler.TestReplicationHandler_9478FB20054B12A5-001/solr-instance-002/./collection1/conf
   [junit4]   2> 1797776 INFO  (coreLoadExecutor-5229-thread-1) [    x:collection1] o.a.s.r.RestManager Initializing RestManager with initArgs: {storageDir=/Users/jenkins/workspace/Lucene-Solr-5.x-MacOSX/solr/build/solr-core/test/J1/temp/solr.handler.TestReplicationHandler_9478FB20054B12A5-001/solr-instance-002/./collection1/conf}
   [junit4]   2> 1797776 INFO  (coreLoadExecutor-5229-thread-1) [    x:collection1] o.a.s.r.ManagedResourceStorage Reading _rest_managed.json using file:dir=/Users/jenkins/workspace/Lucene-Solr-5.x-MacOSX/solr/build/solr-core/test/J1/temp/solr.handler.TestReplicationHandler_9478FB20054B12A5-001/solr-instance-002/./collection1/conf
   [junit4]   2> 1797777 INFO  (coreLoadExecutor-5229-thread-1) [    x:collection1] o.a.s.r.RestManager Initializing 0 registered ManagedResources
   [junit4]   2> 1797785 INFO  (coreLoadExecutor-5229-thread-1) [    x:collection1] o.a.s.h.ReplicationHandler Poll scheduled at an interval of 1000ms
   [junit4]   2> 1797786 INFO  (coreLoadExecutor-5229-thread-1) [    x:collection1] o.a.s.c.CoreContainer registering core: collection1
   [junit4]   2> 1797786 INFO  (searcherExecutor-5230-thread-1-processing-x:collection1) [    x:collection1] o.a.s.c.SolrCore [collection1] Registered new searcher Searcher@4b401a8e[collection1] main{ExitableDirectoryReader(UninvertingDirectoryReader())}
   [junit4]   2> 1797797 INFO  (qtp654168686-11131) [    x:collection1] o.a.s.c.S.Request [collection1] webapp=/solr path=/replication params={version=2&wt=javabin&qt=/replication&command=indexversion} status=0 QTime=1 
   [junit4]   2> 1798123 INFO  (TEST-TestReplicationHandler.doTestReplicateAfterStartup-seed#[9478FB20054B12A5]) [    ] o.e.j.s.ServerConnector Stopped ServerConnector@1477296e{HTTP/1.1}{127.0.0.1:0}
   [junit4]   2> 1798123 INFO  (TEST-TestReplicationHandler.doTestReplicateAfterStartup-seed#[9478FB20054B12A5]) [    ] o.a.s.c.CoreContainer Shutting down CoreContainer instance=1112138219
   [junit4]   2> 1798124 INFO  (TEST-TestReplicationHandler.doTestReplicateAfterStartup-seed#[9478FB20054B12A5]) [    x:collection1] o.a.s.c.SolrCore [collection1]  CLOSING SolrCore org.apache.solr.core.SolrCore@2866dc7a
   [junit4]   2> 1798124 INFO  (TEST-TestReplicationHandler.doTestReplicateAfterStartup-seed#[9478FB20054B12A5]) [    x:collection1] o.a.s.u.UpdateHandler closing DirectUpdateHandler2{commits=0,autocommits=0,soft autocommits=0,optimizes=0,rollbacks=0,expungeDeletes=0,docsPending=0,adds=0,deletesById=0,deletesByQuery=0,errors=0,cumulative_adds=0,cumulative_deletesById=0,cumulative_deletesByQuery=0,cumulative_errors=0}
   [junit4]   2> 1798124 INFO  (TEST-TestReplicationHandler.doTestReplicateAfterStartup-seed#[9478FB20054B12A5]) [    x:collection1] o.a.s.u.SolrCoreState Closing SolrCoreState
   [junit4]   2> 1798124 INFO  (TEST-TestReplicationHandler.doTestReplicateAfterStartup-seed#[9478FB20054B12A5]) [    x:collection1] o.a.s.u.DefaultSolrCoreState SolrCoreState ref count has reached 0 - closing IndexWriter
   [junit4]   2> 1798124 INFO  (TEST-TestReplicationHandler.doTestReplicateAfterStartup-seed#[9478FB20054B12A5]) [    x:collection1] o.a.s.u.DefaultSolrCoreState closing IndexWriter with IndexWriterCloser
   [junit4]   2> 1798126 INFO  (TEST-TestReplicationHandler.doTestReplicateAfterStartup-seed#[9478FB20054B12A5]) [    x:collection1] o.a.s.c.SolrCore [collection1] Closing main searcher on request.
   [junit4]   2> 1798126 INFO  (TEST-TestReplicationHandler.doTestReplicateAfterStartup-seed#[9478FB20054B12A5]) [    x:collection1] o.a.s.c.CachingDirectoryFactory Closing MockDirectoryFactory - 2 directories currently being tracked
   [junit4]   2> 1798127 INFO  (TEST-TestReplicationHandler.doTestReplicateAfterStartup-seed#[9478FB20054B12A5]) [    x:collection1] o.a.s.c.CachingDirectoryFactory looking to close /Users/jenkins/workspace/Lucene-Solr-5.x-MacOSX/solr/build/solr-core/test/J1/temp/solr.handler.TestReplicationHandler_9478FB20054B12A5-001/solr-instance-002/./collection1/data/index [CachedDir<<refCount=0;path=/Users/jenkins/workspace/Lucene-Solr-5.x-MacOSX/solr/build/solr-core/test/J1/temp/solr.handler.TestReplicationHandler_9478FB20054B12A5-001/solr-instance-002/./collection1/data/index;done=false>>]
   [junit4]   2> 1798127 INFO  (TEST-TestReplicationHandler.doTestReplicateAfterStartup-seed#[9478FB20054B12A5]) [    x:collection1] o.a.s.c.CachingDirectoryFactory Closing directory: /Users/jenkins/workspace/Lucene-Solr-5.x-MacOSX/solr/build/solr-core/test/J1/temp/solr.handler.TestReplicationHandler_9478FB20054B12A5-001/solr-instance-002/./collection1/data/index
   [junit4]   2> 1798127 INFO  (TEST-TestReplicationHandler.doTestReplicateAfterStartup-seed#[9478FB20054B12A5]) [    x:collection1] o.a.s.c.CachingDirectoryFactory looking to close /Users/jenkins/workspace/Lucene-Solr-5.x-MacOSX/solr/build/solr-core/test/J1/temp/solr.handler.TestReplicationHandler_9478FB20054B12A5-001/solr-instance-002/./collection1/data [CachedDir<<refCount=0;path=/Users/jenkins/workspace/Lucene-Solr-5.x-MacOSX/solr/build/solr-core/test/J1/temp/solr.handler.TestReplicationHandler_9478FB20054B12A5-001/solr-instance-002/./collection1/data;done=false>>]
   [junit4]   2> 1798127 INFO  (TEST-TestReplicationHandler.doTestReplicateAfterStartup-seed#[9478FB20054B12A5]) [    x:collection1] o.a.s.c.CachingDirectoryFactory Closing directory: /Users/jenkins/workspace/Lucene-Solr-5.x-MacOSX/solr/build/solr-core/test/J1/temp/solr.handler.TestReplicationHandler_9478FB20054B12A5-001/solr-instance-002/./collection1/data
   [junit4]   2> 1798128 INFO  (TEST-TestReplicationHandler.doTestReplicateAfterStartup-seed#[9478FB20054B12A5]) [    x:collection1] o.e.j.s.h.ContextHandler Stopped o.e.j.s.ServletContextHandler@6ba2e91f{/solr,null,UNAVAILABLE}
   [junit4]   2> 1798131 INFO  (qtp654168686-11133) [    x:collection1] o.a.s.c.SolrCore [collection1] REMOVING ALL DOCUMENTS FROM INDEX
   [junit4]   2> 1798131 INFO  (qtp654168686-11133) [    x:collection1] o.a.s.u.p.LogUpdateProcessor [collection1] webapp=/solr path=/update params={version=2&wt=javabin} {deleteByQuery=*:*} 0 0
   [junit4]   2> 1798134 INFO  (qtp654168686-11134) [    x:collection1] o.a.s.u.UpdateHandler start commit{,optimize=false,openSearcher=true,waitSearcher=true,expungeDeletes=false,softCommit=false,prepareCommit=false}
   [junit4]   2> 1798136 INFO  (qtp654168686-11134) [    x:collection1] o.a.s.c.SolrCore SolrDeletionPolicy.onCommit: commits: num=2
   [junit4]   2> 	commit{dir=MockDirectoryWrapper(RAMDirectory@6b19cf lockFactory=org.apache.lucene.store.SingleInstanceLockFactory@776b653f),segFN=segments_1,generation=1}
   [junit4]   2> 	commit{dir=MockDirectoryWrapper(RAMDirectory@6b19cf lockFactory=org.apache.lucene.store.SingleInstanceLockFactory@776b653f),segFN=segments_2,generation=2}
   [junit4]   2> 1798137 INFO  (qtp654168686-11134) [    x:collection1] o.a.s.c.SolrCore newest commit generation = 2
   [junit4]   2> 1798137 INFO  (qtp654168686-11134) [    x:collection1] o.a.s.s.SolrIndexSearcher Opening Searcher@54a5f841[collection1] main
   [junit4]   2> 1798137 INFO  (qtp654168686-11134) [    x:collection1] o.a.s.u.UpdateHandler end_commit_flush
   [junit4]   2> 1798137 INFO  (searcherExecutor-5220-thread-1-processing-x:collection1) [    x:collection1] o.a.s.c.SolrCore [collection1] Registered new searcher Searcher@54a5f841[collection1] main{ExitableDirectoryReader(UninvertingDirectoryReader())}
   [junit4]   2> 1798137 INFO  (qtp654168686-11134) [    x:collection1] o.a.s.u.p.LogUpdateProcessor [collection1] webapp=/solr path=/update params={version=2&wt=javabin&commit=true&waitSearcher=true&softCommit=false} {commit=} 0 3
   [junit4]   2> 1798141 INFO  (TEST-TestReplicationHandler.doTestReplicateAfterStartup-seed#[9478FB20054B12A5]) [    ] o.e.j.s.ServerConnector Stopped ServerConnector@14ce49b9{HTTP/1.1}{127.0.0.1:0}
   [junit4]   2> 1798141 INFO  (TEST-TestReplicationHandler.doTestReplicateAfterStartup-seed#[9478FB20054B12A5]) [    ] o.a.s.c.CoreContainer Shutting down CoreContainer instance=566840302
   [junit4]   2> 1798142 INFO  (TEST-TestReplicationHandler.doTestReplicateAfterStartup-seed#[9478FB20054B12A5]) [    x:collection1] o.a.s.c.SolrCore [collection1]  CLOSING SolrCore org.apache.solr.core.SolrCore@3a0e1272
   [junit4]   2> 1798142 INFO  (TEST-TestReplicationHandler.doTestReplicateAfterStartup-seed#[9478FB20054B12A5]) [    x:collection1] o.a.s.u.UpdateHandler closing DirectUpdateHandler2{commits=1,autocommits=0,soft autocommits=0,optimizes=0,rollbacks=0,expungeDeletes=0,docsPending=0,adds=0,deletesById=0,deletesByQuery=0,errors=0,cumulative_adds=0,cumulative_deletesById=0,cumulative_deletesByQuery=1,cumulative_errors=0}
   [junit4]   2> 1798142 INFO  (TEST-TestReplicationHandler.doTestReplicateAfterStartup-seed#[9478FB20054B12A5]) [    x:collection1] o.a.s.u.SolrCoreState Closing SolrCoreState
   [junit4]   2> 1798142 INFO  (TEST-TestReplicationHandler.doTestReplicateAfterStartup-seed#[9478FB20054B12A5]) [    x:collection1] o.a.s.u.DefaultSolrCoreState SolrCoreState ref count has reached 0 - closing IndexWriter
   [junit4]   2> 1798142 INFO  (TEST-TestReplicationHandler.doTestReplicateAfterStartup-seed#[9478FB20054B12A5]) [    x:collection1] o.a.s.u.DefaultSolrCoreState closing IndexWriter with IndexWriterCloser
   [junit4]   2> 1798143 INFO  (TEST-TestReplicationHandler.doTestReplicateAfterStartup-seed#[9478FB20054B12A5]) [    x:collection1] o.a.s.c.SolrCore [collection1] Closing main searcher on request.
   [junit4]   2> 1798143 INFO  (TEST-TestReplicationHandler.doTestReplicateAfterStartup-seed#[9478FB20054B12A5]) [    x:collection1] o.a.s.c.CachingDirectoryFactory Closing MockDirectoryFactory - 2 directories currently being tracked
   [junit4]   2> 1798143 INFO  (TEST-TestReplicationHandler.doTestReplicateAfterStartup-seed#[9478FB20054B12A5]) [    x:collection1] o.a.s.c.CachingDirectoryFactory looking to close /Users/jenkins/workspace/Lucene-Solr-5.x-MacOSX/solr/build/solr-core/test/J1/temp/solr.handler.TestReplicationHandler_9478FB20054B12A5-001/solr-instance-001/./collection1/data [CachedDir<<refCount=0;path=/Users/jenkins/workspace/Lucene-Solr-5.x-MacOSX/solr/build/solr-core/test/J1/temp/solr.handler.TestReplicationHandler_9478FB20054B12A5-001/solr-instance-001/./collection1/data;done=false>>]
   [junit4]   2> 1798143 INFO  (TEST-TestReplicationHandler.doTestReplicateAfterStartup-seed#[9478FB20054B12A5]) [    x:collection1] o.a.s.c.CachingDirectoryFactory Closing directory: /Users/jenkins/workspace/Lucene-Solr-5.x-MacOSX/solr/build/solr-core/test/J1/temp/solr.handler.TestReplicationHandler_9478FB20054B12A5-001/solr-instance-001/./collection1/data
   [junit4]   2> 1798143 INFO  (TEST-TestReplicationHandler.doTestReplicateAfterStartup-seed#[9478FB20054B12A5]) [    x:collection1] o.a.s.c.CachingDirectoryFactory looking to close /Users/jenkins/workspace/Lucene-Solr-5.x-MacOSX/solr/build/solr-core/test/J1/temp/solr.handler.TestReplicationHandler_9478FB20054B12A5-001/solr-instance-001/./collection1/data/index [CachedDir<<refCount=0;path=/Users/jenkins/workspace/Lucene-Solr-5.x-MacOSX/solr/build/solr-core/test/J1/temp/solr.handler.TestReplicationHandler_9478FB20054B12A5-001/solr-instance-001/./collection1/data/index;done=false>>]
   [junit4]   2> 1798143 INFO  (TEST-TestReplicationHandler.doTestReplicateAfterStartup-seed#[9478FB20054B12A5]) [    x:collection1] o.a.s.c.CachingDirectoryFactory Closing directory: /Users/jenkins/workspace/Lucene-Solr-5.x-MacOSX/solr/build/solr-core/test/J1/temp/solr.handler.TestReplicationHandler_9478FB20054B12A5-001/solr-instance-001/./collection1/data/index
   [junit4]   2> 1798144 INFO  (TEST-TestReplicationHandler.doTestReplicateAfterStartup-seed#[9478FB20054B12A5]) [    x:collection1] o.e.j.s.h.ContextHandler Stopped o.e.j.s.ServletContextHandler@456b80b2{/solr,null,UNAVAILABLE}
   [junit4]   2> 1798148 INFO  (TEST-TestReplicationHandler.doTestReplicateAfterStartup-seed#[9478FB20054B12A5]) [    ] o.e.j.s.Server jetty-9.2.13.v20150730
   [junit4]   2> 1798152 INFO  (TEST-TestReplicationHandler.doTestReplicateAfterStartup-seed#[9478FB20054B12A5]) [    ] o.e.j.s.h.ContextHandler Started o.e.j.s.ServletContextHandler@10e3ac20{/solr,null,AVAILABLE}
   [junit4]   2> 1798153 INFO  (TEST-TestReplicationHandler.doTestReplicateAfterStartup-seed#[9478FB20054B12A5]) [    ] o.e.j.s.ServerConnector Started ServerConnector@53397189{HTTP/1.1}{127.0.0.1:60172}
   [junit4]   2> 1798153 INFO  (TEST-TestReplicationHandler.doTestReplicateAfterStartup-seed#[9478FB20054B12A5]) [    ] o.e.j.s.Server Started @1804052ms
   [junit4]   2> 1798153 INFO  (TEST-TestReplicationHandler.doTestReplicateAfterStartup-seed#[9478FB20054B12A5]) [    ] o.a.s.c.s.e.JettySolrRunner Jetty properties: {hostContext=/solr, solr.data.dir=/Users/jenkins/workspace/Lucene-Solr-5.x-MacOSX/solr/build/solr-core/test/J1/temp/solr.handler.TestReplicationHandler_9478FB20054B12A5-001/solr-instance-001/collection1/data, hostPort=60172}
   [junit4]   2> 1798153 INFO  (TEST-TestReplicationHandler.doTestReplicateAfterStartup-seed#[9478FB20054B12A5]) [    ] o.a.s.s.SolrDispatchFilter SolrDispatchFilter.init(): sun.misc.Launcher$AppClassLoader@a2c6f70
   [junit4]   2> 1798153 INFO  (TEST-TestReplicationHandler.doTestReplicateAfterStartup-seed#[9478FB20054B12A5]) [    ] o.a.s.c.SolrResourceLoader new SolrResourceLoader for directory: '/Users/jenkins/workspace/Lucene-Solr-5.x-MacOSX/solr/build/solr-core/test/J1/temp/solr.handler.TestReplicationHandler_9478FB20054B12A5-001/solr-instance-001/'
   [junit4]   2> 1798154 INFO  (TEST-TestReplicationHandler.doTestReplicateAfterStartup-seed#[9478FB20054B12A5]) [    ] o.a.s.c.SolrResourceLoader JNDI not configured for solr (NoInitialContextEx)
   [junit4]   2> 1798154 INFO  (TEST-TestReplicationHandler.doTestReplicateAfterStartup-seed#[9478FB20054B12A5]) [    ] o.a.s.c.SolrResourceLoader solr home defaulted to 'solr/' (could not find system property or JNDI)
   [junit4]   2> 1798192 INFO  (TEST-TestReplicationHandler.doTestReplicateAfterStartup-seed#[9478FB20054B12A5]) [    ] o.a.s.c.SolrXmlConfig Loading container configuration from /Users/jenkins/workspace/Lucene-Solr-5.x-MacOSX/solr/build/solr-core/test/J1/temp/solr.handler.TestReplicationHandler_9478FB20054B12A5-001/solr-instance-001/solr.xml
   [junit4]   2> 1798227 INFO  (TEST-TestReplicationHandler.doTestReplicateAfterStartup-seed#[9478FB20054B12A5]) [    ] o.a.s.c.CoresLocator Config-defined core root directory: /Users/jenkins/workspace/Lucene-Solr-5.x-MacOSX/solr/build/solr-core/test/J1/temp/solr.handler.TestReplicationHandler_9478FB20054B12A5-001/solr-instance-001/.
   [junit4]   2> 1798227 INFO  (TEST-TestReplicationHandler.doTestReplicateAfterStartup-seed#[9478FB20054B12A5]) [    ] o.a.s.c.CoreContainer New CoreContainer 537540718
   [junit4]   2> 1798227 INFO  (TEST-TestReplicationHandler.doTestReplicateAfterStartup-seed#[9478FB20054B12A5]) [    ] o.a.s.c.CoreContainer Loading cores into CoreContainer [instanceDir=/Users/jenkins/workspace/Lucene-Solr-5.x-MacOSX/solr/build/solr-core/test/J1/temp/solr.handler.TestReplicationHandler_9478FB20054B12A5-001/solr-instance-001/]
   [junit4]   2> 1798227 INFO  (TEST-TestReplicationHandler.doTestReplicateAfterStartup-seed#[9478FB20054B12A5]) [    ] o.a.s.c.CoreContainer loading shared library: /Users/jenkins/workspace/Lucene-Solr-5.x-MacOSX/solr/build/solr-core/test/J1/temp/solr.handler.TestReplicationHandler_9478FB20054B12A5-001/solr-instance-001/lib
   [junit4]   2> 1798227 WARN  (TEST-TestReplicationHandler.doTestReplicateAfterStartup-seed#[9478FB20054B12A5]) [    ] o.a.s.c.SolrResourceLoader Can't find (or read) directory to add to classloader: lib (resolved as: /Users/jenkins/workspace/Lucene-Solr-5.x-MacOSX/solr/build/solr-core/test/J1/temp/solr.handler.TestReplicationHandler_9478FB20054B12A5-001/solr-instance-001/lib).
   [junit4]   2> 1798240 INFO  (TEST-TestReplicationHandler.doTestReplicateAfterStartup-seed#[9478FB20054B12A5]) [    ] o.a.s.h.c.HttpShardHandlerFactory created with socketTimeout : 90000,urlScheme : ,connTimeout : 15000,maxConnectionsPerHost : 20,maxConnections : 10000,corePoolSize : 0,maximumPoolSize : 2147483647,maxThreadIdleTime : 5,sizeOfQueue : -1,fairnessPolicy : false,useRetries : false,
   [junit4]   2> 1798244 INFO  (TEST-TestReplicationHandler.doTestReplicateAfterStartup-seed#[9478FB20054B12A5]) [    ] o.a.s.u.UpdateShardHandler Creating UpdateShardHandler HTTP client with params: socketTimeout=340000&connTimeout=45000&retry=true
   [junit4]   2> 1798245 INFO  (TEST-TestReplicationHandler.doTestReplicateAfterStartup-seed#[9478FB20054B12A5]) [    ] o.a.s.l.LogWatcher SLF4J impl is org.slf4j.impl.Log4jLoggerFactory
   [junit4]   2> 1798245 INFO  (TEST-TestReplicationHandler.doTestReplicateAfterStartup-seed#[9478FB20054B12A5]) [    ] o.a.s.l.LogWatcher Registering Log Listener [Log4j (org.slf4j.impl.Log4jLoggerFactory)]
   [junit4]   2> 1798245 INFO  (TEST-TestReplicationHandler.doTestReplicateAfterStartup-seed#[9478FB20054B12A5]) [    ] o.a.s.c.CoreContainer Security conf doesn't exist. Skipping setup for authorization module.
   [junit4]   2> 1798245 INFO  (TEST-TestReplicationHandler.doTestReplicateAfterStartup-seed#[9478FB20054B12A5]) [    ] o.a.s.c.CoreContainer No authentication plugin used.
   [junit4]   2> 1798246 INFO  (TEST-TestReplicationHandler.doTestReplicateAfterStartup-seed#[9478FB20054B12A5]) [    ] o.a.s.c.CoresLocator Looking for core definitions underneath /Users/jenkins/workspace/Lucene-Solr-5.x-MacOSX/solr/build/solr-core/test/J1/temp/solr.handler.TestReplicationHandler_9478FB20054B12A5-001/solr-instance-001/.
   [junit4]   2> 1798248 INFO  (TEST-TestReplicationHandler.doTestReplicateAfterStartup-seed#[9478FB20054B12A5]) [    ] o.a.s.c.SolrCore Created CoreDescriptor: {transient=false, name=collection1, loadOnStartup=true, dataDir=data/, config=solrconfig.xml, schema=schema.xml, instanceDir=/Users/jenkins/workspace/Lucene-Solr-5.x-MacOSX/solr/build/solr-core/test/J1/temp/solr.handler.TestReplicationHandler_9478FB20054B12A5-001/solr-instance-001/./collection1, absoluteInstDir=/Users/jenkins/workspace/Lucene-Solr-5.x-MacOSX/solr/build/solr-core/test/J1/temp/solr.handler.TestReplicationHandler_9478FB20054B12A5-001/solr-instance-001/./collection1/, configSetProperties=configsetprops.json}
   [junit4]   2> 1798249 INFO  (TEST-TestReplicationHandler.doTestReplicateAfterStartup-seed#[9478FB20054B12A5]) [    ] o.a.s.c.CoresLocator Found core collection1 in /Users/jenkins/workspace/Lucene-Solr-5.x-MacOSX/solr/build/solr-core/test/J1/temp/solr.handler.TestReplicationHandler_9478FB20054B12A5-001/solr-instance-001/./collection1/
   [junit4]   2> 1798249 INFO  (TEST-TestReplicationHandler.doTestReplicateAfterStartup-seed#[9478FB20054B12A5]) [    ] o.a.s.c.CoresLocator Found 1 core definitions
   [junit4]   2> 1798249 INFO  (coreLoadExecutor-5240-thread-1) [    ] o.a.s.c.SolrResourceLoader new SolrResourceLoader for directory: '/Users/jenkins/workspace/Lucene-Solr-5.x-MacOSX/solr/build/solr-core/test/J1/temp/solr.handler.TestReplicationHandler_9478FB20054B12A5-001/solr-instance-001/./collection1/'
   [junit4]   2> 1798250 INFO  (coreLoadExecutor-5240-thread-1) [    ] o.a.s.c.SolrResourceLoader JNDI not configured for solr (NoInitialContextEx)
   [junit4]   2> 1798250 INFO  (coreLoadExecutor-5240-thread-1) [    ] o.a.s.c.SolrResourceLoader solr home defaulted to 'solr/' (could not find system property or JNDI)
   [junit4]   2> 1798250 INFO  (TEST-TestReplicationHandler.doTestReplicateAfterStartup-seed#[9478FB20054B12A5]) [    ] o.a.s.s.SolrDispatchFilter user.dir=/Users/jenkins/workspace/Lucene-Solr-5.x-MacOSX/solr/build/solr-core/test/J1
   [junit4]   2> 1798250 INFO  (TEST-TestReplicationHandler.doTestReplicateAfterStartup-seed#[9478FB20054B12A5]) [    ] o.a.s.s.SolrDispatchFilter SolrDispatchFilter.init() done
   [junit4]   2> 1798282 INFO  (coreLoadExecutor-5240-thread-1) [    ] o.a.s.c.SolrConfig current version of requestparams : -1
   [junit4]   2> 1798364 INFO  (coreLoadExecutor-5240-thread-1) [    ] o.a.s.c.SolrConfig Using Lucene MatchVersion: 5.4.0
   [junit4]   2> 1798431 INFO  (coreLoadExecutor-5240-thread-1) [    ] o.a.s.c.Config Loaded SolrConfig: solrconfig.xml
   [junit4]   2> 1798431 INFO  (coreLoadExecutor-5240-thread-1) [    ] o.a.s.s.IndexSchema Reading Solr Schema from /Users/jenkins/workspace/Lucene-Solr-5.x-MacOSX/solr/build/solr-core/test/J1/temp/solr.handler.TestReplicationHandler_9478FB20054B12A5-001/solr-instance-001/./collection1/conf/schema.xml
   [junit4]   2> 1798437 INFO  (coreLoadExecutor-5240-thread-1) [    ] o.a.s.s.IndexSchema [collection1] Schema name=test
   [junit4]   2> 1798451 INFO  (coreLoadExecutor-5240-thread-1) [    ] o.a.s.s.IndexSchema unique key field: id
   [junit4]   2> 1798454 INFO  (coreLoadExecutor-5240-thread-1) [    ] o.a.s.c.ConfigSetProperties Did not find ConfigSet properties, assuming default properties: Can't find resource 'configsetprops.json' in classpath or '/Users/jenkins/workspace/Lucene-Solr-5.x-MacOSX/solr/build/solr-core/test/J1/temp/solr.handler.TestReplicationHandler_9478FB20054B12A5-001/solr-instance-001/./collection1/conf'
   [junit4]   2> 1798454 INFO  (coreLoadExecutor-5240-thread-1) [    ] o.a.s.c.CoreContainer Creating SolrCore 'collection1' using configuration from instancedir /Users/jenkins/workspace/Lucene-Solr-5.x-MacOSX/solr/build/solr-core/test/J1/temp/solr.handler.TestReplicationHandler_9478FB20054B12A5-001/solr-instance-001/./collection1
   [junit4]   2> 1798454 INFO  (coreLoadExecutor-5240-thread-1) [    x:collection1] o.a.s.c.SolrCore org.apache.solr.core.MockDirectoryFactory
   [junit4]   2> 1798454 INFO  (coreLoadExecutor-5240-thread-1) [    x:collection1] o.a.s.c.SolrCore [[collection1] ] Opening new SolrCore at [/Users/jenkins/workspace/Lucene-Solr-5.x-MacOSX/solr/build/solr-core/test/J1/temp/solr.handler.TestReplicationHandler_9478FB20054B12A5-001/solr-instance-001/./collection1/], dataDir=[null]
   [junit4]   2> 1798454 INFO  (coreLoadExecutor-5240-thread-1) [    x:collection1] o.a.s.c.SolrCore JMX monitoring not detected for core: collection1
   [junit4]   2> 1798455 INFO  (coreLoadExecutor-5240-thread-1) [    x:collection1] o.a.s.c.CachingDirectoryFactory return new directory for /Users/jenkins/workspace/Lucene-Solr-5.x-MacOSX/solr/build/solr-core/test/J1/temp/solr.handler.TestReplicationHandler_9478FB20054B12A5-001/solr-instance-001/./collection1/data
   [junit4]   2> 1798455 INFO  (coreLoadExecutor-5240-thread-1) [    x:collection1] o.a.s.c.SolrCore New index directory detected: old=null new=/Users/jenkins/workspace/Lucene-Solr-5.x-MacOSX/solr/build/solr-core/test/J1/temp/solr.handler.TestReplicationHandler_9478FB20054B12A5-001/solr-instance-001/./collection1/data/index/
   [junit4]   2> 1798455 WARN  (coreLoadExecutor-5240-thread-1) [    x:collection1] o.a.s.c.SolrCore [collection1] Solr index directory '/Users/jenkins/workspace/Lucene-Solr-5.x-MacOSX/solr/build/solr-core/test/J1/temp/solr.handler.TestReplicationHandler_9478FB20054B12A5-001/solr-instance-001/./collection1/data/index' doesn't exist. Creating new index...
   [junit4]   2> 1798455 INFO  (coreLoadExecutor-5240-thread-1) [    x:collection1] o.a.s.c.CachingDirectoryFactory return new directory for /Users/jenkins/workspace/Lucene-Solr-5.x-MacOSX/solr/build/solr-core/test/J1/temp/solr.handler.TestReplicationHandler_9478FB20054B12A5-001/solr-instance-001/./collection1/data/index
   [junit4]   2> 1798456 INFO  (coreLoadExecutor-5240-thread-1) [    x:collection1] o.a.s.u.RandomMergePolicy RandomMergePolicy wrapping class org.apache.lucene.index.TieredMergePolicy: [TieredMergePolicy: maxMergeAtOnce=12, maxMergeAtOnceExplicit=16, maxMergedSegmentMB=88.05859375, floorSegmentMB=1.2021484375, forceMergeDeletesPctAllowed=21.68733320144119, segmentsPerTier=15.0, maxCFSSegmentSizeMB=8.796093022207999E12, noCFSRatio=0.0
   [junit4]   2> 1798456 INFO  (coreLoadExecutor-5240-thread-1) [    x:collection1] o.a.s.c.SolrCore SolrDeletionPolicy.onCommit: commits: num=1
   [junit4]   2> 	commit{dir=MockDirectoryWrapper(RAMDirectory@15cb33a lockFactory=org.apache.lucene.store.SingleInstanceLockFactory@6cfaa588),segFN=segments_1,generation=1}
   [junit4]   2> 1798456 INFO  (coreLoadExecutor-5240-thread-1) [    x:collection1] o.a.s.c.SolrCore newest commit generation = 1
   [junit4]   2> 1798457 INFO  (OldIndexDirectoryCleanupThreadForCore-collection1) [    x:collection1] o.a.s.c.SolrCore Looking for old index directories to cleanup for core collection1 in /Users/jenkins/workspace/Lucene-Solr-5.x-MacOSX/solr/build/solr-core/test/J1/temp/solr.handler.TestReplicationHandler_9478FB20054B12A5-001/solr-instance-001/./collection1/data/
   [junit4]   2> 1798460 INFO  (coreLoadExecutor-5240-thread-1) [    x:collection1] o.a.s.c.SolrCore no updateRequestProcessorChain defined as default, creating implicit default
   [junit4]   2> 1798469 INFO  (coreLoadExecutor-5240-thread-1) [    x:collection1] o.a.s.h.l.XMLLoader xsltCacheLifetimeSeconds=60
   [junit4]   2> 1798471 INFO  (coreLoadExecutor-5240-thread-1) [    x:collection1] o.a.s.h.l.XMLLoader xsltCacheLifetimeSeconds=60
   [junit4]   2> 1798473 INFO  (coreLoadExecutor-5240-thread-1) [    x:collection1] o.a.s.h.l.XMLLoader xsltCacheLifetimeSeconds=60
   [junit4]   2> 1798475 INFO  (coreLoadExecutor-5240-thread-1) [    x:collection1] o.a.s.h.l.XMLLoader xsltCacheLifetimeSeconds=60
   [junit4]   2> 1798478 INFO  (coreLoadExecutor-5240-thread-1) [    x:collection1] o.a.s.c.PluginBag requestHandler : 'lazy' created with startup=lazy 
   [junit4]   2> 1798478 INFO  (coreLoadExecutor-5240-thread-1) [    x:collection1] o.a.s.c.RequestHandlers Registered paths: /admin/segments,/admin/ping,/admin/luke,lazy,defaults,standard,/admin/file,/update/json,/schema,/update,/update/csv,/admin/logging,/update/json/docs,/replication,/config,/get,/admin/threads,/admin/plugins,/admin/mbeans,/admin/properties,/admin/system
   [junit4]   2> 1798480 INFO  (coreLoadExecutor-5240-thread-1) [    x:collection1] o.a.s.c.SolrCore Using default statsCache cache: org.apache.solr.search.stats.LocalStatsCache
   [junit4]   2> 1798481 INFO  (coreLoadExecutor-5240-thread-1) [    x:collection1] o.a.s.c.SolrCore Hard AutoCommit: disabled
   [junit4]   2> 1798481 INFO  (coreLoadExecutor-5240-thread-1) [    x:collection1] o.a.s.c.SolrCore Soft AutoCommit: disabled
   [junit4]   2> 1798481 INFO  (coreLoadExecutor-5240-thread-1) [    x:collection1] o.a.s.u.RandomMergePolicy RandomMergePolicy wrapping class org.apache.lucene.index.TieredMergePolicy: [TieredMergePolicy: maxMergeAtOnce=50, maxMergeAtOnceExplicit=17, maxMergedSegmentMB=40.498046875, floorSegmentMB=2.00390625, forceMergeDeletesPctAllowed=20.145742417588103, segmentsPerTier=22.0, maxCFSSegmentSizeMB=8.796093022207999E12, noCFSRatio=0.1067098211106913
   [junit4]   2> 1798481 INFO  (coreLoadExecutor-5240-thread-1) [    x:collection1] o.a.s.c.SolrCore SolrDeletionPolicy.onInit: commits: num=1
   [junit4]   2> 	commit{dir=MockDirectoryWrapper(RAMDirectory@15cb33a lockFactory=org.apache.lucene.store.SingleInstanceLockFactory@6cfaa588),segFN=segments_1,generation=1}
   [junit4]   2> 1798481 INFO  (coreLoadExecutor-5240-thread-1) [    x:collection1] o.a.s.c.SolrCore newest commit generation = 1
   [junit4]   2> 1798482 INFO  (coreLoadExecutor-5240-thread-1) [    x:collection1] o.a.s.s.SolrIndexSearcher Opening Searcher@542ae776[collection1] main
   [junit4]   2> 1798482 INFO  (coreLoadExecutor-5240-thread-1) [    x:collection1] o.a.s.r.ManagedResourceStorage File-based storage initialized to use dir: /Users/jenkins/workspace/Lucene-Solr-5.x-MacOSX/solr/build/solr-core/test/J1/temp/solr.handler.TestReplicationHandler_9478FB20054B12A5-001/solr-instance-001/./collection1/conf
   [junit4]   2> 1798482 INFO  (coreLoadExecutor-5240-thread-1) [    x:collection1] o.a.s.r.RestManager Initializing RestManager with initArgs: {storageDir=/Users/jenkins/workspace/Lucene-Solr-5.x-MacOSX/solr/build/solr-core/test/J1/temp/solr.handler.TestReplicationHandler_9478FB20054B12A5-001/solr-instance-001/./collection1/conf}
   [junit4]   2> 1798482 INFO  (coreLoadExecutor-5240-thread-1) [    x:collection1] o.a.s.r.ManagedResourceStorage Reading _rest_managed.json using file:dir=/Users/jenkins/workspace/Lucene-Solr-5.x-MacOSX/solr/build/solr-core/test/J1/temp/solr.handler.TestReplicationHandler_9478FB20054B12A5-001/solr-instance-001/./collection1/conf
   [junit4]   2> 1798483 INFO  (coreLoadExecutor-5240-thread-1) [    x:collection1] o.a.s.r.RestManager Initializing 0 registered ManagedResources
   [junit4]   2> 1798483 INFO  (coreLoadExecutor-5240-thread-1) [    x:collection1] o.a.s.h.ReplicationHandler Replication enabled for following config files: schema.xml
   [junit4]   2> 1798483 INFO  (coreLoadExecutor-5240-thread-1) [    x:collection1] o.a.s.h.ReplicationHandler Commits will be reserved for  10000
   [junit4]   2> 1798483 INFO  (searcherExecutor-5241-thread-1-processing-x:collection1) [    x:collection1] o.a.s.c.SolrCore [collection1] Registered new searcher Searcher@542ae776[collection1] main{ExitableDirectoryReader(UninvertingDirectoryReader())}
   [junit4]   2> 1798483 INFO  (coreLoadExecutor-5240-thread-1) [    x:collection1] o.a.s.c.CoreContainer registering core: collection1
   [junit4]   2> 1798757 INFO  (qtp1548590801-11170) [    x:collection1] o.a.s.u.p.LogUpdateProcessor [collection1] webapp=/solr path=/update params={version=2&wt=javabin} {add=[0]} 0 0
   [junit4]   2> 1798759 INFO  (qtp1548590801-11171) [    x:collection1] o.a.s.u.p.LogUpdateProcessor [collection1] webapp=/solr path=/update params={version=2&wt=javabin} {add=[1]} 0 0
   [junit4]   2> 1798763 INFO  (qtp1548590801-11172) [    x:collection1] o.a.s.u.p.LogUpdateProcessor [collection1] webapp=/solr path=/update params={version=2&wt=javabin} {add=[2]} 0 1
   [junit4]   2> 1798767 INFO  (qtp1548590801-11173) [    x:collection1] o.a.s.u.p.LogUpdateProcessor [collection1] webapp=/solr path=/update params={version=2&wt=javabin} {add=[3]} 0 0
   [junit4]   2> 1798771 INFO  (qtp1548590801-11174) [    x:collection1] o.a.s.u.p.LogUpdateProcessor [collection1] webapp=/solr path=/update params={version=2&wt=javabin} {add=[4]} 0 0
   [junit4]   2> 1798780 INFO  (qtp1548590801-11175) [    x:collection1] o.a.s.u.p.LogUpdateProcessor [collection1] webapp=/solr path=/update params={version=2&wt=javabin} {add=[5]} 0 0
   [junit4]   2> 1798783 INFO  (qtp1548590801-11170) [    x:collection1] o.a.s.u.p.LogUpdateProcessor [collection1] webapp=/solr path=/update params={version=2&wt=javabin} {add=[6]} 0 0
   [junit4]   2> 1798786 INFO  (qtp1548590801-11171) [    x:collection1] o.a.s.u.p.LogUpdateProcessor [collection1] webapp=/solr path=/update params={version=2&wt=javabin} {add=[7]} 0 0
   [junit4]   2> 1798789 INFO  (qtp1548590801-11172) [    x:collection1] o.a.s.u.p.LogUpdateProcessor [collection1] webapp=/solr path=/update params={version=2&wt=javabin} {add=[8]} 0 0
   [junit4]   2> 1798793 INFO  (qtp1548590801-11173) [    x:collection1] o.a.s.u.p.LogUpdateProcessor [collection1] webapp=/solr path=/update params={version=2&wt=javabin} {add=[9]} 0 0
   [junit4]   2> 1798800 INFO  (qtp1548590801-11174) [    x:collection1] o.a.s.u.p.LogUpdateProcessor [collection1] webapp=/solr path=/update params={version=2&wt=javabin} {add=[10]} 0 0
   [junit4]   2> 1798802 INFO  (qtp1548590801-11175) [    x:collection1] o.a.s.u.p.LogUpdateProcessor [collection1] webapp=/solr path=/update params={version=2&wt=javabin} {add=[11]} 0 0
   [junit4]   2> 1798805 INFO  (qtp1548590801-11170) [    x:collection1] o.a.s.u.p.LogUpdateProcessor [collection1] webapp=/solr path=/update params={version=2&wt=javabin} {add=[12]} 0 0
   [junit4]   2> 1798809 INFO  (qtp1548590801-11171) [    x:collection1] o.a.s.u.p.LogUpdateProcessor [collection1] webapp=/solr path=/update params={version=2&wt=javabin} {add=[13]} 0 0
   [junit4]   2> 1798812 INFO  (qtp1548590801-11172) [    x:collection1] o.a.s.u.p.LogUpdateProcessor [collection1] webapp=/solr path=/update params={version=2&wt=javabin} {add=[14]} 0 0
   [junit4]   2> 1798816 INFO  (qtp1548590801-11173) [    x:collection1] o.a.s.u.p.LogUpdateProcessor [collection1] webapp=/solr path=/update params={version=2&wt=javabin} {add=[15]} 0 0
   [junit4]   2> 1798820 INFO  (qtp1548590801-11174) [    x:collection1] o.a.s.u.p.LogUpdateProcessor [collection1] webapp=/solr path=/update params={version=2&wt=javabin} {add=[16]} 0 0
   [junit4]   2> 1798824 INFO  (qtp1548590801-11175) [    x:collection1] o.a.s.u.p.LogUpdateProcessor [collection1] webapp=/solr path=/update params={version=2&wt=javabin} {add=[17]} 0 0
   [junit4]   2> 1798832 INFO  (qtp1548590801-11170) [    x:collection1] o.a.s.u.p.LogUpdateProcessor [collection1] webapp=/solr path=/update params={version=2&wt=javabin} {add=[18]} 0 0
   [junit4]   2> 1798835 INFO  (qtp1548590801-11171) [    x:collection1] o.a.s.u.p.LogUpdateProcessor [collection1] webapp=/solr path=/update params={version=2&wt=javabin} {add=[19]} 0 0
   [junit4]   2> 1798840 INFO  (qtp1548590801-11172) [    x:collection1] o.a.s.u.p.LogUpdateProcessor [collection1] webapp=/solr path=/update params={version=2&wt=javabin} {add=[20]} 0 0
   [junit4]   2> 1798842 INFO  (qtp1548590801-11173) [    x:collection1] o.a.s.u.p.LogUpdateProcessor [collection1] webapp=/solr path=/update params={version=2&wt=javabin} {add=[21]} 0 0
   [junit4]   2> 1798845 INFO  (qtp1548590801-11174) [    x:collection1] o.a.s.u.p.LogUpdateProcessor [collection1] webapp=/solr path=/update params={version=2&wt=javabin} {add=[22]} 0 0
   [junit4]   2> 1798848 INFO  (qtp1548590801-11175) [    x:collection1] o.a.s.u.p.LogUpdateProcessor [collection1] webapp=/solr path=/update params={version=2&wt=javabin} {add=[23]} 0 0
   [junit4]   2> 1798851 INFO  (qtp1548590801-11170) [    x:collection1] o.a.s.u.p.LogUpdateProcessor [collection1] webapp=/solr path=/update params={version=2&wt=javabin} {add=[24]} 0 0
   [junit4]   2> 1798855 INFO  (qtp1548590801-11171) [    x:collection1] o.a.s.u.p.LogUpdateProcessor [collection1] webapp=/solr path=/update params={version=2&wt=javabin} {add=[25]} 0 1
   [junit4]   2> 1798858 INFO  (qtp1548590801-11172) [    x:collection1] o.a.s.u.p.LogUpdateProcessor [collection1] webapp=/solr path=/update params={version=2&wt=javabin} {add=[26]} 0 0
   [junit4]   2> 1798862 INFO  (qtp1548590801-11173) [    x:collection1] o.a.s.u.p.LogUpdateProcessor [collection1] webapp=/solr path=/update params={version=2&wt=javabin} {add=[27]} 0 0
   [junit4]   2> 1798869 INFO  (qtp1548590801-11174) [    x:collection1] o.a.s.u.p.LogUpdateProcessor [collection1] webapp=/solr path=/update params={version=2&wt=javabin} {add=[28]} 0 0
   [junit4]   2> 1798872 INFO  (qtp1548590801-11175) [    x:collection1] o.a.s.u.p.LogUpdateProcessor [collection1] webapp=/solr path=/update params={version=2&wt=javabin} {add=[29]} 0 0
   [junit4]   2> 1798875 INFO  (qtp1548590801-11170) [    x:collection1] o.a.s.u.p.LogUpdateProcessor [collection1] webapp=/solr path=/update params={version=2&wt=javabin} {add=[30]} 0 0
   [junit4]   2> 1798879 INFO  (qtp1548590801-11171) [    x:collection1] o.a.s.u.p.LogUpdateProcessor [collection1] webapp=/solr path=/update params={version=2&wt=javabin} {add=[31]} 0 0
   [junit4]   2> 1798884 INFO  (qtp1548590801-11172) [    x:collection1] o.a.s.u.p.LogUpdateProcessor [collection1] webapp=/solr path=/update params={version=2&wt=javabin} {add=[32]} 0 0
   [junit4]   2> 1798887 INFO  (qtp1548590801-11173) [    x:collection1] o.a.s.u.p.LogUpdateProcessor [collection1] webapp=/solr path=/update params={version=2&wt=javabin} {add=[33]} 0 0
   [junit4]   2> 1798890 INFO  (qtp1548590801-11174) [    x:collection1] o.a.s.u.p.LogUpdateProcessor [collection1] webapp=/solr path=/update params={version=2&wt=javabin} {add=[34]} 0 0
   [junit4]   2> 1798895 INFO  (qtp1548590801-11175) [    x:collection1] o.a.s.u.p.LogUpdateProcessor [collection1] webapp=/solr path=/update params={version=2&wt=javabin} {add=[35]} 0 0
   [junit4]   2> 1798900 INFO  (qtp1548590801-11170) [    x:collection1] o.a.s.u.p.LogUpdateProcessor [collection1] webapp=/solr path=/update params={version=2&wt=javabin} {add=[36]} 0 0
   [junit4]   2> 1798903 INFO  (qtp1548590801-11171) [    x:collection1] o.a.s.u.p.LogUpdateProcessor [collection1] webapp=/solr path=/update params={version=2&wt=javabin} {add=[37]} 0 0
   [junit4]   2> 1798906 INFO  (qtp1548590801-11172) [    x:collection1] o.a.s.u.p.LogUpdateProcessor [collection1] webapp=/solr path=/update params={version=2&wt=javabin} {add=[38]} 0 0
   [junit4]   2> 1798910 INFO  (qtp1548590801-11173) [    x:collection1] o.a.s.u.p.LogUpdateProcessor [collection1] webapp=/solr path=/update params={version=2&wt=javabin} {add=[39]} 0 0
   [junit4]   2> 1798913 INFO  (qtp1548590801-11174) [    x:collection1] o.a.s.u.p.LogUpdateProcessor [collection1] webapp=/solr path=/update params={version=2&wt=javabin} {add=[40]} 0 0
   [junit4]   2> 1798918 INFO  (qtp1548590801-11175) [    x:collection1] o.a.s.u.p.LogUpdateProcessor [collection1] webapp=/solr path=/update params={version=2&wt=javabin} {add=[41]} 0 0
   [junit4]   2> 1798922 INFO  (qtp1548590801-11170) [    x:collection1] o.a.s.u.p.LogUpdateProcessor [collection1] webapp=/solr path=/update params={version=2&wt=javabin} {add=[42]} 0 0
   [junit4]   2> 1798925 INFO  (qtp1548590801-11171) [    x:collection1] o.a.s.u.p.LogUpdateProcessor [collection1] webapp=/solr path=/update params={version=2&wt=javabin} {add=[43]} 0 0
   [junit4]   2> 1798928 INFO  (qtp1548590801-11172) [    x:collection1] o.a.s.u.p.LogUpdateProcessor [collection1] webapp=/solr path=/update params={version=2&wt=javabin} {add=[44]} 0 0
   [junit4]   2> 1798931 INFO  (qtp1548590801-11173) [    x:collection1] o.a.s.u.p.LogUpdateProcessor [collection1] webapp=/solr path=/update params={version=2&wt=javabin} {add=[45]} 0 0
   [junit4]   2> 1798934 INFO  (qtp1548590801-11174) [    x:collection1] o.a.s.u.p.LogUpdateProcessor [collection1] webapp=/solr path=/update params={version=2&wt=javabin} {add=[46]} 0 0
   [junit4]   2> 1798937 INFO  (qtp1548590801-11175) [    x:collection1] o.a.s.u.p.LogUpdateProcessor [collection1] webapp=/solr path=/update params={version=2&wt=javabin} {add=[47]} 0 0
   [junit4]   2> 1798940 INFO  (qtp1548590801-11170) [    x:collection1] o.a.s.u.p.LogUpdateProcessor [collection1] webapp=/solr path=/update params={version=2&wt=javabin} {add=[48]} 0 0
   [junit4]   2> 1798943 INFO  (qtp1548590801-11171) [    x:collection1] o.a.s.u.p.LogUpdateProcessor [collection1] webapp=/solr path=/update params={version=2&wt=javabin} {add=[49]} 0 0
   [junit4]   2> 1798946 INFO  (qtp1548590801-11172) [    x:collection1] o.a.s.u.p.LogUpdateProcessor [collection1] webapp=/solr path=/update params={version=2&wt=javabin} {add=[50]} 0 0
   [junit4]   2> 1798949 INFO  (qtp1548590801-11173) [    x:collection1] o.a.s.u.p.LogUpdateProcessor [collection1] webapp=/solr path=/update params={version=2&wt=javabin} {add=[51]} 0 0
   [junit4]   2> 1798959 INFO  (qtp1548590801-11174) [    x:collection1] o.a.s.u.p.LogUpdateProcessor [collection1] webapp=/solr path=/update params={version=2&wt=javabin} {add=[52]} 0 0
   [junit4]   2> 1798962 INFO  (qtp1548590801-11175) [    x:collection1] o.a.s.u.p.LogUpdateProcessor [collection1] webapp=/solr path=/update params={version=2&wt=javabin} {add=[53]} 0 0
   [junit4]   2> 1798965 INFO  (qtp1548590801-11170) [    x:collection1] o.a.s.u.p.LogUpdateProcessor [collection1] webapp=/solr path=/update params={version=2&wt=javabin} {add=[54]} 0 0
   [junit4]   2> 1798968 INFO  (qtp1548590801-11171) [    x:collection1] o.a.s.u.p.LogUpdateProcessor [collection1] webapp=/solr path=/update params={version=2&wt=javabin} {add=[55]} 0 0
   [junit4]   2> 1798973 INFO  (qtp1548590801-11172) [    x:collection1] o.a.s.u.p.LogUpdateProcessor [collection1] webapp=/solr path=/update params={version=2&wt=javabin} {add=[56]} 0 0
   [junit4]   2> 1798975 INFO  (qtp1548590801-11173) [    x:collection1] o.a.s.u.p.LogUpdateProcessor [collection1] webapp=/solr path=/update params={version=2&wt=javabin} {add=[57]} 0 0
   [junit4]   2> 1798978 INFO  (qtp1548590801-11174) [    x:collection1] o.a.s.u.p.LogUpdateProcessor [collection1] webapp=/solr path=/update params={version=2&wt=javabin} {add=[58]} 0 0
   [junit4]   2> 1798981 INFO  (qtp1548590801-11175) [    x:collection1] o.a.s.u.p.LogUpdateProcessor [collection1] webapp=/solr path=/update params={version=2&wt=javabin} {add=[59]} 0 0
   [junit4]   2> 1798983 INFO  (qtp1548590801-11170) [    x:collection1] o.a.s.u.p.LogUpdateProcessor [collection1] webapp=/solr path=/update params={version=2&wt=javabin} {add=[60]} 0 0
   [junit4]   2> 1798988 INFO  (qtp1548590801-11171) [    x:collection1] o.a.s.u.p.LogUpdateProcessor [collection1] webapp=/solr path=/update params={version=2&wt=javabin} {add=[61]} 0 0
   [junit4]   2> 1798992 INFO  (qtp1548590801-11172) [    x:collection1] o.a.s.u.p.LogUpdateProcessor [collection1] webapp=/solr path=/update params={version=2&wt=javabin} {add=[62]} 0 0
   [junit4]   2> 1798995 INFO  (qtp1548590801-11173) [    x:collection1] o.a.s.u.p.LogUpdateProcessor [collection1] webapp=/solr path=/update params={version=2&wt=javabin} {add=[63]} 0 0
   [junit4]   2> 1798998 INFO  (qtp1548590801-11174) [    x:collection1] o.a.s.u.p.LogUpdateProcessor [collection1] webapp=/solr path=/update params={version=2&wt=javabin} {add=[64]} 0 0
   [junit4]   2> 1799000 INFO  (qtp1548590801-11175) [    x:collection1] o.a.s.u.p.LogUpdateProcessor [collection1] webapp=/solr path=/update params={version=2&wt=javabin} {add=[65]} 0 0
   [junit4]   2> 1799005 INFO  (qtp1548590801-11170) [    x:collection1] o.a.s.u.p.LogUpdateProcessor [collection1] webapp=/solr path=/update params={version=2&wt=javabin} {add=[66]} 0 0
   [junit4]   2> 1799008 INFO  (qtp1548590801-11171) [    x:collection1] o.a.s.u.p.LogUpdateProcessor [collection1] webapp=/solr path=/update params={version=2&wt=javabin} {add=[67]} 0 0
   [junit4]   2> 1799011 INFO  (qtp1548590801-11172) [    x:collection1] o.a.s.u.p.LogUpdateProcessor [collection1] webapp=/solr path=/update params={version=2&wt=javabin} {add=[68]} 0 0
   [junit4]   2> 1799014 INFO  (qtp1548590801-11173) [    x:collection1] o.a.s.u.p.LogUpdateProcessor [collection1] webapp=/solr path=/update params={version=2&wt=javabin} {add=[69]} 0 0
   [junit4]   2> 1799017 INFO  (qtp1548590801-11174) [    x:collection1] o.a.s.u.p.LogUpdateProcessor [collection1] webapp=/solr path=/update params={version=2&wt=javabin} {add=[70]} 0 0
   [junit4]   2> 1799019 INFO  (qtp1548590801-11175) [    x:collection1] o.a.s.u.p.LogUpdateProcessor [collection1] webapp=/solr path=/update params={version=2&wt=javabin} {add=[71]} 0 0
   [junit4]   2> 1799022 INFO  (qtp1548590801-11170) [    x:collection1] o.a.s.u.p.LogUpdateProcessor [collection1] webapp=/solr path=/update params={version=2&wt=javabin} {add=[72]} 0 0
   [junit4]   2> 1799024 INFO  (qtp1548590801-11171) [    x:collection1] o.a.s.u.p.LogUpdateProcessor [collection1] webapp=/solr path=/update params={version=2&wt=javabin} {add=[73]} 0 0
   [junit4]   2> 1799029 INFO  (qtp1548590801-11172) [    x:collection1] o.a.s.u.p.LogUpdateProcessor [collection1] webapp=/solr path=/update params={version=2&wt=javabin} {add=[74]} 0 0
   [junit4]   2> 1799032 INFO  (qtp1548590801-11173) [    x:collection1] o.a.s.u.p.LogUpdateProcessor [collection1] webapp=/solr path=/update params={version=2&wt=javabin} {add=[75]} 0 0
   [junit4]   2> 1799035 INFO  (qtp1548590801-11174) [    x:collection1] o.a.s.u.p.LogUpdateProcessor [collection1] webapp=/solr path=/update params={version=2&wt=javabin} {add=[76]} 0 0
   [junit4]   2> 1799037 INFO  (qtp1548590801-11175) [    x:collection1] o.a.s.u.p.LogUpdateProcessor [collection1] webapp=/solr path=/update params={version=2&wt=javabin} {add=[77]} 0 0
   [junit4]   2> 1799040 INFO  (qtp1548590801-11170) [    x:collection1] o.a.s.u.p.LogUpdateProcessor [collection1] webapp=/solr path=/update params={version=2&wt=javabin} {add=[78]} 0 0
   [junit4]   2> 1799042 INFO  (qtp1548590801-11171) [    x:collection1] o.a.s.u.p.LogUpdateProcessor [collection1] webapp=/solr path=/update params={version=2&wt=javabin} {add=[79]} 0 0
   [junit4]   2> 1799050 INFO  (qtp1548590801-11172) [    x:collection1] o.a.s.u.p.LogUpdateProcessor [collection1] webapp=/solr path=/update params={version=2&wt=javabin} {add=[80]} 0 0
   [junit4]   2> 1799053 INFO  (qtp1548590801-11173) [    x:collection1] o.a.s.u.p.LogUpdateProcessor [collection1] webapp=/solr path=/update params={version=2&wt=javabin} {add=[81]} 0 0
   [junit4]   2> 1799058 INFO  (qtp1548590801-11174) [    x:collection1] o.a.s.u.p.LogUpdateProcessor [collection1] webapp=/solr path=/update params={version=2&wt=javabin} {add=[82]} 0 0
   [junit4]   2> 1799061 INFO  (qtp1548590801-11175) [    x:collection1] o.a.s.u.p.LogUpdateProcessor [collection1] webapp=/solr path=/update params={version=2&wt=javabin} {add=[83]} 0 0
   [junit4]   2> 1799064 INFO  (qtp1548590801-11170) [    x:collection1] o.a.s.u.p.LogUpdateProcessor [collection1] webapp=/solr path=/update params={version=2&wt=javabin} {add=[84]} 0 0
   [junit4]   2> 1799067 INFO  (qtp1548590801-11171) [    x:collection1] o.a.s.u.p.LogUpdateProcessor [collection1] webapp=/solr path=/update params={version=2&wt=javabin} {add=[85]} 0 0
   [junit4]   2> 1799069 INFO  (qtp1548590801-11172) [    x:collection1] o.a.s.u.p.LogUpdateProcessor [collection1] webapp=/solr path=/update params={version=2&wt=javabin} {add=[86]} 0 0
   [junit4]   2> 1799072 INFO  (qtp1548590801-11173) [    x:collection1] o.a.s.u.p.LogUpdateProcessor [collection1] webapp=/solr path=/update params={version=2&wt=javabin} {add=[87]} 0 0
   [junit4]   2> 1799075 INFO  (qtp1548590801-11174) [    x:collection1] o.a.s.u.p.LogUpdateProcessor [collection1] webapp=/solr path=/update params={version=2&wt=javabin} {add=[88]} 0 0
   [junit4]   2> 1799077 INFO  (qtp1548590801-11175) [    x:collection1] o.a.s.u.p.LogUpdateProcessor [collection1] webapp=/solr path=/update params={version=2&wt=javabin} {add=[89]} 0 0
   [junit4]   2> 1799079 INFO  (qtp1548590801-11170) [    x:collection1] o.a.s.u.p.LogUpdateProcessor [collection1] webapp=/solr path=/update params={version=2&wt=javabin} {add=[90]} 0 0
   [junit4]   2> 1799082 INFO  (qtp1548590801-11171) [    x:collection1] o.a.s.u.p.LogUpdateProcessor [collection1] webapp=/solr path=/update params={version=2&wt=javabin} {add=[91]} 0 0
   [junit4]   2> 1799084 INFO  (qtp1548590801-11172) [    x:collection1] o.a.s.u.p.LogUpdateProcessor [collection1] webapp=/solr path=/update params={version=2&wt=javabin} {add=[92]} 0 0
   [junit4]   2> 1799088 INFO  (qtp1548590801-11173) [    x:collection1] o.a.s.u.p.LogUpdateProcessor [collection1] webapp=/solr path=/update params={version=2&wt=javabin} {add=[93]} 0 0
   [junit4]   2> 1799090 INFO  (qtp1548590801-11174) [    x:collection1] o.a.s.u.p.LogUpdateProcessor [collection1] webapp=/solr path=/update params={version=2&wt=javabin} {add=[94]} 0 0
   [junit4]   2> 1799092 INFO  (qtp1548590801-11175) [    x:collection1] o.a.s.u.p.LogUpdateProcessor [collection1] webapp=/solr path=/update params={version=2&wt=javabin} {add=[95]} 0 0
   [junit4]   2> 1799095 INFO  (qtp1548590801-11170) [    x:collection1] o.a.s.u.p.LogUpdateProcessor [collection1] webapp=/solr path=/update params={version=2&wt=javabin} {add=[96]} 0 0
   [junit4]   2> 1799098 INFO  (qtp1548590801-11171) [    x:collection1] o.a.s.u.p.LogUpdateProcessor [collection1] webapp=/solr path=/update params={version=2&wt=javabin} {add=[97]} 0 0
   [junit4]   2> 1799103 INFO  (qtp1548590801-11172) [    x:collection1] o.a.s.u.p.LogUpdateProcessor [collection1] webapp=/solr path=/update params={version=2&wt=javabin} {add=[98]} 0 0
   [junit4]   2> 1799105 INFO  (qtp1548590801-11173) [    x:collection1] o.a.s.u.p.LogUpdateProcessor [collection1] webapp=/solr path=/update params={version=2&wt=javabin} {add=[99]} 0 0
   [junit4]   2> 1799109 INFO  (qtp1548590801-11174) [    x:collection1] o.a.s.u.p.LogUpdateProcessor [collection1] webapp=/solr path=/update params={version=2&wt=javabin} {add=[100]} 0 0
   [junit4]   2> 1799112 INFO  (qtp1548590801-11175) [    x:collection1] o.a.s.u.p.LogUpdateProcessor [collection1] webapp=/solr path=/update params={version=2&wt=javabin} {add=[101]} 0 0
   [junit4]   2> 1799120 INFO  (qtp1548590801-11170) [    x:collection1] o.a.s.u.p.LogUpdateProcessor [collection1] webapp=/solr path=/update params={version=2&wt=javabin} {add=[102]} 0 0
   [junit4]   2> 1799123 INFO  (qtp1548590801-11171) [    x:collection1] o.a.s.u.p.LogUpdateProcessor [collection1] webapp=/solr path=/update params={version=2&wt=javabin} {add=[103]} 0 0
   [junit4]   2> 1799126 INFO  (qtp1548590801-11172) [    x:collection1] o.a.s.u.p.LogUpdateProcessor [collection1] webapp=/solr path=/update params={version=2&wt=javabin} {add=[104]} 0 0
   [junit4]   2> 1799128 INFO  (qtp1548590801-11173) [    x:collection1] o.a.s.u.p.LogUpdateProcessor [collection1] webapp=/solr path=/update params={version=2&wt=javabin} {add=[105]} 0 0
   [junit4]   2> 1799132 INFO  (qtp1548590801-11174) [    x:collection1] o.a.s.u.p.LogUpdateProcessor [collection1] webapp=/solr path=/update params={version=2&wt=javabin} {add=[106]} 0 0
   [junit4]   2> 1799135 INFO  (qtp1548590801-11175) [    x:collection1] o.a.s.u.p.LogUpdateProcessor [collection1] webapp=/solr path=/update params={version=2&wt=javabin} {add=[107]} 0 0
   [junit4]   2> 1799140 INFO  (qtp1548590801-11170) [    x:collection1] o.a.s.u.p.LogUpdateProcessor [collection1] webapp=/solr path=/update params={version=2&wt=javabin} {add=[108]} 0 0
   [junit4]   2> 1799142 INFO  (qtp1548590801-11171) [    x:coll

[...truncated too long message...]

ationHandler_9478FB20054B12A5-001/solr-instance-027/collection1/data/index
   [junit4]   2> 1883071 INFO  (TEST-TestReplicationHandler.doTestStressReplication-seed#[9478FB20054B12A5]) [    x:collection1] o.e.j.s.h.ContextHandler Stopped o.e.j.s.ServletContextHandler@3a19e68f{/solr,null,UNAVAILABLE}
   [junit4]   2> 1883076 INFO  (TEST-TestReplicationHandler.doTestStressReplication-seed#[9478FB20054B12A5]) [    ] o.e.j.s.ServerConnector Stopped ServerConnector@1665cf7f{HTTP/1.1}{127.0.0.1:0}
   [junit4]   2> 1883076 INFO  (TEST-TestReplicationHandler.doTestStressReplication-seed#[9478FB20054B12A5]) [    ] o.a.s.c.CoreContainer Shutting down CoreContainer instance=455262668
   [junit4]   2> 1883082 INFO  (TEST-TestReplicationHandler.doTestStressReplication-seed#[9478FB20054B12A5]) [    x:collection1] o.a.s.c.SolrCore [collection1]  CLOSING SolrCore org.apache.solr.core.SolrCore@665629f5
   [junit4]   2> 1883082 INFO  (TEST-TestReplicationHandler.doTestStressReplication-seed#[9478FB20054B12A5]) [    x:collection1] o.a.s.u.UpdateHandler closing DirectUpdateHandler2{commits=1,autocommits=0,soft autocommits=0,optimizes=0,rollbacks=0,expungeDeletes=0,docsPending=0,adds=0,deletesById=0,deletesByQuery=0,errors=0,cumulative_adds=3,cumulative_deletesById=0,cumulative_deletesByQuery=0,cumulative_errors=0}
   [junit4]   2> 1883083 INFO  (TEST-TestReplicationHandler.doTestStressReplication-seed#[9478FB20054B12A5]) [    x:collection1] o.a.s.u.SolrCoreState Closing SolrCoreState
   [junit4]   2> 1883083 INFO  (TEST-TestReplicationHandler.doTestStressReplication-seed#[9478FB20054B12A5]) [    x:collection1] o.a.s.u.DefaultSolrCoreState SolrCoreState ref count has reached 0 - closing IndexWriter
   [junit4]   2> 1883083 INFO  (TEST-TestReplicationHandler.doTestStressReplication-seed#[9478FB20054B12A5]) [    x:collection1] o.a.s.u.DefaultSolrCoreState closing IndexWriter with IndexWriterCloser
   [junit4]   2> 1883084 INFO  (TEST-TestReplicationHandler.doTestStressReplication-seed#[9478FB20054B12A5]) [    x:collection1] o.a.s.c.SolrCore [collection1] Closing main searcher on request.
   [junit4]   2> 1883087 INFO  (TEST-TestReplicationHandler.doTestStressReplication-seed#[9478FB20054B12A5]) [    x:collection1] o.a.s.c.CachingDirectoryFactory Closing StandardDirectoryFactory - 2 directories currently being tracked
   [junit4]   2> 1883087 INFO  (TEST-TestReplicationHandler.doTestStressReplication-seed#[9478FB20054B12A5]) [    x:collection1] o.a.s.c.CachingDirectoryFactory looking to close /Users/jenkins/workspace/Lucene-Solr-5.x-MacOSX/solr/build/solr-core/test/J1/temp/solr.handler.TestReplicationHandler_9478FB20054B12A5-001/solr-instance-028/collection1/data [CachedDir<<refCount=0;path=/Users/jenkins/workspace/Lucene-Solr-5.x-MacOSX/solr/build/solr-core/test/J1/temp/solr.handler.TestReplicationHandler_9478FB20054B12A5-001/solr-instance-028/collection1/data;done=false>>]
   [junit4]   2> 1883087 INFO  (TEST-TestReplicationHandler.doTestStressReplication-seed#[9478FB20054B12A5]) [    x:collection1] o.a.s.c.CachingDirectoryFactory Closing directory: /Users/jenkins/workspace/Lucene-Solr-5.x-MacOSX/solr/build/solr-core/test/J1/temp/solr.handler.TestReplicationHandler_9478FB20054B12A5-001/solr-instance-028/collection1/data
   [junit4]   2> 1883087 INFO  (TEST-TestReplicationHandler.doTestStressReplication-seed#[9478FB20054B12A5]) [    x:collection1] o.a.s.c.CachingDirectoryFactory looking to close /Users/jenkins/workspace/Lucene-Solr-5.x-MacOSX/solr/build/solr-core/test/J1/temp/solr.handler.TestReplicationHandler_9478FB20054B12A5-001/solr-instance-028/collection1/data/index.20151115044353847 [CachedDir<<refCount=0;path=/Users/jenkins/workspace/Lucene-Solr-5.x-MacOSX/solr/build/solr-core/test/J1/temp/solr.handler.TestReplicationHandler_9478FB20054B12A5-001/solr-instance-028/collection1/data/index.20151115044353847;done=false>>]
   [junit4]   2> 1883087 INFO  (TEST-TestReplicationHandler.doTestStressReplication-seed#[9478FB20054B12A5]) [    x:collection1] o.a.s.c.CachingDirectoryFactory Closing directory: /Users/jenkins/workspace/Lucene-Solr-5.x-MacOSX/solr/build/solr-core/test/J1/temp/solr.handler.TestReplicationHandler_9478FB20054B12A5-001/solr-instance-028/collection1/data/index.20151115044353847
   [junit4]   2> 1883088 INFO  (TEST-TestReplicationHandler.doTestStressReplication-seed#[9478FB20054B12A5]) [    x:collection1] o.e.j.s.h.ContextHandler Stopped o.e.j.s.ServletContextHandler@adaabf9{/solr,null,UNAVAILABLE}
   [junit4]   2> 1883093 INFO  (SUITE-TestReplicationHandler-seed#[9478FB20054B12A5]-worker) [    ] o.a.s.SolrTestCaseJ4 ###deleteCore
   [junit4]   2> NOTE: leaving temporary files on disk at: /Users/jenkins/workspace/Lucene-Solr-5.x-MacOSX/solr/build/solr-core/test/J1/temp/solr.handler.TestReplicationHandler_9478FB20054B12A5-001
   [junit4]   2> NOTE: test params are: codec=Asserting(Lucene54): {newname=BlockTreeOrds(blocksize=128), name=BlockTreeOrds(blocksize=128), id=BlockTreeOrds(blocksize=128)}, docValues:{}, sim=RandomSimilarityProvider(queryNorm=true,coord=yes): {}, locale=de, timezone=America/Nome
   [junit4]   2> NOTE: Mac OS X 10.8.5 x86_64/Oracle Corporation 1.7.0_80 (64-bit)/cpus=3,threads=1,free=223442080,total=536870912
   [junit4]   2> NOTE: All tests run in this JVM: [TestManagedSynonymFilterFactory, TestCSVResponseWriter, TriLevelCompositeIdRoutingTest, AutoCommitTest, TestManagedSchemaDynamicFieldResource, OverriddenZkACLAndCredentialsProvidersTest, TestSolrConfigHandler, TestFastOutputStream, TestCollectionAPI, TestComplexPhraseQParserPlugin, PreAnalyzedUpdateProcessorTest, TestIndexSearcher, TestWriterPerf, TestBadConfig, TestSolrDeletionPolicy2, NumericFieldsTest, TestRandomCollapseQParserPlugin, TestLeaderInitiatedRecoveryThread, TestSolrCloudWithKerberosAlt, SpellCheckCollatorTest, TestSystemIdResolver, TestJoin, TestLMJelinekMercerSimilarityFactory, TestExclusionRuleCollectionAccess, RequestHandlersTest, ResourceLoaderTest, HLLSerializationTest, HdfsBasicDistributedZk2Test, TestTrie, TestReload, DirectUpdateHandlerOptimizeTest, SynonymTokenizerTest, TestValueSourceCache, SignatureUpdateProcessorFactoryTest, RAMDirectoryFactoryTest, RulesTest, TestReloadDeadlock, LeaderFailoverAfterPartitionTest, TestDocBasedVersionConstraints, LoggingHandlerTest, HdfsRecoverLeaseTest, TestDistribDocBasedVersion, CustomCollectionTest, SpatialRPTFieldTypeTest, TestFieldCollectionResource, HighlighterConfigTest, TestDistributedGrouping, TestBM25SimilarityFactory, TestSortByMinMaxFunction, TestLRUStatsCache, TestFoldingMultitermQuery, TestZkChroot, ZkSolrClientTest, TestSolrQueryParserResource, TestRealTimeGet, BigEndianAscendingWordSerializerTest, HdfsSyncSliceTest, SimpleMLTQParserTest, TestTrackingShardHandlerFactory, CoreAdminCreateDiscoverTest, DebugComponentTest, DistanceUnitsTest, TestBinaryField, TestSchemaNameResource, DistributedVersionInfoTest, SolrPluginUtilsTest, BadIndexSchemaTest, TestRandomFaceting, TestPKIAuthenticationPlugin, TestMiniSolrCloudCluster, SuggestComponentContextFilterQueryTest, SuggesterTSTTest, TestQueryTypes, TestCollationFieldDocValues, TestRangeQuery, TestCollationField, TestMissingGroups, DistributedMLTComponentTest, UniqFieldsUpdateProcessorFactoryTest, SpellCheckComponentTest, HdfsUnloadDistributedZkTest, TestHighlightDedupGrouping, TestIndexingPerformance, RequestLoggingTest, UpdateRequestProcessorFactoryTest, TestFastWriter, DistributedQueryComponentOptimizationTest, TestBulkSchemaAPI, TestBinaryResponseWriter, DistributedFacetPivotSmallAdvancedTest, TestObjectReleaseTracker, RuleEngineTest, DateFieldTest, FileUtilsTest, OutOfBoxZkACLAndCredentialsProvidersTest, TestManagedStopFilterFactory, BasicFunctionalityTest, TestRebalanceLeaders, TestAddFieldRealTimeGet, CollectionsAPIDistributedZkTest, AnalyticsMergeStrategyTest, OpenExchangeRatesOrgProviderTest, TestSimpleQParserPlugin, TestSolrQueryParser, CachingDirectoryFactoryTest, QueryParsingTest, SearchHandlerTest, TestNoOpRegenerator, DistributedIntervalFacetingTest, TestUniqueKeyFieldResource, IndexSchemaRuntimeFieldTest, TestConfigReload, TestSolrIndexConfig, TestRemoveLastDynamicCopyField, TermVectorComponentDistributedTest, TestDistribIDF, TestFieldTypeResource, DateMathParserTest, TestMaxScoreQueryParser, TestRestManager, AliasIntegrationTest, TestManagedSchema, PluginInfoTest, TestUtils, LeaderElectionIntegrationTest, TestHdfsUpdateLog, DataDrivenBlockJoinTest, ChaosMonkeySafeLeaderTest, BufferStoreTest, CoreAdminHandlerTest, TestSolrJ, FileBasedSpellCheckerTest, BasicZkTest, OpenCloseCoreStressTest, BasicDistributedZk2Test, SyncSliceTest, OverseerTest, FullSolrCloudDistribCmdsTest, TestReplicationHandler]
   [junit4] Completed [260/547] on J1 in 86.35s, 13 tests, 1 failure <<< FAILURES!

[...truncated 915 lines...]
BUILD FAILED
/Users/jenkins/workspace/Lucene-Solr-5.x-MacOSX/build.xml:785: The following error occurred while executing this line:
/Users/jenkins/workspace/Lucene-Solr-5.x-MacOSX/build.xml:729: The following error occurred while executing this line:
/Users/jenkins/workspace/Lucene-Solr-5.x-MacOSX/build.xml:59: The following error occurred while executing this line:
/Users/jenkins/workspace/Lucene-Solr-5.x-MacOSX/solr/build.xml:233: The following error occurred while executing this line:
/Users/jenkins/workspace/Lucene-Solr-5.x-MacOSX/solr/common-build.xml:526: The following error occurred while executing this line:
/Users/jenkins/workspace/Lucene-Solr-5.x-MacOSX/lucene/common-build.xml:1452: The following error occurred while executing this line:
/Users/jenkins/workspace/Lucene-Solr-5.x-MacOSX/lucene/common-build.xml:1006: There were test failures: 547 suites (7 ignored), 2163 tests, 1 failure, 81 ignored (37 assumptions) [seed: 9478FB20054B12A5]

Total time: 83 minutes 54 seconds
Build step 'Invoke Ant' marked build as failure
Archiving artifacts
[WARNINGS] Skipping publisher since build result is FAILURE
Recording test results
Email was triggered for: Failure - Any
Sending email for trigger: Failure - Any



Mime
View raw message