lucene-dev mailing list archives

Site index · List index
Message view « Date » · « Thread »
Top « Date » · « Thread »
From Policeman Jenkins Server <jenk...@thetaphi.de>
Subject [JENKINS] Lucene-Solr-5.x-Solaris (multiarch/jdk1.7.0) - Build # 207 - Still Failing!
Date Tue, 24 Nov 2015 11:45:41 GMT
Build: http://jenkins.thetaphi.de/job/Lucene-Solr-5.x-Solaris/207/
Java: multiarch/jdk1.7.0 -d32 -client -XX:+UseParallelGC

1 tests failed.
FAILED:  org.apache.solr.search.mlt.CloudMLTQParserTest.test

Error Message:
arrays first differed at element [0]; expected:<...lt:bmw lowerfilt:usa[]) -id:26)/no_coord> but was:<...lt:bmw lowerfilt:usa[ lowerfilt:328i]) -id:26)/no_coord>

Stack Trace:
arrays first differed at element [0]; expected:<...lt:bmw lowerfilt:usa[]) -id:26)/no_coord> but was:<...lt:bmw lowerfilt:usa[ lowerfilt:328i]) -id:26)/no_coord>
	at __randomizedtesting.SeedInfo.seed([BD2AB13677BB5E3C:357E8EECD94733C4]:0)
	at org.junit.internal.ComparisonCriteria.arrayEquals(ComparisonCriteria.java:52)
	at org.junit.Assert.internalArrayEquals(Assert.java:416)
	at org.junit.Assert.assertArrayEquals(Assert.java:168)
	at org.junit.Assert.assertArrayEquals(Assert.java:185)
	at org.apache.solr.search.mlt.CloudMLTQParserTest.test(CloudMLTQParserTest.java:175)
	at sun.reflect.NativeMethodAccessorImpl.invoke0(Native Method)
	at sun.reflect.NativeMethodAccessorImpl.invoke(NativeMethodAccessorImpl.java:57)
	at sun.reflect.DelegatingMethodAccessorImpl.invoke(DelegatingMethodAccessorImpl.java:43)
	at java.lang.reflect.Method.invoke(Method.java:606)
	at com.carrotsearch.randomizedtesting.RandomizedRunner.invoke(RandomizedRunner.java:1764)
	at com.carrotsearch.randomizedtesting.RandomizedRunner$8.evaluate(RandomizedRunner.java:871)
	at com.carrotsearch.randomizedtesting.RandomizedRunner$9.evaluate(RandomizedRunner.java:907)
	at com.carrotsearch.randomizedtesting.RandomizedRunner$10.evaluate(RandomizedRunner.java:921)
	at org.apache.solr.BaseDistributedSearchTestCase$ShardsRepeatRule$ShardsFixedStatement.callStatement(BaseDistributedSearchTestCase.java:963)
	at org.apache.solr.BaseDistributedSearchTestCase$ShardsRepeatRule$ShardsStatement.evaluate(BaseDistributedSearchTestCase.java:938)
	at com.carrotsearch.randomizedtesting.rules.SystemPropertiesRestoreRule$1.evaluate(SystemPropertiesRestoreRule.java:57)
	at org.apache.lucene.util.TestRuleSetupTeardownChained$1.evaluate(TestRuleSetupTeardownChained.java:50)
	at org.apache.lucene.util.AbstractBeforeAfterRule$1.evaluate(AbstractBeforeAfterRule.java:46)
	at org.apache.lucene.util.TestRuleThreadAndTestName$1.evaluate(TestRuleThreadAndTestName.java:49)
	at org.apache.lucene.util.TestRuleIgnoreAfterMaxFailures$1.evaluate(TestRuleIgnoreAfterMaxFailures.java:65)
	at org.apache.lucene.util.TestRuleMarkFailure$1.evaluate(TestRuleMarkFailure.java:48)
	at com.carrotsearch.randomizedtesting.rules.StatementAdapter.evaluate(StatementAdapter.java:36)
	at com.carrotsearch.randomizedtesting.ThreadLeakControl$StatementRunner.run(ThreadLeakControl.java:367)
	at com.carrotsearch.randomizedtesting.ThreadLeakControl.forkTimeoutingTask(ThreadLeakControl.java:809)
	at com.carrotsearch.randomizedtesting.ThreadLeakControl$3.evaluate(ThreadLeakControl.java:460)
	at com.carrotsearch.randomizedtesting.RandomizedRunner.runSingleTest(RandomizedRunner.java:880)
	at com.carrotsearch.randomizedtesting.RandomizedRunner$5.evaluate(RandomizedRunner.java:781)
	at com.carrotsearch.randomizedtesting.RandomizedRunner$6.evaluate(RandomizedRunner.java:816)
	at com.carrotsearch.randomizedtesting.RandomizedRunner$7.evaluate(RandomizedRunner.java:827)
	at com.carrotsearch.randomizedtesting.rules.StatementAdapter.evaluate(StatementAdapter.java:36)
	at com.carrotsearch.randomizedtesting.rules.SystemPropertiesRestoreRule$1.evaluate(SystemPropertiesRestoreRule.java:57)
	at org.apache.lucene.util.AbstractBeforeAfterRule$1.evaluate(AbstractBeforeAfterRule.java:46)
	at com.carrotsearch.randomizedtesting.rules.StatementAdapter.evaluate(StatementAdapter.java:36)
	at org.apache.lucene.util.TestRuleStoreClassName$1.evaluate(TestRuleStoreClassName.java:42)
	at com.carrotsearch.randomizedtesting.rules.NoShadowingOrOverridesOnMethodsRule$1.evaluate(NoShadowingOrOverridesOnMethodsRule.java:40)
	at com.carrotsearch.randomizedtesting.rules.NoShadowingOrOverridesOnMethodsRule$1.evaluate(NoShadowingOrOverridesOnMethodsRule.java:40)
	at com.carrotsearch.randomizedtesting.rules.StatementAdapter.evaluate(StatementAdapter.java:36)
	at com.carrotsearch.randomizedtesting.rules.StatementAdapter.evaluate(StatementAdapter.java:36)
	at com.carrotsearch.randomizedtesting.rules.StatementAdapter.evaluate(StatementAdapter.java:36)
	at org.apache.lucene.util.TestRuleAssertionsRequired$1.evaluate(TestRuleAssertionsRequired.java:54)
	at org.apache.lucene.util.TestRuleMarkFailure$1.evaluate(TestRuleMarkFailure.java:48)
	at org.apache.lucene.util.TestRuleIgnoreAfterMaxFailures$1.evaluate(TestRuleIgnoreAfterMaxFailures.java:65)
	at org.apache.lucene.util.TestRuleIgnoreTestSuites$1.evaluate(TestRuleIgnoreTestSuites.java:55)
	at com.carrotsearch.randomizedtesting.rules.StatementAdapter.evaluate(StatementAdapter.java:36)
	at com.carrotsearch.randomizedtesting.ThreadLeakControl$StatementRunner.run(ThreadLeakControl.java:367)
	at java.lang.Thread.run(Thread.java:745)




Build Log:
[...truncated 11177 lines...]
   [junit4] Suite: org.apache.solr.search.mlt.CloudMLTQParserTest
   [junit4]   2> Creating dataDir: /export/home/jenkins/workspace/Lucene-Solr-5.x-Solaris/solr/build/solr-core/test/J0/temp/solr.search.mlt.CloudMLTQParserTest_BD2AB13677BB5E3C-001/init-core-data-001
   [junit4]   2> 3188327 INFO  (SUITE-CloudMLTQParserTest-seed#[BD2AB13677BB5E3C]-worker) [    ] o.a.s.SolrTestCaseJ4 Randomized ssl (false) and clientAuth (false)
   [junit4]   2> 3188327 INFO  (SUITE-CloudMLTQParserTest-seed#[BD2AB13677BB5E3C]-worker) [    ] o.a.s.BaseDistributedSearchTestCase Setting hostContext system property: /e_hf/
   [junit4]   2> 3188331 INFO  (TEST-CloudMLTQParserTest.test-seed#[BD2AB13677BB5E3C]) [    ] o.a.s.c.ZkTestServer STARTING ZK TEST SERVER
   [junit4]   2> 3188331 INFO  (Thread-11411) [    ] o.a.s.c.ZkTestServer client port:0.0.0.0/0.0.0.0:0
   [junit4]   2> 3188331 INFO  (Thread-11411) [    ] o.a.s.c.ZkTestServer Starting server
   [junit4]   2> 3188436 INFO  (TEST-CloudMLTQParserTest.test-seed#[BD2AB13677BB5E3C]) [    ] o.a.s.c.ZkTestServer start zk server on port:53149
   [junit4]   2> 3188436 INFO  (TEST-CloudMLTQParserTest.test-seed#[BD2AB13677BB5E3C]) [    ] o.a.s.c.c.SolrZkClient Using default ZkCredentialsProvider
   [junit4]   2> 3188437 INFO  (TEST-CloudMLTQParserTest.test-seed#[BD2AB13677BB5E3C]) [    ] o.a.s.c.c.ConnectionManager Waiting for client to connect to ZooKeeper
   [junit4]   2> 3188440 INFO  (zkCallback-4163-thread-1) [    ] o.a.s.c.c.ConnectionManager Watcher org.apache.solr.common.cloud.ConnectionManager@1b45ba7 name:ZooKeeperConnection Watcher:127.0.0.1:53149 got event WatchedEvent state:SyncConnected type:None path:null path:null type:None
   [junit4]   2> 3188440 INFO  (TEST-CloudMLTQParserTest.test-seed#[BD2AB13677BB5E3C]) [    ] o.a.s.c.c.ConnectionManager Client is connected to ZooKeeper
   [junit4]   2> 3188440 INFO  (TEST-CloudMLTQParserTest.test-seed#[BD2AB13677BB5E3C]) [    ] o.a.s.c.c.SolrZkClient Using default ZkACLProvider
   [junit4]   2> 3188440 INFO  (TEST-CloudMLTQParserTest.test-seed#[BD2AB13677BB5E3C]) [    ] o.a.s.c.c.SolrZkClient makePath: /solr
   [junit4]   2> 3188445 INFO  (TEST-CloudMLTQParserTest.test-seed#[BD2AB13677BB5E3C]) [    ] o.a.s.c.c.SolrZkClient Using default ZkCredentialsProvider
   [junit4]   2> 3188445 INFO  (TEST-CloudMLTQParserTest.test-seed#[BD2AB13677BB5E3C]) [    ] o.a.s.c.c.ConnectionManager Waiting for client to connect to ZooKeeper
   [junit4]   2> 3188447 INFO  (zkCallback-4164-thread-1) [    ] o.a.s.c.c.ConnectionManager Watcher org.apache.solr.common.cloud.ConnectionManager@1f2ee9e name:ZooKeeperConnection Watcher:127.0.0.1:53149/solr got event WatchedEvent state:SyncConnected type:None path:null path:null type:None
   [junit4]   2> 3188447 INFO  (TEST-CloudMLTQParserTest.test-seed#[BD2AB13677BB5E3C]) [    ] o.a.s.c.c.ConnectionManager Client is connected to ZooKeeper
   [junit4]   2> 3188448 INFO  (TEST-CloudMLTQParserTest.test-seed#[BD2AB13677BB5E3C]) [    ] o.a.s.c.c.SolrZkClient Using default ZkACLProvider
   [junit4]   2> 3188448 INFO  (TEST-CloudMLTQParserTest.test-seed#[BD2AB13677BB5E3C]) [    ] o.a.s.c.c.SolrZkClient makePath: /collections/collection1
   [junit4]   2> 3188451 INFO  (TEST-CloudMLTQParserTest.test-seed#[BD2AB13677BB5E3C]) [    ] o.a.s.c.c.SolrZkClient makePath: /collections/collection1/shards
   [junit4]   2> 3188454 INFO  (TEST-CloudMLTQParserTest.test-seed#[BD2AB13677BB5E3C]) [    ] o.a.s.c.c.SolrZkClient makePath: /collections/control_collection
   [junit4]   2> 3188457 INFO  (TEST-CloudMLTQParserTest.test-seed#[BD2AB13677BB5E3C]) [    ] o.a.s.c.c.SolrZkClient makePath: /collections/control_collection/shards
   [junit4]   2> 3188459 INFO  (TEST-CloudMLTQParserTest.test-seed#[BD2AB13677BB5E3C]) [    ] o.a.s.c.AbstractZkTestCase put /export/home/jenkins/workspace/Lucene-Solr-5.x-Solaris/solr/core/src/test-files/solr/collection1/conf/solrconfig.xml to /configs/conf1/solrconfig.xml
   [junit4]   2> 3188459 INFO  (TEST-CloudMLTQParserTest.test-seed#[BD2AB13677BB5E3C]) [    ] o.a.s.c.c.SolrZkClient makePath: /configs/conf1/solrconfig.xml
   [junit4]   2> 3188466 INFO  (TEST-CloudMLTQParserTest.test-seed#[BD2AB13677BB5E3C]) [    ] o.a.s.c.AbstractZkTestCase put /export/home/jenkins/workspace/Lucene-Solr-5.x-Solaris/solr/core/src/test-files/solr/collection1/conf/schema.xml to /configs/conf1/schema.xml
   [junit4]   2> 3188466 INFO  (TEST-CloudMLTQParserTest.test-seed#[BD2AB13677BB5E3C]) [    ] o.a.s.c.c.SolrZkClient makePath: /configs/conf1/schema.xml
   [junit4]   2> 3188469 INFO  (TEST-CloudMLTQParserTest.test-seed#[BD2AB13677BB5E3C]) [    ] o.a.s.c.AbstractZkTestCase put /export/home/jenkins/workspace/Lucene-Solr-5.x-Solaris/solr/core/src/test-files/solr/collection1/conf/solrconfig.snippet.randomindexconfig.xml to /configs/conf1/solrconfig.snippet.randomindexconfig.xml
   [junit4]   2> 3188469 INFO  (TEST-CloudMLTQParserTest.test-seed#[BD2AB13677BB5E3C]) [    ] o.a.s.c.c.SolrZkClient makePath: /configs/conf1/solrconfig.snippet.randomindexconfig.xml
   [junit4]   2> 3188471 INFO  (TEST-CloudMLTQParserTest.test-seed#[BD2AB13677BB5E3C]) [    ] o.a.s.c.AbstractZkTestCase put /export/home/jenkins/workspace/Lucene-Solr-5.x-Solaris/solr/core/src/test-files/solr/collection1/conf/stopwords.txt to /configs/conf1/stopwords.txt
   [junit4]   2> 3188471 INFO  (TEST-CloudMLTQParserTest.test-seed#[BD2AB13677BB5E3C]) [    ] o.a.s.c.c.SolrZkClient makePath: /configs/conf1/stopwords.txt
   [junit4]   2> 3188474 INFO  (TEST-CloudMLTQParserTest.test-seed#[BD2AB13677BB5E3C]) [    ] o.a.s.c.AbstractZkTestCase put /export/home/jenkins/workspace/Lucene-Solr-5.x-Solaris/solr/core/src/test-files/solr/collection1/conf/protwords.txt to /configs/conf1/protwords.txt
   [junit4]   2> 3188474 INFO  (TEST-CloudMLTQParserTest.test-seed#[BD2AB13677BB5E3C]) [    ] o.a.s.c.c.SolrZkClient makePath: /configs/conf1/protwords.txt
   [junit4]   2> 3188476 INFO  (TEST-CloudMLTQParserTest.test-seed#[BD2AB13677BB5E3C]) [    ] o.a.s.c.AbstractZkTestCase put /export/home/jenkins/workspace/Lucene-Solr-5.x-Solaris/solr/core/src/test-files/solr/collection1/conf/currency.xml to /configs/conf1/currency.xml
   [junit4]   2> 3188477 INFO  (TEST-CloudMLTQParserTest.test-seed#[BD2AB13677BB5E3C]) [    ] o.a.s.c.c.SolrZkClient makePath: /configs/conf1/currency.xml
   [junit4]   2> 3188479 INFO  (TEST-CloudMLTQParserTest.test-seed#[BD2AB13677BB5E3C]) [    ] o.a.s.c.AbstractZkTestCase put /export/home/jenkins/workspace/Lucene-Solr-5.x-Solaris/solr/core/src/test-files/solr/collection1/conf/enumsConfig.xml to /configs/conf1/enumsConfig.xml
   [junit4]   2> 3188479 INFO  (TEST-CloudMLTQParserTest.test-seed#[BD2AB13677BB5E3C]) [    ] o.a.s.c.c.SolrZkClient makePath: /configs/conf1/enumsConfig.xml
   [junit4]   2> 3188482 INFO  (TEST-CloudMLTQParserTest.test-seed#[BD2AB13677BB5E3C]) [    ] o.a.s.c.AbstractZkTestCase put /export/home/jenkins/workspace/Lucene-Solr-5.x-Solaris/solr/core/src/test-files/solr/collection1/conf/open-exchange-rates.json to /configs/conf1/open-exchange-rates.json
   [junit4]   2> 3188482 INFO  (TEST-CloudMLTQParserTest.test-seed#[BD2AB13677BB5E3C]) [    ] o.a.s.c.c.SolrZkClient makePath: /configs/conf1/open-exchange-rates.json
   [junit4]   2> 3188485 INFO  (TEST-CloudMLTQParserTest.test-seed#[BD2AB13677BB5E3C]) [    ] o.a.s.c.AbstractZkTestCase put /export/home/jenkins/workspace/Lucene-Solr-5.x-Solaris/solr/core/src/test-files/solr/collection1/conf/mapping-ISOLatin1Accent.txt to /configs/conf1/mapping-ISOLatin1Accent.txt
   [junit4]   2> 3188485 INFO  (TEST-CloudMLTQParserTest.test-seed#[BD2AB13677BB5E3C]) [    ] o.a.s.c.c.SolrZkClient makePath: /configs/conf1/mapping-ISOLatin1Accent.txt
   [junit4]   2> 3188487 INFO  (TEST-CloudMLTQParserTest.test-seed#[BD2AB13677BB5E3C]) [    ] o.a.s.c.AbstractZkTestCase put /export/home/jenkins/workspace/Lucene-Solr-5.x-Solaris/solr/core/src/test-files/solr/collection1/conf/old_synonyms.txt to /configs/conf1/old_synonyms.txt
   [junit4]   2> 3188488 INFO  (TEST-CloudMLTQParserTest.test-seed#[BD2AB13677BB5E3C]) [    ] o.a.s.c.c.SolrZkClient makePath: /configs/conf1/old_synonyms.txt
   [junit4]   2> 3188491 INFO  (TEST-CloudMLTQParserTest.test-seed#[BD2AB13677BB5E3C]) [    ] o.a.s.c.AbstractZkTestCase put /export/home/jenkins/workspace/Lucene-Solr-5.x-Solaris/solr/core/src/test-files/solr/collection1/conf/synonyms.txt to /configs/conf1/synonyms.txt
   [junit4]   2> 3188491 INFO  (TEST-CloudMLTQParserTest.test-seed#[BD2AB13677BB5E3C]) [    ] o.a.s.c.c.SolrZkClient makePath: /configs/conf1/synonyms.txt
   [junit4]   2> 3188668 INFO  (TEST-CloudMLTQParserTest.test-seed#[BD2AB13677BB5E3C]) [    ] o.a.s.SolrTestCaseJ4 Writing core.properties file to /export/home/jenkins/workspace/Lucene-Solr-5.x-Solaris/solr/build/solr-core/test/J0/temp/solr.search.mlt.CloudMLTQParserTest_BD2AB13677BB5E3C-001/control-001/cores/collection1
   [junit4]   2> 3188670 INFO  (TEST-CloudMLTQParserTest.test-seed#[BD2AB13677BB5E3C]) [    ] o.e.j.s.Server jetty-9.2.13.v20150730
   [junit4]   2> 3188671 INFO  (TEST-CloudMLTQParserTest.test-seed#[BD2AB13677BB5E3C]) [    ] o.e.j.s.h.ContextHandler Started o.e.j.s.ServletContextHandler@107f837{/e_hf,null,AVAILABLE}
   [junit4]   2> 3188672 INFO  (TEST-CloudMLTQParserTest.test-seed#[BD2AB13677BB5E3C]) [    ] o.e.j.s.ServerConnector Started ServerConnector@38f4d8{HTTP/1.1}{127.0.0.1:50887}
   [junit4]   2> 3188672 INFO  (TEST-CloudMLTQParserTest.test-seed#[BD2AB13677BB5E3C]) [    ] o.e.j.s.Server Started @3194896ms
   [junit4]   2> 3188672 INFO  (TEST-CloudMLTQParserTest.test-seed#[BD2AB13677BB5E3C]) [    ] o.a.s.c.s.e.JettySolrRunner Jetty properties: {hostPort=50887, coreRootDirectory=/export/home/jenkins/workspace/Lucene-Solr-5.x-Solaris/solr/build/solr-core/test/J0/temp/solr.search.mlt.CloudMLTQParserTest_BD2AB13677BB5E3C-001/control-001/cores, hostContext=/e_hf, solr.data.dir=/export/home/jenkins/workspace/Lucene-Solr-5.x-Solaris/solr/build/solr-core/test/J0/temp/solr.search.mlt.CloudMLTQParserTest_BD2AB13677BB5E3C-001/tempDir-001/control/data}
   [junit4]   2> 3188672 INFO  (TEST-CloudMLTQParserTest.test-seed#[BD2AB13677BB5E3C]) [    ] o.a.s.s.SolrDispatchFilter SolrDispatchFilter.init(): sun.misc.Launcher$AppClassLoader@893918
   [junit4]   2> 3188672 INFO  (TEST-CloudMLTQParserTest.test-seed#[BD2AB13677BB5E3C]) [    ] o.a.s.c.SolrResourceLoader new SolrResourceLoader for directory: '/export/home/jenkins/workspace/Lucene-Solr-5.x-Solaris/solr/build/solr-core/test/J0/temp/solr.search.mlt.CloudMLTQParserTest_BD2AB13677BB5E3C-001/control-001'
   [junit4]   2> 3188672 INFO  (TEST-CloudMLTQParserTest.test-seed#[BD2AB13677BB5E3C]) [    ] o.a.s.c.SolrResourceLoader JNDI not configured for solr (NoInitialContextEx)
   [junit4]   2> 3188672 INFO  (TEST-CloudMLTQParserTest.test-seed#[BD2AB13677BB5E3C]) [    ] o.a.s.c.SolrResourceLoader solr home defaulted to 'solr/' (could not find system property or JNDI)
   [junit4]   2> 3188673 INFO  (TEST-CloudMLTQParserTest.test-seed#[BD2AB13677BB5E3C]) [    ] o.a.s.c.c.SolrZkClient Using default ZkCredentialsProvider
   [junit4]   2> 3188673 INFO  (TEST-CloudMLTQParserTest.test-seed#[BD2AB13677BB5E3C]) [    ] o.a.s.c.c.ConnectionManager Waiting for client to connect to ZooKeeper
   [junit4]   2> 3188675 INFO  (zkCallback-4165-thread-1) [    ] o.a.s.c.c.ConnectionManager Watcher org.apache.solr.common.cloud.ConnectionManager@122fe12 name:ZooKeeperConnection Watcher:127.0.0.1:53149/solr got event WatchedEvent state:SyncConnected type:None path:null path:null type:None
   [junit4]   2> 3188675 INFO  (TEST-CloudMLTQParserTest.test-seed#[BD2AB13677BB5E3C]) [    ] o.a.s.c.c.ConnectionManager Client is connected to ZooKeeper
   [junit4]   2> 3188675 INFO  (TEST-CloudMLTQParserTest.test-seed#[BD2AB13677BB5E3C]) [    ] o.a.s.c.c.SolrZkClient Using default ZkACLProvider
   [junit4]   2> 3188677 INFO  (TEST-CloudMLTQParserTest.test-seed#[BD2AB13677BB5E3C]) [    ] o.a.s.s.SolrDispatchFilter Loading solr.xml from SolrHome (not found in ZooKeeper)
   [junit4]   2> 3188677 INFO  (TEST-CloudMLTQParserTest.test-seed#[BD2AB13677BB5E3C]) [    ] o.a.s.c.SolrXmlConfig Loading container configuration from /export/home/jenkins/workspace/Lucene-Solr-5.x-Solaris/solr/build/solr-core/test/J0/temp/solr.search.mlt.CloudMLTQParserTest_BD2AB13677BB5E3C-001/control-001/solr.xml
   [junit4]   2> 3188695 INFO  (TEST-CloudMLTQParserTest.test-seed#[BD2AB13677BB5E3C]) [    ] o.a.s.c.CoresLocator Config-defined core root directory: /export/home/jenkins/workspace/Lucene-Solr-5.x-Solaris/solr/build/solr-core/test/J0/temp/solr.search.mlt.CloudMLTQParserTest_BD2AB13677BB5E3C-001/control-001/cores
   [junit4]   2> 3188695 INFO  (TEST-CloudMLTQParserTest.test-seed#[BD2AB13677BB5E3C]) [    ] o.a.s.c.CoreContainer New CoreContainer 4230213
   [junit4]   2> 3188695 INFO  (TEST-CloudMLTQParserTest.test-seed#[BD2AB13677BB5E3C]) [    ] o.a.s.c.CoreContainer Loading cores into CoreContainer [instanceDir=/export/home/jenkins/workspace/Lucene-Solr-5.x-Solaris/solr/build/solr-core/test/J0/temp/solr.search.mlt.CloudMLTQParserTest_BD2AB13677BB5E3C-001/control-001]
   [junit4]   2> 3188695 WARN  (TEST-CloudMLTQParserTest.test-seed#[BD2AB13677BB5E3C]) [    ] o.a.s.c.CoreContainer Couldn't add files from /export/home/jenkins/workspace/Lucene-Solr-5.x-Solaris/solr/build/solr-core/test/J0/temp/solr.search.mlt.CloudMLTQParserTest_BD2AB13677BB5E3C-001/control-001/lib to classpath: /export/home/jenkins/workspace/Lucene-Solr-5.x-Solaris/solr/build/solr-core/test/J0/temp/solr.search.mlt.CloudMLTQParserTest_BD2AB13677BB5E3C-001/control-001/lib
   [junit4]   2> 3188695 INFO  (TEST-CloudMLTQParserTest.test-seed#[BD2AB13677BB5E3C]) [    ] o.a.s.h.c.HttpShardHandlerFactory created with socketTimeout : 90000,urlScheme : ,connTimeout : 15000,maxConnectionsPerHost : 20,maxConnections : 10000,corePoolSize : 0,maximumPoolSize : 2147483647,maxThreadIdleTime : 5,sizeOfQueue : -1,fairnessPolicy : false,useRetries : false,
   [junit4]   2> 3188696 INFO  (TEST-CloudMLTQParserTest.test-seed#[BD2AB13677BB5E3C]) [    ] o.a.s.u.UpdateShardHandler Creating UpdateShardHandler HTTP client with params: socketTimeout=340000&connTimeout=45000&retry=true
   [junit4]   2> 3188697 INFO  (TEST-CloudMLTQParserTest.test-seed#[BD2AB13677BB5E3C]) [    ] o.a.s.l.LogWatcher SLF4J impl is org.slf4j.impl.Log4jLoggerFactory
   [junit4]   2> 3188697 INFO  (TEST-CloudMLTQParserTest.test-seed#[BD2AB13677BB5E3C]) [    ] o.a.s.l.LogWatcher Registering Log Listener [Log4j (org.slf4j.impl.Log4jLoggerFactory)]
   [junit4]   2> 3188697 INFO  (TEST-CloudMLTQParserTest.test-seed#[BD2AB13677BB5E3C]) [    ] o.a.s.c.ZkContainer Zookeeper client=127.0.0.1:53149/solr
   [junit4]   2> 3188697 INFO  (TEST-CloudMLTQParserTest.test-seed#[BD2AB13677BB5E3C]) [    ] o.a.s.c.ZkController zkHost includes chroot
   [junit4]   2> 3188697 INFO  (TEST-CloudMLTQParserTest.test-seed#[BD2AB13677BB5E3C]) [    ] o.a.s.c.c.SolrZkClient Using default ZkCredentialsProvider
   [junit4]   2> 3188697 INFO  (TEST-CloudMLTQParserTest.test-seed#[BD2AB13677BB5E3C]) [    ] o.a.s.c.c.ConnectionManager Waiting for client to connect to ZooKeeper
   [junit4]   2> 3188699 INFO  (zkCallback-4167-thread-1) [    ] o.a.s.c.c.ConnectionManager Watcher org.apache.solr.common.cloud.ConnectionManager@8dd774 name:ZooKeeperConnection Watcher:127.0.0.1:53149 got event WatchedEvent state:SyncConnected type:None path:null path:null type:None
   [junit4]   2> 3188700 INFO  (TEST-CloudMLTQParserTest.test-seed#[BD2AB13677BB5E3C]) [    ] o.a.s.c.c.ConnectionManager Client is connected to ZooKeeper
   [junit4]   2> 3188700 INFO  (TEST-CloudMLTQParserTest.test-seed#[BD2AB13677BB5E3C]) [    ] o.a.s.c.c.SolrZkClient Using default ZkACLProvider
   [junit4]   2> 3188702 INFO  (TEST-CloudMLTQParserTest.test-seed#[BD2AB13677BB5E3C]) [n:127.0.0.1:50887_e_hf    ] o.a.s.c.c.ConnectionManager Waiting for client to connect to ZooKeeper
   [junit4]   2> 3188703 INFO  (zkCallback-4168-thread-1-processing-n:127.0.0.1:50887_e_hf) [n:127.0.0.1:50887_e_hf    ] o.a.s.c.c.ConnectionManager Watcher org.apache.solr.common.cloud.ConnectionManager@163493a name:ZooKeeperConnection Watcher:127.0.0.1:53149/solr got event WatchedEvent state:SyncConnected type:None path:null path:null type:None
   [junit4]   2> 3188705 INFO  (TEST-CloudMLTQParserTest.test-seed#[BD2AB13677BB5E3C]) [n:127.0.0.1:50887_e_hf    ] o.a.s.c.c.ConnectionManager Client is connected to ZooKeeper
   [junit4]   2> 3188706 INFO  (TEST-CloudMLTQParserTest.test-seed#[BD2AB13677BB5E3C]) [n:127.0.0.1:50887_e_hf    ] o.a.s.c.c.SolrZkClient makePath: /overseer/queue
   [junit4]   2> 3188710 INFO  (TEST-CloudMLTQParserTest.test-seed#[BD2AB13677BB5E3C]) [n:127.0.0.1:50887_e_hf    ] o.a.s.c.c.SolrZkClient makePath: /overseer/collection-queue-work
   [junit4]   2> 3188714 INFO  (TEST-CloudMLTQParserTest.test-seed#[BD2AB13677BB5E3C]) [n:127.0.0.1:50887_e_hf    ] o.a.s.c.c.SolrZkClient makePath: /overseer/collection-map-running
   [junit4]   2> 3188718 INFO  (TEST-CloudMLTQParserTest.test-seed#[BD2AB13677BB5E3C]) [n:127.0.0.1:50887_e_hf    ] o.a.s.c.c.SolrZkClient makePath: /overseer/collection-map-completed
   [junit4]   2> 3188722 INFO  (TEST-CloudMLTQParserTest.test-seed#[BD2AB13677BB5E3C]) [n:127.0.0.1:50887_e_hf    ] o.a.s.c.c.SolrZkClient makePath: /overseer/collection-map-failure
   [junit4]   2> 3188727 INFO  (TEST-CloudMLTQParserTest.test-seed#[BD2AB13677BB5E3C]) [n:127.0.0.1:50887_e_hf    ] o.a.s.c.c.SolrZkClient makePath: /live_nodes
   [junit4]   2> 3188730 INFO  (TEST-CloudMLTQParserTest.test-seed#[BD2AB13677BB5E3C]) [n:127.0.0.1:50887_e_hf    ] o.a.s.c.c.SolrZkClient makePath: /aliases.json
   [junit4]   2> 3188732 INFO  (TEST-CloudMLTQParserTest.test-seed#[BD2AB13677BB5E3C]) [n:127.0.0.1:50887_e_hf    ] o.a.s.c.c.SolrZkClient makePath: /clusterstate.json
   [junit4]   2> 3188735 INFO  (TEST-CloudMLTQParserTest.test-seed#[BD2AB13677BB5E3C]) [n:127.0.0.1:50887_e_hf    ] o.a.s.c.c.SolrZkClient makePath: /security.json
   [junit4]   2> 3188738 INFO  (TEST-CloudMLTQParserTest.test-seed#[BD2AB13677BB5E3C]) [n:127.0.0.1:50887_e_hf    ] o.a.s.c.ZkController Register node as live in ZooKeeper:/live_nodes/127.0.0.1:50887_e_hf
   [junit4]   2> 3188739 INFO  (TEST-CloudMLTQParserTest.test-seed#[BD2AB13677BB5E3C]) [n:127.0.0.1:50887_e_hf    ] o.a.s.c.c.SolrZkClient makePath: /live_nodes/127.0.0.1:50887_e_hf
   [junit4]   2> 3188743 INFO  (TEST-CloudMLTQParserTest.test-seed#[BD2AB13677BB5E3C]) [n:127.0.0.1:50887_e_hf    ] o.a.s.c.c.SolrZkClient makePath: /overseer_elect
   [junit4]   2> 3188746 INFO  (TEST-CloudMLTQParserTest.test-seed#[BD2AB13677BB5E3C]) [n:127.0.0.1:50887_e_hf    ] o.a.s.c.c.SolrZkClient makePath: /overseer_elect/election
   [junit4]   2> 3188749 INFO  (TEST-CloudMLTQParserTest.test-seed#[BD2AB13677BB5E3C]) [n:127.0.0.1:50887_e_hf    ] o.a.s.c.Overseer Overseer (id=null) closing
   [junit4]   2> 3188750 INFO  (TEST-CloudMLTQParserTest.test-seed#[BD2AB13677BB5E3C]) [n:127.0.0.1:50887_e_hf    ] o.a.s.c.LeaderElector Joined leadership election with path: /overseer_elect/election/94920069900861444-127.0.0.1:50887_e_hf-n_0000000000
   [junit4]   2> 3188751 INFO  (TEST-CloudMLTQParserTest.test-seed#[BD2AB13677BB5E3C]) [n:127.0.0.1:50887_e_hf    ] o.a.s.c.OverseerElectionContext I am going to be the leader 127.0.0.1:50887_e_hf
   [junit4]   2> 3188751 INFO  (TEST-CloudMLTQParserTest.test-seed#[BD2AB13677BB5E3C]) [n:127.0.0.1:50887_e_hf    ] o.a.s.c.c.SolrZkClient makePath: /overseer_elect/leader
   [junit4]   2> 3188754 INFO  (TEST-CloudMLTQParserTest.test-seed#[BD2AB13677BB5E3C]) [n:127.0.0.1:50887_e_hf    ] o.a.s.c.Overseer Overseer (id=94920069900861444-127.0.0.1:50887_e_hf-n_0000000000) starting
   [junit4]   2> 3188757 INFO  (TEST-CloudMLTQParserTest.test-seed#[BD2AB13677BB5E3C]) [n:127.0.0.1:50887_e_hf    ] o.a.s.c.c.SolrZkClient makePath: /overseer/queue-work
   [junit4]   2> 3188765 INFO  (TEST-CloudMLTQParserTest.test-seed#[BD2AB13677BB5E3C]) [n:127.0.0.1:50887_e_hf    ] o.a.s.c.OverseerAutoReplicaFailoverThread Starting OverseerAutoReplicaFailoverThread autoReplicaFailoverWorkLoopDelay=10000 autoReplicaFailoverWaitAfterExpiration=30000 autoReplicaFailoverBadNodeExpiration=60000
   [junit4]   2> 3188766 INFO  (TEST-CloudMLTQParserTest.test-seed#[BD2AB13677BB5E3C]) [n:127.0.0.1:50887_e_hf    ] o.a.s.c.c.ZkStateReader Updating cluster state from ZooKeeper... 
   [junit4]   2> 3188772 INFO  (OverseerCollectionConfigSetProcessor-94920069900861444-127.0.0.1:50887_e_hf-n_0000000000) [n:127.0.0.1:50887_e_hf    ] o.a.s.c.OverseerTaskProcessor Process current queue of overseer operations
   [junit4]   2> 3188774 INFO  (OverseerStateUpdate-94920069900861444-127.0.0.1:50887_e_hf-n_0000000000) [n:127.0.0.1:50887_e_hf    ] o.a.s.c.Overseer Starting to work on the main queue
   [junit4]   2> 3188787 INFO  (TEST-CloudMLTQParserTest.test-seed#[BD2AB13677BB5E3C]) [n:127.0.0.1:50887_e_hf    ] o.a.s.c.CoreContainer Security conf doesn't exist. Skipping setup for authorization module.
   [junit4]   2> 3188787 INFO  (TEST-CloudMLTQParserTest.test-seed#[BD2AB13677BB5E3C]) [n:127.0.0.1:50887_e_hf    ] o.a.s.c.CoreContainer No authentication plugin used.
   [junit4]   2> 3188788 INFO  (TEST-CloudMLTQParserTest.test-seed#[BD2AB13677BB5E3C]) [n:127.0.0.1:50887_e_hf    ] o.a.s.c.CoresLocator Looking for core definitions underneath /export/home/jenkins/workspace/Lucene-Solr-5.x-Solaris/solr/build/solr-core/test/J0/temp/solr.search.mlt.CloudMLTQParserTest_BD2AB13677BB5E3C-001/control-001/cores
   [junit4]   2> 3188789 INFO  (TEST-CloudMLTQParserTest.test-seed#[BD2AB13677BB5E3C]) [n:127.0.0.1:50887_e_hf    ] o.a.s.c.SolrCore Created CoreDescriptor: {configSetProperties=configsetprops.json, dataDir=data/, shard=, coreNodeName=, name=collection1, config=solrconfig.xml, transient=false, instanceDir=/export/home/jenkins/workspace/Lucene-Solr-5.x-Solaris/solr/build/solr-core/test/J0/temp/solr.search.mlt.CloudMLTQParserTest_BD2AB13677BB5E3C-001/control-001/cores/collection1, loadOnStartup=true, collection=control_collection, absoluteInstDir=/export/home/jenkins/workspace/Lucene-Solr-5.x-Solaris/solr/build/solr-core/test/J0/temp/solr.search.mlt.CloudMLTQParserTest_BD2AB13677BB5E3C-001/control-001/cores/collection1/, schema=schema.xml}
   [junit4]   2> 3188789 INFO  (TEST-CloudMLTQParserTest.test-seed#[BD2AB13677BB5E3C]) [n:127.0.0.1:50887_e_hf    ] o.a.s.c.CoresLocator Found core collection1 in /export/home/jenkins/workspace/Lucene-Solr-5.x-Solaris/solr/build/solr-core/test/J0/temp/solr.search.mlt.CloudMLTQParserTest_BD2AB13677BB5E3C-001/control-001/cores/collection1/
   [junit4]   2> 3188789 INFO  (TEST-CloudMLTQParserTest.test-seed#[BD2AB13677BB5E3C]) [n:127.0.0.1:50887_e_hf    ] o.a.s.c.CoresLocator Found 1 core definitions
   [junit4]   2> 3188791 INFO  (TEST-CloudMLTQParserTest.test-seed#[BD2AB13677BB5E3C]) [n:127.0.0.1:50887_e_hf    ] o.a.s.s.SolrDispatchFilter user.dir=/export/home/jenkins/workspace/Lucene-Solr-5.x-Solaris/solr/build/solr-core/test/J0
   [junit4]   2> 3188791 INFO  (coreLoadExecutor-8270-thread-1-processing-n:127.0.0.1:50887_e_hf) [n:127.0.0.1:50887_e_hf c:control_collection   x:collection1] o.a.s.c.ZkController publishing state=down
   [junit4]   2> 3188791 INFO  (coreLoadExecutor-8270-thread-1-processing-n:127.0.0.1:50887_e_hf) [n:127.0.0.1:50887_e_hf c:control_collection   x:collection1] o.a.s.c.ZkController numShards not found on descriptor - reading it from system property
   [junit4]   2> 3188791 INFO  (TEST-CloudMLTQParserTest.test-seed#[BD2AB13677BB5E3C]) [n:127.0.0.1:50887_e_hf    ] o.a.s.s.SolrDispatchFilter SolrDispatchFilter.init() done
   [junit4]   2> 3188794 INFO  (OverseerStateUpdate-94920069900861444-127.0.0.1:50887_e_hf-n_0000000000) [n:127.0.0.1:50887_e_hf    ] o.a.s.c.Overseer processMessage: queueSize: 1, message = {
   [junit4]   2>   "core":"collection1",
   [junit4]   2>   "collection":"control_collection",
   [junit4]   2>   "numShards":"1",
   [junit4]   2>   "state":"down",
   [junit4]   2>   "node_name":"127.0.0.1:50887_e_hf",
   [junit4]   2>   "operation":"state",
   [junit4]   2>   "roles":null,
   [junit4]   2>   "base_url":"http://127.0.0.1:50887/e_hf",
   [junit4]   2>   "shard":null} current state version: 0
   [junit4]   2> 3188795 INFO  (coreLoadExecutor-8270-thread-1-processing-n:127.0.0.1:50887_e_hf) [n:127.0.0.1:50887_e_hf c:control_collection   x:collection1] o.a.s.c.ZkController look for our core node name
   [junit4]   2> 3188795 INFO  (OverseerStateUpdate-94920069900861444-127.0.0.1:50887_e_hf-n_0000000000) [n:127.0.0.1:50887_e_hf    ] o.a.s.c.o.ReplicaMutator Update state numShards=1 message={
   [junit4]   2>   "core":"collection1",
   [junit4]   2>   "collection":"control_collection",
   [junit4]   2>   "numShards":"1",
   [junit4]   2>   "state":"down",
   [junit4]   2>   "node_name":"127.0.0.1:50887_e_hf",
   [junit4]   2>   "operation":"state",
   [junit4]   2>   "roles":null,
   [junit4]   2>   "base_url":"http://127.0.0.1:50887/e_hf",
   [junit4]   2>   "shard":null}
   [junit4]   2> 3188796 INFO  (OverseerStateUpdate-94920069900861444-127.0.0.1:50887_e_hf-n_0000000000) [n:127.0.0.1:50887_e_hf    ] o.a.s.c.o.ClusterStateMutator building a new cName: control_collection
   [junit4]   2> 3188797 INFO  (OverseerStateUpdate-94920069900861444-127.0.0.1:50887_e_hf-n_0000000000) [n:127.0.0.1:50887_e_hf    ] o.a.s.c.o.ReplicaMutator Assigning new node to shard shard=shard1
   [junit4]   2> 3188800 INFO  (zkCallback-4168-thread-1-processing-n:127.0.0.1:50887_e_hf) [n:127.0.0.1:50887_e_hf    ] o.a.s.c.c.ZkStateReader A cluster state change: WatchedEvent state:SyncConnected type:NodeDataChanged path:/clusterstate.json, has occurred - updating... (live nodes size: 1)
   [junit4]   2> 3189797 INFO  (coreLoadExecutor-8270-thread-1-processing-n:127.0.0.1:50887_e_hf) [n:127.0.0.1:50887_e_hf c:control_collection   x:collection1] o.a.s.c.ZkController waiting to find shard id in clusterstate for collection1
   [junit4]   2> 3189797 INFO  (coreLoadExecutor-8270-thread-1-processing-n:127.0.0.1:50887_e_hf) [n:127.0.0.1:50887_e_hf c:control_collection   x:collection1] o.a.s.c.ZkController Check for collection zkNode:control_collection
   [junit4]   2> 3189798 INFO  (coreLoadExecutor-8270-thread-1-processing-n:127.0.0.1:50887_e_hf) [n:127.0.0.1:50887_e_hf c:control_collection   x:collection1] o.a.s.c.ZkController Collection zkNode exists
   [junit4]   2> 3189798 INFO  (coreLoadExecutor-8270-thread-1-processing-n:127.0.0.1:50887_e_hf) [n:127.0.0.1:50887_e_hf c:control_collection   x:collection1] o.a.s.c.c.ZkStateReader Load collection config from:/collections/control_collection
   [junit4]   2> 3189799 INFO  (coreLoadExecutor-8270-thread-1-processing-n:127.0.0.1:50887_e_hf) [n:127.0.0.1:50887_e_hf c:control_collection   x:collection1] o.a.s.c.c.ZkStateReader path=/collections/control_collection configName=conf1 specified config exists in ZooKeeper
   [junit4]   2> 3189799 INFO  (coreLoadExecutor-8270-thread-1-processing-n:127.0.0.1:50887_e_hf) [n:127.0.0.1:50887_e_hf c:control_collection   x:collection1] o.a.s.c.SolrResourceLoader new SolrResourceLoader for directory: '/export/home/jenkins/workspace/Lucene-Solr-5.x-Solaris/solr/build/solr-core/test/J0/temp/solr.search.mlt.CloudMLTQParserTest_BD2AB13677BB5E3C-001/control-001/cores/collection1'
   [junit4]   2> 3189800 INFO  (coreLoadExecutor-8270-thread-1-processing-n:127.0.0.1:50887_e_hf) [n:127.0.0.1:50887_e_hf c:control_collection   x:collection1] o.a.s.c.SolrResourceLoader JNDI not configured for solr (NoInitialContextEx)
   [junit4]   2> 3189800 INFO  (coreLoadExecutor-8270-thread-1-processing-n:127.0.0.1:50887_e_hf) [n:127.0.0.1:50887_e_hf c:control_collection   x:collection1] o.a.s.c.SolrResourceLoader solr home defaulted to 'solr/' (could not find system property or JNDI)
   [junit4]   2> 3189802 INFO  (coreLoadExecutor-8270-thread-1-processing-n:127.0.0.1:50887_e_hf) [n:127.0.0.1:50887_e_hf c:control_collection   x:collection1] o.a.s.c.Config loaded config solrconfig.xml with version 0 
   [junit4]   2> 3189819 INFO  (coreLoadExecutor-8270-thread-1-processing-n:127.0.0.1:50887_e_hf) [n:127.0.0.1:50887_e_hf c:control_collection   x:collection1] o.a.s.c.SolrConfig current version of requestparams : -1
   [junit4]   2> 3189840 INFO  (coreLoadExecutor-8270-thread-1-processing-n:127.0.0.1:50887_e_hf) [n:127.0.0.1:50887_e_hf c:control_collection   x:collection1] o.a.s.c.SolrConfig Using Lucene MatchVersion: 5.4.0
   [junit4]   2> 3189881 INFO  (coreLoadExecutor-8270-thread-1-processing-n:127.0.0.1:50887_e_hf) [n:127.0.0.1:50887_e_hf c:control_collection   x:collection1] o.a.s.c.Config Loaded SolrConfig: solrconfig.xml
   [junit4]   2> 3189890 INFO  (coreLoadExecutor-8270-thread-1-processing-n:127.0.0.1:50887_e_hf) [n:127.0.0.1:50887_e_hf c:control_collection   x:collection1] o.a.s.s.IndexSchema [collection1] Schema name=test
   [junit4]   2> 3190190 INFO  (coreLoadExecutor-8270-thread-1-processing-n:127.0.0.1:50887_e_hf) [n:127.0.0.1:50887_e_hf c:control_collection   x:collection1] o.a.s.s.OpenExchangeRatesOrgProvider Initialized with rates=open-exchange-rates.json, refreshInterval=1440.
   [junit4]   2> 3190200 INFO  (coreLoadExecutor-8270-thread-1-processing-n:127.0.0.1:50887_e_hf) [n:127.0.0.1:50887_e_hf c:control_collection   x:collection1] o.a.s.s.IndexSchema default search field in schema is text
   [junit4]   2> 3190202 INFO  (coreLoadExecutor-8270-thread-1-processing-n:127.0.0.1:50887_e_hf) [n:127.0.0.1:50887_e_hf c:control_collection   x:collection1] o.a.s.s.IndexSchema unique key field: id
   [junit4]   2> 3190215 INFO  (coreLoadExecutor-8270-thread-1-processing-n:127.0.0.1:50887_e_hf) [n:127.0.0.1:50887_e_hf c:control_collection   x:collection1] o.a.s.s.FileExchangeRateProvider Reloading exchange rates from file currency.xml
   [junit4]   2> 3190218 INFO  (coreLoadExecutor-8270-thread-1-processing-n:127.0.0.1:50887_e_hf) [n:127.0.0.1:50887_e_hf c:control_collection   x:collection1] o.a.s.s.FileExchangeRateProvider Reloading exchange rates from file currency.xml
   [junit4]   2> 3190222 INFO  (coreLoadExecutor-8270-thread-1-processing-n:127.0.0.1:50887_e_hf) [n:127.0.0.1:50887_e_hf c:control_collection   x:collection1] o.a.s.s.OpenExchangeRatesOrgProvider Reloading exchange rates from open-exchange-rates.json
   [junit4]   2> 3190223 WARN  (coreLoadExecutor-8270-thread-1-processing-n:127.0.0.1:50887_e_hf) [n:127.0.0.1:50887_e_hf c:control_collection   x:collection1] o.a.s.s.OpenExchangeRatesOrgProvider Unknown key IMPORTANT NOTE
   [junit4]   2> 3190223 WARN  (coreLoadExecutor-8270-thread-1-processing-n:127.0.0.1:50887_e_hf) [n:127.0.0.1:50887_e_hf c:control_collection   x:collection1] o.a.s.s.OpenExchangeRatesOrgProvider Expected key, got STRING
   [junit4]   2> 3190223 INFO  (coreLoadExecutor-8270-thread-1-processing-n:127.0.0.1:50887_e_hf) [n:127.0.0.1:50887_e_hf c:control_collection   x:collection1] o.a.s.s.OpenExchangeRatesOrgProvider Reloading exchange rates from open-exchange-rates.json
   [junit4]   2> 3190225 WARN  (coreLoadExecutor-8270-thread-1-processing-n:127.0.0.1:50887_e_hf) [n:127.0.0.1:50887_e_hf c:control_collection   x:collection1] o.a.s.s.OpenExchangeRatesOrgProvider Unknown key IMPORTANT NOTE
   [junit4]   2> 3190225 WARN  (coreLoadExecutor-8270-thread-1-processing-n:127.0.0.1:50887_e_hf) [n:127.0.0.1:50887_e_hf c:control_collection   x:collection1] o.a.s.s.OpenExchangeRatesOrgProvider Expected key, got STRING
   [junit4]   2> 3190227 INFO  (coreLoadExecutor-8270-thread-1-processing-n:127.0.0.1:50887_e_hf) [n:127.0.0.1:50887_e_hf c:control_collection   x:collection1] o.a.s.c.ConfigSetProperties Did not find ConfigSet properties, assuming default properties: Can't find resource 'configsetprops.json' in classpath or '/configs/conf1', cwd=/export/home/jenkins/workspace/Lucene-Solr-5.x-Solaris/solr/build/solr-core/test/J0
   [junit4]   2> 3190227 INFO  (coreLoadExecutor-8270-thread-1-processing-n:127.0.0.1:50887_e_hf) [n:127.0.0.1:50887_e_hf c:control_collection   x:collection1] o.a.s.c.CoreContainer Creating SolrCore 'collection1' using configuration from collection control_collection
   [junit4]   2> 3190227 INFO  (coreLoadExecutor-8270-thread-1-processing-n:127.0.0.1:50887_e_hf) [n:127.0.0.1:50887_e_hf c:control_collection s:shard1 r:core_node1 x:collection1] o.a.s.c.SolrCore org.apache.solr.core.MockDirectoryFactory
   [junit4]   2> 3190227 INFO  (coreLoadExecutor-8270-thread-1-processing-n:127.0.0.1:50887_e_hf) [n:127.0.0.1:50887_e_hf c:control_collection s:shard1 r:core_node1 x:collection1] o.a.s.c.SolrCore [[collection1] ] Opening new SolrCore at [/export/home/jenkins/workspace/Lucene-Solr-5.x-Solaris/solr/build/solr-core/test/J0/temp/solr.search.mlt.CloudMLTQParserTest_BD2AB13677BB5E3C-001/control-001/cores/collection1], dataDir=[null]
   [junit4]   2> 3190227 INFO  (coreLoadExecutor-8270-thread-1-processing-n:127.0.0.1:50887_e_hf) [n:127.0.0.1:50887_e_hf c:control_collection s:shard1 r:core_node1 x:collection1] o.a.s.c.JmxMonitoredMap JMX monitoring is enabled. Adding Solr mbeans to JMX Server: com.sun.jmx.mbeanserver.JmxMBeanServer@e28cbb
   [junit4]   2> 3190228 INFO  (coreLoadExecutor-8270-thread-1-processing-n:127.0.0.1:50887_e_hf) [n:127.0.0.1:50887_e_hf c:control_collection s:shard1 r:core_node1 x:collection1] o.a.s.c.CachingDirectoryFactory return new directory for /export/home/jenkins/workspace/Lucene-Solr-5.x-Solaris/solr/build/solr-core/test/J0/temp/solr.search.mlt.CloudMLTQParserTest_BD2AB13677BB5E3C-001/control-001/cores/collection1/data
   [junit4]   2> 3190228 INFO  (coreLoadExecutor-8270-thread-1-processing-n:127.0.0.1:50887_e_hf) [n:127.0.0.1:50887_e_hf c:control_collection s:shard1 r:core_node1 x:collection1] o.a.s.c.SolrCore New index directory detected: old=null new=/export/home/jenkins/workspace/Lucene-Solr-5.x-Solaris/solr/build/solr-core/test/J0/temp/solr.search.mlt.CloudMLTQParserTest_BD2AB13677BB5E3C-001/control-001/cores/collection1/data/index/
   [junit4]   2> 3190228 WARN  (coreLoadExecutor-8270-thread-1-processing-n:127.0.0.1:50887_e_hf) [n:127.0.0.1:50887_e_hf c:control_collection s:shard1 r:core_node1 x:collection1] o.a.s.c.SolrCore [collection1] Solr index directory '/export/home/jenkins/workspace/Lucene-Solr-5.x-Solaris/solr/build/solr-core/test/J0/temp/solr.search.mlt.CloudMLTQParserTest_BD2AB13677BB5E3C-001/control-001/cores/collection1/data/index' doesn't exist. Creating new index...
   [junit4]   2> 3190228 INFO  (coreLoadExecutor-8270-thread-1-processing-n:127.0.0.1:50887_e_hf) [n:127.0.0.1:50887_e_hf c:control_collection s:shard1 r:core_node1 x:collection1] o.a.s.c.CachingDirectoryFactory return new directory for /export/home/jenkins/workspace/Lucene-Solr-5.x-Solaris/solr/build/solr-core/test/J0/temp/solr.search.mlt.CloudMLTQParserTest_BD2AB13677BB5E3C-001/control-001/cores/collection1/data/index
   [junit4]   2> 3190229 INFO  (coreLoadExecutor-8270-thread-1-processing-n:127.0.0.1:50887_e_hf) [n:127.0.0.1:50887_e_hf c:control_collection s:shard1 r:core_node1 x:collection1] o.a.s.u.RandomMergePolicy RandomMergePolicy wrapping class org.apache.lucene.index.LogDocMergePolicy: [LogDocMergePolicy: minMergeSize=1000, mergeFactor=45, maxMergeSize=9223372036854775807, maxMergeSizeForForcedMerge=9223372036854775807, calibrateSizeByDeletes=true, maxMergeDocs=2147483647, maxCFSSegmentSizeMB=8.796093022207999E12, noCFSRatio=0.7881108121917481]
   [junit4]   2> 3190229 INFO  (coreLoadExecutor-8270-thread-1-processing-n:127.0.0.1:50887_e_hf) [n:127.0.0.1:50887_e_hf c:control_collection s:shard1 r:core_node1 x:collection1] o.a.s.c.SolrCore SolrDeletionPolicy.onCommit: commits: num=1
   [junit4]   2> 	commit{dir=RawDirectoryWrapper(RAMDirectory@de5b6e lockFactory=org.apache.lucene.store.SingleInstanceLockFactory@44a190),segFN=segments_1,generation=1}
   [junit4]   2> 3190229 INFO  (coreLoadExecutor-8270-thread-1-processing-n:127.0.0.1:50887_e_hf) [n:127.0.0.1:50887_e_hf c:control_collection s:shard1 r:core_node1 x:collection1] o.a.s.c.SolrCore newest commit generation = 1
   [junit4]   2> 3190229 INFO  (OldIndexDirectoryCleanupThreadForCore-collection1) [n:127.0.0.1:50887_e_hf c:control_collection s:shard1 r:core_node1 x:collection1] o.a.s.c.SolrCore Looking for old index directories to cleanup for core collection1 in /export/home/jenkins/workspace/Lucene-Solr-5.x-Solaris/solr/build/solr-core/test/J0/temp/solr.search.mlt.CloudMLTQParserTest_BD2AB13677BB5E3C-001/control-001/cores/collection1/data/
   [junit4]   2> 3190230 WARN  (OldIndexDirectoryCleanupThreadForCore-collection1) [n:127.0.0.1:50887_e_hf c:control_collection s:shard1 r:core_node1 x:collection1] o.a.s.c.DirectoryFactory /export/home/jenkins/workspace/Lucene-Solr-5.x-Solaris/solr/build/solr-core/test/J0/temp/solr.search.mlt.CloudMLTQParserTest_BD2AB13677BB5E3C-001/control-001/cores/collection1/data/ does not point to a valid data directory; skipping clean-up of old index directories.
   [junit4]   2> 3190233 INFO  (coreLoadExecutor-8270-thread-1-processing-n:127.0.0.1:50887_e_hf) [n:127.0.0.1:50887_e_hf c:control_collection s:shard1 r:core_node1 x:collection1] o.a.s.u.p.UpdateRequestProcessorChain creating updateRequestProcessorChain "dedupe"
   [junit4]   2> 3190233 INFO  (coreLoadExecutor-8270-thread-1-processing-n:127.0.0.1:50887_e_hf) [n:127.0.0.1:50887_e_hf c:control_collection s:shard1 r:core_node1 x:collection1] o.a.s.u.p.UpdateRequestProcessorChain inserting DistributedUpdateProcessorFactory into updateRequestProcessorChain "dedupe"
   [junit4]   2> 3190233 INFO  (coreLoadExecutor-8270-thread-1-processing-n:127.0.0.1:50887_e_hf) [n:127.0.0.1:50887_e_hf c:control_collection s:shard1 r:core_node1 x:collection1] o.a.s.u.p.UpdateRequestProcessorChain creating updateRequestProcessorChain "dedupe-allfields"
   [junit4]   2> 3190233 INFO  (coreLoadExecutor-8270-thread-1-processing-n:127.0.0.1:50887_e_hf) [n:127.0.0.1:50887_e_hf c:control_collection s:shard1 r:core_node1 x:collection1] o.a.s.u.p.UpdateRequestProcessorChain inserting DistributedUpdateProcessorFactory into updateRequestProcessorChain "dedupe-allfields"
   [junit4]   2> 3190233 INFO  (coreLoadExecutor-8270-thread-1-processing-n:127.0.0.1:50887_e_hf) [n:127.0.0.1:50887_e_hf c:control_collection s:shard1 r:core_node1 x:collection1] o.a.s.u.p.UpdateRequestProcessorChain creating updateRequestProcessorChain "stored_sig"
   [junit4]   2> 3190233 INFO  (coreLoadExecutor-8270-thread-1-processing-n:127.0.0.1:50887_e_hf) [n:127.0.0.1:50887_e_hf c:control_collection s:shard1 r:core_node1 x:collection1] o.a.s.u.p.UpdateRequestProcessorChain inserting DistributedUpdateProcessorFactory into updateRequestProcessorChain "stored_sig"
   [junit4]   2> 3190234 INFO  (coreLoadExecutor-8270-thread-1-processing-n:127.0.0.1:50887_e_hf) [n:127.0.0.1:50887_e_hf c:control_collection s:shard1 r:core_node1 x:collection1] o.a.s.u.p.UpdateRequestProcessorChain creating updateRequestProcessorChain "uniq-fields"
   [junit4]   2> 3190234 INFO  (coreLoadExecutor-8270-thread-1-processing-n:127.0.0.1:50887_e_hf) [n:127.0.0.1:50887_e_hf c:control_collection s:shard1 r:core_node1 x:collection1] o.a.s.u.p.UpdateRequestProcessorChain inserting DistributedUpdateProcessorFactory into updateRequestProcessorChain "uniq-fields"
   [junit4]   2> 3190234 INFO  (coreLoadExecutor-8270-thread-1-processing-n:127.0.0.1:50887_e_hf) [n:127.0.0.1:50887_e_hf c:control_collection s:shard1 r:core_node1 x:collection1] o.a.s.u.p.UpdateRequestProcessorChain creating updateRequestProcessorChain "distrib-dup-test-chain-explicit"
   [junit4]   2> 3190234 INFO  (coreLoadExecutor-8270-thread-1-processing-n:127.0.0.1:50887_e_hf) [n:127.0.0.1:50887_e_hf c:control_collection s:shard1 r:core_node1 x:collection1] o.a.s.u.p.UpdateRequestProcessorChain creating updateRequestProcessorChain "distrib-dup-test-chain-implicit"
   [junit4]   2> 3190234 INFO  (coreLoadExecutor-8270-thread-1-processing-n:127.0.0.1:50887_e_hf) [n:127.0.0.1:50887_e_hf c:control_collection s:shard1 r:core_node1 x:collection1] o.a.s.u.p.UpdateRequestProcessorChain inserting DistributedUpdateProcessorFactory into updateRequestProcessorChain "distrib-dup-test-chain-implicit"
   [junit4]   2> 3190234 INFO  (coreLoadExecutor-8270-thread-1-processing-n:127.0.0.1:50887_e_hf) [n:127.0.0.1:50887_e_hf c:control_collection s:shard1 r:core_node1 x:collection1] o.a.s.c.SolrCore no updateRequestProcessorChain defined as default, creating implicit default
   [junit4]   2> 3190237 INFO  (coreLoadExecutor-8270-thread-1-processing-n:127.0.0.1:50887_e_hf) [n:127.0.0.1:50887_e_hf c:control_collection s:shard1 r:core_node1 x:collection1] o.a.s.h.l.XMLLoader xsltCacheLifetimeSeconds=60
   [junit4]   2> 3190239 INFO  (coreLoadExecutor-8270-thread-1-processing-n:127.0.0.1:50887_e_hf) [n:127.0.0.1:50887_e_hf c:control_collection s:shard1 r:core_node1 x:collection1] o.a.s.h.l.XMLLoader xsltCacheLifetimeSeconds=60
   [junit4]   2> 3190240 INFO  (coreLoadExecutor-8270-thread-1-processing-n:127.0.0.1:50887_e_hf) [n:127.0.0.1:50887_e_hf c:control_collection s:shard1 r:core_node1 x:collection1] o.a.s.h.l.XMLLoader xsltCacheLifetimeSeconds=60
   [junit4]   2> 3190242 INFO  (coreLoadExecutor-8270-thread-1-processing-n:127.0.0.1:50887_e_hf) [n:127.0.0.1:50887_e_hf c:control_collection s:shard1 r:core_node1 x:collection1] o.a.s.h.l.XMLLoader xsltCacheLifetimeSeconds=60
   [junit4]   2> 3190246 INFO  (coreLoadExecutor-8270-thread-1-processing-n:127.0.0.1:50887_e_hf) [n:127.0.0.1:50887_e_hf c:control_collection s:shard1 r:core_node1 x:collection1] o.a.s.c.PluginBag requestHandler : 'lazy' created with startup=lazy 
   [junit4]   2> 3190248 INFO  (coreLoadExecutor-8270-thread-1-processing-n:127.0.0.1:50887_e_hf) [n:127.0.0.1:50887_e_hf c:control_collection s:shard1 r:core_node1 x:collection1] o.a.s.c.RequestHandlers Registered paths: defaults,dismax,tvrh,/mlt,/debug/dump,spellCheckCompRH1,spellCheckWithWordbreak,/terms,spellCheckWithWordbreak_Direct,/admin/logging,spellCheckCompRH_Direct,lazy,/update/json/docs,/admin/system,/update/csv,/admin/segments,/schema,/admin/file,mltrh,/update,/update/json,/admin/plugins,/admin/luke,/get,mock,/admin/properties,/search-facet-invariants,/search-facet-def,/replication,/admin/mbeans,/config,/admin/ping,/admin/threads,standard,spellCheckCompRH
   [junit4]   2> 3190249 WARN  (coreLoadExecutor-8270-thread-1-processing-n:127.0.0.1:50887_e_hf) [n:127.0.0.1:50887_e_hf c:control_collection s:shard1 r:core_node1 x:collection1] o.a.s.c.SolrCore solrconfig.xml uses deprecated <admin/gettableFiles>, Please update your config to use the ShowFileRequestHandler.
   [junit4]   2> 3190250 INFO  (coreLoadExecutor-8270-thread-1-processing-n:127.0.0.1:50887_e_hf) [n:127.0.0.1:50887_e_hf c:control_collection s:shard1 r:core_node1 x:collection1] o.a.s.c.SolrCore Using default statsCache cache: org.apache.solr.search.stats.LocalStatsCache
   [junit4]   2> 3190250 INFO  (coreLoadExecutor-8270-thread-1-processing-n:127.0.0.1:50887_e_hf) [n:127.0.0.1:50887_e_hf c:control_collection s:shard1 r:core_node1 x:collection1] o.a.s.u.UpdateHandler Using UpdateLog implementation: org.apache.solr.update.UpdateLog
   [junit4]   2> 3190251 INFO  (coreLoadExecutor-8270-thread-1-processing-n:127.0.0.1:50887_e_hf) [n:127.0.0.1:50887_e_hf c:control_collection s:shard1 r:core_node1 x:collection1] o.a.s.u.UpdateLog Initializing UpdateLog: dataDir= defaultSyncLevel=FLUSH numRecordsToKeep=100 maxNumLogsToKeep=10 numVersionBuckets=65536
   [junit4]   2> 3190251 INFO  (coreLoadExecutor-8270-thread-1-processing-n:127.0.0.1:50887_e_hf) [n:127.0.0.1:50887_e_hf c:control_collection s:shard1 r:core_node1 x:collection1] o.a.s.c.SolrCore Hard AutoCommit: disabled
   [junit4]   2> 3190252 INFO  (coreLoadExecutor-8270-thread-1-processing-n:127.0.0.1:50887_e_hf) [n:127.0.0.1:50887_e_hf c:control_collection s:shard1 r:core_node1 x:collection1] o.a.s.c.SolrCore Soft AutoCommit: disabled
   [junit4]   2> 3190252 INFO  (coreLoadExecutor-8270-thread-1-processing-n:127.0.0.1:50887_e_hf) [n:127.0.0.1:50887_e_hf c:control_collection s:shard1 r:core_node1 x:collection1] o.a.s.u.RandomMergePolicy RandomMergePolicy wrapping class org.apache.lucene.index.LogByteSizeMergePolicy: [LogByteSizeMergePolicy: minMergeSize=1677721, mergeFactor=17, maxMergeSize=2147483648, maxMergeSizeForForcedMerge=9223372036854775807, calibrateSizeByDeletes=true, maxMergeDocs=2147483647, maxCFSSegmentSizeMB=8.796093022207999E12, noCFSRatio=0.0]
   [junit4]   2> 3190252 INFO  (coreLoadExecutor-8270-thread-1-processing-n:127.0.0.1:50887_e_hf) [n:127.0.0.1:50887_e_hf c:control_collection s:shard1 r:core_node1 x:collection1] o.a.s.c.SolrCore SolrDeletionPolicy.onInit: commits: num=1
   [junit4]   2> 	commit{dir=RawDirectoryWrapper(RAMDirectory@de5b6e lockFactory=org.apache.lucene.store.SingleInstanceLockFactory@44a190),segFN=segments_1,generation=1}
   [junit4]   2> 3190252 INFO  (coreLoadExecutor-8270-thread-1-processing-n:127.0.0.1:50887_e_hf) [n:127.0.0.1:50887_e_hf c:control_collection s:shard1 r:core_node1 x:collection1] o.a.s.c.SolrCore newest commit generation = 1
   [junit4]   2> 3190253 INFO  (coreLoadExecutor-8270-thread-1-processing-n:127.0.0.1:50887_e_hf) [n:127.0.0.1:50887_e_hf c:control_collection s:shard1 r:core_node1 x:collection1] o.a.s.s.SolrIndexSearcher Opening Searcher@7be4be[collection1] main
   [junit4]   2> 3190253 INFO  (coreLoadExecutor-8270-thread-1-processing-n:127.0.0.1:50887_e_hf) [n:127.0.0.1:50887_e_hf c:control_collection s:shard1 r:core_node1 x:collection1] o.a.s.c.c.ZkStateReader Load collection config from:/collections/control_collection
   [junit4]   2> 3190254 INFO  (coreLoadExecutor-8270-thread-1-processing-n:127.0.0.1:50887_e_hf) [n:127.0.0.1:50887_e_hf c:control_collection s:shard1 r:core_node1 x:collection1] o.a.s.c.c.ZkStateReader path=/collections/control_collection configName=conf1 specified config exists in ZooKeeper
   [junit4]   2> 3190254 INFO  (coreLoadExecutor-8270-thread-1-processing-n:127.0.0.1:50887_e_hf) [n:127.0.0.1:50887_e_hf c:control_collection s:shard1 r:core_node1 x:collection1] o.a.s.r.RestManager Initializing RestManager with initArgs: {storageIO=org.apache.solr.rest.ManagedResourceStorage$InMemoryStorageIO}
   [junit4]   2> 3190254 INFO  (coreLoadExecutor-8270-thread-1-processing-n:127.0.0.1:50887_e_hf) [n:127.0.0.1:50887_e_hf c:control_collection s:shard1 r:core_node1 x:collection1] o.a.s.r.ManagedResourceStorage Reading _rest_managed.json using InMemoryStorage
   [junit4]   2> 3190254 INFO  (coreLoadExecutor-8270-thread-1-processing-n:127.0.0.1:50887_e_hf) [n:127.0.0.1:50887_e_hf c:control_collection s:shard1 r:core_node1 x:collection1] o.a.s.r.RestManager Initializing 0 registered ManagedResources
   [junit4]   2> 3190254 INFO  (coreLoadExecutor-8270-thread-1-processing-n:127.0.0.1:50887_e_hf) [n:127.0.0.1:50887_e_hf c:control_collection s:shard1 r:core_node1 x:collection1] o.a.s.h.c.SpellCheckComponent Initializing spell checkers
   [junit4]   2> 3190288 INFO  (coreLoadExecutor-8270-thread-1-processing-n:127.0.0.1:50887_e_hf) [n:127.0.0.1:50887_e_hf c:control_collection s:shard1 r:core_node1 x:collection1] o.a.s.s.DirectSolrSpellChecker init: {name=direct,classname=DirectSolrSpellChecker,field=lowerfilt,minQueryLength=3}
   [junit4]   2> 3190371 INFO  (coreLoadExecutor-8270-thread-1-processing-n:127.0.0.1:50887_e_hf) [n:127.0.0.1:50887_e_hf c:control_collection s:shard1 r:core_node1 x:collection1] o.a.s.h.ReplicationHandler Commits will be reserved for  10000
   [junit4]   2> 3190371 INFO  (searcherExecutor-8271-thread-1-processing-x:collection1 c:control_collection r:core_node1 n:127.0.0.1:50887_e_hf s:shard1) [n:127.0.0.1:50887_e_hf c:control_collection s:shard1 r:core_node1 x:collection1] o.a.s.h.c.SpellCheckComponent Loading spell index for spellchecker: default
   [junit4]   2> 3190372 INFO  (searcherExecutor-8271-thread-1-processing-x:collection1 c:control_collection r:core_node1 n:127.0.0.1:50887_e_hf s:shard1) [n:127.0.0.1:50887_e_hf c:control_collection s:shard1 r:core_node1 x:collection1] o.a.s.h.c.SpellCheckComponent Loading spell index for spellchecker: direct
   [junit4]   2> 3190372 INFO  (coreLoadExecutor-8270-thread-1-processing-n:127.0.0.1:50887_e_hf) [n:127.0.0.1:50887_e_hf c:control_collection s:shard1 r:core_node1 x:collection1] o.a.s.u.UpdateLog Looking up max value of version field to seed version buckets
   [junit4]   2> 3190372 INFO  (coreLoadExecutor-8270-thread-1-processing-n:127.0.0.1:50887_e_hf) [n:127.0.0.1:50887_e_hf c:control_collection s:shard1 r:core_node1 x:collection1] o.a.s.u.VersionInfo Refreshing highest value of _version_ for 65536 version buckets from index
   [junit4]   2> 3190372 INFO  (coreLoadExecutor-8270-thread-1-processing-n:127.0.0.1:50887_e_hf) [n:127.0.0.1:50887_e_hf c:control_collection s:shard1 r:core_node1 x:collection1] o.a.s.u.VersionInfo No terms found for _version_, cannot seed version bucket highest value from index
   [junit4]   2> 3190372 INFO  (coreLoadExecutor-8270-thread-1-processing-n:127.0.0.1:50887_e_hf) [n:127.0.0.1:50887_e_hf c:control_collection s:shard1 r:core_node1 x:collection1] o.a.s.u.UpdateLog Could not find max version in index or recent updates, using new clock 1518721120551829504
   [junit4]   2> 3190372 INFO  (searcherExecutor-8271-thread-1-processing-x:collection1 c:control_collection r:core_node1 n:127.0.0.1:50887_e_hf s:shard1) [n:127.0.0.1:50887_e_hf c:control_collection s:shard1 r:core_node1 x:collection1] o.a.s.h.c.SpellCheckComponent Loading spell index for spellchecker: wordbreak
   [junit4]   2> 3190372 INFO  (searcherExecutor-8271-thread-1-processing-x:collection1 c:control_collection r:core_node1 n:127.0.0.1:50887_e_hf s:shard1) [n:127.0.0.1:50887_e_hf c:control_collection s:shard1 r:core_node1 x:collection1] o.a.s.h.c.SpellCheckComponent Loading spell index for spellchecker: multipleFields
   [junit4]   2> 3190373 INFO  (searcherExecutor-8271-thread-1-processing-x:collection1 c:control_collection r:core_node1 n:127.0.0.1:50887_e_hf s:shard1) [n:127.0.0.1:50887_e_hf c:control_collection s:shard1 r:core_node1 x:collection1] o.a.s.h.c.SpellCheckComponent Loading spell index for spellchecker: jarowinkler
   [junit4]   2> 3190373 INFO  (searcherExecutor-8271-thread-1-processing-x:collection1 c:control_collection r:core_node1 n:127.0.0.1:50887_e_hf s:shard1) [n:127.0.0.1:50887_e_hf c:control_collection s:shard1 r:core_node1 x:collection1] o.a.s.h.c.SpellCheckComponent Loading spell index for spellchecker: external
   [junit4]   2> 3190374 INFO  (searcherExecutor-8271-thread-1-processing-x:collection1 c:control_collection r:core_node1 n:127.0.0.1:50887_e_hf s:shard1) [n:127.0.0.1:50887_e_hf c:control_collection s:shard1 r:core_node1 x:collection1] o.a.s.h.c.SpellCheckComponent Loading spell index for spellchecker: freq
   [junit4]   2> 3190374 INFO  (coreLoadExecutor-8270-thread-1-processing-n:127.0.0.1:50887_e_hf) [n:127.0.0.1:50887_e_hf c:control_collection s:shard1 r:core_node1 x:collection1] o.a.s.u.UpdateLog Took 1.0ms to seed version buckets with highest version 1518721120551829504
   [junit4]   2> 3190374 INFO  (coreLoadExecutor-8270-thread-1-processing-n:127.0.0.1:50887_e_hf) [n:127.0.0.1:50887_e_hf c:control_collection s:shard1 r:core_node1 x:collection1] o.a.s.c.ZkController watch zkdir /configs/conf1
   [junit4]   2> 3190374 INFO  (searcherExecutor-8271-thread-1-processing-x:collection1 c:control_collection r:core_node1 n:127.0.0.1:50887_e_hf s:shard1) [n:127.0.0.1:50887_e_hf c:control_collection s:shard1 r:core_node1 x:collection1] o.a.s.h.c.SpellCheckComponent Loading spell index for spellchecker: fqcn
   [junit4]   2> 3190375 INFO  (coreLoadExecutor-8270-thread-1-processing-n:127.0.0.1:50887_e_hf) [n:127.0.0.1:50887_e_hf c:control_collection s:shard1 r:core_node1 x:collection1] o.a.s.c.CoreContainer registering core: collection1
   [junit4]   2> 3190375 INFO  (searcherExecutor-8271-thread-1-processing-x:collection1 c:control_collection r:core_node1 n:127.0.0.1:50887_e_hf s:shard1) [n:127.0.0.1:50887_e_hf c:control_collection s:shard1 r:core_node1 x:collection1] o.a.s.h.c.SpellCheckComponent Loading spell index for spellchecker: perDict
   [junit4]   2> 3190375 INFO  (coreZkRegister-8264-thread-1-processing-x:collection1 c:control_collection r:core_node1 n:127.0.0.1:50887_e_hf s:shard1) [n:127.0.0.1:50887_e_hf c:control_collection s:shard1 r:core_node1 x:collection1] o.a.s.c.ZkController Register replica - core:collection1 address:http://127.0.0.1:50887/e_hf collection:control_collection shard:shard1
   [junit4]   2> 3190376 INFO  (searcherExecutor-8271-thread-1-processing-x:collection1 c:control_collection r:core_node1 n:127.0.0.1:50887_e_hf s:shard1) [n:127.0.0.1:50887_e_hf c:control_collection s:shard1 r:core_node1 x:collection1] o.a.s.c.SolrCore [collection1] Registered new searcher Searcher@7be4be[collection1] main{ExitableDirectoryReader(UninvertingDirectoryReader())}
   [junit4]   2> 3190376 INFO  (coreZkRegister-8264-thread-1-processing-x:collection1 c:control_collection r:core_node1 n:127.0.0.1:50887_e_hf s:shard1) [n:127.0.0.1:50887_e_hf c:control_collection s:shard1 r:core_node1 x:collection1] o.a.s.c.c.SolrZkClient makePath: /collections/control_collection/leader_elect/shard1/election
   [junit4]   2> 3190382 INFO  (coreZkRegister-8264-thread-1-processing-x:collection1 c:control_collection r:core_node1 n:127.0.0.1:50887_e_hf s:shard1) [n:127.0.0.1:50887_e_hf c:control_collection s:shard1 r:core_node1 x:collection1] o.a.s.c.LeaderElector Joined leadership election with path: /collections/control_collection/leader_elect/shard1/election/94920069900861444-core_node1-n_0000000000
   [junit4]   2> 3190382 INFO  (coreZkRegister-8264-thread-1-processing-x:collection1 c:control_collection r:core_node1 n:127.0.0.1:50887_e_hf s:shard1) [n:127.0.0.1:50887_e_hf c:control_collection s:shard1 r:core_node1 x:collection1] o.a.s.c.ShardLeaderElectionContext Running the leader process for shard shard1
   [junit4]   2> 3190385 INFO  (coreZkRegister-8264-thread-1-processing-x:collection1 c:control_collection r:core_node1 n:127.0.0.1:50887_e_hf s:shard1) [n:127.0.0.1:50887_e_hf c:control_collection s:shard1 r:core_node1 x:collection1] o.a.s.c.ShardLeaderElectionContext Enough replicas found to continue.
   [junit4]   2> 3190385 INFO  (coreZkRegister-8264-thread-1-processing-x:collection1 c:control_collection r:core_node1 n:127.0.0.1:50887_e_hf s:shard1) [n:127.0.0.1:50887_e_hf c:control_collection s:shard1 r:core_node1 x:collection1] o.a.s.c.ShardLeaderElectionContext I may be the new leader - try and sync
   [junit4]   2> 3190385 INFO  (coreZkRegister-8264-thread-1-processing-x:collection1 c:control_collection r:core_node1 n:127.0.0.1:50887_e_hf s:shard1) [n:127.0.0.1:50887_e_hf c:control_collection s:shard1 r:core_node1 x:collection1] o.a.s.c.SyncStrategy Sync replicas to http://127.0.0.1:50887/e_hf/collection1/
   [junit4]   2> 3190385 INFO  (coreZkRegister-8264-thread-1-processing-x:collection1 c:control_collection r:core_node1 n:127.0.0.1:50887_e_hf s:shard1) [n:127.0.0.1:50887_e_hf c:control_collection s:shard1 r:core_node1 x:collection1] o.a.s.c.SyncStrategy Sync Success - now sync replicas to me
   [junit4]   2> 3190385 INFO  (coreZkRegister-8264-thread-1-processing-x:collection1 c:control_collection r:core_node1 n:127.0.0.1:50887_e_hf s:shard1) [n:127.0.0.1:50887_e_hf c:control_collection s:shard1 r:core_node1 x:collection1] o.a.s.c.SyncStrategy http://127.0.0.1:50887/e_hf/collection1/ has no replicas
   [junit4]   2> 3190385 INFO  (OverseerStateUpdate-94920069900861444-127.0.0.1:50887_e_hf-n_0000000000) [n:127.0.0.1:50887_e_hf    ] o.a.s.c.Overseer processMessage: queueSize: 1, message = {
   [junit4]   2>   "operation":"leader",
   [junit4]   2>   "shard":"shard1",
   [junit4]   2>   "collection":"control_collection"} current state version: 1
   [junit4]   2> 3190387 INFO  (coreZkRegister-8264-thread-1-processing-x:collection1 c:control_collection r:core_node1 n:127.0.0.1:50887_e_hf s:shard1) [n:127.0.0.1:50887_e_hf c:control_collection s:shard1 r:core_node1 x:collection1] o.a.s.c.c.SolrZkClient makePath: /collections/control_collection/leaders/shard1
   [junit4]   2> 3190387 INFO  (zkCallback-4168-thread-1-processing-n:127.0.0.1:50887_e_hf) [n:127.0.0.1:50887_e_hf    ] o.a.s.c.c.ZkStateReader A cluster state change: WatchedEvent state:SyncConnected type:NodeDataChanged path:/clusterstate.json, has occurred - updating... (live nodes size: 1)
   [junit4]   2> 3190392 INFO  (coreZkRegister-8264-thread-1-processing-x:collection1 c:control_collection r:core_node1 n:127.0.0.1:50887_e_hf s:shard1) [n:127.0.0.1:50887_e_hf c:control_collection s:shard1 r:core_node1 x:collection1] o.a.s.c.ShardLeaderElectionContextBase Creating leader registration node
   [junit4]   2> 3190394 INFO  (coreZkRegister-8264-thread-1-processing-x:collection1 c:control_collection r:core_node1 n:127.0.0.1:50887_e_hf s:shard1) [n:127.0.0.1:50887_e_hf c:control_collection s:shard1 r:core_node1 x:collection1] o.a.s.c.ShardLeaderElectionContext I am the new leader: http://127.0.0.1:50887/e_hf/collection1/ shard1
   [junit4]   2> 3190396 INFO  (OverseerStateUpdate-94920069900861444-127.0.0.1:50887_e_hf-n_0000000000) [n:127.0.0.1:50887_e_hf    ] o.a.s.c.Overseer processMessage: queueSize: 1, message = {
   [junit4]   2>   "operation":"leader",
   [junit4]   2>   "shard":"shard1",
   [junit4]   2>   "collection":"control_collection",
   [junit4]   2>   "base_url":"http://127.0.0.1:50887/e_hf",
   [junit4]   2>   "core":"collection1",
   [junit4]   2>   "state":"active"} current state version: 2
   [junit4]   2> 3190500 INFO  (zkCallback-4168-thread-1-processing-n:127.0.0.1:50887_e_hf) [n:127.0.0.1:50887_e_hf    ] o.a.s.c.c.ZkStateReader A cluster state change: WatchedEvent state:SyncConnected type:NodeDataChanged path:/clusterstate.json, has occurred - updating... (live nodes size: 1)
   [junit4]   2> 3190549 INFO  (coreZkRegister-8264-thread-1-processing-x:collection1 c:control_collection r:core_node1 n:127.0.0.1:50887_e_hf s:shard1) [n:127.0.0.1:50887_e_hf c:control_collection s:shard1 r:core_node1 x:collection1] o.a.s.c.ZkController We are http://127.0.0.1:50887/e_hf/collection1/ and leader is http://127.0.0.1:50887/e_hf/collection1/
   [junit4]   2> 3190549 INFO  (coreZkRegister-8264-thread-1-processing-x:collection1 c:control_collection r:core_node1 n:127.0.0.1:50887_e_hf s:shard1) [n:127.0.0.1:50887_e_hf c:control_collection s:shard1 r:core_node1 x:collection1] o.a.s.c.ZkController No LogReplay needed for core=collection1 baseURL=http://127.0.0.1:50887/e_hf
   [junit4]   2> 3190549 INFO  (coreZkRegister-8264-thread-1-processing-x:collection1 c:control_collection r:core_node1 n:127.0.0.1:50887_e_hf s:shard1) [n:127.0.0.1:50887_e_hf c:control_collection s:shard1 r:core_node1 x:collection1] o.a.s.c.ZkController I am the leader, no recovery necessary
   [junit4]   2> 3190549 INFO  (coreZkRegister-8264-thread-1-processing-x:collection1 c:control_collection r:core_node1 n:127.0.0.1:50887_e_hf s:shard1) [n:127.0.0.1:50887_e_hf c:control_collection s:shard1 r:core_node1 x:collection1] o.a.s.c.ZkController publishing state=active
   [junit4]   2> 3190549 INFO  (coreZkRegister-8264-thread-1-processing-x:collection1 c:control_collection r:core_node1 n:127.0.0.1:50887_e_hf s:shard1) [n:127.0.0.1:50887_e_hf c:control_collection s:shard1 r:core_node1 x:collection1] o.a.s.c.ZkController numShards not found on descriptor - reading it from system property
   [junit4]   2> 3190552 INFO  (OverseerStateUpdate-94920069900861444-127.0.0.1:50887_e_hf-n_0000000000) [n:127.0.0.1:50887_e_hf    ] o.a.s.c.Overseer processMessage: queueSize: 1, message = {
   [junit4]   2>   "core":"collection1",
   [junit4]   2>   "collection":"control_collection",
   [junit4]   2>   "numShards":"1",
   [junit4]   2>   "state":"active",
   [junit4]   2>   "node_name":"127.0.0.1:50887_e_hf",
   [junit4]   2>   "operation":"state",
   [junit4]   2>   "core_node_name":"core_node1",
   [junit4]   2>   "roles":null,
   [junit4]   2>   "base_url":"http://127.0.0.1:50887/e_hf",
   [junit4]   2>   "shard":"shard1"} current state version: 3
   [junit4]   2> 3190553 INFO  (OverseerStateUpdate-94920069900861444-127.0.0.1:50887_e_hf-n_0000000000) [n:127.0.0.1:50887_e_hf    ] o.a.s.c.o.ReplicaMutator Update state numShards=1 message={
   [junit4]   2>   "core":"collection1",
   [junit4]   2>   "collection":"control_collection",
   [junit4]   2>   "numShards":"1",
   [junit4]   2>   "state":"active",
   [junit4]   2>   "node_name":"127.0.0.1:50887_e_hf",
   [junit4]   2>   "operation":"state",
   [junit4]   2>   "core_node_name":"core_node1",
   [junit4]   2>   "roles":null,
   [junit4]   2>   "base_url":"http://127.0.0.1:50887/e_hf",
   [junit4]   2>   "shard":"shard1"}
   [junit4]   2> 3190657 INFO  (zkCallback-4168-thread-2-processing-n:127.0.0.1:50887_e_hf) [n:127.0.0.1:50887_e_hf    ] o.a.s.c.c.ZkStateReader A cluster state change: WatchedEvent state:SyncConnected type:NodeDataChanged path:/clusterstate.json, has occurred - updating... (live nodes size: 1)
   [junit4]   2> 3190795 INFO  (TEST-CloudMLTQParserTest.test-seed#[BD2AB13677BB5E3C]) [    ] o.a.s.c.c.SolrZkClient Using default ZkCredentialsProvider
   [junit4]   2> 3190796 INFO  (TEST-CloudMLTQParserTest.test-seed#[BD2AB13677BB5E3C]) [    ] o.a.s.c.c.ConnectionManager Waiting for client to connect to ZooKeeper
   [junit4]   2> 3190798 INFO  (zkCallback-4170-thread-1) [    ] o.a.s.c.c.ConnectionManager Watcher org.apache.solr.common.cloud.ConnectionManager@18a34c name:ZooKeeperConnection Watcher:127.0.0.1:53149/solr got event WatchedEvent state:SyncConnected type:None path:null path:null type:None
   [junit4]   2> 3190798 INFO  (TEST-CloudMLTQParserTest.test-seed#[BD2AB13677BB5E3C]) [    ] o.a.s.c.c.ConnectionManager Client is connected to ZooKeeper
   [junit4]   2> 3190798 INFO  (TEST-CloudMLTQParserTest.test-seed#[BD2AB13677BB5E3C]) [    ] o.a.s.c.c.SolrZkClient Using default ZkACLProvider
   [junit4]   2> 3190798 INFO  (TEST-CloudMLTQParserTest.test-seed#[BD2AB13677BB5E3C]) [    ] o.a.s.c.c.ZkStateReader Updating cluster state from ZooKeeper... 
   [junit4]   2> 3190802 INFO  (TEST-CloudMLTQParserTest.test-seed#[BD2AB13677BB5E3C]) [    ] o.a.s.c.ChaosMonkey monkey: init - expire sessions:false cause connection loss:false
   [junit4]   2> 3190943 INFO  (TEST-CloudMLTQParserTest.test-seed#[BD2AB13677BB5E3C]) [    ] o.a.s.SolrTestCaseJ4 Writing core.properties file to /export/home/jenkins/workspace/Lucene-Solr-5.x-Solaris/solr/build/solr-core/test/J0/temp/solr.search.mlt.CloudMLTQParserTest_BD2AB13677BB5E3C-001/shard-1-001/cores/collection1
   [junit4]   2> 3190944 INFO  (TEST-CloudMLTQParserTest.test-seed#[BD2AB13677BB5E3C]) [    ] o.a.s.c.AbstractFullDistribZkTestBase create jetty 1 in directory /export/home/jenkins/workspace/Lucene-Solr-5.x-Solaris/solr/build/solr-core/test/J0/temp/solr.search.mlt.CloudMLTQParserTest_BD2AB13677BB5E3C-001/shard-1-001
   [junit4]   2> 3190944 INFO  (TEST-CloudMLTQParserTest.test-seed#[BD2AB13677BB5E3C]) [    ] o.e.j.s.Server jetty-9.2.13.v20150730
   [junit4]   2> 3190946 INFO  (TEST-CloudMLTQParserTest.test-seed#[BD2AB13677BB5E3C]) [    ] o.e.j.s.h.ContextHandler Started o.e.j.s.ServletContextHandler@d59664{/e_hf,null,AVAILABLE}
   [junit4]   2> 3190947 INFO  (TEST-CloudMLTQParserTest.test-seed#[BD2AB13677BB5E3C]) [    ] o.e.j.s.ServerConnector Started ServerConnector@84a28a{HTTP/1.1}{127.0.0.1:64408}
   [junit4]   2> 3190947 INFO  (TEST-CloudMLTQParserTest.test-seed#[BD2AB13677BB5E3C]) [    ] o.e.j.s.Server Started @3197171ms
   [junit4]   2> 3190947 INFO  (TEST-CloudMLTQParserTest.test-seed#[BD2AB13677BB5E3C]) [    ] o.a.s.c.s.e.JettySolrRunner Jetty properties: {hostContext=/e_hf, hostPort=64408, solrconfig=solrconfig.xml, coreRootDirectory=/export/home/jenkins/workspace/Lucene-Solr-5.x-Solaris/solr/build/solr-core/test/J0/temp/solr.search.mlt.CloudMLTQParserTest_BD2AB13677BB5E3C-001/shard-1-001/cores, solr.data.dir=/export/home/jenkins/workspace/Lucene-Solr-5.x-Solaris/solr/build/solr-core/test/J0/temp/solr.search.mlt.CloudMLTQParserTest_BD2AB13677BB5E3C-001/tempDir-001/jetty1}
   [junit4]   2> 3190947 INFO  (TEST-CloudMLTQParserTest.test-seed#[BD2AB13677BB5E3C]) [    ] o.a.s.s.SolrDispatchFilter SolrDispatchFilter.init(): sun.misc.Launcher$AppClassLoader@893918
   [junit4]   2> 3190947 INFO  (TEST-CloudMLTQParserTest.test-seed#[BD2AB13677BB5E3C]) [    ] o.a.s.c.SolrResourceLoader new SolrResourceLoader for directory: '/export/home/jenkins/workspace/Lucene-Solr-5.x-Solaris/solr/build/solr-core/test/J0/temp/solr.search.mlt.CloudMLTQParserTest_BD2AB13677BB5E3C-001/shard-1-001'
   [junit4]   2> 3190947 INFO  (TEST-CloudMLTQParserTest.test-seed#[BD2AB13677BB5E3C]) [    ] o.a.s.c.SolrResourceLoader JNDI not configured for solr (NoInitialContextEx)
   [junit4]   2> 3190947 INFO  (TEST-CloudMLTQParserTest.test-seed#[BD2AB13677BB5E3C]) [    ] o.a.s.c.SolrResourceLoader solr home defaulted to 'solr/' (could not find system property or JNDI)
   [junit4]   2> 3190948 INFO  (TEST-CloudMLTQParserTest.test-seed#[BD2AB13677BB5E3C]) [    ] o.a.s.c.c.SolrZkClient Using default ZkCredentialsProvider
   [junit4]   2> 3190949 INFO  (TEST-CloudMLTQParserTest.test-seed#[BD2AB13677BB5E3C]) [    ] o.a.s.c.c.ConnectionManager Waiting for client to connect to ZooKeeper
   [junit4]   2> 3190950 INFO  (zkCallback-4171-thread-1) [    ] o.a.s.c.c.ConnectionManager Watcher org.apache.solr.common.cloud.ConnectionManager@1165a41 name:ZooKeeperConnection Watcher:127.0.0.1:53149/solr got event WatchedEvent state:SyncConnected type:None path:null path:null type:None
   [junit4]   2> 3190950 INFO  (TEST-CloudMLTQParserTest.test-seed#[BD2AB13677BB5E3C]) [    ] o.a.s.c.c.ConnectionManager Client is connected to ZooKeeper
   [junit4]   2> 3190951 INFO  (TEST-CloudMLTQParserTest.test-seed#[BD2AB13677BB5E3C]) [    ] o.a.s.c.c.SolrZkClient Using default ZkACLProvider
   [junit4]   2> 3190952 INFO  (TEST-CloudMLTQParserTest.test-seed#[BD2AB13677BB5E3C]) [    ] o.a.s.s.SolrDispatchFilter Loading solr.xml from SolrHome (not found in ZooKeeper)
   [junit4]   2> 3190952 INFO  (TEST-CloudMLTQParserTest.test-seed#[BD2AB13677BB5E3C]) [    ] o.a.s.c.SolrXmlConfig Loading container configuration from /export/home/jenkins/workspace/Lucene-Solr-5.x-Solaris/solr/build/solr-core/test/J0/temp/solr.search.mlt.CloudMLTQParserTest_BD2AB13677BB5E3C-001/shard-1-001/solr.xml
   [junit4]   2> 3190967 INFO  (TEST-CloudMLTQParserTest.test-seed#[BD2AB13677BB5E3C]) [    ] o.a.s.c.CoresLocator Config-defined core root directory: /export/home/jenkins/workspace/Lucene-Solr-5.x-Solaris/solr/build/solr-core/test/J0/temp/solr.search.mlt.CloudMLTQParserTest_BD2AB13677BB5E3C-001/shard-1-001/cores
   [junit4]   2> 3190967 INFO  (TEST-CloudMLTQParserTest.test-seed#[BD2AB13677BB5E3C]) [    ] o.a.s.c.CoreContainer New CoreContainer 11936430
   [junit4]   2> 3190967 INFO  (TEST-CloudMLTQParserTest.test-seed#[BD2AB13677BB5E3C]) [    ] o.a.s.c.CoreContainer Loading cores into CoreContainer [instanceDir=/export/home/jenkins/workspace/Lucene-Solr-5.x-Solaris/solr/build/solr-core/test/J0/temp/solr.search.mlt.CloudMLTQParserTest_BD2AB13677BB5E3C-001/shard-1-001]
   [junit4]   2> 3190967 WARN  (TEST-CloudMLTQParserTest.test-seed#[BD2AB13677BB5E3C]) [    ] o.a.s.c.CoreContainer Couldn't add files from /export/home/jenkins/workspace/Lucene-Solr-5.x-Solaris/solr/build/solr-core/test/J0/temp/solr.search.mlt.CloudMLTQParserTest_BD2AB13677BB5E3C-001/shard-1-001/lib to classpath: /export/home/jenkins/workspace/Lucene-Solr-5.x-Solaris/solr/build/solr-core/test/J0/temp/solr.search.mlt.CloudMLTQParserTest_BD2AB13677BB5E3C-001/shard-1-001/lib
   [junit4]   2> 3190967 INFO  (TEST-CloudMLTQParserTest.test-seed#[BD2AB13677BB5E3C]) [    ] o.a.s.h.c.HttpShardHandlerFactory created with socketTimeout : 90000,urlScheme : ,connTimeout : 15000,maxConnectionsPerHost : 20,maxConnections : 10000,corePoolSize : 0,maximumPoolSize : 2147483647,maxThreadIdleTime : 5,sizeOfQueue : -1,fairnessPolicy : false,useRetries : false,
   [junit4]   2> 3190969 INFO  (TEST-CloudMLTQParserTest.test-seed#[BD2AB13677BB5E3C]) [    ] o.a.s.u.UpdateShardHandler Creating UpdateShardHandler HTTP client with params: socketTimeout=340000&connTimeout=45000&retry=true
   [junit4]   2> 3190969 INFO  (TEST-CloudMLTQParserTest.test-seed#[BD2AB13677BB5E3C]) [    ] o.a.s.l.LogWatcher SLF4J impl is org.slf4j.impl.Log4jLoggerFactory
   [junit4]   2> 3190969 INFO  (TEST-CloudMLTQParserTest.test-seed#[BD2AB13677BB5E3C]) [    ] o.a.s.l.LogWatcher Registering Log Listener [Log4j (org.slf4j.impl.Log4jLoggerFactory)]
   [junit4]   2> 3190969 INFO  (TEST-CloudMLTQParserTest.test-seed#[BD2AB13677BB5E3C]) [    ] o.a.s.c.ZkContainer Zookeeper client=127.0.0.1:53149/solr
   [junit4]   2> 3190969 INFO  (TEST-CloudMLTQParserTest.test-seed#[BD2AB13677BB5E3C]) [    ] o.a.s.c.ZkController zkHost includes chroot
   [junit4]   2> 3190969 INFO  (TEST-CloudMLTQParserTest.test-seed#[BD2AB13677BB5E3C]) [    ] o.a.s.c.c.SolrZkClient Using default ZkCredentialsProvider
   [junit4]   2> 3190970 INFO  (TEST-CloudMLTQParserTest.test-seed#[BD2AB13677BB5E3C]) [    ] o.a.s.c.c.ConnectionManager Waiting for client to connect to ZooKeeper
   [junit4]   2> 3190971 INFO  (zkCallback-4173-thread-1) [    ] o.a.s.c.c.ConnectionManager Watcher org.apache.solr.common.cloud.ConnectionManager@1d0e983 name:ZooKeeperConnection Watcher:127.0.0.1:53149 got event WatchedEvent state:SyncConnected type:None path:null path:null type:None
   [junit4]   2> 3190971 INFO  (TEST-CloudMLTQParserTest.test-seed#[BD2AB13677BB5E3C]) [    ] o.a.s.c.c.ConnectionManager Client is connected to ZooKeeper
   [junit4]   2> 3190972 INFO  (TEST-CloudMLTQParserTest.test-seed#[BD2AB13677BB5E3C]) [    ] o.a.s.c.c.SolrZkClient Using default ZkACLProvider
   [junit4]   2> 3190974 INFO  (TEST-CloudMLTQParserTest.test-seed#[BD2AB13677BB5E3C]) [n:127.0.0.1:64408_e_hf    ] o.a.s.c.c.ConnectionManager Waiting for client to connect to ZooKeeper
   [junit4]   2> 3190975 INFO  (zkCallback-4174-thread-1-processing-n:127.0.0.1:64408_e_hf) [n:127.0.0.1:64408_e_hf    ] o.a.s.c.c.ConnectionManager Watcher org.apache.solr.common.cloud.ConnectionManager@1bbb746 name:ZooKeeperConnection Watcher:127.0.0.1:53149/solr got event WatchedEvent state:SyncConnected type:None path:null path:null type:None
   [junit4]   2> 3190975 INFO  (TEST-CloudMLTQParserTest.test-seed#[BD2AB13677BB5E3C]) [n:127.0.0.1:64408_e_hf    ] o.a.s.c.c.ConnectionManager Client is connected to ZooKeeper
   [junit4]   2> 3190983 INFO  (TEST-CloudMLTQParserTest.test-seed#[BD2AB13677BB5E3C]) [n:127.0.0.1:64408_e_hf    ] o.a.s.c.c.ZkStateReader Updating cluster state from ZooKeeper... 
   [junit4]   2> 3191991 INFO  (TEST-CloudMLTQParserTest.test-seed#[BD2AB13677BB5E3C]) [n:127.0.0.1:64408_e_hf    ] o.a.s.c.ZkController Register node as live in ZooKeeper:/live_nodes/127.0.0.1:64408_e_hf
   [junit4]   2> 3191992 INFO  (TEST-CloudMLTQParserTest.test-seed#[BD2AB13677BB5E3C]) [n:127.0.0.1:64408_e_hf    ] o.a.s.c.c.SolrZkClient makePath: /live_nodes/127.0.0.1:64408_e_hf
   [junit4]   2> 3191994 INFO  (zkCallback-4170-thread-1) [    ] o.a.s.c.c.ZkStateReader A live node change: WatchedEvent state:SyncConnected type:NodeChildrenChanged path:/live_nodes, has occurred - updating... (live nodes size: 1)
   [junit4]   2> 3191994 INFO  (zkCallback-4168-thread-2-processing-n:127.0.0.1:50887_e_hf) [n:127.0.0.1:50887_e_hf    ] o.a.s.c.c.ZkStateReader A live node change: WatchedEvent state:SyncConnected type:NodeChildrenChanged path:/live_nodes, has occurred - updating... (live nodes size: 1)
   [junit4]   2> 3191994 INFO  (zkCallback-4174-thread-1-processing-n:127.0.0.1:64408_e_hf) [n:127.0.0.1:64408_e_hf    ] o.a.s.c.c.ZkStateReader A live node change: WatchedEvent state:SyncConnected type:NodeChildrenChanged path:/live_nodes, has occurred - updating... (live nodes size: 1)
   [junit4]   2> 3191997 INFO  (TEST-CloudMLTQParserTest.test-seed#[BD2AB13677BB5E3C]) [n:127.0.0.1:64408_e_hf    ] o.a.s.c.Overseer Overseer (id=null) closing
   [junit4]   2> 3191998 INFO  (TEST-CloudMLTQParserTest.test-seed#[BD2AB13677BB5E3C]) [n:127.0.0.1:64408_e_hf    ] o.a.s.c.LeaderElector Joined leadership election with path: /overseer_elect/election/94920069900861448-127.0.0.1:64408_e_hf-n_0000000001
   [junit4]   2> 3191999 INFO  (TEST-CloudMLTQParserTest.test-seed#[BD2AB13677BB5E3C]) [n:127.0.0.1:64408_e_hf    ] o.a.s.c.LeaderElector Watching path /overseer_elect/election/94920069900861444-127.0.0.1:50887_e_hf-n_0000000000 to know if I could be the leader
   [junit4]   2> 3192008 INFO  (TEST-CloudMLTQParserTest.test-seed#[BD2AB13677BB5E3C]) [n:127.0.0.1:64408_e_hf    ] o.a.s.c.CoreContainer Security conf doesn't exist. Skipping setup for authorization module.
   [junit4]   2> 3192008 INFO  (TEST-CloudMLTQParserTest.test-seed#[BD2AB13677BB5E3C]) [n:127.0.0.1:64408_e_hf    ] o.a.s.c.CoreContainer No authentication plugin used.
   [junit4]   2> 3192009 INFO  (TEST-CloudMLTQParserTest.test-seed#[BD2AB13677BB5E3C]) [n:127.0.0.1:64408_e_hf    ] o.a.s.c.CoresLocator Looking for core definitions underneath /export/home/jenkins/workspace/Lucene-Solr-5.x-Solaris/solr/build/solr-core/test/J0/temp/solr.search.mlt.CloudMLTQParserTest_BD2AB13677BB5E3C-001/shard-1-001/cores
   [junit4]   2> 3192009 INFO  (TEST-CloudMLTQParserTest.test-seed#[BD2AB13677BB5E3C]) [n:127.0.0.1:64408_e_hf    ] o.a.s.c.SolrCore Created CoreDescriptor: {absoluteInstDir=/export/home/jenkins/workspace/Lucene-Solr-5.x-Solaris/solr/build/solr-core/test/J0/temp/solr.search.mlt.CloudMLTQParserTest_BD2AB13677BB5E3C-001/shard-1-001/cores/collection1/, dataDir=data/, coreNodeName=, loadOnStartup=true, schema=schema.xml, transient=false, configSetProperties=configsetprops.json, collection=collection1, config=solrconfig.xml, name=collection1, instanceDir=/export/home/jenkins/workspace/Lucene-Solr-5.x-Solaris/solr/build/solr-core/test/J0/temp/solr.search.mlt.CloudMLTQParserTest_BD2AB13677BB5E3C-001/shard-1-001/cores/collection1, shard=}
   [junit4]   2> 3192009 INFO  (TEST-CloudMLTQParserTest.test-seed#[BD2AB13677BB5E3C]) [n:127.0.0.1:64408_e_hf    ] o.a.s.c.CoresLocator Found core collection1 in /export/home/jenkins/workspace/Lucene-Solr-5.x-Solaris/solr/build/solr-core/test/J0/temp/solr.search.mlt.CloudMLTQParserTest_BD2AB13677BB5E3C-001/shard-1-001/cores/collection1/
   [junit4]   2> 3192010 INFO  (TEST-CloudMLTQParserTest.test-seed#[BD2AB13677BB5E3C]) [n:127.0.0.1:64408_e_hf    ] o.a.s.c.CoresLocator Found 1 core definitions
   [junit4]   2> 3192011 INFO  (coreLoadExecutor-8281-thread-1-processing-n:127.0.0.1:64408_e_hf) [n:127.0.0.1:64408_e_hf c:collection1   x:collection1] o.a.s.c.ZkController publishing state=down
   [junit4]   2> 3192011 INFO  (coreLoadExecutor-8281-thread-1-processing-n:127.0.0.1:64408_e_hf) [n:127.0.0.1:64408_e_hf c:collection1   x:collection1] o.a.s.c.ZkController numShards not found on descriptor - reading it from system property
   [junit4]   2> 3192011 INFO  (TEST-CloudMLTQParserTest.test-seed#[BD2AB13677BB5E3C]) [n:127.0.0.1:64408_e_hf    ] o.a.s.s.SolrDispatchFilter user.dir=/export/home/jenkins/workspace/Lucene-Solr-5.x-Solaris/solr/build/solr-core/test/J0
   [junit4]   2> 3192011 INFO  (TEST-CloudMLTQParserTest.test-seed#[BD2AB13677BB5E3C]) [n:127.0.0.1:64408_e_hf    ] o.a.s.s.SolrDispatchFilter SolrDispatchFilter.init() done
   [junit4]   2> 3192014 INFO  (OverseerStateUpdate-94920069900861444-127.0.0.1:50887_e_hf-n_0000000000) [n:127.0.0.1:50887_e_hf    ] o.a.s.c.Overseer processMessage: queueSize: 1, message = {
   [junit4]   2>   "core":"collection1",
   [junit4]   2>   "collection":"collection1",
   [junit4]   2>   "numShards":"2",
   [junit4]   2>   "state":"down",
   [junit4]   2>   "node_name":"127.0.0.1:64408_e_hf",
   [junit4]   2>   "operation":"state",
   [junit4]   2>   "roles":null,
   [junit4]   2>   "base_url":"http://127.0.0.1:64408/e_hf",
   [junit4]   2>   "shard":null} current state version: 4
   [junit4]   2> 3192014 INFO  (coreLoadExecutor-8281-thread-1-processing-n:127.0.0.1:64408_e_hf) [n:127.0.0.1:64408_e_hf c:collection1   x:collection1] o.a.s.c.ZkController look for our core node name
   [junit4]   2> 3192014 INFO  (OverseerStateUpdate-94920069900861444-127.0.0.1:50887_e_hf-n_0000000000) [n:127.0.0.1:50887_e_hf    ] o.a.s.c.o.ReplicaMutator Update state numShards=2 message={
   [junit4]   2>   "core":"collection1",
   [junit4]   2>   "collection":"collection1",
   [junit4]   2>   "numShards":"2",
   [junit4]   2>   "state":"down",
   [junit4]   2>   "node_name":"127.0.0.1:64408_e_hf",
   [junit4]   2>   "operation":"state",
   [junit4]   2>   "roles":null,
   [junit4]   2>   "base_url":"http://127.0.0.1:64408/e_hf",
   [junit4]   2>   "shard":null}
   [junit4]   2> 3192014 INFO  (OverseerStateUpdate-94920069900861444-127.0.0.1:50887_e_hf-n_0000000000) [n:127.0.0.1:50887_e_hf    ] o.a.s.c.o.ClusterStateMutator building a new cName: collection1
   [junit4]   2> 3192014 INFO  (OverseerStateUpdate-94920069900861444-127.0.0.1:50887_e_hf-n_0000000000) [n:127.0.0.1:50887_e_hf    ] o.a.s.c.o.ReplicaMutator Assigning new node to shard shard=shard2
   [junit4]   2> 3192118 INFO  (zkCallback-4170-thread-1) [    ] o.a.s.c.c.ZkStateReader A cluster state change: WatchedEvent state:SyncConnected type:NodeDataChanged path:/clusterstate.json, has occurred - updating... (live nodes size: 2)
   [junit4]   2> 3192118 INFO  (zkCallback-4168-thread-2-processing-n:127.0.0.1:50887_e_hf) [n:127.0.0.1:50887_e_hf    ] o.a.s.c.c.ZkStateReader A cluster state change: WatchedEvent state:SyncConnected type:NodeDataChanged path:/clusterstate.json, has occurred - updating... (live nodes size: 2)
   [junit4]   2> 3192119 INFO  (zkCallback-4174-thread-1-processing-n:127.0.0.1:64408_e_hf) [n:127.0.0.1:64408_e_hf    ] o.a.s.c.c.ZkStateReader A cluster state change: WatchedEvent state:SyncConnected type:NodeDataChanged path:/clusterstate.json, has occurred - updating... (live nodes size: 2)
   [junit4]   2> 3193016 INFO  (coreLoadExecutor-8281-thread-1-processing-n:127.0.0.1:64408_e_hf) [n:127.0.0.1:64408_e_hf c:collection1   x:collection1] o.a.s.c.ZkController waiting to find shard id in clusterstate for collection1
   [junit4]   2> 3193016 INFO  (coreLoadExecutor-8281-thread-1-processing-n:127.0.0.1:64408_e_hf) [n:127.0.0.1:64408_e_hf c:collection1   x:collection1] o.a.s.c.ZkController Check for collection zkNode:collection1
   [junit4]   2> 3193017 INFO  (coreLoadExecutor-8281-thread-1-processing-n:127.0.0.1:64408_e_hf) [n:127.0.0.1:64408_e_hf c:collection1   x:collection1] o.a.s.c.ZkController Collection zkNode exists
   [junit4]   2> 3193017 INFO  (coreLoadExecutor-8281-thread-1-processing-n:127.0.0.1:64408_e_hf) [n:127.0.0.1:64408_e_hf c:collection1   x:collection1] o.a.s.c.c.ZkStateReader Load collection config from:/collections/collection1
   [junit4]   2> 3193018 INFO  (coreLoadExecutor-8281-thread-1-processing-n:127.0.0.1:64408_e_hf) [n:127.0.0.1:64408_e_hf c:collection1   x:collection1] o.a.s.c.c.ZkStateReader path=/collections/collection1 configName=conf1 specified config exists in ZooKeeper
   [junit4]   2> 3193018 INFO  (coreLoadExecutor-8281-thread-1-processing-n:127.0.0.1:64408_e_hf) [n:127.0.0.1:64408_e_hf c:collection1   x:collection1] o.a.s.c.SolrResourceLoader new SolrResourceLoader for directory: '/export/home/jenkins/workspace/Lucene-Solr-5.x-Solaris/solr/build/solr-core/test/J0/temp/solr.search.mlt.CloudMLTQParserTest_BD2AB13677BB5E3C-001/shard-1-001/cores/collection1'
   [junit4]   2> 3193018 INFO  (coreLoadExecutor-8281-thread-1-processing-n:127.0.0.1:64408_e_hf) [n:127.0.0.1:64408_e_hf c:collection1   x:collection1] o.a.s.c.SolrResourceLoader JNDI not configured for solr (NoInitialContextEx)
   [junit4]   2> 3193018 INFO  (coreLoadExecutor-8281-thread-1-processing-n:127.0.0.1:64408_e_hf) [n:127.0.0.1:64408_e_hf c:collection1   x:collection1] o.a.s.c.SolrResourceLoader solr home defaulted to 'solr/' (could not find system property or JNDI)
   [junit4]   2> 3193021 INFO  (coreLoadExecutor-8281-thread-1-processing-n:127.0.0.1:64408_e_hf) [n:127.0.0.1:64408_e_hf c:collection1   x:collection1] o.a.s.c.Config loaded config solrconfig.xml with version 0 
   [junit4]   2> 3193029 INFO  (coreLoadExecutor-8281-thread-1-processing-n:127.0.0.1:64408_e_hf) [n:127.0.0.1:64408_e_hf c:collection1   x:collection1] o.a.s.c.SolrConfig current version of requestparams : -1
   [junit4]   2> 3193048 INFO  (coreLoadExecutor-8281-thread-1-processing-n:127.0.0.1:64408_e_hf) [n:127.0.0.1:64408_e_hf c:collection1   x:collection1] o.a.s.c.SolrConfig Using Lucene MatchVersion: 5.4.0
   [junit4]   2> 3193091 INFO  (coreLoadExecutor-8281-thread-1-processing-n:127.0.0.1:64408_e_hf) [n:127.0.0.1:64408_e_hf c:collection1   x:collection1] o.a.s.c.Config Loaded SolrConfig: solrconfig.xml
   [junit4]   2> 3193099 INFO  (coreLoadExecutor-8281-thread-1-processing-n:127.0.0.1:64408_e_hf) [n:127.0.0.1:64408_e_hf c:collection1   x:collection1] o.a.s.s.IndexSchema [collection1] Schema name=test
   [junit4]   2> 3193427 INFO  (coreLoadExecutor-8281-thread-1-processing-n:127.0.0.1:64408_e_hf) [n:127.0.0.1:64408_e_hf c:collection1   x:collection1] o.a.s.s.OpenExchangeRatesOrgProvider Initialized with rates=open-exchange-rates.json, refreshInterval=1440.
   [junit4]   2> 3193435 INFO  (coreLoadExecutor-8281-thread-1-processing-n:127.0.0.1:64408_e_hf) [n:127.0.0.1:64408_e_hf c:collection1   x:collection1] o.a.s.s.IndexSchema default search field in schema is text
   [junit4]   2> 3193437 INFO  (coreLoadExecutor-8281-thread-1-processing-n:127.0.0.1:64408_e_hf) [n:127.0.0.1:64408_e_hf c:collection1   x:collection1] o.a.s.s.IndexSchema unique key field: id
   [junit4]   2> 3193449 INFO  (coreLoadExecutor-8281-thread-1-processing-n:127.0.0.1:64408_e_hf) [n:127.0.0.1:64408_e_hf c:collection1   x:collection1] o.a.s.s.FileExchangeRateProvider Reloading exchange rates from file currency.xml
   [junit4]   2> 3193452 INFO  (coreLoadExecutor-8281-thread-1-processing-n:127.0.0.1:64408_e_hf) [n:127.0.0.1:64408_e_hf c:collection1   x:collection1] o.a.s.s.FileExchangeRateProvider Reloading exchange rates from file currency.xml
   [junit4]   2> 3193455 INFO  (coreLoadExecutor-8281-thread-1-processing-n:127.0.0.1:64408_e_hf) [n:127.0.0.1:64408_e_hf c:collection1   x:collection1] o.a.s.s.OpenExchangeRatesOrgProvider Reloading exchange rates from open-exchange-rates.json
   [junit4]   2> 3193456 WARN  (coreLoadExecutor-8281-thread-1-processing-n:127.0.0.1:64408_e_hf) [n:127.0.0.1:64408_e_hf c:collection1   x:collection1] o.a.s.s.OpenExchangeRatesOrgProvider Unknown key IMPORTANT NOTE
   [junit4]   2> 3193456 WARN  (coreLoadExecutor-8281-thread-1-processing-n:127.0.0.1:64408_e_hf) [n:127.0.0.1:64408_e_hf c:collection1   x:collection1] o.a.s.s.OpenExchangeRatesOrgProvider Expected key, got STRING
   [junit4]   2> 3193456 INFO  (coreLoadExecutor-8281-thread-1-processing-n:127.0.0.1:64408_e_hf) [n:127.0.0.1:64408_e_hf c:collection1   x:collection1] o.a.s.s.OpenExchangeRatesOrgProvider Reloading exchange rates from open-exchange-rates.json
   [junit4]   2> 3193457 WARN  (coreLoadExecutor-8281-thread-1-processing-n:127.0.0.1:64408_e_hf) [n:127.0.0.1:64408_e_hf c:collection1   x:collection1] o.a.s.s.OpenExchangeRatesOrgProvider Unknown key IMPORTANT NOTE
   [junit4]   2> 3193457 WARN  (coreLoadExecutor-8281-thread-1-processing-n:127.0.0.1:64408_e_hf) [n:127.0.0.1:64408_e_hf c:collection1   x:collection1] o.a.s.s.OpenExchangeRatesOrgProvider Expected key, got STRING
   [junit4]   2> 3193459 INFO  (coreLoadExecutor-8281-thread-1-processing-n:127.0.0.1:64408_e_hf) [n:127.0.0.1:64408_e_hf c:collection1   x:collection1] o.a.s.c.ConfigSetProperties Did not find ConfigSet properties, assuming default properties: Can't find resource 'configsetprops.json' in classpath or '/configs/conf1', cwd=/export/home/jenkins/workspace/Lucene-Solr-5.x-Solaris/solr/build/solr-core/test/J0
   [junit4]   2> 3193459 INFO  (coreLoadExecutor-8281-thread-1-processing-n:127.0.0.1:64408_e_hf) [n:127.0.0.1:64408_e_hf c:collection1   x:collection1] o.a.s.c.CoreContainer Creating SolrCore 'collection1' using configuration from collection collection1
   [junit4]   2> 3193459 INFO  (coreLoadExecutor-8281-thread-1-processing-n:127.0.0.1:64408_e_hf) [n:127.0.0.1:64408_e_hf c:collection1 s:shard2 r:core_node1 x:collection1] o.a.s.c.SolrCore org.apache.solr.core.MockDirectoryFactory
   [junit4]   2> 3193459 INFO  (coreLoadExecutor-8281-thread-1-processing-n:127.0.0.1:64408_e_hf) [n:127.0.0.1:64408_e_hf c:collection1 s:shard2 r:core_node1 x:collection1] o.a.s.c.SolrCore [[collection1] ] Opening new SolrCore at [/export/home/jenkins/workspace/Lucene-Solr-5.x-Solaris/solr/build/solr-core/test/J0/temp/solr.search.mlt.CloudMLTQParserTest_BD2AB13677BB5E3C-001/shard-1-001/cores/collection1], dataDir=[null]
   [junit4]   2> 3193459 INFO  (coreLoadExecutor-8281-thread-1-processing-n:127.0.0.1:64408_e_hf) [n:127.0.0.1:64408_e_hf c:collection1 s:shard2 r:core

[...truncated too long message...]

ed ServerConnector@19095c5{HTTP/1.1}{127.0.0.1:0}
   [junit4]   2> 3226916 INFO  (TEST-CloudMLTQParserTest.testInvalidDocument-seed#[BD2AB13677BB5E3C]) [    ] o.e.j.s.h.ContextHandler Stopped o.e.j.s.ServletContextHandler@14198b5{/e_hf,null,UNAVAILABLE}
   [junit4]   2> 3226918 INFO  (TEST-CloudMLTQParserTest.testInvalidDocument-seed#[BD2AB13677BB5E3C]) [n:127.0.0.1:54670_e_hf c:collection1 s:shard1 r:core_node4 x:collection1] o.a.s.c.ChaosMonkey monkey: stop shard! 61008
   [junit4]   2> 3226920 INFO  (TEST-CloudMLTQParserTest.testInvalidDocument-seed#[BD2AB13677BB5E3C]) [n:127.0.0.1:54670_e_hf c:collection1 s:shard1 r:core_node4 x:collection1] o.a.s.c.ZkTestServer connecting to 127.0.0.1:59852 59852
   [junit4]   2> 3227025 INFO  (Thread-11451) [n:127.0.0.1:45265_e_hf c:collection1 s:shard1 r:core_node2 x:collection1] o.a.s.c.ZkTestServer connecting to 127.0.0.1:59852 59852
   [junit4]   2> 3227026 WARN  (Thread-11451) [n:127.0.0.1:45265_e_hf c:collection1 s:shard1 r:core_node2 x:collection1] o.a.s.c.ZkTestServer Watch limit violations: 
   [junit4]   2> Maximum concurrent create/delete watches above limit:
   [junit4]   2> 
   [junit4]   2> 	6	/solr/aliases.json
   [junit4]   2> 	5	/solr/configs/conf1
   [junit4]   2> 	5	/solr/security.json
   [junit4]   2> 
   [junit4]   2> Maximum concurrent data watches above limit:
   [junit4]   2> 
   [junit4]   2> 	6	/solr/clusterstate.json
   [junit4]   2> 	4	/solr/collections/collection1/state.json
   [junit4]   2> 
   [junit4]   2> Maximum concurrent children watches above limit:
   [junit4]   2> 
   [junit4]   2> 	6	/solr/live_nodes
   [junit4]   2> 	6	/solr/collections
   [junit4]   2> 	5	/solr/overseer/collection-queue-work
   [junit4]   2> 	5	/solr/overseer/queue
   [junit4]   2> 
   [junit4]   2> 3227027 INFO  (SUITE-CloudMLTQParserTest-seed#[BD2AB13677BB5E3C]-worker) [n:127.0.0.1:54670_e_hf c:collection1 s:shard1 r:core_node4 x:collection1] o.a.s.SolrTestCaseJ4 ###deleteCore
   [junit4]   2> NOTE: leaving temporary files on disk at: /export/home/jenkins/workspace/Lucene-Solr-5.x-Solaris/solr/build/solr-core/test/J0/temp/solr.search.mlt.CloudMLTQParserTest_BD2AB13677BB5E3C-001
   [junit4]   2> NOTE: test params are: codec=Asserting(Lucene54): {intDefault=PostingsFormat(name=LuceneVarGapDocFreqInterval), timestamp=PostingsFormat(name=LuceneVarGapDocFreqInterval), lowerfilt=PostingsFormat(name=Asserting), id=PostingsFormat(name=LuceneVarGapFixedInterval), range_facet_l_dv=PostingsFormat(name=LuceneVarGapFixedInterval), range_facet_l=PostingsFormat(name=LuceneVarGapDocFreqInterval), lowerfilt1and2=PostingsFormat(name=Asserting), _version_=PostingsFormat(name=LuceneVarGapDocFreqInterval), range_facet_i_dv=PostingsFormat(name=LuceneVarGapDocFreqInterval), multiDefault=PostingsFormat(name=Asserting), lowerfilt1=PostingsFormat(name=Direct)}, docValues:{timestamp=DocValuesFormat(name=Lucene54), range_facet_l_dv=DocValuesFormat(name=Direct), range_facet_i_dv=DocValuesFormat(name=Lucene54)}, sim=DefaultSimilarity, locale=zh, timezone=Asia/Riyadh87
   [junit4]   2> NOTE: SunOS 5.11 x86/Oracle Corporation 1.7.0_91 (32-bit)/cpus=3,threads=1,free=239667120,total=453509120
   [junit4]   2> NOTE: All tests run in this JVM: [TestUpdate, MultiThreadedOCPTest, JSONWriterTest, QueryEqualityTest, SortSpecParsingTest, TestLMDirichletSimilarityFactory, TestMiniSolrCloudClusterBase, TestDefaultSearchFieldResource, TestRequestStatusCollectionAPI, BigEndianAscendingWordDeserializerTest, TestSolrQueryParserDefaultOperatorResource, TestDynamicLoading, TestConfigSetsAPIZkFailure, DistributedVersionInfoTest, TestXIncludeConfig, LeaderFailoverAfterPartitionTest, TestRawTransformer, DistributedFacetPivotLongTailTest, CleanupOldIndexTest, SliceStateTest, TestConfigOverlay, TestCloudManagedSchemaConcurrent, HdfsCollectionsAPIDistributedZkTest, XmlUpdateRequestHandlerTest, IndexSchemaTest, ShardRoutingTest, TermsComponentTest, JsonLoaderTest, ExitableDirectoryReaderTest, HdfsRecoverLeaseTest, TestDocSet, TestSolrDeletionPolicy1, TestCloudPivotFacet, TestSolrConfigHandlerCloud, TestConfigSetsAPI, AlternateDirectoryTest, TestHashPartitioner, TestCustomSort, TestExtendedDismaxParser, TestDynamicFieldCollectionResource, MigrateRouteKeyTest, DirectSolrSpellCheckerTest, CoreMergeIndexesAdminHandlerTest, TestFastLRUCache, BasicAuthIntegrationTest, RuleEngineTest, TestManagedStopFilterFactory, ChangedSchemaMergeTest, TestWordDelimiterFilterFactory, TestCursorMarkWithoutUniqueKey, TestRandomDVFaceting, ClusterStateTest, DataDrivenBlockJoinTest, PeerSyncTest, CollectionStateFormat2Test, PolyFieldTest, CircularListTest, TestStressReorder, ReplicationFactorTest, RemoteQueryErrorTest, ForceLeaderTest, OverseerTaskQueueTest, TestPseudoReturnFields, TestMaxScoreQueryParser, TestRecoveryHdfs, DocValuesMultiTest, TestFunctionQuery, HdfsChaosMonkeySafeLeaderTest, HdfsWriteToMultipleCollectionsTest, TestSolrXml, TestDocumentBuilder, TestMergePolicyConfig, TestMinMaxOnMultiValuedField, RecoveryZkTest, TestFaceting, TestClassicSimilarityFactory, FullHLLTest, TestReplicationHandler, ScriptEngineTest, SolrRequestParserTest, TestCopyFieldCollectionResource, SimplePostToolTest, PingRequestHandlerTest, TestConfig, SmileWriterTest, OverseerRolesTest, TestPartialUpdateDeduplication, HdfsBasicDistributedZkTest, DOMUtilTest, CoreAdminRequestStatusTest, TestSchemaManager, HdfsNNFailoverTest, TestSchemaResource, ConnectionManagerTest, SolrIndexConfigTest, TestDynamicFieldResource, SchemaVersionSpecificBehaviorTest, CollectionTooManyReplicasTest, SimpleFacetsTest, TestSweetSpotSimilarityFactory, MoreLikeThisHandlerTest, HdfsThreadLeakTest, HardAutoCommitTest, QueryElevationComponentTest, BasicDistributedZkTest, SharedFSAutoReplicaFailoverUtilsTest, OverseerCollectionConfigSetProcessorTest, SuggesterFSTTest, BadComponentTest, TestHighlightDedupGrouping, TestReRankQParserPlugin, TestManagedSchemaFieldTypeResource, TestPhraseSuggestions, ParsingFieldUpdateProcessorsTest, TimeZoneUtilsTest, TestCloudInspectUtil, PrimUtilsTest, TestCodecSupport, PathHierarchyTokenizerFactoryTest, CollectionReloadTest, TestStressUserVersions, DeleteInactiveReplicaTest, ChaosMonkeyNothingIsSafeTest, ClusterStateUpdateTest, LeaderElectionTest, HdfsRecoveryZkTest, HdfsSyncSliceTest, ExplicitHLLTest, TestHdfsUpdateLog, TestSort, DistributedQueryElevationComponentTest, TestCSVLoader, OverseerStatusTest, DocValuesMissingTest, MultiTermTest, TestBinaryField, MinimalSchemaTest, TestElisionMultitermQuery, TestSolrCoreProperties, DirectSolrConnectionTest, TestDFRSimilarityFactory, TestIBSimilarityFactory, URLClassifyProcessorTest, TestSuggestSpellingConverter, DateFieldTest, DistributedIntervalFacetingTest, TestJettySolrRunner, ActionThrottleTest, CollectionsAPIAsyncDistributedZkTest, ConcurrentDeleteAndCreateCollectionTest, CustomCollectionTest, HttpPartitionTest, SharedFSAutoReplicaFailoverTest, SimpleCollectionCreateDeleteTest, SolrXmlInZkTest, TestAuthenticationFramework, TestLeaderInitiatedRecoveryThread, TestRebalanceLeaders, VMParamsZkACLAndCredentialsProvidersTest, HdfsUnloadDistributedZkTest, StressHdfsTest, CachingDirectoryFactoryTest, QueryResultKeyTest, TestConfigSetImmutable, TestConfigSetProperties, TestImplicitCoreProperties, TestInfoStreamLogging, TestInitParams, TestNRTOpen, TestShardHandlerFactory, TestSolrDynamicMBean, TestBlobHandler, TestConfigReload, DistributedFacetPivotLargeTest, DistributedQueryComponentCustomSortTest, SpatialHeatmapFacetsTest, TestExpandComponent, TestPivotHelperCode, JavabinLoaderTest, HighlighterMaxOffsetTest, TestIntervalFaceting, TestMacros, TestChildDocTransformer, TestCustomDocTransformer, TestRawResponseWriter, TestSortingResponseWriter, TestManagedResource, TestManagedResourceStorage, TestRestManager, TestFieldTypeCollectionResource, TestManagedSchemaFieldResource, TestRemoveLastDynamicCopyField, TestSchemaNameResource, TestSchemaSimilarityResource, TestSerializedLuceneMatchVersion, TestSolrQueryParserResource, TestUniqueKeyFieldResource, BadCopyFieldTest, DateRangeFieldTest, SpatialRPTFieldTypeTest, TestBulkSchemaConcurrent, TestCollationFieldDocValues, TestManagedSchema, AnalyticsMergeStrategyTest, AnalyticsQueryTest, CursorMarkTest, MergeStrategyTest, RankQueryTest, TestAddFieldRealTimeGet, TestCollapseQParserPlugin, TestComplexPhraseQParserPlugin, TestFieldSortValues, TestHashQParserPlugin, TestInitQParser, TestNoOpRegenerator, TestOverriddenPrefixQueryForCustomFieldType, TestReloadDeadlock, TestSearcherReuse, TestStandardQParsers, TestTrieFacet, TestOrdValues, BJQParserTest, TestScoreJoinQPNoScore, TestScoreJoinQPScore, CloudMLTQParserTest]
   [junit4] Completed [519/550] on J0 in 38.73s, 2 tests, 1 failure <<< FAILURES!

[...truncated 111 lines...]
BUILD FAILED
/export/home/jenkins/workspace/Lucene-Solr-5.x-Solaris/build.xml:785: The following error occurred while executing this line:
/export/home/jenkins/workspace/Lucene-Solr-5.x-Solaris/build.xml:729: The following error occurred while executing this line:
/export/home/jenkins/workspace/Lucene-Solr-5.x-Solaris/build.xml:59: The following error occurred while executing this line:
/export/home/jenkins/workspace/Lucene-Solr-5.x-Solaris/solr/build.xml:233: The following error occurred while executing this line:
/export/home/jenkins/workspace/Lucene-Solr-5.x-Solaris/solr/common-build.xml:526: The following error occurred while executing this line:
/export/home/jenkins/workspace/Lucene-Solr-5.x-Solaris/lucene/common-build.xml:1452: The following error occurred while executing this line:
/export/home/jenkins/workspace/Lucene-Solr-5.x-Solaris/lucene/common-build.xml:1006: There were test failures: 550 suites (7 ignored), 2176 tests, 1 failure, 52 ignored (38 assumptions) [seed: BD2AB13677BB5E3C]

Total time: 77 minutes 29 seconds
Build step 'Invoke Ant' marked build as failure
Archiving artifacts
[WARNINGS] Skipping publisher since build result is FAILURE
Recording test results
Email was triggered for: Failure - Any
Sending email for trigger: Failure - Any



Mime
View raw message