lucene-dev mailing list archives

Site index · List index
Message view « Date » · « Thread »
Top « Date » · « Thread »
From Apache Jenkins Server <jenk...@builds.apache.org>
Subject [JENKINS] Lucene-Solr-NightlyTests-5.x - Build # 1031 - Still Failing
Date Sun, 29 Nov 2015 10:07:57 GMT
Build: https://builds.apache.org/job/Lucene-Solr-NightlyTests-5.x/1031/

1 tests failed.
FAILED:  org.apache.solr.cloud.CollectionsAPIDistributedZkTest.test

Error Message:
Captured an uncaught exception in thread: Thread[id=177356, name=collection0, state=RUNNABLE, group=TGRP-CollectionsAPIDistributedZkTest]

Stack Trace:
com.carrotsearch.randomizedtesting.UncaughtExceptionError: Captured an uncaught exception in thread: Thread[id=177356, name=collection0, state=RUNNABLE, group=TGRP-CollectionsAPIDistributedZkTest]
Caused by: org.apache.solr.client.solrj.impl.HttpSolrClient$RemoteSolrException: Error from server at https://127.0.0.1:37905: collection already exists: awholynewstresscollection_collection0_0
	at __randomizedtesting.SeedInfo.seed([EA00A48BF6BCDC00]:0)
	at org.apache.solr.client.solrj.impl.HttpSolrClient.executeMethod(HttpSolrClient.java:574)
	at org.apache.solr.client.solrj.impl.HttpSolrClient.request(HttpSolrClient.java:240)
	at org.apache.solr.client.solrj.impl.HttpSolrClient.request(HttpSolrClient.java:229)
	at org.apache.solr.client.solrj.impl.LBHttpSolrClient.doRequest(LBHttpSolrClient.java:372)
	at org.apache.solr.client.solrj.impl.LBHttpSolrClient.request(LBHttpSolrClient.java:325)
	at org.apache.solr.client.solrj.impl.CloudSolrClient.sendRequest(CloudSolrClient.java:1099)
	at org.apache.solr.client.solrj.impl.CloudSolrClient.requestWithRetryOnStaleState(CloudSolrClient.java:870)
	at org.apache.solr.client.solrj.impl.CloudSolrClient.request(CloudSolrClient.java:806)
	at org.apache.solr.client.solrj.SolrClient.request(SolrClient.java:1220)
	at org.apache.solr.cloud.AbstractFullDistribZkTestBase.createCollection(AbstractFullDistribZkTestBase.java:1573)
	at org.apache.solr.cloud.AbstractFullDistribZkTestBase.createCollection(AbstractFullDistribZkTestBase.java:1594)
	at org.apache.solr.cloud.CollectionsAPIDistributedZkTest$1CollectionThread.run(CollectionsAPIDistributedZkTest.java:876)




Build Log:
[...truncated 11392 lines...]
   [junit4] Suite: org.apache.solr.cloud.CollectionsAPIDistributedZkTest
   [junit4]   2> Creating dataDir: /x1/jenkins/jenkins-slave/workspace/Lucene-Solr-NightlyTests-5.x/solr/build/solr-core/test/J1/temp/solr.cloud.CollectionsAPIDistributedZkTest_EA00A48BF6BCDC00-001/init-core-data-001
   [junit4]   2> 2066769 INFO  (SUITE-CollectionsAPIDistributedZkTest-seed#[EA00A48BF6BCDC00]-worker) [    ] o.a.s.SolrTestCaseJ4 Randomized ssl (true) and clientAuth (false)
   [junit4]   2> 2066769 INFO  (SUITE-CollectionsAPIDistributedZkTest-seed#[EA00A48BF6BCDC00]-worker) [    ] o.a.s.BaseDistributedSearchTestCase Setting hostContext system property: /
   [junit4]   2> 2066774 INFO  (TEST-CollectionsAPIDistributedZkTest.test-seed#[EA00A48BF6BCDC00]) [    ] o.a.s.c.ZkTestServer STARTING ZK TEST SERVER
   [junit4]   2> 2066775 INFO  (Thread-170089) [    ] o.a.s.c.ZkTestServer client port:0.0.0.0/0.0.0.0:0
   [junit4]   2> 2066775 INFO  (Thread-170089) [    ] o.a.s.c.ZkTestServer Starting server
   [junit4]   2> 2066875 INFO  (TEST-CollectionsAPIDistributedZkTest.test-seed#[EA00A48BF6BCDC00]) [    ] o.a.s.c.ZkTestServer start zk server on port:42201
   [junit4]   2> 2066875 INFO  (TEST-CollectionsAPIDistributedZkTest.test-seed#[EA00A48BF6BCDC00]) [    ] o.a.s.c.c.SolrZkClient Using default ZkCredentialsProvider
   [junit4]   2> 2066878 INFO  (TEST-CollectionsAPIDistributedZkTest.test-seed#[EA00A48BF6BCDC00]) [    ] o.a.s.c.c.ConnectionManager Waiting for client to connect to ZooKeeper
   [junit4]   2> 2066881 INFO  (zkCallback-1839-thread-1) [    ] o.a.s.c.c.ConnectionManager Watcher org.apache.solr.common.cloud.ConnectionManager@1cbf3146 name:ZooKeeperConnection Watcher:127.0.0.1:42201 got event WatchedEvent state:SyncConnected type:None path:null path:null type:None
   [junit4]   2> 2066881 INFO  (TEST-CollectionsAPIDistributedZkTest.test-seed#[EA00A48BF6BCDC00]) [    ] o.a.s.c.c.ConnectionManager Client is connected to ZooKeeper
   [junit4]   2> 2066881 INFO  (TEST-CollectionsAPIDistributedZkTest.test-seed#[EA00A48BF6BCDC00]) [    ] o.a.s.c.c.SolrZkClient Using default ZkACLProvider
   [junit4]   2> 2066881 INFO  (TEST-CollectionsAPIDistributedZkTest.test-seed#[EA00A48BF6BCDC00]) [    ] o.a.s.c.c.SolrZkClient makePath: /solr
   [junit4]   2> 2066895 INFO  (TEST-CollectionsAPIDistributedZkTest.test-seed#[EA00A48BF6BCDC00]) [    ] o.a.s.c.c.SolrZkClient Using default ZkCredentialsProvider
   [junit4]   2> 2066900 INFO  (TEST-CollectionsAPIDistributedZkTest.test-seed#[EA00A48BF6BCDC00]) [    ] o.a.s.c.c.ConnectionManager Waiting for client to connect to ZooKeeper
   [junit4]   2> 2066906 INFO  (zkCallback-1840-thread-1) [    ] o.a.s.c.c.ConnectionManager Watcher org.apache.solr.common.cloud.ConnectionManager@62e4ded3 name:ZooKeeperConnection Watcher:127.0.0.1:42201/solr got event WatchedEvent state:SyncConnected type:None path:null path:null type:None
   [junit4]   2> 2066907 INFO  (TEST-CollectionsAPIDistributedZkTest.test-seed#[EA00A48BF6BCDC00]) [    ] o.a.s.c.c.ConnectionManager Client is connected to ZooKeeper
   [junit4]   2> 2066907 INFO  (TEST-CollectionsAPIDistributedZkTest.test-seed#[EA00A48BF6BCDC00]) [    ] o.a.s.c.c.SolrZkClient Using default ZkACLProvider
   [junit4]   2> 2066907 INFO  (TEST-CollectionsAPIDistributedZkTest.test-seed#[EA00A48BF6BCDC00]) [    ] o.a.s.c.c.SolrZkClient makePath: /collections/collection1
   [junit4]   2> 2066909 INFO  (TEST-CollectionsAPIDistributedZkTest.test-seed#[EA00A48BF6BCDC00]) [    ] o.a.s.c.c.SolrZkClient makePath: /collections/collection1/shards
   [junit4]   2> 2066910 INFO  (TEST-CollectionsAPIDistributedZkTest.test-seed#[EA00A48BF6BCDC00]) [    ] o.a.s.c.c.SolrZkClient makePath: /collections/control_collection
   [junit4]   2> 2066911 INFO  (TEST-CollectionsAPIDistributedZkTest.test-seed#[EA00A48BF6BCDC00]) [    ] o.a.s.c.c.SolrZkClient makePath: /collections/control_collection/shards
   [junit4]   2> 2066913 INFO  (TEST-CollectionsAPIDistributedZkTest.test-seed#[EA00A48BF6BCDC00]) [    ] o.a.s.c.AbstractZkTestCase put /x1/jenkins/jenkins-slave/workspace/Lucene-Solr-NightlyTests-5.x/solr/core/src/test-files/solr/collection1/conf/solrconfig-tlog.xml to /configs/conf1/solrconfig.xml
   [junit4]   2> 2066913 INFO  (TEST-CollectionsAPIDistributedZkTest.test-seed#[EA00A48BF6BCDC00]) [    ] o.a.s.c.c.SolrZkClient makePath: /configs/conf1/solrconfig.xml
   [junit4]   2> 2066916 INFO  (TEST-CollectionsAPIDistributedZkTest.test-seed#[EA00A48BF6BCDC00]) [    ] o.a.s.c.AbstractZkTestCase put /x1/jenkins/jenkins-slave/workspace/Lucene-Solr-NightlyTests-5.x/solr/core/src/test-files/solr/collection1/conf/schema.xml to /configs/conf1/schema.xml
   [junit4]   2> 2066916 INFO  (TEST-CollectionsAPIDistributedZkTest.test-seed#[EA00A48BF6BCDC00]) [    ] o.a.s.c.c.SolrZkClient makePath: /configs/conf1/schema.xml
   [junit4]   2> 2066918 INFO  (TEST-CollectionsAPIDistributedZkTest.test-seed#[EA00A48BF6BCDC00]) [    ] o.a.s.c.AbstractZkTestCase put /x1/jenkins/jenkins-slave/workspace/Lucene-Solr-NightlyTests-5.x/solr/core/src/test-files/solr/collection1/conf/solrconfig.snippet.randomindexconfig.xml to /configs/conf1/solrconfig.snippet.randomindexconfig.xml
   [junit4]   2> 2066918 INFO  (TEST-CollectionsAPIDistributedZkTest.test-seed#[EA00A48BF6BCDC00]) [    ] o.a.s.c.c.SolrZkClient makePath: /configs/conf1/solrconfig.snippet.randomindexconfig.xml
   [junit4]   2> 2066920 INFO  (TEST-CollectionsAPIDistributedZkTest.test-seed#[EA00A48BF6BCDC00]) [    ] o.a.s.c.AbstractZkTestCase put /x1/jenkins/jenkins-slave/workspace/Lucene-Solr-NightlyTests-5.x/solr/core/src/test-files/solr/collection1/conf/stopwords.txt to /configs/conf1/stopwords.txt
   [junit4]   2> 2066920 INFO  (TEST-CollectionsAPIDistributedZkTest.test-seed#[EA00A48BF6BCDC00]) [    ] o.a.s.c.c.SolrZkClient makePath: /configs/conf1/stopwords.txt
   [junit4]   2> 2066922 INFO  (TEST-CollectionsAPIDistributedZkTest.test-seed#[EA00A48BF6BCDC00]) [    ] o.a.s.c.AbstractZkTestCase put /x1/jenkins/jenkins-slave/workspace/Lucene-Solr-NightlyTests-5.x/solr/core/src/test-files/solr/collection1/conf/protwords.txt to /configs/conf1/protwords.txt
   [junit4]   2> 2066922 INFO  (TEST-CollectionsAPIDistributedZkTest.test-seed#[EA00A48BF6BCDC00]) [    ] o.a.s.c.c.SolrZkClient makePath: /configs/conf1/protwords.txt
   [junit4]   2> 2066924 INFO  (TEST-CollectionsAPIDistributedZkTest.test-seed#[EA00A48BF6BCDC00]) [    ] o.a.s.c.AbstractZkTestCase put /x1/jenkins/jenkins-slave/workspace/Lucene-Solr-NightlyTests-5.x/solr/core/src/test-files/solr/collection1/conf/currency.xml to /configs/conf1/currency.xml
   [junit4]   2> 2066924 INFO  (TEST-CollectionsAPIDistributedZkTest.test-seed#[EA00A48BF6BCDC00]) [    ] o.a.s.c.c.SolrZkClient makePath: /configs/conf1/currency.xml
   [junit4]   2> 2066926 INFO  (TEST-CollectionsAPIDistributedZkTest.test-seed#[EA00A48BF6BCDC00]) [    ] o.a.s.c.AbstractZkTestCase put /x1/jenkins/jenkins-slave/workspace/Lucene-Solr-NightlyTests-5.x/solr/core/src/test-files/solr/collection1/conf/enumsConfig.xml to /configs/conf1/enumsConfig.xml
   [junit4]   2> 2066926 INFO  (TEST-CollectionsAPIDistributedZkTest.test-seed#[EA00A48BF6BCDC00]) [    ] o.a.s.c.c.SolrZkClient makePath: /configs/conf1/enumsConfig.xml
   [junit4]   2> 2066930 INFO  (TEST-CollectionsAPIDistributedZkTest.test-seed#[EA00A48BF6BCDC00]) [    ] o.a.s.c.AbstractZkTestCase put /x1/jenkins/jenkins-slave/workspace/Lucene-Solr-NightlyTests-5.x/solr/core/src/test-files/solr/collection1/conf/open-exchange-rates.json to /configs/conf1/open-exchange-rates.json
   [junit4]   2> 2066931 INFO  (TEST-CollectionsAPIDistributedZkTest.test-seed#[EA00A48BF6BCDC00]) [    ] o.a.s.c.c.SolrZkClient makePath: /configs/conf1/open-exchange-rates.json
   [junit4]   2> 2066933 INFO  (TEST-CollectionsAPIDistributedZkTest.test-seed#[EA00A48BF6BCDC00]) [    ] o.a.s.c.AbstractZkTestCase put /x1/jenkins/jenkins-slave/workspace/Lucene-Solr-NightlyTests-5.x/solr/core/src/test-files/solr/collection1/conf/mapping-ISOLatin1Accent.txt to /configs/conf1/mapping-ISOLatin1Accent.txt
   [junit4]   2> 2066933 INFO  (TEST-CollectionsAPIDistributedZkTest.test-seed#[EA00A48BF6BCDC00]) [    ] o.a.s.c.c.SolrZkClient makePath: /configs/conf1/mapping-ISOLatin1Accent.txt
   [junit4]   2> 2066935 INFO  (TEST-CollectionsAPIDistributedZkTest.test-seed#[EA00A48BF6BCDC00]) [    ] o.a.s.c.AbstractZkTestCase put /x1/jenkins/jenkins-slave/workspace/Lucene-Solr-NightlyTests-5.x/solr/core/src/test-files/solr/collection1/conf/old_synonyms.txt to /configs/conf1/old_synonyms.txt
   [junit4]   2> 2066935 INFO  (TEST-CollectionsAPIDistributedZkTest.test-seed#[EA00A48BF6BCDC00]) [    ] o.a.s.c.c.SolrZkClient makePath: /configs/conf1/old_synonyms.txt
   [junit4]   2> 2066941 INFO  (TEST-CollectionsAPIDistributedZkTest.test-seed#[EA00A48BF6BCDC00]) [    ] o.a.s.c.AbstractZkTestCase put /x1/jenkins/jenkins-slave/workspace/Lucene-Solr-NightlyTests-5.x/solr/core/src/test-files/solr/collection1/conf/synonyms.txt to /configs/conf1/synonyms.txt
   [junit4]   2> 2066941 INFO  (TEST-CollectionsAPIDistributedZkTest.test-seed#[EA00A48BF6BCDC00]) [    ] o.a.s.c.c.SolrZkClient makePath: /configs/conf1/synonyms.txt
   [junit4]   2> 2066946 INFO  (TEST-CollectionsAPIDistributedZkTest.test-seed#[EA00A48BF6BCDC00]) [    ] o.a.s.c.c.SolrZkClient Using default ZkCredentialsProvider
   [junit4]   2> 2066965 INFO  (TEST-CollectionsAPIDistributedZkTest.test-seed#[EA00A48BF6BCDC00]) [    ] o.a.s.c.c.ConnectionManager Waiting for client to connect to ZooKeeper
   [junit4]   2> 2066975 INFO  (zkCallback-1841-thread-1) [    ] o.a.s.c.c.ConnectionManager Watcher org.apache.solr.common.cloud.ConnectionManager@691a793a name:ZooKeeperConnection Watcher:127.0.0.1:42201/solr got event WatchedEvent state:SyncConnected type:None path:null path:null type:None
   [junit4]   2> 2066975 INFO  (TEST-CollectionsAPIDistributedZkTest.test-seed#[EA00A48BF6BCDC00]) [    ] o.a.s.c.c.ConnectionManager Client is connected to ZooKeeper
   [junit4]   2> 2066975 INFO  (TEST-CollectionsAPIDistributedZkTest.test-seed#[EA00A48BF6BCDC00]) [    ] o.a.s.c.c.SolrZkClient Using default ZkACLProvider
   [junit4]   2> 2067540 INFO  (TEST-CollectionsAPIDistributedZkTest.test-seed#[EA00A48BF6BCDC00]) [    ] o.a.s.SolrTestCaseJ4 Writing core.properties file to /x1/jenkins/jenkins-slave/workspace/Lucene-Solr-NightlyTests-5.x/solr/build/solr-core/test/J1/temp/solr.cloud.CollectionsAPIDistributedZkTest_EA00A48BF6BCDC00-001/control-001/cores/collection1
   [junit4]   2> 2067545 INFO  (TEST-CollectionsAPIDistributedZkTest.test-seed#[EA00A48BF6BCDC00]) [    ] o.e.j.s.Server jetty-9.2.13.v20150730
   [junit4]   2> 2067550 INFO  (TEST-CollectionsAPIDistributedZkTest.test-seed#[EA00A48BF6BCDC00]) [    ] o.e.j.s.h.ContextHandler Started o.e.j.s.ServletContextHandler@27697030{/,null,AVAILABLE}
   [junit4]   2> 2067580 INFO  (TEST-CollectionsAPIDistributedZkTest.test-seed#[EA00A48BF6BCDC00]) [    ] o.e.j.s.ServerConnector Started ServerConnector@fd7facb{SSL-http/1.1}{127.0.0.1:53156}
   [junit4]   2> 2067580 INFO  (TEST-CollectionsAPIDistributedZkTest.test-seed#[EA00A48BF6BCDC00]) [    ] o.e.j.s.Server Started @2070425ms
   [junit4]   2> 2067580 INFO  (TEST-CollectionsAPIDistributedZkTest.test-seed#[EA00A48BF6BCDC00]) [    ] o.a.s.c.s.e.JettySolrRunner Jetty properties: {hostPort=53156, hostContext=/, solr.data.dir=/x1/jenkins/jenkins-slave/workspace/Lucene-Solr-NightlyTests-5.x/solr/build/solr-core/test/J1/temp/solr.cloud.CollectionsAPIDistributedZkTest_EA00A48BF6BCDC00-001/tempDir-001/control/data, coreRootDirectory=/x1/jenkins/jenkins-slave/workspace/Lucene-Solr-NightlyTests-5.x/solr/build/solr-core/test/J1/../../../../../../../../../../x1/jenkins/jenkins-slave/workspace/Lucene-Solr-NightlyTests-5.x/solr/build/solr-core/test/J1/temp/solr.cloud.CollectionsAPIDistributedZkTest_EA00A48BF6BCDC00-001/control-001/cores}
   [junit4]   2> 2067581 INFO  (TEST-CollectionsAPIDistributedZkTest.test-seed#[EA00A48BF6BCDC00]) [    ] o.a.s.s.SolrDispatchFilter SolrDispatchFilter.init(): sun.misc.Launcher$AppClassLoader@3827de24
   [junit4]   2> 2067581 INFO  (TEST-CollectionsAPIDistributedZkTest.test-seed#[EA00A48BF6BCDC00]) [    ] o.a.s.c.SolrResourceLoader new SolrResourceLoader for directory: '/x1/jenkins/jenkins-slave/workspace/Lucene-Solr-NightlyTests-5.x/solr/build/solr-core/test/J1/temp/solr.cloud.CollectionsAPIDistributedZkTest_EA00A48BF6BCDC00-001/control-001'
   [junit4]   2> 2067581 INFO  (TEST-CollectionsAPIDistributedZkTest.test-seed#[EA00A48BF6BCDC00]) [    ] o.a.s.c.SolrResourceLoader JNDI not configured for solr (NoInitialContextEx)
   [junit4]   2> 2067581 INFO  (TEST-CollectionsAPIDistributedZkTest.test-seed#[EA00A48BF6BCDC00]) [    ] o.a.s.c.SolrResourceLoader solr home defaulted to 'solr/' (could not find system property or JNDI)
   [junit4]   2> 2067581 INFO  (TEST-CollectionsAPIDistributedZkTest.test-seed#[EA00A48BF6BCDC00]) [    ] o.a.s.c.c.SolrZkClient Using default ZkCredentialsProvider
   [junit4]   2> 2067598 INFO  (TEST-CollectionsAPIDistributedZkTest.test-seed#[EA00A48BF6BCDC00]) [    ] o.a.s.c.c.ConnectionManager Waiting for client to connect to ZooKeeper
   [junit4]   2> 2067600 INFO  (zkCallback-1842-thread-1) [    ] o.a.s.c.c.ConnectionManager Watcher org.apache.solr.common.cloud.ConnectionManager@245149bc name:ZooKeeperConnection Watcher:127.0.0.1:42201/solr got event WatchedEvent state:SyncConnected type:None path:null path:null type:None
   [junit4]   2> 2067600 INFO  (TEST-CollectionsAPIDistributedZkTest.test-seed#[EA00A48BF6BCDC00]) [    ] o.a.s.c.c.ConnectionManager Client is connected to ZooKeeper
   [junit4]   2> 2067600 INFO  (TEST-CollectionsAPIDistributedZkTest.test-seed#[EA00A48BF6BCDC00]) [    ] o.a.s.c.c.SolrZkClient Using default ZkACLProvider
   [junit4]   2> 2067601 INFO  (TEST-CollectionsAPIDistributedZkTest.test-seed#[EA00A48BF6BCDC00]) [    ] o.a.s.s.SolrDispatchFilter Loading solr.xml from SolrHome (not found in ZooKeeper)
   [junit4]   2> 2067601 INFO  (TEST-CollectionsAPIDistributedZkTest.test-seed#[EA00A48BF6BCDC00]) [    ] o.a.s.c.SolrXmlConfig Loading container configuration from /x1/jenkins/jenkins-slave/workspace/Lucene-Solr-NightlyTests-5.x/solr/build/solr-core/test/J1/temp/solr.cloud.CollectionsAPIDistributedZkTest_EA00A48BF6BCDC00-001/control-001/solr.xml
   [junit4]   2> 2067615 INFO  (TEST-CollectionsAPIDistributedZkTest.test-seed#[EA00A48BF6BCDC00]) [    ] o.a.s.c.CoresLocator Config-defined core root directory: /x1/jenkins/jenkins-slave/workspace/Lucene-Solr-NightlyTests-5.x/solr/build/solr-core/test/J1/../../../../../../../../../../x1/jenkins/jenkins-slave/workspace/Lucene-Solr-NightlyTests-5.x/solr/build/solr-core/test/J1/temp/solr.cloud.CollectionsAPIDistributedZkTest_EA00A48BF6BCDC00-001/control-001/cores
   [junit4]   2> 2067615 INFO  (TEST-CollectionsAPIDistributedZkTest.test-seed#[EA00A48BF6BCDC00]) [    ] o.a.s.c.CoreContainer New CoreContainer 1580381518
   [junit4]   2> 2067615 INFO  (TEST-CollectionsAPIDistributedZkTest.test-seed#[EA00A48BF6BCDC00]) [    ] o.a.s.c.CoreContainer Loading cores into CoreContainer [instanceDir=/x1/jenkins/jenkins-slave/workspace/Lucene-Solr-NightlyTests-5.x/solr/build/solr-core/test/J1/temp/solr.cloud.CollectionsAPIDistributedZkTest_EA00A48BF6BCDC00-001/control-001]
   [junit4]   2> 2067615 WARN  (TEST-CollectionsAPIDistributedZkTest.test-seed#[EA00A48BF6BCDC00]) [    ] o.a.s.c.CoreContainer Couldn't add files from /x1/jenkins/jenkins-slave/workspace/Lucene-Solr-NightlyTests-5.x/solr/build/solr-core/test/J1/temp/solr.cloud.CollectionsAPIDistributedZkTest_EA00A48BF6BCDC00-001/control-001/lib to classpath: /x1/jenkins/jenkins-slave/workspace/Lucene-Solr-NightlyTests-5.x/solr/build/solr-core/test/J1/temp/solr.cloud.CollectionsAPIDistributedZkTest_EA00A48BF6BCDC00-001/control-001/lib
   [junit4]   2> 2067616 INFO  (TEST-CollectionsAPIDistributedZkTest.test-seed#[EA00A48BF6BCDC00]) [    ] o.a.s.h.c.HttpShardHandlerFactory created with socketTimeout : 90000,urlScheme : ,connTimeout : 15000,maxConnectionsPerHost : 20,maxConnections : 10000,corePoolSize : 0,maximumPoolSize : 2147483647,maxThreadIdleTime : 5,sizeOfQueue : -1,fairnessPolicy : false,useRetries : false,
   [junit4]   2> 2067622 INFO  (TEST-CollectionsAPIDistributedZkTest.test-seed#[EA00A48BF6BCDC00]) [    ] o.a.s.u.UpdateShardHandler Creating UpdateShardHandler HTTP client with params: socketTimeout=340000&connTimeout=45000&retry=true
   [junit4]   2> 2067624 INFO  (TEST-CollectionsAPIDistributedZkTest.test-seed#[EA00A48BF6BCDC00]) [    ] o.a.s.l.LogWatcher SLF4J impl is org.slf4j.impl.Log4jLoggerFactory
   [junit4]   2> 2067624 INFO  (TEST-CollectionsAPIDistributedZkTest.test-seed#[EA00A48BF6BCDC00]) [    ] o.a.s.l.LogWatcher Registering Log Listener [Log4j (org.slf4j.impl.Log4jLoggerFactory)]
   [junit4]   2> 2067625 INFO  (TEST-CollectionsAPIDistributedZkTest.test-seed#[EA00A48BF6BCDC00]) [    ] o.a.s.c.ZkContainer Zookeeper client=127.0.0.1:42201/solr
   [junit4]   2> 2067625 INFO  (TEST-CollectionsAPIDistributedZkTest.test-seed#[EA00A48BF6BCDC00]) [    ] o.a.s.c.ZkController zkHost includes chroot
   [junit4]   2> 2067625 INFO  (TEST-CollectionsAPIDistributedZkTest.test-seed#[EA00A48BF6BCDC00]) [    ] o.a.s.c.c.SolrZkClient Using default ZkCredentialsProvider
   [junit4]   2> 2067626 INFO  (TEST-CollectionsAPIDistributedZkTest.test-seed#[EA00A48BF6BCDC00]) [    ] o.a.s.c.c.ConnectionManager Waiting for client to connect to ZooKeeper
   [junit4]   2> 2067632 INFO  (zkCallback-1844-thread-1) [    ] o.a.s.c.c.ConnectionManager Watcher org.apache.solr.common.cloud.ConnectionManager@65e69d24 name:ZooKeeperConnection Watcher:127.0.0.1:42201 got event WatchedEvent state:SyncConnected type:None path:null path:null type:None
   [junit4]   2> 2067632 INFO  (TEST-CollectionsAPIDistributedZkTest.test-seed#[EA00A48BF6BCDC00]) [    ] o.a.s.c.c.ConnectionManager Client is connected to ZooKeeper
   [junit4]   2> 2067632 INFO  (TEST-CollectionsAPIDistributedZkTest.test-seed#[EA00A48BF6BCDC00]) [    ] o.a.s.c.c.SolrZkClient Using default ZkACLProvider
   [junit4]   2> 2067641 INFO  (TEST-CollectionsAPIDistributedZkTest.test-seed#[EA00A48BF6BCDC00]) [n:127.0.0.1:53156_    ] o.a.s.c.c.ConnectionManager Waiting for client to connect to ZooKeeper
   [junit4]   2> 2067660 INFO  (zkCallback-1845-thread-1-processing-n:127.0.0.1:53156_) [n:127.0.0.1:53156_    ] o.a.s.c.c.ConnectionManager Watcher org.apache.solr.common.cloud.ConnectionManager@43eb8a24 name:ZooKeeperConnection Watcher:127.0.0.1:42201/solr got event WatchedEvent state:SyncConnected type:None path:null path:null type:None
   [junit4]   2> 2067660 INFO  (TEST-CollectionsAPIDistributedZkTest.test-seed#[EA00A48BF6BCDC00]) [n:127.0.0.1:53156_    ] o.a.s.c.c.ConnectionManager Client is connected to ZooKeeper
   [junit4]   2> 2067662 INFO  (TEST-CollectionsAPIDistributedZkTest.test-seed#[EA00A48BF6BCDC00]) [n:127.0.0.1:53156_    ] o.a.s.c.c.SolrZkClient makePath: /overseer/queue
   [junit4]   2> 2067663 INFO  (TEST-CollectionsAPIDistributedZkTest.test-seed#[EA00A48BF6BCDC00]) [n:127.0.0.1:53156_    ] o.a.s.c.c.SolrZkClient makePath: /overseer/collection-queue-work
   [junit4]   2> 2067666 INFO  (TEST-CollectionsAPIDistributedZkTest.test-seed#[EA00A48BF6BCDC00]) [n:127.0.0.1:53156_    ] o.a.s.c.c.SolrZkClient makePath: /overseer/collection-map-running
   [junit4]   2> 2067667 INFO  (TEST-CollectionsAPIDistributedZkTest.test-seed#[EA00A48BF6BCDC00]) [n:127.0.0.1:53156_    ] o.a.s.c.c.SolrZkClient makePath: /overseer/collection-map-completed
   [junit4]   2> 2067669 INFO  (TEST-CollectionsAPIDistributedZkTest.test-seed#[EA00A48BF6BCDC00]) [n:127.0.0.1:53156_    ] o.a.s.c.c.SolrZkClient makePath: /overseer/collection-map-failure
   [junit4]   2> 2067671 INFO  (TEST-CollectionsAPIDistributedZkTest.test-seed#[EA00A48BF6BCDC00]) [n:127.0.0.1:53156_    ] o.a.s.c.c.SolrZkClient makePath: /live_nodes
   [junit4]   2> 2067672 INFO  (TEST-CollectionsAPIDistributedZkTest.test-seed#[EA00A48BF6BCDC00]) [n:127.0.0.1:53156_    ] o.a.s.c.c.SolrZkClient makePath: /aliases.json
   [junit4]   2> 2067673 INFO  (TEST-CollectionsAPIDistributedZkTest.test-seed#[EA00A48BF6BCDC00]) [n:127.0.0.1:53156_    ] o.a.s.c.c.SolrZkClient makePath: /clusterstate.json
   [junit4]   2> 2067674 INFO  (TEST-CollectionsAPIDistributedZkTest.test-seed#[EA00A48BF6BCDC00]) [n:127.0.0.1:53156_    ] o.a.s.c.c.SolrZkClient makePath: /security.json
   [junit4]   2> 2067675 INFO  (TEST-CollectionsAPIDistributedZkTest.test-seed#[EA00A48BF6BCDC00]) [n:127.0.0.1:53156_    ] o.a.s.c.ZkController Register node as live in ZooKeeper:/live_nodes/127.0.0.1:53156_
   [junit4]   2> 2067675 INFO  (TEST-CollectionsAPIDistributedZkTest.test-seed#[EA00A48BF6BCDC00]) [n:127.0.0.1:53156_    ] o.a.s.c.c.SolrZkClient makePath: /live_nodes/127.0.0.1:53156_
   [junit4]   2> 2067676 INFO  (TEST-CollectionsAPIDistributedZkTest.test-seed#[EA00A48BF6BCDC00]) [n:127.0.0.1:53156_    ] o.a.s.c.c.SolrZkClient makePath: /overseer_elect
   [junit4]   2> 2067683 INFO  (TEST-CollectionsAPIDistributedZkTest.test-seed#[EA00A48BF6BCDC00]) [n:127.0.0.1:53156_    ] o.a.s.c.c.SolrZkClient makePath: /overseer_elect/election
   [junit4]   2> 2067685 INFO  (TEST-CollectionsAPIDistributedZkTest.test-seed#[EA00A48BF6BCDC00]) [n:127.0.0.1:53156_    ] o.a.s.c.Overseer Overseer (id=null) closing
   [junit4]   2> 2067685 INFO  (TEST-CollectionsAPIDistributedZkTest.test-seed#[EA00A48BF6BCDC00]) [n:127.0.0.1:53156_    ] o.a.s.c.LeaderElector Joined leadership election with path: /overseer_elect/election/94947864418254853-127.0.0.1:53156_-n_0000000000
   [junit4]   2> 2067686 INFO  (TEST-CollectionsAPIDistributedZkTest.test-seed#[EA00A48BF6BCDC00]) [n:127.0.0.1:53156_    ] o.a.s.c.OverseerElectionContext I am going to be the leader 127.0.0.1:53156_
   [junit4]   2> 2067686 INFO  (TEST-CollectionsAPIDistributedZkTest.test-seed#[EA00A48BF6BCDC00]) [n:127.0.0.1:53156_    ] o.a.s.c.c.SolrZkClient makePath: /overseer_elect/leader
   [junit4]   2> 2067689 INFO  (TEST-CollectionsAPIDistributedZkTest.test-seed#[EA00A48BF6BCDC00]) [n:127.0.0.1:53156_    ] o.a.s.c.Overseer Overseer (id=94947864418254853-127.0.0.1:53156_-n_0000000000) starting
   [junit4]   2> 2067692 INFO  (TEST-CollectionsAPIDistributedZkTest.test-seed#[EA00A48BF6BCDC00]) [n:127.0.0.1:53156_    ] o.a.s.c.c.SolrZkClient makePath: /overseer/queue-work
   [junit4]   2> 2067704 INFO  (TEST-CollectionsAPIDistributedZkTest.test-seed#[EA00A48BF6BCDC00]) [n:127.0.0.1:53156_    ] o.a.s.c.OverseerAutoReplicaFailoverThread Starting OverseerAutoReplicaFailoverThread autoReplicaFailoverWorkLoopDelay=10000 autoReplicaFailoverWaitAfterExpiration=10000 autoReplicaFailoverBadNodeExpiration=60000
   [junit4]   2> 2067710 INFO  (OverseerStateUpdate-94947864418254853-127.0.0.1:53156_-n_0000000000) [n:127.0.0.1:53156_    ] o.a.s.c.Overseer Starting to work on the main queue
   [junit4]   2> 2067711 INFO  (OverseerCollectionConfigSetProcessor-94947864418254853-127.0.0.1:53156_-n_0000000000) [n:127.0.0.1:53156_    ] o.a.s.c.OverseerTaskProcessor Process current queue of overseer operations
   [junit4]   2> 2067711 INFO  (OverseerStateUpdate-94947864418254853-127.0.0.1:53156_-n_0000000000) [n:127.0.0.1:53156_    ] o.a.s.c.c.ZkStateReader Updating cluster state from ZooKeeper... 
   [junit4]   2> 2067729 INFO  (TEST-CollectionsAPIDistributedZkTest.test-seed#[EA00A48BF6BCDC00]) [n:127.0.0.1:53156_    ] o.a.s.c.c.ZkStateReader Updating cluster state from ZooKeeper... 
   [junit4]   2> 2067795 INFO  (TEST-CollectionsAPIDistributedZkTest.test-seed#[EA00A48BF6BCDC00]) [n:127.0.0.1:53156_    ] o.a.s.c.CoreContainer Security conf doesn't exist. Skipping setup for authorization module.
   [junit4]   2> 2067795 INFO  (TEST-CollectionsAPIDistributedZkTest.test-seed#[EA00A48BF6BCDC00]) [n:127.0.0.1:53156_    ] o.a.s.c.CoreContainer No authentication plugin used.
   [junit4]   2> 2067799 INFO  (TEST-CollectionsAPIDistributedZkTest.test-seed#[EA00A48BF6BCDC00]) [n:127.0.0.1:53156_    ] o.a.s.c.CoresLocator Looking for core definitions underneath /x1/jenkins/jenkins-slave/workspace/Lucene-Solr-NightlyTests-5.x/solr/build/solr-core/test/J1/../../../../../../../../../../x1/jenkins/jenkins-slave/workspace/Lucene-Solr-NightlyTests-5.x/solr/build/solr-core/test/J1/temp/solr.cloud.CollectionsAPIDistributedZkTest_EA00A48BF6BCDC00-001/control-001/cores
   [junit4]   2> 2067799 INFO  (TEST-CollectionsAPIDistributedZkTest.test-seed#[EA00A48BF6BCDC00]) [n:127.0.0.1:53156_    ] o.a.s.c.SolrCore Created CoreDescriptor: {absoluteInstDir=/x1/jenkins/jenkins-slave/workspace/Lucene-Solr-NightlyTests-5.x/solr/build/solr-core/test/J1/../../../../../../../../../../x1/jenkins/jenkins-slave/workspace/Lucene-Solr-NightlyTests-5.x/solr/build/solr-core/test/J1/temp/solr.cloud.CollectionsAPIDistributedZkTest_EA00A48BF6BCDC00-001/control-001/cores/collection1/, loadOnStartup=true, shard=, dataDir=data/, coreNodeName=, schema=schema.xml, configSetProperties=configsetprops.json, collection=control_collection, name=collection1, instanceDir=/x1/jenkins/jenkins-slave/workspace/Lucene-Solr-NightlyTests-5.x/solr/build/solr-core/test/J1/../../../../../../../../../../x1/jenkins/jenkins-slave/workspace/Lucene-Solr-NightlyTests-5.x/solr/build/solr-core/test/J1/temp/solr.cloud.CollectionsAPIDistributedZkTest_EA00A48BF6BCDC00-001/control-001/cores/collection1, config=solrconfig.xml, transient=false}
   [junit4]   2> 2067800 INFO  (TEST-CollectionsAPIDistributedZkTest.test-seed#[EA00A48BF6BCDC00]) [n:127.0.0.1:53156_    ] o.a.s.c.CoresLocator Found core collection1 in /x1/jenkins/jenkins-slave/workspace/Lucene-Solr-NightlyTests-5.x/solr/build/solr-core/test/J1/../../../../../../../../../../x1/jenkins/jenkins-slave/workspace/Lucene-Solr-NightlyTests-5.x/solr/build/solr-core/test/J1/temp/solr.cloud.CollectionsAPIDistributedZkTest_EA00A48BF6BCDC00-001/control-001/cores/collection1/
   [junit4]   2> 2067800 INFO  (TEST-CollectionsAPIDistributedZkTest.test-seed#[EA00A48BF6BCDC00]) [n:127.0.0.1:53156_    ] o.a.s.c.CoresLocator Found 1 core definitions
   [junit4]   2> 2067808 INFO  (coreLoadExecutor-3797-thread-1-processing-n:127.0.0.1:53156_) [n:127.0.0.1:53156_ c:control_collection   x:collection1] o.a.s.c.ZkController publishing state=down
   [junit4]   2> 2067808 INFO  (coreLoadExecutor-3797-thread-1-processing-n:127.0.0.1:53156_) [n:127.0.0.1:53156_ c:control_collection   x:collection1] o.a.s.c.ZkController numShards not found on descriptor - reading it from system property
   [junit4]   2> 2067811 INFO  (coreLoadExecutor-3797-thread-1-processing-n:127.0.0.1:53156_) [n:127.0.0.1:53156_ c:control_collection   x:collection1] o.a.s.c.ZkController look for our core node name
   [junit4]   2> 2067815 INFO  (OverseerStateUpdate-94947864418254853-127.0.0.1:53156_-n_0000000000) [n:127.0.0.1:53156_    ] o.a.s.c.Overseer processMessage: queueSize: 1, message = {
   [junit4]   2>   "node_name":"127.0.0.1:53156_",
   [junit4]   2>   "base_url":"https://127.0.0.1:53156",
   [junit4]   2>   "numShards":"1",
   [junit4]   2>   "core":"collection1",
   [junit4]   2>   "collection":"control_collection",
   [junit4]   2>   "roles":null,
   [junit4]   2>   "shard":null,
   [junit4]   2>   "state":"down",
   [junit4]   2>   "operation":"state"} current state version: 0
   [junit4]   2> 2067816 INFO  (OverseerStateUpdate-94947864418254853-127.0.0.1:53156_-n_0000000000) [n:127.0.0.1:53156_    ] o.a.s.c.o.ReplicaMutator Update state numShards=1 message={
   [junit4]   2>   "node_name":"127.0.0.1:53156_",
   [junit4]   2>   "base_url":"https://127.0.0.1:53156",
   [junit4]   2>   "numShards":"1",
   [junit4]   2>   "core":"collection1",
   [junit4]   2>   "collection":"control_collection",
   [junit4]   2>   "roles":null,
   [junit4]   2>   "shard":null,
   [junit4]   2>   "state":"down",
   [junit4]   2>   "operation":"state"}
   [junit4]   2> 2067816 INFO  (OverseerStateUpdate-94947864418254853-127.0.0.1:53156_-n_0000000000) [n:127.0.0.1:53156_    ] o.a.s.c.o.ClusterStateMutator building a new cName: control_collection
   [junit4]   2> 2067816 INFO  (OverseerStateUpdate-94947864418254853-127.0.0.1:53156_-n_0000000000) [n:127.0.0.1:53156_    ] o.a.s.c.o.ReplicaMutator Assigning new node to shard shard=shard1
   [junit4]   2> 2067817 INFO  (TEST-CollectionsAPIDistributedZkTest.test-seed#[EA00A48BF6BCDC00]) [n:127.0.0.1:53156_    ] o.a.s.s.SolrDispatchFilter user.dir=/x1/jenkins/jenkins-slave/workspace/Lucene-Solr-NightlyTests-5.x/solr/build/solr-core/test/J1
   [junit4]   2> 2067817 INFO  (TEST-CollectionsAPIDistributedZkTest.test-seed#[EA00A48BF6BCDC00]) [n:127.0.0.1:53156_    ] o.a.s.s.SolrDispatchFilter SolrDispatchFilter.init() done
   [junit4]   2> 2067818 INFO  (zkCallback-1845-thread-1-processing-n:127.0.0.1:53156_) [n:127.0.0.1:53156_    ] o.a.s.c.c.ZkStateReader A cluster state change: WatchedEvent state:SyncConnected type:NodeDataChanged path:/clusterstate.json, has occurred - updating... (live nodes size: 1)
   [junit4]   2> 2067819 INFO  (zkCallback-1845-thread-2-processing-n:127.0.0.1:53156_) [n:127.0.0.1:53156_    ] o.a.s.c.c.ZkStateReader A cluster state change: WatchedEvent state:SyncConnected type:NodeDataChanged path:/clusterstate.json, has occurred - updating... (live nodes size: 1)
   [junit4]   2> 2068812 INFO  (coreLoadExecutor-3797-thread-1-processing-n:127.0.0.1:53156_) [n:127.0.0.1:53156_ c:control_collection   x:collection1] o.a.s.c.ZkController waiting to find shard id in clusterstate for collection1
   [junit4]   2> 2068813 INFO  (coreLoadExecutor-3797-thread-1-processing-n:127.0.0.1:53156_) [n:127.0.0.1:53156_ c:control_collection   x:collection1] o.a.s.c.ZkController Check for collection zkNode:control_collection
   [junit4]   2> 2068813 INFO  (coreLoadExecutor-3797-thread-1-processing-n:127.0.0.1:53156_) [n:127.0.0.1:53156_ c:control_collection   x:collection1] o.a.s.c.ZkController Collection zkNode exists
   [junit4]   2> 2068813 INFO  (coreLoadExecutor-3797-thread-1-processing-n:127.0.0.1:53156_) [n:127.0.0.1:53156_ c:control_collection   x:collection1] o.a.s.c.c.ZkStateReader Load collection config from:/collections/control_collection
   [junit4]   2> 2068814 INFO  (coreLoadExecutor-3797-thread-1-processing-n:127.0.0.1:53156_) [n:127.0.0.1:53156_ c:control_collection   x:collection1] o.a.s.c.c.ZkStateReader path=/collections/control_collection configName=conf1 specified config exists in ZooKeeper
   [junit4]   2> 2068814 INFO  (coreLoadExecutor-3797-thread-1-processing-n:127.0.0.1:53156_) [n:127.0.0.1:53156_ c:control_collection   x:collection1] o.a.s.c.SolrResourceLoader new SolrResourceLoader for directory: '/x1/jenkins/jenkins-slave/workspace/Lucene-Solr-NightlyTests-5.x/solr/build/solr-core/test/J1/temp/solr.cloud.CollectionsAPIDistributedZkTest_EA00A48BF6BCDC00-001/control-001/cores/collection1'
   [junit4]   2> 2068814 INFO  (coreLoadExecutor-3797-thread-1-processing-n:127.0.0.1:53156_) [n:127.0.0.1:53156_ c:control_collection   x:collection1] o.a.s.c.SolrResourceLoader JNDI not configured for solr (NoInitialContextEx)
   [junit4]   2> 2068815 INFO  (coreLoadExecutor-3797-thread-1-processing-n:127.0.0.1:53156_) [n:127.0.0.1:53156_ c:control_collection   x:collection1] o.a.s.c.SolrResourceLoader solr home defaulted to 'solr/' (could not find system property or JNDI)
   [junit4]   2> 2068816 INFO  (coreLoadExecutor-3797-thread-1-processing-n:127.0.0.1:53156_) [n:127.0.0.1:53156_ c:control_collection   x:collection1] o.a.s.c.Config loaded config solrconfig.xml with version 0 
   [junit4]   2> 2068822 INFO  (coreLoadExecutor-3797-thread-1-processing-n:127.0.0.1:53156_) [n:127.0.0.1:53156_ c:control_collection   x:collection1] o.a.s.c.SolrConfig current version of requestparams : -1
   [junit4]   2> 2068871 INFO  (coreLoadExecutor-3797-thread-1-processing-n:127.0.0.1:53156_) [n:127.0.0.1:53156_ c:control_collection   x:collection1] o.a.s.c.SolrConfig Using Lucene MatchVersion: 5.5.0
   [junit4]   2> 2068909 INFO  (coreLoadExecutor-3797-thread-1-processing-n:127.0.0.1:53156_) [n:127.0.0.1:53156_ c:control_collection   x:collection1] o.a.s.c.Config Loaded SolrConfig: solrconfig.xml
   [junit4]   2> 2068925 INFO  (coreLoadExecutor-3797-thread-1-processing-n:127.0.0.1:53156_) [n:127.0.0.1:53156_ c:control_collection   x:collection1] o.a.s.s.IndexSchema [collection1] Schema name=test
   [junit4]   2> 2069374 INFO  (coreLoadExecutor-3797-thread-1-processing-n:127.0.0.1:53156_) [n:127.0.0.1:53156_ c:control_collection   x:collection1] o.a.s.s.OpenExchangeRatesOrgProvider Initialized with rates=open-exchange-rates.json, refreshInterval=1440.
   [junit4]   2> 2069381 INFO  (coreLoadExecutor-3797-thread-1-processing-n:127.0.0.1:53156_) [n:127.0.0.1:53156_ c:control_collection   x:collection1] o.a.s.s.IndexSchema default search field in schema is text
   [junit4]   2> 2069382 INFO  (coreLoadExecutor-3797-thread-1-processing-n:127.0.0.1:53156_) [n:127.0.0.1:53156_ c:control_collection   x:collection1] o.a.s.s.IndexSchema unique key field: id
   [junit4]   2> 2069404 INFO  (coreLoadExecutor-3797-thread-1-processing-n:127.0.0.1:53156_) [n:127.0.0.1:53156_ c:control_collection   x:collection1] o.a.s.s.FileExchangeRateProvider Reloading exchange rates from file currency.xml
   [junit4]   2> 2069407 INFO  (coreLoadExecutor-3797-thread-1-processing-n:127.0.0.1:53156_) [n:127.0.0.1:53156_ c:control_collection   x:collection1] o.a.s.s.FileExchangeRateProvider Reloading exchange rates from file currency.xml
   [junit4]   2> 2069409 INFO  (coreLoadExecutor-3797-thread-1-processing-n:127.0.0.1:53156_) [n:127.0.0.1:53156_ c:control_collection   x:collection1] o.a.s.s.OpenExchangeRatesOrgProvider Reloading exchange rates from open-exchange-rates.json
   [junit4]   2> 2069410 WARN  (coreLoadExecutor-3797-thread-1-processing-n:127.0.0.1:53156_) [n:127.0.0.1:53156_ c:control_collection   x:collection1] o.a.s.s.OpenExchangeRatesOrgProvider Unknown key IMPORTANT NOTE
   [junit4]   2> 2069410 WARN  (coreLoadExecutor-3797-thread-1-processing-n:127.0.0.1:53156_) [n:127.0.0.1:53156_ c:control_collection   x:collection1] o.a.s.s.OpenExchangeRatesOrgProvider Expected key, got STRING
   [junit4]   2> 2069410 INFO  (coreLoadExecutor-3797-thread-1-processing-n:127.0.0.1:53156_) [n:127.0.0.1:53156_ c:control_collection   x:collection1] o.a.s.s.OpenExchangeRatesOrgProvider Reloading exchange rates from open-exchange-rates.json
   [junit4]   2> 2069412 WARN  (coreLoadExecutor-3797-thread-1-processing-n:127.0.0.1:53156_) [n:127.0.0.1:53156_ c:control_collection   x:collection1] o.a.s.s.OpenExchangeRatesOrgProvider Unknown key IMPORTANT NOTE
   [junit4]   2> 2069412 WARN  (coreLoadExecutor-3797-thread-1-processing-n:127.0.0.1:53156_) [n:127.0.0.1:53156_ c:control_collection   x:collection1] o.a.s.s.OpenExchangeRatesOrgProvider Expected key, got STRING
   [junit4]   2> 2069413 INFO  (coreLoadExecutor-3797-thread-1-processing-n:127.0.0.1:53156_) [n:127.0.0.1:53156_ c:control_collection   x:collection1] o.a.s.c.ConfigSetProperties Did not find ConfigSet properties, assuming default properties: Can't find resource 'configsetprops.json' in classpath or '/configs/conf1', cwd=/x1/jenkins/jenkins-slave/workspace/Lucene-Solr-NightlyTests-5.x/solr/build/solr-core/test/J1
   [junit4]   2> 2069413 INFO  (coreLoadExecutor-3797-thread-1-processing-n:127.0.0.1:53156_) [n:127.0.0.1:53156_ c:control_collection   x:collection1] o.a.s.c.CoreContainer Creating SolrCore 'collection1' using configuration from collection control_collection
   [junit4]   2> 2069413 INFO  (coreLoadExecutor-3797-thread-1-processing-n:127.0.0.1:53156_) [n:127.0.0.1:53156_ c:control_collection s:shard1 r:core_node1 x:collection1] o.a.s.c.SolrCore org.apache.solr.core.MockDirectoryFactory
   [junit4]   2> 2069413 INFO  (coreLoadExecutor-3797-thread-1-processing-n:127.0.0.1:53156_) [n:127.0.0.1:53156_ c:control_collection s:shard1 r:core_node1 x:collection1] o.a.s.c.SolrCore [[collection1] ] Opening new SolrCore at [/x1/jenkins/jenkins-slave/workspace/Lucene-Solr-NightlyTests-5.x/solr/build/solr-core/test/J1/temp/solr.cloud.CollectionsAPIDistributedZkTest_EA00A48BF6BCDC00-001/control-001/cores/collection1], dataDir=[null]
   [junit4]   2> 2069414 INFO  (coreLoadExecutor-3797-thread-1-processing-n:127.0.0.1:53156_) [n:127.0.0.1:53156_ c:control_collection s:shard1 r:core_node1 x:collection1] o.a.s.c.JmxMonitoredMap JMX monitoring is enabled. Adding Solr mbeans to JMX Server: com.sun.jmx.mbeanserver.JmxMBeanServer@783de479
   [junit4]   2> 2069415 INFO  (coreLoadExecutor-3797-thread-1-processing-n:127.0.0.1:53156_) [n:127.0.0.1:53156_ c:control_collection s:shard1 r:core_node1 x:collection1] o.a.s.c.CachingDirectoryFactory return new directory for /x1/jenkins/jenkins-slave/workspace/Lucene-Solr-NightlyTests-5.x/solr/build/solr-core/test/J1/../../../../../../../../../../x1/jenkins/jenkins-slave/workspace/Lucene-Solr-NightlyTests-5.x/solr/build/solr-core/test/J1/temp/solr.cloud.CollectionsAPIDistributedZkTest_EA00A48BF6BCDC00-001/control-001/cores/collection1/data
   [junit4]   2> 2069415 INFO  (coreLoadExecutor-3797-thread-1-processing-n:127.0.0.1:53156_) [n:127.0.0.1:53156_ c:control_collection s:shard1 r:core_node1 x:collection1] o.a.s.c.SolrCore New index directory detected: old=null new=/x1/jenkins/jenkins-slave/workspace/Lucene-Solr-NightlyTests-5.x/solr/build/solr-core/test/J1/../../../../../../../../../../x1/jenkins/jenkins-slave/workspace/Lucene-Solr-NightlyTests-5.x/solr/build/solr-core/test/J1/temp/solr.cloud.CollectionsAPIDistributedZkTest_EA00A48BF6BCDC00-001/control-001/cores/collection1/data/index/
   [junit4]   2> 2069415 WARN  (coreLoadExecutor-3797-thread-1-processing-n:127.0.0.1:53156_) [n:127.0.0.1:53156_ c:control_collection s:shard1 r:core_node1 x:collection1] o.a.s.c.SolrCore [collection1] Solr index directory '/x1/jenkins/jenkins-slave/workspace/Lucene-Solr-NightlyTests-5.x/solr/build/solr-core/test/J1/../../../../../../../../../../x1/jenkins/jenkins-slave/workspace/Lucene-Solr-NightlyTests-5.x/solr/build/solr-core/test/J1/temp/solr.cloud.CollectionsAPIDistributedZkTest_EA00A48BF6BCDC00-001/control-001/cores/collection1/data/index' doesn't exist. Creating new index...
   [junit4]   2> 2069415 INFO  (coreLoadExecutor-3797-thread-1-processing-n:127.0.0.1:53156_) [n:127.0.0.1:53156_ c:control_collection s:shard1 r:core_node1 x:collection1] o.a.s.c.CachingDirectoryFactory return new directory for /x1/jenkins/jenkins-slave/workspace/Lucene-Solr-NightlyTests-5.x/solr/build/solr-core/test/J1/../../../../../../../../../../x1/jenkins/jenkins-slave/workspace/Lucene-Solr-NightlyTests-5.x/solr/build/solr-core/test/J1/temp/solr.cloud.CollectionsAPIDistributedZkTest_EA00A48BF6BCDC00-001/control-001/cores/collection1/data/index
   [junit4]   2> 2069415 INFO  (coreLoadExecutor-3797-thread-1-processing-n:127.0.0.1:53156_) [n:127.0.0.1:53156_ c:control_collection s:shard1 r:core_node1 x:collection1] o.a.s.u.RandomMergePolicy RandomMergePolicy wrapping class org.apache.lucene.index.LogByteSizeMergePolicy: [LogByteSizeMergePolicy: minMergeSize=1677721, mergeFactor=9, maxMergeSize=2147483648, maxMergeSizeForForcedMerge=9223372036854775807, calibrateSizeByDeletes=true, maxMergeDocs=2147483647, maxCFSSegmentSizeMB=1.853515625, noCFSRatio=0.19011965434550931]
   [junit4]   2> 2069416 INFO  (coreLoadExecutor-3797-thread-1-processing-n:127.0.0.1:53156_) [n:127.0.0.1:53156_ c:control_collection s:shard1 r:core_node1 x:collection1] o.a.s.c.SolrCore SolrDeletionPolicy.onCommit: commits: num=1
   [junit4]   2> 	commit{dir=MockDirectoryWrapper(RAMDirectory@6293ac8c lockFactory=org.apache.lucene.store.SingleInstanceLockFactory@4d254de3),segFN=segments_1,generation=1}
   [junit4]   2> 2069416 INFO  (coreLoadExecutor-3797-thread-1-processing-n:127.0.0.1:53156_) [n:127.0.0.1:53156_ c:control_collection s:shard1 r:core_node1 x:collection1] o.a.s.c.SolrCore newest commit generation = 1
   [junit4]   2> 2069420 INFO  (coreLoadExecutor-3797-thread-1-processing-n:127.0.0.1:53156_) [n:127.0.0.1:53156_ c:control_collection s:shard1 r:core_node1 x:collection1] o.a.s.u.p.UpdateRequestProcessorChain creating updateRequestProcessorChain "nodistrib"
   [junit4]   2> 2069420 INFO  (coreLoadExecutor-3797-thread-1-processing-n:127.0.0.1:53156_) [n:127.0.0.1:53156_ c:control_collection s:shard1 r:core_node1 x:collection1] o.a.s.u.p.UpdateRequestProcessorChain creating updateRequestProcessorChain "dedupe"
   [junit4]   2> 2069420 INFO  (coreLoadExecutor-3797-thread-1-processing-n:127.0.0.1:53156_) [n:127.0.0.1:53156_ c:control_collection s:shard1 r:core_node1 x:collection1] o.a.s.u.p.UpdateRequestProcessorChain inserting DistributedUpdateProcessorFactory into updateRequestProcessorChain "dedupe"
   [junit4]   2> 2069421 INFO  (coreLoadExecutor-3797-thread-1-processing-n:127.0.0.1:53156_) [n:127.0.0.1:53156_ c:control_collection s:shard1 r:core_node1 x:collection1] o.a.s.u.p.UpdateRequestProcessorChain creating updateRequestProcessorChain "stored_sig"
   [junit4]   2> 2069421 INFO  (coreLoadExecutor-3797-thread-1-processing-n:127.0.0.1:53156_) [n:127.0.0.1:53156_ c:control_collection s:shard1 r:core_node1 x:collection1] o.a.s.u.p.UpdateRequestProcessorChain inserting DistributedUpdateProcessorFactory into updateRequestProcessorChain "stored_sig"
   [junit4]   2> 2069421 INFO  (coreLoadExecutor-3797-thread-1-processing-n:127.0.0.1:53156_) [n:127.0.0.1:53156_ c:control_collection s:shard1 r:core_node1 x:collection1] o.a.s.u.p.UpdateRequestProcessorChain creating updateRequestProcessorChain "distrib-dup-test-chain-explicit"
   [junit4]   2> 2069421 INFO  (coreLoadExecutor-3797-thread-1-processing-n:127.0.0.1:53156_) [n:127.0.0.1:53156_ c:control_collection s:shard1 r:core_node1 x:collection1] o.a.s.u.p.UpdateRequestProcessorChain creating updateRequestProcessorChain "distrib-dup-test-chain-implicit"
   [junit4]   2> 2069421 INFO  (coreLoadExecutor-3797-thread-1-processing-n:127.0.0.1:53156_) [n:127.0.0.1:53156_ c:control_collection s:shard1 r:core_node1 x:collection1] o.a.s.u.p.UpdateRequestProcessorChain inserting DistributedUpdateProcessorFactory into updateRequestProcessorChain "distrib-dup-test-chain-implicit"
   [junit4]   2> 2069421 INFO  (coreLoadExecutor-3797-thread-1-processing-n:127.0.0.1:53156_) [n:127.0.0.1:53156_ c:control_collection s:shard1 r:core_node1 x:collection1] o.a.s.c.SolrCore no updateRequestProcessorChain defined as default, creating implicit default
   [junit4]   2> 2069421 WARN  (coreLoadExecutor-3797-thread-1-processing-n:127.0.0.1:53156_) [n:127.0.0.1:53156_ c:control_collection s:shard1 r:core_node1 x:collection1] o.a.s.c.RequestHandlers INVALID paramSet a in requestHandler {type = requestHandler,name = /dump,class = DumpRequestHandler,args = {defaults={a=A,b=B}}}
   [junit4]   2> 2069424 INFO  (coreLoadExecutor-3797-thread-1-processing-n:127.0.0.1:53156_) [n:127.0.0.1:53156_ c:control_collection s:shard1 r:core_node1 x:collection1] o.a.s.h.l.XMLLoader xsltCacheLifetimeSeconds=60
   [junit4]   2> 2069426 INFO  (coreLoadExecutor-3797-thread-1-processing-n:127.0.0.1:53156_) [n:127.0.0.1:53156_ c:control_collection s:shard1 r:core_node1 x:collection1] o.a.s.h.l.XMLLoader xsltCacheLifetimeSeconds=60
   [junit4]   2> 2069427 INFO  (OldIndexDirectoryCleanupThreadForCore-collection1) [n:127.0.0.1:53156_ c:control_collection s:shard1 r:core_node1 x:collection1] o.a.s.c.SolrCore Looking for old index directories to cleanup for core collection1 in /x1/jenkins/jenkins-slave/workspace/Lucene-Solr-NightlyTests-5.x/solr/build/solr-core/test/J1/../../../../../../../../../../x1/jenkins/jenkins-slave/workspace/Lucene-Solr-NightlyTests-5.x/solr/build/solr-core/test/J1/temp/solr.cloud.CollectionsAPIDistributedZkTest_EA00A48BF6BCDC00-001/control-001/cores/collection1/data/
   [junit4]   2> 2069427 WARN  (OldIndexDirectoryCleanupThreadForCore-collection1) [n:127.0.0.1:53156_ c:control_collection s:shard1 r:core_node1 x:collection1] o.a.s.c.DirectoryFactory /x1/jenkins/jenkins-slave/workspace/Lucene-Solr-NightlyTests-5.x/solr/build/solr-core/test/J1/../../../../../../../../../../x1/jenkins/jenkins-slave/workspace/Lucene-Solr-NightlyTests-5.x/solr/build/solr-core/test/J1/temp/solr.cloud.CollectionsAPIDistributedZkTest_EA00A48BF6BCDC00-001/control-001/cores/collection1/data/ does not point to a valid data directory; skipping clean-up of old index directories.
   [junit4]   2> 2069428 INFO  (coreLoadExecutor-3797-thread-1-processing-n:127.0.0.1:53156_) [n:127.0.0.1:53156_ c:control_collection s:shard1 r:core_node1 x:collection1] o.a.s.h.l.XMLLoader xsltCacheLifetimeSeconds=60
   [junit4]   2> 2069430 INFO  (coreLoadExecutor-3797-thread-1-processing-n:127.0.0.1:53156_) [n:127.0.0.1:53156_ c:control_collection s:shard1 r:core_node1 x:collection1] o.a.s.h.l.XMLLoader xsltCacheLifetimeSeconds=60
   [junit4]   2> 2069435 INFO  (coreLoadExecutor-3797-thread-1-processing-n:127.0.0.1:53156_) [n:127.0.0.1:53156_ c:control_collection s:shard1 r:core_node1 x:collection1] o.a.s.c.RequestHandlers Registered paths: /admin/file,/schema,standard,/admin/system,/admin/segments,/admin/properties,/update/json/docs,/admin/logging,/config,/replication,/update/csv,/get,/admin/plugins,/admin/luke,/update/json,/dump,/update,/admin/mbeans,/admin/threads,/admin/ping
   [junit4]   2> 2069437 INFO  (coreLoadExecutor-3797-thread-1-processing-n:127.0.0.1:53156_) [n:127.0.0.1:53156_ c:control_collection s:shard1 r:core_node1 x:collection1] o.a.s.c.SolrCore Using default statsCache cache: org.apache.solr.search.stats.LocalStatsCache
   [junit4]   2> 2069438 INFO  (coreLoadExecutor-3797-thread-1-processing-n:127.0.0.1:53156_) [n:127.0.0.1:53156_ c:control_collection s:shard1 r:core_node1 x:collection1] o.a.s.u.UpdateHandler Using UpdateLog implementation: org.apache.solr.update.UpdateLog
   [junit4]   2> 2069438 INFO  (coreLoadExecutor-3797-thread-1-processing-n:127.0.0.1:53156_) [n:127.0.0.1:53156_ c:control_collection s:shard1 r:core_node1 x:collection1] o.a.s.u.UpdateLog Initializing UpdateLog: dataDir= defaultSyncLevel=FLUSH numRecordsToKeep=100 maxNumLogsToKeep=10 numVersionBuckets=65536
   [junit4]   2> 2069439 INFO  (coreLoadExecutor-3797-thread-1-processing-n:127.0.0.1:53156_) [n:127.0.0.1:53156_ c:control_collection s:shard1 r:core_node1 x:collection1] o.a.s.c.SolrCore Hard AutoCommit: disabled
   [junit4]   2> 2069439 INFO  (coreLoadExecutor-3797-thread-1-processing-n:127.0.0.1:53156_) [n:127.0.0.1:53156_ c:control_collection s:shard1 r:core_node1 x:collection1] o.a.s.c.SolrCore Soft AutoCommit: disabled
   [junit4]   2> 2069439 INFO  (coreLoadExecutor-3797-thread-1-processing-n:127.0.0.1:53156_) [n:127.0.0.1:53156_ c:control_collection s:shard1 r:core_node1 x:collection1] o.a.s.u.RandomMergePolicy RandomMergePolicy wrapping class org.apache.lucene.index.MockRandomMergePolicy: org.apache.lucene.index.MockRandomMergePolicy@65304623
   [junit4]   2> 2069440 INFO  (coreLoadExecutor-3797-thread-1-processing-n:127.0.0.1:53156_) [n:127.0.0.1:53156_ c:control_collection s:shard1 r:core_node1 x:collection1] o.a.s.c.SolrCore SolrDeletionPolicy.onInit: commits: num=1
   [junit4]   2> 	commit{dir=MockDirectoryWrapper(RAMDirectory@6293ac8c lockFactory=org.apache.lucene.store.SingleInstanceLockFactory@4d254de3),segFN=segments_1,generation=1}
   [junit4]   2> 2069440 INFO  (coreLoadExecutor-3797-thread-1-processing-n:127.0.0.1:53156_) [n:127.0.0.1:53156_ c:control_collection s:shard1 r:core_node1 x:collection1] o.a.s.c.SolrCore newest commit generation = 1
   [junit4]   2> 2069440 INFO  (coreLoadExecutor-3797-thread-1-processing-n:127.0.0.1:53156_) [n:127.0.0.1:53156_ c:control_collection s:shard1 r:core_node1 x:collection1] o.a.s.s.SolrIndexSearcher Opening Searcher@105d2567[collection1] main
   [junit4]   2> 2069440 INFO  (coreLoadExecutor-3797-thread-1-processing-n:127.0.0.1:53156_) [n:127.0.0.1:53156_ c:control_collection s:shard1 r:core_node1 x:collection1] o.a.s.c.c.ZkStateReader Load collection config from:/collections/control_collection
   [junit4]   2> 2069441 INFO  (coreLoadExecutor-3797-thread-1-processing-n:127.0.0.1:53156_) [n:127.0.0.1:53156_ c:control_collection s:shard1 r:core_node1 x:collection1] o.a.s.c.c.ZkStateReader path=/collections/control_collection configName=conf1 specified config exists in ZooKeeper
   [junit4]   2> 2069441 INFO  (coreLoadExecutor-3797-thread-1-processing-n:127.0.0.1:53156_) [n:127.0.0.1:53156_ c:control_collection s:shard1 r:core_node1 x:collection1] o.a.s.r.ManagedResourceStorage Setting up ZooKeeper-based storage for the RestManager with znodeBase: /configs/conf1
   [junit4]   2> 2069441 INFO  (coreLoadExecutor-3797-thread-1-processing-n:127.0.0.1:53156_) [n:127.0.0.1:53156_ c:control_collection s:shard1 r:core_node1 x:collection1] o.a.s.r.ManagedResourceStorage Configured ZooKeeperStorageIO with znodeBase: /configs/conf1
   [junit4]   2> 2069441 INFO  (coreLoadExecutor-3797-thread-1-processing-n:127.0.0.1:53156_) [n:127.0.0.1:53156_ c:control_collection s:shard1 r:core_node1 x:collection1] o.a.s.r.RestManager Initializing RestManager with initArgs: {}
   [junit4]   2> 2069441 INFO  (coreLoadExecutor-3797-thread-1-processing-n:127.0.0.1:53156_) [n:127.0.0.1:53156_ c:control_collection s:shard1 r:core_node1 x:collection1] o.a.s.r.ManagedResourceStorage Reading _rest_managed.json using ZooKeeperStorageIO:path=/configs/conf1
   [junit4]   2> 2069441 INFO  (coreLoadExecutor-3797-thread-1-processing-n:127.0.0.1:53156_) [n:127.0.0.1:53156_ c:control_collection s:shard1 r:core_node1 x:collection1] o.a.s.r.ManagedResourceStorage No data found for znode /configs/conf1/_rest_managed.json
   [junit4]   2> 2069442 INFO  (coreLoadExecutor-3797-thread-1-processing-n:127.0.0.1:53156_) [n:127.0.0.1:53156_ c:control_collection s:shard1 r:core_node1 x:collection1] o.a.s.r.ManagedResourceStorage Loaded null at path _rest_managed.json using ZooKeeperStorageIO:path=/configs/conf1
   [junit4]   2> 2069442 INFO  (coreLoadExecutor-3797-thread-1-processing-n:127.0.0.1:53156_) [n:127.0.0.1:53156_ c:control_collection s:shard1 r:core_node1 x:collection1] o.a.s.r.RestManager Initializing 0 registered ManagedResources
   [junit4]   2> 2069442 INFO  (coreLoadExecutor-3797-thread-1-processing-n:127.0.0.1:53156_) [n:127.0.0.1:53156_ c:control_collection s:shard1 r:core_node1 x:collection1] o.a.s.h.ReplicationHandler Commits will be reserved for  10000
   [junit4]   2> 2069442 INFO  (coreLoadExecutor-3797-thread-1-processing-n:127.0.0.1:53156_) [n:127.0.0.1:53156_ c:control_collection s:shard1 r:core_node1 x:collection1] o.a.s.u.UpdateLog Looking up max value of version field to seed version buckets
   [junit4]   2> 2069442 INFO  (coreLoadExecutor-3797-thread-1-processing-n:127.0.0.1:53156_) [n:127.0.0.1:53156_ c:control_collection s:shard1 r:core_node1 x:collection1] o.a.s.u.VersionInfo Refreshing highest value of _version_ for 65536 version buckets from index
   [junit4]   2> 2069442 INFO  (coreLoadExecutor-3797-thread-1-processing-n:127.0.0.1:53156_) [n:127.0.0.1:53156_ c:control_collection s:shard1 r:core_node1 x:collection1] o.a.s.u.VersionInfo No terms found for _version_, cannot seed version bucket highest value from index
   [junit4]   2> 2069442 INFO  (coreLoadExecutor-3797-thread-1-processing-n:127.0.0.1:53156_) [n:127.0.0.1:53156_ c:control_collection s:shard1 r:core_node1 x:collection1] o.a.s.u.UpdateLog Could not find max version in index or recent updates, using new clock 1519165833487581184
   [junit4]   2> 2069444 INFO  (coreLoadExecutor-3797-thread-1-processing-n:127.0.0.1:53156_) [n:127.0.0.1:53156_ c:control_collection s:shard1 r:core_node1 x:collection1] o.a.s.u.UpdateLog Took 1.0ms to seed version buckets with highest version 1519165833487581184
   [junit4]   2> 2069444 INFO  (coreLoadExecutor-3797-thread-1-processing-n:127.0.0.1:53156_) [n:127.0.0.1:53156_ c:control_collection s:shard1 r:core_node1 x:collection1] o.a.s.c.ZkController watch zkdir /configs/conf1
   [junit4]   2> 2069444 INFO  (searcherExecutor-3798-thread-1-processing-n:127.0.0.1:53156_ x:collection1 c:control_collection s:shard1 r:core_node1) [n:127.0.0.1:53156_ c:control_collection s:shard1 r:core_node1 x:collection1] o.a.s.c.SolrCore [collection1] Registered new searcher Searcher@105d2567[collection1] main{ExitableDirectoryReader(UninvertingDirectoryReader())}
   [junit4]   2> 2069445 INFO  (coreLoadExecutor-3797-thread-1-processing-n:127.0.0.1:53156_) [n:127.0.0.1:53156_ c:control_collection s:shard1 r:core_node1 x:collection1] o.a.s.c.CoreContainer registering core: collection1
   [junit4]   2> 2069449 INFO  (coreZkRegister-3791-thread-1-processing-n:127.0.0.1:53156_ x:collection1 c:control_collection s:shard1 r:core_node1) [n:127.0.0.1:53156_ c:control_collection s:shard1 r:core_node1 x:collection1] o.a.s.c.ZkController Register replica - core:collection1 address:https://127.0.0.1:53156 collection:control_collection shard:shard1
   [junit4]   2> 2069450 INFO  (coreZkRegister-3791-thread-1-processing-n:127.0.0.1:53156_ x:collection1 c:control_collection s:shard1 r:core_node1) [n:127.0.0.1:53156_ c:control_collection s:shard1 r:core_node1 x:collection1] o.a.s.c.c.SolrZkClient makePath: /collections/control_collection/leader_elect/shard1/election
   [junit4]   2> 2069453 INFO  (coreZkRegister-3791-thread-1-processing-n:127.0.0.1:53156_ x:collection1 c:control_collection s:shard1 r:core_node1) [n:127.0.0.1:53156_ c:control_collection s:shard1 r:core_node1 x:collection1] o.a.s.c.LeaderElector Joined leadership election with path: /collections/control_collection/leader_elect/shard1/election/94947864418254853-core_node1-n_0000000000
   [junit4]   2> 2069454 INFO  (coreZkRegister-3791-thread-1-processing-n:127.0.0.1:53156_ x:collection1 c:control_collection s:shard1 r:core_node1) [n:127.0.0.1:53156_ c:control_collection s:shard1 r:core_node1 x:collection1] o.a.s.c.ShardLeaderElectionContext Running the leader process for shard shard1
   [junit4]   2> 2069456 INFO  (coreZkRegister-3791-thread-1-processing-n:127.0.0.1:53156_ x:collection1 c:control_collection s:shard1 r:core_node1) [n:127.0.0.1:53156_ c:control_collection s:shard1 r:core_node1 x:collection1] o.a.s.c.ShardLeaderElectionContext Enough replicas found to continue.
   [junit4]   2> 2069456 INFO  (OverseerStateUpdate-94947864418254853-127.0.0.1:53156_-n_0000000000) [n:127.0.0.1:53156_    ] o.a.s.c.Overseer processMessage: queueSize: 1, message = {
   [junit4]   2>   "operation":"leader",
   [junit4]   2>   "shard":"shard1",
   [junit4]   2>   "collection":"control_collection"} current state version: 1
   [junit4]   2> 2069456 INFO  (coreZkRegister-3791-thread-1-processing-n:127.0.0.1:53156_ x:collection1 c:control_collection s:shard1 r:core_node1) [n:127.0.0.1:53156_ c:control_collection s:shard1 r:core_node1 x:collection1] o.a.s.c.ShardLeaderElectionContext I may be the new leader - try and sync
   [junit4]   2> 2069457 INFO  (coreZkRegister-3791-thread-1-processing-n:127.0.0.1:53156_ x:collection1 c:control_collection s:shard1 r:core_node1) [n:127.0.0.1:53156_ c:control_collection s:shard1 r:core_node1 x:collection1] o.a.s.c.SyncStrategy Sync replicas to https://127.0.0.1:53156/collection1/
   [junit4]   2> 2069457 INFO  (coreZkRegister-3791-thread-1-processing-n:127.0.0.1:53156_ x:collection1 c:control_collection s:shard1 r:core_node1) [n:127.0.0.1:53156_ c:control_collection s:shard1 r:core_node1 x:collection1] o.a.s.c.SyncStrategy Sync Success - now sync replicas to me
   [junit4]   2> 2069457 INFO  (coreZkRegister-3791-thread-1-processing-n:127.0.0.1:53156_ x:collection1 c:control_collection s:shard1 r:core_node1) [n:127.0.0.1:53156_ c:control_collection s:shard1 r:core_node1 x:collection1] o.a.s.c.SyncStrategy https://127.0.0.1:53156/collection1/ has no replicas
   [junit4]   2> 2069458 INFO  (zkCallback-1845-thread-3-processing-n:127.0.0.1:53156_) [n:127.0.0.1:53156_    ] o.a.s.c.c.ZkStateReader A cluster state change: WatchedEvent state:SyncConnected type:NodeDataChanged path:/clusterstate.json, has occurred - updating... (live nodes size: 1)
   [junit4]   2> 2069458 INFO  (zkCallback-1845-thread-2-processing-n:127.0.0.1:53156_) [n:127.0.0.1:53156_    ] o.a.s.c.c.ZkStateReader A cluster state change: WatchedEvent state:SyncConnected type:NodeDataChanged path:/clusterstate.json, has occurred - updating... (live nodes size: 1)
   [junit4]   2> 2069459 INFO  (coreZkRegister-3791-thread-1-processing-n:127.0.0.1:53156_ x:collection1 c:control_collection s:shard1 r:core_node1) [n:127.0.0.1:53156_ c:control_collection s:shard1 r:core_node1 x:collection1] o.a.s.c.c.SolrZkClient makePath: /collections/control_collection/leaders/shard1
   [junit4]   2> 2069464 INFO  (coreZkRegister-3791-thread-1-processing-n:127.0.0.1:53156_ x:collection1 c:control_collection s:shard1 r:core_node1) [n:127.0.0.1:53156_ c:control_collection s:shard1 r:core_node1 x:collection1] o.a.s.c.ShardLeaderElectionContextBase Creating leader registration node
   [junit4]   2> 2069466 INFO  (coreZkRegister-3791-thread-1-processing-n:127.0.0.1:53156_ x:collection1 c:control_collection s:shard1 r:core_node1) [n:127.0.0.1:53156_ c:control_collection s:shard1 r:core_node1 x:collection1] o.a.s.c.ShardLeaderElectionContext I am the new leader: https://127.0.0.1:53156/collection1/ shard1
   [junit4]   2> 2069467 INFO  (OverseerStateUpdate-94947864418254853-127.0.0.1:53156_-n_0000000000) [n:127.0.0.1:53156_    ] o.a.s.c.Overseer processMessage: queueSize: 1, message = {
   [junit4]   2>   "operation":"leader",
   [junit4]   2>   "shard":"shard1",
   [junit4]   2>   "collection":"control_collection",
   [junit4]   2>   "base_url":"https://127.0.0.1:53156",
   [junit4]   2>   "core":"collection1",
   [junit4]   2>   "state":"active"} current state version: 2
   [junit4]   2> 2069569 INFO  (zkCallback-1845-thread-3-processing-n:127.0.0.1:53156_) [n:127.0.0.1:53156_    ] o.a.s.c.c.ZkStateReader A cluster state change: WatchedEvent state:SyncConnected type:NodeDataChanged path:/clusterstate.json, has occurred - updating... (live nodes size: 1)
   [junit4]   2> 2069569 INFO  (zkCallback-1845-thread-2-processing-n:127.0.0.1:53156_) [n:127.0.0.1:53156_    ] o.a.s.c.c.ZkStateReader A cluster state change: WatchedEvent state:SyncConnected type:NodeDataChanged path:/clusterstate.json, has occurred - updating... (live nodes size: 1)
   [junit4]   2> 2069618 INFO  (coreZkRegister-3791-thread-1-processing-n:127.0.0.1:53156_ x:collection1 c:control_collection s:shard1 r:core_node1) [n:127.0.0.1:53156_ c:control_collection s:shard1 r:core_node1 x:collection1] o.a.s.c.ZkController We are https://127.0.0.1:53156/collection1/ and leader is https://127.0.0.1:53156/collection1/
   [junit4]   2> 2069618 INFO  (coreZkRegister-3791-thread-1-processing-n:127.0.0.1:53156_ x:collection1 c:control_collection s:shard1 r:core_node1) [n:127.0.0.1:53156_ c:control_collection s:shard1 r:core_node1 x:collection1] o.a.s.c.ZkController No LogReplay needed for core=collection1 baseURL=https://127.0.0.1:53156
   [junit4]   2> 2069618 INFO  (coreZkRegister-3791-thread-1-processing-n:127.0.0.1:53156_ x:collection1 c:control_collection s:shard1 r:core_node1) [n:127.0.0.1:53156_ c:control_collection s:shard1 r:core_node1 x:collection1] o.a.s.c.ZkController I am the leader, no recovery necessary
   [junit4]   2> 2069618 INFO  (coreZkRegister-3791-thread-1-processing-n:127.0.0.1:53156_ x:collection1 c:control_collection s:shard1 r:core_node1) [n:127.0.0.1:53156_ c:control_collection s:shard1 r:core_node1 x:collection1] o.a.s.c.ZkController publishing state=active
   [junit4]   2> 2069618 INFO  (coreZkRegister-3791-thread-1-processing-n:127.0.0.1:53156_ x:collection1 c:control_collection s:shard1 r:core_node1) [n:127.0.0.1:53156_ c:control_collection s:shard1 r:core_node1 x:collection1] o.a.s.c.ZkController numShards not found on descriptor - reading it from system property
   [junit4]   2> 2069620 INFO  (OverseerStateUpdate-94947864418254853-127.0.0.1:53156_-n_0000000000) [n:127.0.0.1:53156_    ] o.a.s.c.Overseer processMessage: queueSize: 1, message = {
   [junit4]   2>   "node_name":"127.0.0.1:53156_",
   [junit4]   2>   "base_url":"https://127.0.0.1:53156",
   [junit4]   2>   "core_node_name":"core_node1",
   [junit4]   2>   "numShards":"1",
   [junit4]   2>   "core":"collection1",
   [junit4]   2>   "collection":"control_collection",
   [junit4]   2>   "roles":null,
   [junit4]   2>   "shard":"shard1",
   [junit4]   2>   "state":"active",
   [junit4]   2>   "operation":"state"} current state version: 3
   [junit4]   2> 2069621 INFO  (OverseerStateUpdate-94947864418254853-127.0.0.1:53156_-n_0000000000) [n:127.0.0.1:53156_    ] o.a.s.c.o.ReplicaMutator Update state numShards=1 message={
   [junit4]   2>   "node_name":"127.0.0.1:53156_",
   [junit4]   2>   "base_url":"https://127.0.0.1:53156",
   [junit4]   2>   "core_node_name":"core_node1",
   [junit4]   2>   "numShards":"1",
   [junit4]   2>   "core":"collection1",
   [junit4]   2>   "collection":"control_collection",
   [junit4]   2>   "roles":null,
   [junit4]   2>   "shard":"shard1",
   [junit4]   2>   "state":"active",
   [junit4]   2>   "operation":"state"}
   [junit4]   2> 2069738 INFO  (zkCallback-1845-thread-2-processing-n:127.0.0.1:53156_) [n:127.0.0.1:53156_    ] o.a.s.c.c.ZkStateReader A cluster state change: WatchedEvent state:SyncConnected type:NodeDataChanged path:/clusterstate.json, has occurred - updating... (live nodes size: 1)
   [junit4]   2> 2069738 INFO  (zkCallback-1845-thread-3-processing-n:127.0.0.1:53156_) [n:127.0.0.1:53156_    ] o.a.s.c.c.ZkStateReader A cluster state change: WatchedEvent state:SyncConnected type:NodeDataChanged path:/clusterstate.json, has occurred - updating... (live nodes size: 1)
   [junit4]   2> 2069843 INFO  (TEST-CollectionsAPIDistributedZkTest.test-seed#[EA00A48BF6BCDC00]) [    ] o.a.s.c.c.SolrZkClient Using default ZkCredentialsProvider
   [junit4]   2> 2069860 INFO  (TEST-CollectionsAPIDistributedZkTest.test-seed#[EA00A48BF6BCDC00]) [    ] o.a.s.c.c.ConnectionManager Waiting for client to connect to ZooKeeper
   [junit4]   2> 2069865 INFO  (zkCallback-1847-thread-1) [    ] o.a.s.c.c.ConnectionManager Watcher org.apache.solr.common.cloud.ConnectionManager@7e568b91 name:ZooKeeperConnection Watcher:127.0.0.1:42201/solr got event WatchedEvent state:SyncConnected type:None path:null path:null type:None
   [junit4]   2> 2069865 INFO  (TEST-CollectionsAPIDistributedZkTest.test-seed#[EA00A48BF6BCDC00]) [    ] o.a.s.c.c.ConnectionManager Client is connected to ZooKeeper
   [junit4]   2> 2069865 INFO  (TEST-CollectionsAPIDistributedZkTest.test-seed#[EA00A48BF6BCDC00]) [    ] o.a.s.c.c.SolrZkClient Using default ZkACLProvider
   [junit4]   2> 2069866 INFO  (TEST-CollectionsAPIDistributedZkTest.test-seed#[EA00A48BF6BCDC00]) [    ] o.a.s.c.c.ZkStateReader Updating cluster state from ZooKeeper... 
   [junit4]   2> 2069867 INFO  (TEST-CollectionsAPIDistributedZkTest.test-seed#[EA00A48BF6BCDC00]) [    ] o.a.s.c.ChaosMonkey monkey: init - expire sessions:false cause connection loss:false
   [junit4]   2> 2070535 INFO  (TEST-CollectionsAPIDistributedZkTest.test-seed#[EA00A48BF6BCDC00]) [    ] o.a.s.SolrTestCaseJ4 Writing core.properties file to /x1/jenkins/jenkins-slave/workspace/Lucene-Solr-NightlyTests-5.x/solr/build/solr-core/test/J1/temp/solr.cloud.CollectionsAPIDistributedZkTest_EA00A48BF6BCDC00-001/shard-1-001/cores/collection1
   [junit4]   2> 2070537 INFO  (TEST-CollectionsAPIDistributedZkTest.test-seed#[EA00A48BF6BCDC00]) [    ] o.a.s.c.AbstractFullDistribZkTestBase create jetty 1 in directory /x1/jenkins/jenkins-slave/workspace/Lucene-Solr-NightlyTests-5.x/solr/build/solr-core/test/J1/temp/solr.cloud.CollectionsAPIDistributedZkTest_EA00A48BF6BCDC00-001/shard-1-001
   [junit4]   2> 2070548 INFO  (TEST-CollectionsAPIDistributedZkTest.test-seed#[EA00A48BF6BCDC00]) [    ] o.e.j.s.Server jetty-9.2.13.v20150730
   [junit4]   2> 2070588 INFO  (TEST-CollectionsAPIDistributedZkTest.test-seed#[EA00A48BF6BCDC00]) [    ] o.e.j.s.h.ContextHandler Started o.e.j.s.ServletContextHandler@764c07d0{/,null,AVAILABLE}
   [junit4]   2> 2070598 INFO  (TEST-CollectionsAPIDistributedZkTest.test-seed#[EA00A48BF6BCDC00]) [    ] o.e.j.s.ServerConnector Started ServerConnector@2ec7f960{SSL-http/1.1}{127.0.0.1:36896}
   [junit4]   2> 2070598 INFO  (TEST-CollectionsAPIDistributedZkTest.test-seed#[EA00A48BF6BCDC00]) [    ] o.e.j.s.Server Started @2073443ms
   [junit4]   2> 2070598 INFO  (TEST-CollectionsAPIDistributedZkTest.test-seed#[EA00A48BF6BCDC00]) [    ] o.a.s.c.s.e.JettySolrRunner Jetty properties: {solrconfig=solrconfig.xml, hostPort=36896, coreRootDirectory=/x1/jenkins/jenkins-slave/workspace/Lucene-Solr-NightlyTests-5.x/solr/build/solr-core/test/J1/temp/solr.cloud.CollectionsAPIDistributedZkTest_EA00A48BF6BCDC00-001/shard-1-001/cores, hostContext=/, solr.data.dir=/x1/jenkins/jenkins-slave/workspace/Lucene-Solr-NightlyTests-5.x/solr/build/solr-core/test/J1/temp/solr.cloud.CollectionsAPIDistributedZkTest_EA00A48BF6BCDC00-001/tempDir-001/jetty1}
   [junit4]   2> 2070598 INFO  (TEST-CollectionsAPIDistributedZkTest.test-seed#[EA00A48BF6BCDC00]) [    ] o.a.s.s.SolrDispatchFilter SolrDispatchFilter.init(): sun.misc.Launcher$AppClassLoader@3827de24
   [junit4]   2> 2070598 INFO  (TEST-CollectionsAPIDistributedZkTest.test-seed#[EA00A48BF6BCDC00]) [    ] o.a.s.c.SolrResourceLoader new SolrResourceLoader for directory: '/x1/jenkins/jenkins-slave/workspace/Lucene-Solr-NightlyTests-5.x/solr/build/solr-core/test/J1/temp/solr.cloud.CollectionsAPIDistributedZkTest_EA00A48BF6BCDC00-001/shard-1-001'
   [junit4]   2> 2070599 INFO  (TEST-CollectionsAPIDistributedZkTest.test-seed#[EA00A48BF6BCDC00]) [    ] o.a.s.c.SolrResourceLoader JNDI not configured for solr (NoInitialContextEx)
   [junit4]   2> 2070599 INFO  (TEST-CollectionsAPIDistributedZkTest.test-seed#[EA00A48BF6BCDC00]) [    ] o.a.s.c.SolrResourceLoader solr home defaulted to 'solr/' (could not find system property or JNDI)
   [junit4]   2> 2070599 INFO  (TEST-CollectionsAPIDistributedZkTest.test-seed#[EA00A48BF6BCDC00]) [    ] o.a.s.c.c.SolrZkClient Using default ZkCredentialsProvider
   [junit4]   2> 2070600 INFO  (TEST-CollectionsAPIDistributedZkTest.test-seed#[EA00A48BF6BCDC00]) [    ] o.a.s.c.c.ConnectionManager Waiting for client to connect to ZooKeeper
   [junit4]   2> 2070601 INFO  (zkCallback-1848-thread-1) [    ] o.a.s.c.c.ConnectionManager Watcher org.apache.solr.common.cloud.ConnectionManager@14fd4fa2 name:ZooKeeperConnection Watcher:127.0.0.1:42201/solr got event WatchedEvent state:SyncConnected type:None path:null path:null type:None
   [junit4]   2> 2070601 INFO  (TEST-CollectionsAPIDistributedZkTest.test-seed#[EA00A48BF6BCDC00]) [    ] o.a.s.c.c.ConnectionManager Client is connected to ZooKeeper
   [junit4]   2> 2070601 INFO  (TEST-CollectionsAPIDistributedZkTest.test-seed#[EA00A48BF6BCDC00]) [    ] o.a.s.c.c.SolrZkClient Using default ZkACLProvider
   [junit4]   2> 2070602 INFO  (TEST-CollectionsAPIDistributedZkTest.test-seed#[EA00A48BF6BCDC00]) [    ] o.a.s.s.SolrDispatchFilter Loading solr.xml from SolrHome (not found in ZooKeeper)
   [junit4]   2> 2070602 INFO  (TEST-CollectionsAPIDistributedZkTest.test-seed#[EA00A48BF6BCDC00]) [    ] o.a.s.c.SolrXmlConfig Loading container configuration from /x1/jenkins/jenkins-slave/workspace/Lucene-Solr-NightlyTests-5.x/solr/build/solr-core/test/J1/temp/solr.cloud.CollectionsAPIDistributedZkTest_EA00A48BF6BCDC00-001/shard-1-001/solr.xml
   [junit4]   2> 2070621 INFO  (TEST-CollectionsAPIDistributedZkTest.test-seed#[EA00A48BF6BCDC00]) [    ] o.a.s.c.CoresLocator Config-defined core root directory: /x1/jenkins/jenkins-slave/workspace/Lucene-Solr-NightlyTests-5.x/solr/build/solr-core/test/J1/temp/solr.cloud.CollectionsAPIDistributedZkTest_EA00A48BF6BCDC00-001/shard-1-001/cores
   [junit4]   2> 2070621 INFO  (TEST-CollectionsAPIDistributedZkTest.test-seed#[EA00A48BF6BCDC00]) [    ] o.a.s.c.CoreContainer New CoreContainer 941909283
   [junit4]   2> 2070621 INFO  (TEST-CollectionsAPIDistributedZkTest.test-seed#[EA00A48BF6BCDC00]) [    ] o.a.s.c.CoreContainer Loading cores into CoreContainer [instanceDir=/x1/jenkins/jenkins-slave/workspace/Lucene-Solr-NightlyTests-5.x/solr/build/solr-core/test/J1/temp/solr.cloud.CollectionsAPIDistributedZkTest_EA00A48BF6BCDC00-001/shard-1-001]
   [junit4]   2> 2070621 WARN  (TEST-CollectionsAPIDistributedZkTest.test-seed#[EA00A48BF6BCDC00]) [    ] o.a.s.c.CoreContainer Couldn't add files from /x1/jenkins/jenkins-slave/workspace/Lucene-Solr-NightlyTests-5.x/solr/build/solr-core/test/J1/temp/solr.cloud.CollectionsAPIDistributedZkTest_EA00A48BF6BCDC00-001/shard-1-001/lib to classpath: /x1/jenkins/jenkins-slave/workspace/Lucene-Solr-NightlyTests-5.x/solr/build/solr-core/test/J1/temp/solr.cloud.CollectionsAPIDistributedZkTest_EA00A48BF6BCDC00-001/shard-1-001/lib
   [junit4]   2> 2070621 INFO  (TEST-CollectionsAPIDistributedZkTest.test-seed#[EA00A48BF6BCDC00]) [    ] o.a.s.h.c.HttpShardHandlerFactory created with socketTimeout : 90000,urlScheme : ,connTimeout : 15000,maxConnectionsPerHost : 20,maxConnections : 10000,corePoolSize : 0,maximumPoolSize : 2147483647,maxThreadIdleTime : 5,sizeOfQueue : -1,fairnessPolicy : false,useRetries : false,
   [junit4]   2> 2070634 INFO  (TEST-CollectionsAPIDistributedZkTest.test-seed#[EA00A48BF6BCDC00]) [    ] o.a.s.u.UpdateShardHandler Creating UpdateShardHandler HTTP client with params: socketTimeout=340000&connTimeout=45000&retry=true
   [junit4]   2> 2070636 INFO  (TEST-CollectionsAPIDistributedZkTest.test-seed#[EA00A48BF6BCDC00]) [    ] o.a.s.l.LogWatcher SLF4J impl is org.slf4j.impl.Log4jLoggerFactory
   [junit4]   2> 2070637 INFO  (TEST-CollectionsAPIDistributedZkTest.test-seed#[EA00A48BF6BCDC00]) [    ] o.a.s.l.LogWatcher Registering Log Listener [Log4j (org.slf4j.impl.Log4jLoggerFactory)]
   [junit4]   2> 2070637 INFO  (TEST-CollectionsAPIDistributedZkTest.test-seed#[EA00A48BF6BCDC00]) [    ] o.a.s.c.ZkContainer Zookeeper client=127.0.0.1:42201/solr
   [junit4]   2> 2070637 INFO  (TEST-CollectionsAPIDistributedZkTest.test-seed#[EA00A48BF6BCDC00]) [    ] o.a.s.c.ZkController zkHost includes chroot
   [junit4]   2> 2070637 INFO  (TEST-CollectionsAPIDistributedZkTest.test-seed#[EA00A48BF6BCDC00]) [    ] o.a.s.c.c.SolrZkClient Using default ZkCredentialsProvider
   [junit4]   2> 2070645 INFO  (TEST-CollectionsAPIDistributedZkTest.test-seed#[EA00A48BF6BCDC00]) [    ] o.a.s.c.c.ConnectionManager Waiting for client to connect to ZooKeeper
   [junit4]   2> 2070645 INFO  (zkCallback-1850-thread-1) [    ] o.a.s.c.c.ConnectionManager Watcher org.apache.solr.common.cloud.ConnectionManager@1f2d958 name:ZooKeeperConnection Watcher:127.0.0.1:42201 got event WatchedEvent state:SyncConnected type:None path:null path:null type:None
   [junit4]   2> 2070645 INFO  (TEST-CollectionsAPIDistributedZkTest.test-seed#[EA00A48BF6BCDC00]) [    ] o.a.s.c.c.ConnectionManager Client is connected to ZooKeeper
   [junit4]   2> 2070646 INFO  (TEST-CollectionsAPIDistributedZkTest.test-seed#[EA00A48BF6BCDC00]) [    ] o.a.s.c.c.SolrZkClient Using default ZkACLProvider
   [junit4]   2> 2070653 INFO  (TEST-CollectionsAPIDistributedZkTest.test-seed#[EA00A48BF6BCDC00]) [n:127.0.0.1:36896_    ] o.a.s.c.c.ConnectionManager Waiting for client to connect to ZooKeeper
   [junit4]   2> 2070654 INFO  (zkCallback-1851-thread-1-processing-n:127.0.0.1:36896_) [n:127.0.0.1:36896_    ] o.a.s.c.c.ConnectionManager Watcher org.apache.solr.common.cloud.ConnectionManager@aad92d7 name:ZooKeeperConnection Watcher:127.0.0.1:42201/solr got event WatchedEvent state:SyncConnected type:None path:null path:null type:None
   [junit4]   2> 2070654 INFO  (TEST-CollectionsAPIDistributedZkTest.test-seed#[EA00A48BF6BCDC00]) [n:127.0.0.1:36896_    ] o.a.s.c.c.ConnectionManager Client is connected to ZooKeeper
   [junit4]   2> 2070669 INFO  (TEST-CollectionsAPIDistributedZkTest.test-seed#[EA00A48BF6BCDC00]) [n:127.0.0.1:36896_    ] o.a.s.c.c.ZkStateReader Updating cluster state from ZooKeeper... 
   [junit4]   2> 2071675 INFO  (TEST-CollectionsAPIDistributedZkTest.test-seed#[EA00A48BF6BCDC00]) [n:127.0.0.1:36896_    ] o.a.s.c.ZkController Register node as live in ZooKeeper:/live_nodes/127.0.0.1:36896_
   [junit4]   2> 2071675 INFO  (TEST-CollectionsAPIDistributedZkTest.test-seed#[EA00A48BF6BCDC00]) [n:127.0.0.1:36896_    ] o.a.s.c.c.SolrZkClient makePath: /live_nodes/127.0.0.1:36896_
   [junit4]   2> 2071676 INFO  (zkCallback-1847-thread-1) [    ] o.a.s.c.c.ZkStateReader A live node change: WatchedEvent state:SyncConnected type:NodeChildrenChanged path:/live_nodes, has occurred - updating... (live nodes size: 1)
   [junit4]   2> 2071676 INFO  (zkCallback-1845-thread-3-processing-n:127.0.0.1:53156_) [n:127.0.0.1:53156_    ] o.a.s.c.c.ZkStateReader A live node change: WatchedEvent state:SyncConnected type:NodeChildrenChanged path:/live_nodes, has occurred - updating... (live nodes size: 1)
   [junit4]   2> 2071676 INFO  (zkCallback-1845-thread-2-processing-n:127.0.0.1:53156_) [n:127.0.0.1:53156_    ] o.a.s.c.c.ZkStateReader A live node change: WatchedEvent state:SyncConnected type:NodeChildrenChanged path:/live_nodes, has occurred - updating... (live nodes size: 1)
   [junit4]   2> 2071676 INFO  (zkCallback-1851-thread-1-processing-n:127.0.0.1:36896_) [n:127.0.0.1:36896_    ] o.a.s.c.c.ZkStateReader A live node change: WatchedEvent state:SyncConnected type:NodeChildrenChanged path:/live_nodes, has occurred - updating... (live nodes size: 1)
   [junit4]   2> 2071679 INFO  (TEST-CollectionsAPIDistributedZkTest.test-seed#[EA00A48BF6BCDC00]) [n:127.0.0.1:36896_    ] o.a.s.c.Overseer Overseer (id=null) closing
   [junit4]   2> 2071680 INFO  (TEST-CollectionsAPIDistributedZkTest.test-seed#[EA00A48BF6BCDC00]) [n:127.0.0.1:36896_    ] o.a.s.c.LeaderElector Joined leadership election with path: /overseer_elect/election/94947864418254857-127.0.0.1:36896_-n_0000000001
   [junit4]   2> 2071680 INFO  (TEST-CollectionsAPIDistributedZkTest.test-seed#[EA00A48BF6BCDC00]) [n:127.0.0.1:36896_    ] o.a.s.c.LeaderElector Watching path /overseer_elect/election/94947864418254853-127.0.0.1:53156_-n_0000000000 to know if I could be the leader
   [junit4]   2> 2071835 INFO  (TEST-CollectionsAPIDistributedZkTest.test-seed#[EA00A48BF6BCDC00]) [n:127.0.0.1:36896_    ] o.a.s.c.CoreContainer Security conf doesn't exist. Skipping setup for authorization module.
   [junit4]   2> 2071835 INFO  (TEST-CollectionsAPIDistributedZkTest.test-seed#[EA00A48BF6BCDC00]) [n:127.0.0.1:36896_    ] o.a.s.c.CoreContainer No authentication plugin used.
   [junit4]   2> 2071836 INFO  (TEST-CollectionsAPIDistributedZkTest.test-seed#[EA00A48BF6BCDC00]) [n:127.0.0.1:36896_    ] o.a.s.c.CoresLocator Looking for core definitions underneath /x1/jenkins/jenkins-slave/workspace/Lucene-Solr-NightlyTests-5.x/solr/build/solr-core/test/J1/temp/solr.cloud.CollectionsAPIDistributedZkTest_EA00A48BF6BCDC00-001/shard-1-001/cores
   [junit4]   2> 2071837 INFO  (TEST-CollectionsAPIDistributedZkTest.test-seed#[EA00A48BF6BCDC00]) [n:127.0.0.1:36896_    ] o.a.s.c.SolrCore Created CoreDescriptor: {collection=collection1, coreNodeName=, name=collection1, dataDir=data/, shard=, loadOnStartup=true, config=solrconfig.xml, instanceDir=/x1/jenkins/jenkins-slave/workspace/Lucene-Solr-NightlyTests-5.x/solr/build/solr-core/test/J1/temp/solr.cloud.CollectionsAPIDistributedZkTest_EA00A48BF6BCDC00-001/shard-1-001/cores/collection1, transient=false, configSetProperties=configsetprops.json, schema=schema.xml, absoluteInstDir=/x1/jenkins/jenkins-slave/workspace/Lucene-Solr-NightlyTests-5.x/solr/build/solr-core/test/J1/temp/solr.cloud.CollectionsAPIDistributedZkTest_EA00A48BF6BCDC00-001/shard-1-001/cores/collection1/}
   [junit4]   2> 2071837 INFO  (TEST-CollectionsAPIDistributedZkTest.test-seed#[EA00A48BF6BCDC00]) [n:127.0.0.1:36896_    ] o.a.s.c.CoresLocator Found core collection1 in /x1/jenkins/jenkins-slave/workspace/Lucene-Solr-NightlyTests-5.x/solr/build/solr-core/test/J1/temp/solr.cloud.CollectionsAPIDistributedZkTest_EA00A48BF6BCDC00-001/shard-1-001/cores/collection1/
   [junit4]   2> 2071838 INFO  (TEST-CollectionsAPIDistributedZkTest.test-seed#[EA00A48BF6BCDC00]) [n:127.0.0.1:36896_    ] o.a.s.c.CoresLocator Found 1 core definitions
   [junit4]   2> 2071839 INFO  (TEST-CollectionsAPIDistributedZkTest.test-seed#[EA00A48BF6BCDC00]) [n:127.0.0.1:36896_    ] o.a.s.s.SolrDispatchFilter user.dir=/x1/jenkins/jenkins-slave/workspace/Lucene-Solr-NightlyTests-5.x/solr/build/solr-core/test/J1
   [junit4]   2> 2071839 INFO  (TEST-CollectionsAPIDistributedZkTest.test-seed#[EA00A48BF6BCDC00]) [n:127.0.0.1:36896_    ] o.a.s.s.SolrDispatchFilter SolrDispatchFilter.init() done
   [junit4]   2> 2071839 INFO  (coreLoadExecutor-3808-thread-1-processing-n:127.0.0.1:36896_) [n:127.0.0.1:36896_ c:collection1   x:collection1] o.a.s.c.ZkController publishing state=down
   [junit4]   2> 2071839 INFO  (coreLoadExecutor-3808-thread-1-processing-n:127.0.0.1:36896_) [n:127.0.0.1:36896_ c:collection1   x:collection1] o.a.s.c.ZkController numShards not found on descriptor - reading it from system property
   [junit4]   2> 2071841 INFO  (OverseerStateUpdate-94947864418254853-127.0.0.1:53156_-n_0000000000) [n:127.0.0.1:53156_    ] o.a.s.c.Overseer processMessage: queueSize: 1, message = {
   [junit4]   2>   "node_name":"127.0.0.1:36896_",
   [junit4]   2>   "base_url":"https://127.0.0.1:36896",
   [junit4]   2>   "numShards":"2",
   [junit4]   2>   "core":"collection1",
   [junit4]   2>   "collection":"collection1",
   [junit4]   2>   "roles":null,
   [junit4]   2>   "shard":null,
   [junit4]   2>   "state":"down",
   [junit4]   2>   "operation":"state"} current state version: 4
   [junit4]   2> 2071841 INFO  (OverseerStateUpdate-94947864418254853-127.0.0.1:53156_-n_0000000000) [n:127.0.0.1:53156_    ] o.a.s.c.o.ReplicaMutator Update state numShards=2 message={
   [junit4]   2>   "node_name":"127.0.0.1:36896_",
   [junit4]   2>   "base_url":"https://127.0.0.1:36896",
   [junit4]   2>   "numShards":"2",
   [junit4]   2>   "core":"collection1",
   [junit4]   2>   "collection":"collection1",
   [junit4]   2>   "roles":null,
   [junit4]   2>   "shard":null,
   [junit4]   2>   "state":"down",
   [junit4]   2>   "operation":"state"}
   [junit4]   2> 2071841 INFO  (coreLoadExecutor-3808-thread-1-processing-n:127.0.0.1:36896_) [n:127.0.0.1:36896_ c:collection1   x:collection1] o.a.s.c.ZkController look for our core node name
   [junit4]   2> 2071841 INFO  (OverseerStateUpdate-94947864418254853-127.0.0.1:53156_-n_0000000000) [n:127.0.0.1:53156_    ] o.a.s.c.o.ClusterStateMutator building a new cName: collection1
   [junit4]   2> 2071842 INFO  (OverseerStateUpdate-94947864418254853-127.0.0.1:53156_-n_0000000000) [n:127.0.0.1:53156_    ] o.a.s.c.o.ReplicaMutator Assigning new node to shard shard=shard1
   [junit4]   2> 2071844 INFO  (zkCallback-1847-thread-1) [    ] o.a.s.c.c.ZkStateReader A cluster state change: WatchedEvent state:SyncConnected type:NodeDataChanged path:/clusterstate.json, has occurred - updating... (live nodes size: 2)
   [junit4]   2> 2071844 INFO  (zkCallback-1851-thread-1-processing-n:127.0.0.1:36896_) [n:127.0.0.1:36896_    ] o.a.s.c.c.ZkStateReader A cluster state change: WatchedEvent state:SyncConnected type:NodeDataChanged path:/clusterstate.json, has occurred - updating... (live nodes size: 2)
   [junit4]   2> 2071844 INFO  (zkCallback-1845-thread-2-processing-n:127.0.0.1:53156_) [n:127.0.0.1:53156_    ] o.a.s.c.c.ZkStateReader A cluster state change: WatchedEvent state:SyncConnected type:NodeDataChanged path:/clusterstate.json, has occurred - updating... (live nodes size: 2)
   [junit4]   2> 2071844 INFO  (zkCallback-1845-thread-3-processing-n:127.0.0.1:53156_) [n:127.0.0.1:53156_    ] o.a.s.c.c.ZkStateReader A cluster state change: WatchedEvent state:SyncConnected type:NodeDataChanged path:/clusterstate.json, has occurred - updating... (live nodes size: 2)
   [junit4]   2> 2072843 INFO  (coreLoadExecutor-3808-thread-1-processing-n:127.0.0.1:36896_) [n:127.0.0.1:36896_ c:collection1   x:collection1] o.a.s.c.ZkController waiting to find shard id in clusterstate for collection1
   [junit4]   2> 2072843 INFO  (coreLoadExecutor-3808-thread-1-processing-n:127.0.0.1:36896_) [n:127.0.0.1:36896_ c:collection1   x:collection1] o.a.s.c.ZkController Check for collection zkNode:collection1
   [junit4]   2> 2072843 INFO  (coreLoadExecutor-3808-thread-1-processing-n:127.0.0.1:36896_) [n:127.0.0.1:36896_ c:collection1   x:collection1] o.a.s.c.ZkController Collection zkNode exists
   [junit4]   2> 2072843 INFO  (coreLoadExecutor-3808-thread-1-processing-n:127.0.0.1:36896_) [n:127.0.0.1:36896_ c:collection1   x:collection1] o.a.s.c.c.ZkStateReader Load collection config from:/collections/collection1
   [junit4]   2> 2072844 INFO  (coreLoadExecutor-3808-thread-1-processing-n:127.0.0.1:36896_) [n:127.0.0.1:36896_ c:collection1   x:collection1] o.a.s.c.c.ZkStateReader path=/collections/collection1 configName=conf1 specified config exists in ZooKeeper
   [junit4]   2> 2072844 INFO  (coreLoadExecutor-3808-thread-1-processing-n:127.0.0.1:36896_) [n:127.0.0.1:36896_ c:collection1   x:collection1] o.a.s.c.SolrResourceLoader new SolrResourceLoader for directory: '/x1/jenkins/jenkins-slave/workspace/Lucene-Solr-NightlyTests-5.x/solr/build/solr-core/test/J1/temp/solr.cloud.CollectionsAPIDistributedZkTest_EA00A48BF6BCDC00-001/shard-1-001/cores/collection1'
   [junit4]   2> 2072844 INFO  (coreLoadExecutor-3808-thread-1-processing-n:127.0.0.1:36896_) [n:127.0.0.1:36896_ c:collection1   x:collection1] o.a.s.c.SolrResourceLoader JNDI not configured for solr (NoInitialContextEx)
   [junit4]   2> 2072844 INFO  (coreLoadExecutor-3808-thread-1-processing-n:127.0.0.1:36896_) [n:127.0.0.1:36896_ c:collection1   x:collection1] o.a.s.c.SolrResourceLoader solr home defaulted to 'solr/' (could not find system property or JNDI)
   [junit4]   2> 2072846 INFO  (coreLoadExecutor-3808-thread-1-processing-n:127.0.0.1:36896_) [n:127.0.0.1:36896_ c:collection1   x:collection1] o.a.s.c.Config loaded config solrconfig.xml with version 0 
   [junit4]   2> 2072852 INFO  (coreLoadExecutor-3808-thread-1-processing-n:127.0.0.1:36896_) [n:127.0.0.1:36896_ c:collection1   x:collection1] o.a.s.c.SolrConfig current version of requestparams : -1
   [junit4]   2> 2072866 INFO  (coreLoadExecutor-3808-thread-1-processing-n:127.0.0.1:36896_) [n:127.0.0.1:36896_ c:collection1   x:collection1] o.a.s.c.SolrConfig Using Lucene MatchVersion: 5.5.0
   [junit4]   2> 2072945 INFO  (coreLoadExecutor-3808-thread-1-processing-n:127.0.0.1:36896_) [n:127.0.0.1:36896_ c:collection1   x:collection1] o.a.s.c.Config Loaded SolrConfig: solrconfig.xml
   [junit4]   2> 2072957 INFO  (coreLoadExecutor-3808-thread-1-processing-n:127.0.0.1:36896_) [n:127.0.0.1:36896_ c:collection1   x:collection1] o.a.s.s.IndexSchema [collection1] Schema name=test
   [junit4]   2> 2073423 INFO  (coreLoadExecutor-3808-thread-1-processing-n:127.0.0.1:36896_) [n:127.0.0.1:36896_ c:collection1   x:collection1] o.a.s.s.OpenExchangeRatesOrgProvider Initialized with rates=open-exchange-rates.json, refreshInterval=1440.
   [junit4]   2> 2073437 INFO  (coreLoadExecutor-3808-thread-1-processing-n:127.0.0.1:36896_) [n:127.0.0.1:36896_ c:collection1   x:collection1] o.a.s.s.IndexSchema default search field in schema is text
   [junit4]   2> 2073439 INFO  (coreLoadExecutor-3808-thread-1-processing-n:127.0.0.1:36896_) [n:127.0.0.1:36896_ c:collection1   x:collection1] o.a.s.s.IndexSchema unique key field: id
   [junit4]   2> 2073461 INFO  (coreLoadExecutor-3808-thread-1-processing-n:127.0.0.1:36896_) [n:127.0.0.1:36896_ c:collection1   x:collection1] o.a.s.s.FileExchangeRateProvider Reloading exchange rates from file currency.xml
   [junit4]   2> 2073467 INFO  (coreLoadExecutor-3808-thread-1-processing-n:127.0.0.1:36896_) [n:127.0.0.1:36896_ c:collection1   x:collection1] o.a.s.s.FileExchangeRateProvider Reloading exchange rates from file currency.xml
   [junit4]   2> 2073471 INFO  (coreLoadExecutor-3808-thread-1-processing-n:127.0.0.1:36896_) [n:127.0.0.1:36896_ c:collection1   x:collection1] o.a.s.s.OpenExchangeRatesOrgProvider Reloading exchange rates from open-exchange-rates.json
   [junit4]   2> 2073473 WARN  (coreLoadExecutor-3808-thread-1-processing-n:127.0.0.1:36896_) [n:127.0.0.1:36896_ c:collection1   x:collection1] o.a.s.s.OpenExchangeRatesOrgProvider Unknown key IMPORTANT NOTE
   [junit4]   2> 2073474 WARN  (coreLoadExecutor-3808-thread-1-processing-n:127.0.0.1:36896_) [n:127.0.0.1:36896_ c:collection1   x:collection1] o.a.s.s.OpenExchangeRatesOrgProvider Expected key, got STRING
   [junit4]   2> 2073474 INFO  (coreLoadExecutor-3808-thread-1-processing-n:127.0.0.1:36896_) [n:127.0.0.1:36896_ c:collection1   x:collection1] o.a.s.s.OpenExchangeRatesOrgProvider Reloading exchange rates from open-exchange-rates.json
   [junit4]   2> 2073476 WARN  (coreLoadExecutor-3808-thread-1-processing-n:127.0.0.1:36896_) [n:127.0.0.1:36896_ c:collection1   x:collection1] o.a.s.s.OpenExchangeRatesOrgProvider Unknown key IMPORTANT NOTE
   [junit4]   2> 2073476 WARN  (coreLoadExecutor-3808-thread-1-processing-n:127.0.0.1:36896_) [n:127.0.0.1:36896_ c:collection1   x:collection1] o.a.s.s.OpenExchangeRatesOrgProvider Expected key, got STRING
   [junit4]   2> 2073477 INFO  (coreLoadExecutor-3808-thread-1-processing-n:127.0.0.1:36896_) [n:127.0.0.1:36896_ c:collection1   x:collection1] o.a.s.c.ConfigSetProperties Did not find ConfigSet properties, assuming default properties: Can't find resource 'configsetprops.json' in classpath or '/configs/conf1', cwd=/x1/jenkins/jenkins-slave/workspace/Lucene-Solr-NightlyTests-5.x/solr/build/solr-core/test/J1
   [junit4]   2> 2073477 INFO  (coreLoadExecutor-3808-thread-1-processing-n:127.0.0.1:36896_) [n:127.0.0.1:36896_ c:collection1   x:collection1] o.a.s.c.CoreContainer Creating SolrCore 'collection1' using configuration from collection collection1
   [junit4]   2> 2073477 INFO  (coreLoadExecutor-3808-thread-1-processing-n:127.0.0.1:36896_) [n:127.0.0.1:36896_ c:collection1 s:shard1 r:core_node1 x:collection1] o.a.s.c.SolrCore org.apache.solr.core.MockDirectoryFactory
   [junit4]   2> 2073477 INFO  (coreLoadExecutor-3808-thread-1-processing-n:127.0.0.1:36896_) [n:127.0.0.1:36896_ c:collection1 s:shard1 r:core_node1 x:collection1] o.a.s.c.SolrCore [[collection1] ] Opening new SolrCore at [/x1/jenkins/jenkins-slave/workspace/Lucene-Solr-NightlyTests-5.x/solr/build/solr-core/test/J1/temp/solr.cloud.CollectionsAPIDistributedZkTest_EA00A48BF6BCDC00-001/shard-1-001/cores/collection1], dataDir=[null]
   [junit4]   2> 2073477 INFO  (coreLoadExecutor-3808-thread-1-processing-n:127.0.0.1:36896_) [n:127.0.0.1:36896_ c:collection1 s:shard1 r:core_node1 x:collection1] o.a.s.c.JmxMonitoredMap JMX monitoring is enabled. Adding Solr mbeans to JMX Server: com.sun.jmx.mbeanserver.JmxMBeanServer@783de479
   [junit4]   2> 2073478 INFO  (coreLoadExecutor-3808-thread-1-processing-n:127.0.0.1:36896_) [n:127.0.0.1:36896_ c:collection1 s:shard1 r:core_node1 x:collection1] o.a.s.c.CachingDirectoryFactory return new directory for /x1/jenkins/jenkins-slave/workspace/Lucene-Solr-NightlyTests-5.x/solr/build/solr-core/test/J1/temp/solr.cloud.CollectionsAPIDistributedZkTest_EA00A48BF6BCDC00-001/shard-1-001/cores/collection1/data
   [junit4]   2> 2073478 INFO  (coreLoadExecutor-3808-thread-1-processing-n:127.0.0.1:36896_) [n:127.0.0.1:36896_ c:collection1 s:shard1 r:core_node1 x:collection1] o.a.s.c.SolrCore New index directory detected: old=null new=/x1/jenkins/jenkins-slave/workspace/Lucene-Solr-NightlyTests-5.x/solr/build/solr-core/test/J1/temp/solr.cloud.CollectionsAPIDistributedZkTest_EA00A48BF6BCDC00-001/shard-1-001/cores/collection1/data/index/
   [junit4]   2> 2073478 WARN  (coreLoadExecutor-3808-thread-1-processing-n:127.0.0.1:36896_) [n:127.0.0.1:36896_ c:collection1 s:shard1 r:core_node1 x:collection1] o.a.s.c.SolrCore [collection1] Solr index directory '/x1/jenkins/jenkins-slave/workspace/Lucene-Solr-NightlyTests-5.x/solr/build/solr-core/test/J1/temp/solr.cloud.CollectionsAPIDistributedZkTest_EA00A48BF6BCDC00-001/shard-1-001/cores/collection1/d

[...truncated too long message...]

lrj.SolrClient.request(SolrClient.java:1220)
   [junit4]    > 	at org.apache.solr.cloud.AbstractFullDistribZkTestBase.createCollection(AbstractFullDistribZkTestBase.java:1573)
   [junit4]    > 	at org.apache.solr.cloud.AbstractFullDistribZkTestBase.createCollection(AbstractFullDistribZkTestBase.java:1594)
   [junit4]    > 	at org.apache.solr.cloud.CollectionsAPIDistributedZkTest$1CollectionThread.run(CollectionsAPIDistributedZkTest.java:876)Throwable #5: com.carrotsearch.randomizedtesting.UncaughtExceptionError: Captured an uncaught exception in thread: Thread[id=177360, name=collection4, state=RUNNABLE, group=TGRP-CollectionsAPIDistributedZkTest]
   [junit4]    > Caused by: org.apache.solr.client.solrj.impl.HttpSolrClient$RemoteSolrException: Error from server at https://127.0.0.1:37905: collection already exists: awholynewstresscollection_collection4_0
   [junit4]    > 	at __randomizedtesting.SeedInfo.seed([EA00A48BF6BCDC00]:0)
   [junit4]    > 	at org.apache.solr.client.solrj.impl.HttpSolrClient.executeMethod(HttpSolrClient.java:574)
   [junit4]    > 	at org.apache.solr.client.solrj.impl.HttpSolrClient.request(HttpSolrClient.java:240)
   [junit4]    > 	at org.apache.solr.client.solrj.impl.HttpSolrClient.request(HttpSolrClient.java:229)
   [junit4]    > 	at org.apache.solr.client.solrj.impl.LBHttpSolrClient.doRequest(LBHttpSolrClient.java:372)
   [junit4]    > 	at org.apache.solr.client.solrj.impl.LBHttpSolrClient.request(LBHttpSolrClient.java:325)
   [junit4]    > 	at org.apache.solr.client.solrj.impl.CloudSolrClient.sendRequest(CloudSolrClient.java:1099)
   [junit4]    > 	at org.apache.solr.client.solrj.impl.CloudSolrClient.requestWithRetryOnStaleState(CloudSolrClient.java:870)
   [junit4]    > 	at org.apache.solr.client.solrj.impl.CloudSolrClient.request(CloudSolrClient.java:806)
   [junit4]    > 	at org.apache.solr.client.solrj.SolrClient.request(SolrClient.java:1220)
   [junit4]    > 	at org.apache.solr.cloud.AbstractFullDistribZkTestBase.createCollection(AbstractFullDistribZkTestBase.java:1573)
   [junit4]    > 	at org.apache.solr.cloud.AbstractFullDistribZkTestBase.createCollection(AbstractFullDistribZkTestBase.java:1594)
   [junit4]    > 	at org.apache.solr.cloud.CollectionsAPIDistributedZkTest$1CollectionThread.run(CollectionsAPIDistributedZkTest.java:876)Throwable #6: com.carrotsearch.randomizedtesting.UncaughtExceptionError: Captured an uncaught exception in thread: Thread[id=177359, name=collection3, state=RUNNABLE, group=TGRP-CollectionsAPIDistributedZkTest]
   [junit4]    > Caused by: org.apache.solr.client.solrj.impl.HttpSolrClient$RemoteSolrException: Error from server at https://127.0.0.1:36361: collection already exists: awholynewstresscollection_collection3_0
   [junit4]    > 	at __randomizedtesting.SeedInfo.seed([EA00A48BF6BCDC00]:0)
   [junit4]    > 	at org.apache.solr.client.solrj.impl.HttpSolrClient.executeMethod(HttpSolrClient.java:574)
   [junit4]    > 	at org.apache.solr.client.solrj.impl.HttpSolrClient.request(HttpSolrClient.java:240)
   [junit4]    > 	at org.apache.solr.client.solrj.impl.HttpSolrClient.request(HttpSolrClient.java:229)
   [junit4]    > 	at org.apache.solr.client.solrj.impl.LBHttpSolrClient.doRequest(LBHttpSolrClient.java:372)
   [junit4]    > 	at org.apache.solr.client.solrj.impl.LBHttpSolrClient.request(LBHttpSolrClient.java:325)
   [junit4]    > 	at org.apache.solr.client.solrj.impl.CloudSolrClient.sendRequest(CloudSolrClient.java:1099)
   [junit4]    > 	at org.apache.solr.client.solrj.impl.CloudSolrClient.requestWithRetryOnStaleState(CloudSolrClient.java:870)
   [junit4]    > 	at org.apache.solr.client.solrj.impl.CloudSolrClient.request(CloudSolrClient.java:806)
   [junit4]    > 	at org.apache.solr.client.solrj.SolrClient.request(SolrClient.java:1220)
   [junit4]    > 	at org.apache.solr.cloud.AbstractFullDistribZkTestBase.createCollection(AbstractFullDistribZkTestBase.java:1573)
   [junit4]    > 	at org.apache.solr.cloud.AbstractFullDistribZkTestBase.createCollection(AbstractFullDistribZkTestBase.java:1594)
   [junit4]    > 	at org.apache.solr.cloud.CollectionsAPIDistributedZkTest$1CollectionThread.run(CollectionsAPIDistributedZkTest.java:876)Throwable #7: com.carrotsearch.randomizedtesting.UncaughtExceptionError: Captured an uncaught exception in thread: Thread[id=177358, name=collection2, state=RUNNABLE, group=TGRP-CollectionsAPIDistributedZkTest]
   [junit4]    > Caused by: org.apache.solr.client.solrj.impl.HttpSolrClient$RemoteSolrException: Error from server at https://127.0.0.1:36361: Could not find collection : awholynewstresscollection_collection2_0
   [junit4]    > 	at __randomizedtesting.SeedInfo.seed([EA00A48BF6BCDC00]:0)
   [junit4]    > 	at org.apache.solr.client.solrj.impl.HttpSolrClient.executeMethod(HttpSolrClient.java:574)
   [junit4]    > 	at org.apache.solr.client.solrj.impl.HttpSolrClient.request(HttpSolrClient.java:240)
   [junit4]    > 	at org.apache.solr.client.solrj.impl.HttpSolrClient.request(HttpSolrClient.java:229)
   [junit4]    > 	at org.apache.solr.client.solrj.impl.LBHttpSolrClient.doRequest(LBHttpSolrClient.java:372)
   [junit4]    > 	at org.apache.solr.client.solrj.impl.LBHttpSolrClient.request(LBHttpSolrClient.java:325)
   [junit4]    > 	at org.apache.solr.client.solrj.impl.CloudSolrClient.sendRequest(CloudSolrClient.java:1099)
   [junit4]    > 	at org.apache.solr.client.solrj.impl.CloudSolrClient.requestWithRetryOnStaleState(CloudSolrClient.java:870)
   [junit4]    > 	at org.apache.solr.client.solrj.impl.CloudSolrClient.request(CloudSolrClient.java:806)
   [junit4]    > 	at org.apache.solr.client.solrj.SolrClient.request(SolrClient.java:1220)
   [junit4]    > 	at org.apache.solr.cloud.CollectionsAPIDistributedZkTest$1CollectionThread.run(CollectionsAPIDistributedZkTest.java:883)
   [junit4]   2> 2854653 INFO  (SUITE-CollectionsAPIDistributedZkTest-seed#[EA00A48BF6BCDC00]-worker) [n:127.0.0.1:36361_ c:halfdeletedcollection2 s:shard2 r:core_node9 x:halfdeletedcollection2_shard2_replica2] o.a.s.SolrTestCaseJ4 ###deleteCore
   [junit4]   2> NOTE: leaving temporary files on disk at: /x1/jenkins/jenkins-slave/workspace/Lucene-Solr-NightlyTests-5.x/solr/build/solr-core/test/J1/temp/solr.cloud.CollectionsAPIDistributedZkTest_EA00A48BF6BCDC00-001
   [junit4]   2> Nov 29, 2015 9:43:42 AM com.carrotsearch.randomizedtesting.ThreadLeakControl checkThreadLeaks
   [junit4]   2> WARNING: Will linger awaiting termination of 1 leaked thread(s).
   [junit4]   2> NOTE: test params are: codec=CheapBastard, sim=RandomSimilarityProvider(queryNorm=false,coord=yes): {}, locale=ar_LY, timezone=Europe/Zurich
   [junit4]   2> NOTE: Linux 3.13.0-52-generic amd64/Oracle Corporation 1.7.0_80 (64-bit)/cpus=4,threads=1,free=53993784,total=429916160
   [junit4]   2> NOTE: All tests run in this JVM: [ClusterStateUpdateTest, TestManagedSchemaFieldTypeResource, TestLeaderInitiatedRecoveryThread, TestAddFieldRealTimeGet, TestSolrCoreProperties, RollingRestartTest, TestSolrConfigHandlerCloud, IndexBasedSpellCheckerTest, TestDocumentBuilder, TestQueryTypes, TestInitQParser, UUIDUpdateProcessorFallbackTest, TimeZoneUtilsTest, TestFreeTextSuggestions, ChaosMonkeyNothingIsSafeTest, DataDrivenBlockJoinTest, DistributedTermsComponentTest, ZkSolrClientTest, TestExpandComponent, TestRestManager, NumericFieldsTest, BigEndianAscendingWordDeserializerTest, TestClusterStateMutator, SpellPossibilityIteratorTest, SolrIndexSplitterTest, OpenExchangeRatesOrgProviderTest, TestSystemIdResolver, TestOverriddenPrefixQueryForCustomFieldType, TestClassNameShortening, SolrPluginUtilsTest, TestSerializedLuceneMatchVersion, ShardSplitTest, SuggestComponentTest, TestStandardQParsers, TestManagedSchemaFieldResource, TestSolrQueryParserDefaultOperatorResource, HdfsBasicDistributedZkTest, SpatialRPTFieldTypeTest, DocValuesTest, TestConfigSetsAPIZkFailure, TestRuleBasedAuthorizationPlugin, BitVectorTest, TestSchemaResource, HdfsRecoverLeaseTest, TestCopyFieldCollectionResource, WordBreakSolrSpellCheckerTest, TestFiltering, FullHLLTest, TestCodecSupport, TestRequestForwarding, BadCopyFieldTest, SpellCheckCollatorTest, MigrateRouteKeyTest, TestJettySolrRunner, TestBM25SimilarityFactory, FastVectorHighlighterTest, SecurityConfHandlerTest, SpellCheckComponentTest, SpellingQueryConverterTest, MultiTermTest, SpatialFilterTest, UpdateRequestProcessorFactoryTest, SimpleMLTQParserTest, SolrInfoMBeanTest, TestExactStatsCache, DistanceFunctionTest, SimplePostToolTest, DeleteReplicaTest, TestSortingResponseWriter, TestMiniSolrCloudClusterSSL, TestManagedStopFilterFactory, TestPartialUpdateDeduplication, CollectionsAPIDistributedZkTest]
   [junit4] Completed [406/551] on J1 in 788.27s, 1 test, 1 error <<< FAILURES!

[...truncated 474 lines...]
BUILD FAILED
/x1/jenkins/jenkins-slave/workspace/Lucene-Solr-NightlyTests-5.x/build.xml:792: The following error occurred while executing this line:
/x1/jenkins/jenkins-slave/workspace/Lucene-Solr-NightlyTests-5.x/build.xml:729: The following error occurred while executing this line:
/x1/jenkins/jenkins-slave/workspace/Lucene-Solr-NightlyTests-5.x/build.xml:59: The following error occurred while executing this line:
/x1/jenkins/jenkins-slave/workspace/Lucene-Solr-NightlyTests-5.x/solr/build.xml:233: The following error occurred while executing this line:
/x1/jenkins/jenkins-slave/workspace/Lucene-Solr-NightlyTests-5.x/solr/common-build.xml:526: The following error occurred while executing this line:
/x1/jenkins/jenkins-slave/workspace/Lucene-Solr-NightlyTests-5.x/lucene/common-build.xml:1452: The following error occurred while executing this line:
/x1/jenkins/jenkins-slave/workspace/Lucene-Solr-NightlyTests-5.x/lucene/common-build.xml:1006: There were test failures: 551 suites (7 ignored), 2177 tests, 1 error, 32 ignored (18 assumptions) [seed: EA00A48BF6BCDC00]

Total time: 211 minutes 55 seconds
Build step 'Invoke Ant' marked build as failure
Archiving artifacts
Recording test results
Email was triggered for: Failure - Any
Sending email for trigger: Failure - Any



Mime
View raw message