lucene-dev mailing list archives

Site index · List index
Message view « Date » · « Thread »
Top « Date » · « Thread »
From Policeman Jenkins Server <jenk...@thetaphi.de>
Subject [JENKINS] Lucene-Solr-5.4-Linux (64bit/jdk1.7.0_80) - Build # 264 - Still Failing!
Date Fri, 27 Nov 2015 23:38:41 GMT
Build: http://jenkins.thetaphi.de/job/Lucene-Solr-5.4-Linux/264/
Java: 64bit/jdk1.7.0_80 -XX:-UseCompressedOops -XX:+UseConcMarkSweepGC

1 tests failed.
FAILED:  org.apache.solr.cloud.DeleteInactiveReplicaTest.deleteInactiveReplicaTest

Error Message:
Server refused connection at: http://127.0.0.1:58733

Stack Trace:
org.apache.solr.client.solrj.SolrServerException: Server refused connection at: http://127.0.0.1:58733
	at __randomizedtesting.SeedInfo.seed([E1B754C76534C2C8:2C89CF342A95B42A]:0)
	at org.apache.solr.client.solrj.impl.HttpSolrClient.executeMethod(HttpSolrClient.java:581)
	at org.apache.solr.client.solrj.impl.HttpSolrClient.request(HttpSolrClient.java:240)
	at org.apache.solr.client.solrj.impl.HttpSolrClient.request(HttpSolrClient.java:229)
	at org.apache.solr.client.solrj.SolrClient.request(SolrClient.java:1220)
	at org.apache.solr.cloud.DeleteInactiveReplicaTest.deleteInactiveReplicaTest(DeleteInactiveReplicaTest.java:128)
	at sun.reflect.NativeMethodAccessorImpl.invoke0(Native Method)
	at sun.reflect.NativeMethodAccessorImpl.invoke(NativeMethodAccessorImpl.java:57)
	at sun.reflect.DelegatingMethodAccessorImpl.invoke(DelegatingMethodAccessorImpl.java:43)
	at java.lang.reflect.Method.invoke(Method.java:606)
	at com.carrotsearch.randomizedtesting.RandomizedRunner.invoke(RandomizedRunner.java:1764)
	at com.carrotsearch.randomizedtesting.RandomizedRunner$8.evaluate(RandomizedRunner.java:871)
	at com.carrotsearch.randomizedtesting.RandomizedRunner$9.evaluate(RandomizedRunner.java:907)
	at com.carrotsearch.randomizedtesting.RandomizedRunner$10.evaluate(RandomizedRunner.java:921)
	at org.apache.solr.BaseDistributedSearchTestCase$ShardsRepeatRule$ShardsFixedStatement.callStatement(BaseDistributedSearchTestCase.java:963)
	at org.apache.solr.BaseDistributedSearchTestCase$ShardsRepeatRule$ShardsStatement.evaluate(BaseDistributedSearchTestCase.java:938)
	at com.carrotsearch.randomizedtesting.rules.SystemPropertiesRestoreRule$1.evaluate(SystemPropertiesRestoreRule.java:57)
	at org.apache.lucene.util.TestRuleSetupTeardownChained$1.evaluate(TestRuleSetupTeardownChained.java:50)
	at org.apache.lucene.util.AbstractBeforeAfterRule$1.evaluate(AbstractBeforeAfterRule.java:46)
	at org.apache.lucene.util.TestRuleThreadAndTestName$1.evaluate(TestRuleThreadAndTestName.java:49)
	at org.apache.lucene.util.TestRuleIgnoreAfterMaxFailures$1.evaluate(TestRuleIgnoreAfterMaxFailures.java:65)
	at org.apache.lucene.util.TestRuleMarkFailure$1.evaluate(TestRuleMarkFailure.java:48)
	at com.carrotsearch.randomizedtesting.rules.StatementAdapter.evaluate(StatementAdapter.java:36)
	at com.carrotsearch.randomizedtesting.ThreadLeakControl$StatementRunner.run(ThreadLeakControl.java:367)
	at com.carrotsearch.randomizedtesting.ThreadLeakControl.forkTimeoutingTask(ThreadLeakControl.java:809)
	at com.carrotsearch.randomizedtesting.ThreadLeakControl$3.evaluate(ThreadLeakControl.java:460)
	at com.carrotsearch.randomizedtesting.RandomizedRunner.runSingleTest(RandomizedRunner.java:880)
	at com.carrotsearch.randomizedtesting.RandomizedRunner$5.evaluate(RandomizedRunner.java:781)
	at com.carrotsearch.randomizedtesting.RandomizedRunner$6.evaluate(RandomizedRunner.java:816)
	at com.carrotsearch.randomizedtesting.RandomizedRunner$7.evaluate(RandomizedRunner.java:827)
	at com.carrotsearch.randomizedtesting.rules.StatementAdapter.evaluate(StatementAdapter.java:36)
	at com.carrotsearch.randomizedtesting.rules.SystemPropertiesRestoreRule$1.evaluate(SystemPropertiesRestoreRule.java:57)
	at org.apache.lucene.util.AbstractBeforeAfterRule$1.evaluate(AbstractBeforeAfterRule.java:46)
	at com.carrotsearch.randomizedtesting.rules.StatementAdapter.evaluate(StatementAdapter.java:36)
	at org.apache.lucene.util.TestRuleStoreClassName$1.evaluate(TestRuleStoreClassName.java:42)
	at com.carrotsearch.randomizedtesting.rules.NoShadowingOrOverridesOnMethodsRule$1.evaluate(NoShadowingOrOverridesOnMethodsRule.java:40)
	at com.carrotsearch.randomizedtesting.rules.NoShadowingOrOverridesOnMethodsRule$1.evaluate(NoShadowingOrOverridesOnMethodsRule.java:40)
	at com.carrotsearch.randomizedtesting.rules.StatementAdapter.evaluate(StatementAdapter.java:36)
	at com.carrotsearch.randomizedtesting.rules.StatementAdapter.evaluate(StatementAdapter.java:36)
	at com.carrotsearch.randomizedtesting.rules.StatementAdapter.evaluate(StatementAdapter.java:36)
	at org.apache.lucene.util.TestRuleAssertionsRequired$1.evaluate(TestRuleAssertionsRequired.java:54)
	at org.apache.lucene.util.TestRuleMarkFailure$1.evaluate(TestRuleMarkFailure.java:48)
	at org.apache.lucene.util.TestRuleIgnoreAfterMaxFailures$1.evaluate(TestRuleIgnoreAfterMaxFailures.java:65)
	at org.apache.lucene.util.TestRuleIgnoreTestSuites$1.evaluate(TestRuleIgnoreTestSuites.java:55)
	at com.carrotsearch.randomizedtesting.rules.StatementAdapter.evaluate(StatementAdapter.java:36)
	at com.carrotsearch.randomizedtesting.ThreadLeakControl$StatementRunner.run(ThreadLeakControl.java:367)
	at java.lang.Thread.run(Thread.java:745)
Caused by: java.net.ConnectException: Connection refused
	at java.net.PlainSocketImpl.socketConnect(Native Method)
	at java.net.AbstractPlainSocketImpl.doConnect(AbstractPlainSocketImpl.java:339)
	at java.net.AbstractPlainSocketImpl.connectToAddress(AbstractPlainSocketImpl.java:200)
	at java.net.AbstractPlainSocketImpl.connect(AbstractPlainSocketImpl.java:182)
	at java.net.SocksSocketImpl.connect(SocksSocketImpl.java:392)
	at java.net.Socket.connect(Socket.java:579)
	at org.apache.http.conn.scheme.PlainSocketFactory.connectSocket(PlainSocketFactory.java:117)
	at org.apache.http.impl.conn.DefaultClientConnectionOperator.openConnection(DefaultClientConnectionOperator.java:177)
	at org.apache.http.impl.conn.ManagedClientConnectionImpl.open(ManagedClientConnectionImpl.java:304)
	at org.apache.http.impl.client.DefaultRequestDirector.tryConnect(DefaultRequestDirector.java:611)
	at org.apache.http.impl.client.DefaultRequestDirector.execute(DefaultRequestDirector.java:446)
	at org.apache.http.impl.client.AbstractHttpClient.doExecute(AbstractHttpClient.java:882)
	at org.apache.http.impl.client.CloseableHttpClient.execute(CloseableHttpClient.java:82)
	at org.apache.http.impl.client.CloseableHttpClient.execute(CloseableHttpClient.java:107)
	at org.apache.http.impl.client.CloseableHttpClient.execute(CloseableHttpClient.java:55)
	at org.apache.solr.client.solrj.impl.HttpSolrClient.executeMethod(HttpSolrClient.java:479)
	... 45 more




Build Log:
[...truncated 10763 lines...]
   [junit4] Suite: org.apache.solr.cloud.DeleteInactiveReplicaTest
   [junit4]   2> Creating dataDir: /home/jenkins/workspace/Lucene-Solr-5.4-Linux/solr/build/solr-core/test/J0/temp/solr.cloud.DeleteInactiveReplicaTest_E1B754C76534C2C8-001/init-core-data-001
   [junit4]   2> 1278313 INFO  (SUITE-DeleteInactiveReplicaTest-seed#[E1B754C76534C2C8]-worker) [    ] o.a.s.SolrTestCaseJ4 Randomized ssl (false) and clientAuth (false)
   [junit4]   2> 1278313 INFO  (SUITE-DeleteInactiveReplicaTest-seed#[E1B754C76534C2C8]-worker) [    ] o.a.s.BaseDistributedSearchTestCase Setting hostContext system property: /
   [junit4]   2> 1278316 INFO  (TEST-DeleteInactiveReplicaTest.deleteInactiveReplicaTest-seed#[E1B754C76534C2C8]) [    ] o.a.s.c.ZkTestServer STARTING ZK TEST SERVER
   [junit4]   2> 1278317 INFO  (Thread-3378) [    ] o.a.s.c.ZkTestServer client port:0.0.0.0/0.0.0.0:0
   [junit4]   2> 1278318 INFO  (Thread-3378) [    ] o.a.s.c.ZkTestServer Starting server
   [junit4]   2> 1278417 INFO  (TEST-DeleteInactiveReplicaTest.deleteInactiveReplicaTest-seed#[E1B754C76534C2C8]) [    ] o.a.s.c.ZkTestServer start zk server on port:58492
   [junit4]   2> 1278418 INFO  (TEST-DeleteInactiveReplicaTest.deleteInactiveReplicaTest-seed#[E1B754C76534C2C8]) [    ] o.a.s.c.c.SolrZkClient Using default ZkCredentialsProvider
   [junit4]   2> 1278418 INFO  (TEST-DeleteInactiveReplicaTest.deleteInactiveReplicaTest-seed#[E1B754C76534C2C8]) [    ] o.a.s.c.c.ConnectionManager Waiting for client to connect to ZooKeeper
   [junit4]   2> 1278421 INFO  (zkCallback-962-thread-1) [    ] o.a.s.c.c.ConnectionManager Watcher org.apache.solr.common.cloud.ConnectionManager@24611f86 name:ZooKeeperConnection Watcher:127.0.0.1:58492 got event WatchedEvent state:SyncConnected type:None path:null path:null type:None
   [junit4]   2> 1278421 INFO  (TEST-DeleteInactiveReplicaTest.deleteInactiveReplicaTest-seed#[E1B754C76534C2C8]) [    ] o.a.s.c.c.ConnectionManager Client is connected to ZooKeeper
   [junit4]   2> 1278421 INFO  (TEST-DeleteInactiveReplicaTest.deleteInactiveReplicaTest-seed#[E1B754C76534C2C8]) [    ] o.a.s.c.c.SolrZkClient Using default ZkACLProvider
   [junit4]   2> 1278421 INFO  (TEST-DeleteInactiveReplicaTest.deleteInactiveReplicaTest-seed#[E1B754C76534C2C8]) [    ] o.a.s.c.c.SolrZkClient makePath: /solr
   [junit4]   2> 1278422 INFO  (TEST-DeleteInactiveReplicaTest.deleteInactiveReplicaTest-seed#[E1B754C76534C2C8]) [    ] o.a.s.c.c.SolrZkClient Using default ZkCredentialsProvider
   [junit4]   2> 1278423 INFO  (TEST-DeleteInactiveReplicaTest.deleteInactiveReplicaTest-seed#[E1B754C76534C2C8]) [    ] o.a.s.c.c.ConnectionManager Waiting for client to connect to ZooKeeper
   [junit4]   2> 1278424 INFO  (zkCallback-963-thread-1) [    ] o.a.s.c.c.ConnectionManager Watcher org.apache.solr.common.cloud.ConnectionManager@5848b1ec name:ZooKeeperConnection Watcher:127.0.0.1:58492/solr got event WatchedEvent state:SyncConnected type:None path:null path:null type:None
   [junit4]   2> 1278424 INFO  (TEST-DeleteInactiveReplicaTest.deleteInactiveReplicaTest-seed#[E1B754C76534C2C8]) [    ] o.a.s.c.c.ConnectionManager Client is connected to ZooKeeper
   [junit4]   2> 1278424 INFO  (TEST-DeleteInactiveReplicaTest.deleteInactiveReplicaTest-seed#[E1B754C76534C2C8]) [    ] o.a.s.c.c.SolrZkClient Using default ZkACLProvider
   [junit4]   2> 1278424 INFO  (TEST-DeleteInactiveReplicaTest.deleteInactiveReplicaTest-seed#[E1B754C76534C2C8]) [    ] o.a.s.c.c.SolrZkClient makePath: /collections/collection1
   [junit4]   2> 1278425 INFO  (TEST-DeleteInactiveReplicaTest.deleteInactiveReplicaTest-seed#[E1B754C76534C2C8]) [    ] o.a.s.c.c.SolrZkClient makePath: /collections/collection1/shards
   [junit4]   2> 1278426 INFO  (TEST-DeleteInactiveReplicaTest.deleteInactiveReplicaTest-seed#[E1B754C76534C2C8]) [    ] o.a.s.c.c.SolrZkClient makePath: /collections/control_collection
   [junit4]   2> 1278426 INFO  (TEST-DeleteInactiveReplicaTest.deleteInactiveReplicaTest-seed#[E1B754C76534C2C8]) [    ] o.a.s.c.c.SolrZkClient makePath: /collections/control_collection/shards
   [junit4]   2> 1278427 INFO  (TEST-DeleteInactiveReplicaTest.deleteInactiveReplicaTest-seed#[E1B754C76534C2C8]) [    ] o.a.s.c.AbstractZkTestCase put /home/jenkins/workspace/Lucene-Solr-5.4-Linux/solr/core/src/test-files/solr/collection1/conf/solrconfig-tlog.xml to /configs/conf1/solrconfig.xml
   [junit4]   2> 1278427 INFO  (TEST-DeleteInactiveReplicaTest.deleteInactiveReplicaTest-seed#[E1B754C76534C2C8]) [    ] o.a.s.c.c.SolrZkClient makePath: /configs/conf1/solrconfig.xml
   [junit4]   2> 1278428 INFO  (TEST-DeleteInactiveReplicaTest.deleteInactiveReplicaTest-seed#[E1B754C76534C2C8]) [    ] o.a.s.c.AbstractZkTestCase put /home/jenkins/workspace/Lucene-Solr-5.4-Linux/solr/core/src/test-files/solr/collection1/conf/schema.xml to /configs/conf1/schema.xml
   [junit4]   2> 1278428 INFO  (TEST-DeleteInactiveReplicaTest.deleteInactiveReplicaTest-seed#[E1B754C76534C2C8]) [    ] o.a.s.c.c.SolrZkClient makePath: /configs/conf1/schema.xml
   [junit4]   2> 1278429 INFO  (TEST-DeleteInactiveReplicaTest.deleteInactiveReplicaTest-seed#[E1B754C76534C2C8]) [    ] o.a.s.c.AbstractZkTestCase put /home/jenkins/workspace/Lucene-Solr-5.4-Linux/solr/core/src/test-files/solr/collection1/conf/solrconfig.snippet.randomindexconfig.xml to /configs/conf1/solrconfig.snippet.randomindexconfig.xml
   [junit4]   2> 1278429 INFO  (TEST-DeleteInactiveReplicaTest.deleteInactiveReplicaTest-seed#[E1B754C76534C2C8]) [    ] o.a.s.c.c.SolrZkClient makePath: /configs/conf1/solrconfig.snippet.randomindexconfig.xml
   [junit4]   2> 1278430 INFO  (TEST-DeleteInactiveReplicaTest.deleteInactiveReplicaTest-seed#[E1B754C76534C2C8]) [    ] o.a.s.c.AbstractZkTestCase put /home/jenkins/workspace/Lucene-Solr-5.4-Linux/solr/core/src/test-files/solr/collection1/conf/stopwords.txt to /configs/conf1/stopwords.txt
   [junit4]   2> 1278430 INFO  (TEST-DeleteInactiveReplicaTest.deleteInactiveReplicaTest-seed#[E1B754C76534C2C8]) [    ] o.a.s.c.c.SolrZkClient makePath: /configs/conf1/stopwords.txt
   [junit4]   2> 1278431 INFO  (TEST-DeleteInactiveReplicaTest.deleteInactiveReplicaTest-seed#[E1B754C76534C2C8]) [    ] o.a.s.c.AbstractZkTestCase put /home/jenkins/workspace/Lucene-Solr-5.4-Linux/solr/core/src/test-files/solr/collection1/conf/protwords.txt to /configs/conf1/protwords.txt
   [junit4]   2> 1278431 INFO  (TEST-DeleteInactiveReplicaTest.deleteInactiveReplicaTest-seed#[E1B754C76534C2C8]) [    ] o.a.s.c.c.SolrZkClient makePath: /configs/conf1/protwords.txt
   [junit4]   2> 1278432 INFO  (TEST-DeleteInactiveReplicaTest.deleteInactiveReplicaTest-seed#[E1B754C76534C2C8]) [    ] o.a.s.c.AbstractZkTestCase put /home/jenkins/workspace/Lucene-Solr-5.4-Linux/solr/core/src/test-files/solr/collection1/conf/currency.xml to /configs/conf1/currency.xml
   [junit4]   2> 1278432 INFO  (TEST-DeleteInactiveReplicaTest.deleteInactiveReplicaTest-seed#[E1B754C76534C2C8]) [    ] o.a.s.c.c.SolrZkClient makePath: /configs/conf1/currency.xml
   [junit4]   2> 1278433 INFO  (TEST-DeleteInactiveReplicaTest.deleteInactiveReplicaTest-seed#[E1B754C76534C2C8]) [    ] o.a.s.c.AbstractZkTestCase put /home/jenkins/workspace/Lucene-Solr-5.4-Linux/solr/core/src/test-files/solr/collection1/conf/enumsConfig.xml to /configs/conf1/enumsConfig.xml
   [junit4]   2> 1278433 INFO  (TEST-DeleteInactiveReplicaTest.deleteInactiveReplicaTest-seed#[E1B754C76534C2C8]) [    ] o.a.s.c.c.SolrZkClient makePath: /configs/conf1/enumsConfig.xml
   [junit4]   2> 1278434 INFO  (TEST-DeleteInactiveReplicaTest.deleteInactiveReplicaTest-seed#[E1B754C76534C2C8]) [    ] o.a.s.c.AbstractZkTestCase put /home/jenkins/workspace/Lucene-Solr-5.4-Linux/solr/core/src/test-files/solr/collection1/conf/open-exchange-rates.json to /configs/conf1/open-exchange-rates.json
   [junit4]   2> 1278434 INFO  (TEST-DeleteInactiveReplicaTest.deleteInactiveReplicaTest-seed#[E1B754C76534C2C8]) [    ] o.a.s.c.c.SolrZkClient makePath: /configs/conf1/open-exchange-rates.json
   [junit4]   2> 1278435 INFO  (TEST-DeleteInactiveReplicaTest.deleteInactiveReplicaTest-seed#[E1B754C76534C2C8]) [    ] o.a.s.c.AbstractZkTestCase put /home/jenkins/workspace/Lucene-Solr-5.4-Linux/solr/core/src/test-files/solr/collection1/conf/mapping-ISOLatin1Accent.txt to /configs/conf1/mapping-ISOLatin1Accent.txt
   [junit4]   2> 1278435 INFO  (TEST-DeleteInactiveReplicaTest.deleteInactiveReplicaTest-seed#[E1B754C76534C2C8]) [    ] o.a.s.c.c.SolrZkClient makePath: /configs/conf1/mapping-ISOLatin1Accent.txt
   [junit4]   2> 1278436 INFO  (TEST-DeleteInactiveReplicaTest.deleteInactiveReplicaTest-seed#[E1B754C76534C2C8]) [    ] o.a.s.c.AbstractZkTestCase put /home/jenkins/workspace/Lucene-Solr-5.4-Linux/solr/core/src/test-files/solr/collection1/conf/old_synonyms.txt to /configs/conf1/old_synonyms.txt
   [junit4]   2> 1278436 INFO  (TEST-DeleteInactiveReplicaTest.deleteInactiveReplicaTest-seed#[E1B754C76534C2C8]) [    ] o.a.s.c.c.SolrZkClient makePath: /configs/conf1/old_synonyms.txt
   [junit4]   2> 1278438 INFO  (TEST-DeleteInactiveReplicaTest.deleteInactiveReplicaTest-seed#[E1B754C76534C2C8]) [    ] o.a.s.c.AbstractZkTestCase put /home/jenkins/workspace/Lucene-Solr-5.4-Linux/solr/core/src/test-files/solr/collection1/conf/synonyms.txt to /configs/conf1/synonyms.txt
   [junit4]   2> 1278438 INFO  (TEST-DeleteInactiveReplicaTest.deleteInactiveReplicaTest-seed#[E1B754C76534C2C8]) [    ] o.a.s.c.c.SolrZkClient makePath: /configs/conf1/synonyms.txt
   [junit4]   2> 1278490 INFO  (TEST-DeleteInactiveReplicaTest.deleteInactiveReplicaTest-seed#[E1B754C76534C2C8]) [    ] o.a.s.SolrTestCaseJ4 Writing core.properties file to /home/jenkins/workspace/Lucene-Solr-5.4-Linux/solr/build/solr-core/test/J0/temp/solr.cloud.DeleteInactiveReplicaTest_E1B754C76534C2C8-001/control-001/cores/collection1
   [junit4]   2> 1278491 INFO  (TEST-DeleteInactiveReplicaTest.deleteInactiveReplicaTest-seed#[E1B754C76534C2C8]) [    ] o.e.j.s.Server jetty-9.2.13.v20150730
   [junit4]   2> 1278492 INFO  (TEST-DeleteInactiveReplicaTest.deleteInactiveReplicaTest-seed#[E1B754C76534C2C8]) [    ] o.e.j.s.h.ContextHandler Started o.e.j.s.ServletContextHandler@221343bf{/,null,AVAILABLE}
   [junit4]   2> 1278494 INFO  (TEST-DeleteInactiveReplicaTest.deleteInactiveReplicaTest-seed#[E1B754C76534C2C8]) [    ] o.e.j.s.ServerConnector Started ServerConnector@7a17d2d{HTTP/1.1}{127.0.0.1:41464}
   [junit4]   2> 1278494 INFO  (TEST-DeleteInactiveReplicaTest.deleteInactiveReplicaTest-seed#[E1B754C76534C2C8]) [    ] o.e.j.s.Server Started @1279958ms
   [junit4]   2> 1278494 INFO  (TEST-DeleteInactiveReplicaTest.deleteInactiveReplicaTest-seed#[E1B754C76534C2C8]) [    ] o.a.s.c.s.e.JettySolrRunner Jetty properties: {hostPort=41464, solr.data.dir=/home/jenkins/workspace/Lucene-Solr-5.4-Linux/solr/build/solr-core/test/J0/temp/solr.cloud.DeleteInactiveReplicaTest_E1B754C76534C2C8-001/tempDir-001/control/data, hostContext=/, coreRootDirectory=/home/jenkins/workspace/Lucene-Solr-5.4-Linux/solr/build/solr-core/test/J0/../../../../../../../../../home/jenkins/workspace/Lucene-Solr-5.4-Linux/solr/build/solr-core/test/J0/temp/solr.cloud.DeleteInactiveReplicaTest_E1B754C76534C2C8-001/control-001/cores}
   [junit4]   2> 1278494 INFO  (TEST-DeleteInactiveReplicaTest.deleteInactiveReplicaTest-seed#[E1B754C76534C2C8]) [    ] o.a.s.s.SolrDispatchFilter SolrDispatchFilter.init(): sun.misc.Launcher$AppClassLoader@8f8acd0
   [junit4]   2> 1278495 INFO  (TEST-DeleteInactiveReplicaTest.deleteInactiveReplicaTest-seed#[E1B754C76534C2C8]) [    ] o.a.s.c.SolrResourceLoader new SolrResourceLoader for directory: '/home/jenkins/workspace/Lucene-Solr-5.4-Linux/solr/build/solr-core/test/J0/temp/solr.cloud.DeleteInactiveReplicaTest_E1B754C76534C2C8-001/control-001'
   [junit4]   2> 1278495 INFO  (TEST-DeleteInactiveReplicaTest.deleteInactiveReplicaTest-seed#[E1B754C76534C2C8]) [    ] o.a.s.c.SolrResourceLoader JNDI not configured for solr (NoInitialContextEx)
   [junit4]   2> 1278495 INFO  (TEST-DeleteInactiveReplicaTest.deleteInactiveReplicaTest-seed#[E1B754C76534C2C8]) [    ] o.a.s.c.SolrResourceLoader solr home defaulted to 'solr/' (could not find system property or JNDI)
   [junit4]   2> 1278495 INFO  (TEST-DeleteInactiveReplicaTest.deleteInactiveReplicaTest-seed#[E1B754C76534C2C8]) [    ] o.a.s.c.c.SolrZkClient Using default ZkCredentialsProvider
   [junit4]   2> 1278495 INFO  (TEST-DeleteInactiveReplicaTest.deleteInactiveReplicaTest-seed#[E1B754C76534C2C8]) [    ] o.a.s.c.c.ConnectionManager Waiting for client to connect to ZooKeeper
   [junit4]   2> 1278496 INFO  (zkCallback-964-thread-1) [    ] o.a.s.c.c.ConnectionManager Watcher org.apache.solr.common.cloud.ConnectionManager@6250b5d3 name:ZooKeeperConnection Watcher:127.0.0.1:58492/solr got event WatchedEvent state:SyncConnected type:None path:null path:null type:None
   [junit4]   2> 1278496 INFO  (TEST-DeleteInactiveReplicaTest.deleteInactiveReplicaTest-seed#[E1B754C76534C2C8]) [    ] o.a.s.c.c.ConnectionManager Client is connected to ZooKeeper
   [junit4]   2> 1278497 INFO  (TEST-DeleteInactiveReplicaTest.deleteInactiveReplicaTest-seed#[E1B754C76534C2C8]) [    ] o.a.s.c.c.SolrZkClient Using default ZkACLProvider
   [junit4]   2> 1278497 INFO  (TEST-DeleteInactiveReplicaTest.deleteInactiveReplicaTest-seed#[E1B754C76534C2C8]) [    ] o.a.s.s.SolrDispatchFilter Loading solr.xml from SolrHome (not found in ZooKeeper)
   [junit4]   2> 1278497 INFO  (TEST-DeleteInactiveReplicaTest.deleteInactiveReplicaTest-seed#[E1B754C76534C2C8]) [    ] o.a.s.c.SolrXmlConfig Loading container configuration from /home/jenkins/workspace/Lucene-Solr-5.4-Linux/solr/build/solr-core/test/J0/temp/solr.cloud.DeleteInactiveReplicaTest_E1B754C76534C2C8-001/control-001/solr.xml
   [junit4]   2> 1278506 INFO  (TEST-DeleteInactiveReplicaTest.deleteInactiveReplicaTest-seed#[E1B754C76534C2C8]) [    ] o.a.s.c.CoresLocator Config-defined core root directory: /home/jenkins/workspace/Lucene-Solr-5.4-Linux/solr/build/solr-core/test/J0/../../../../../../../../../home/jenkins/workspace/Lucene-Solr-5.4-Linux/solr/build/solr-core/test/J0/temp/solr.cloud.DeleteInactiveReplicaTest_E1B754C76534C2C8-001/control-001/cores
   [junit4]   2> 1278506 INFO  (TEST-DeleteInactiveReplicaTest.deleteInactiveReplicaTest-seed#[E1B754C76534C2C8]) [    ] o.a.s.c.CoreContainer New CoreContainer 984538455
   [junit4]   2> 1278506 INFO  (TEST-DeleteInactiveReplicaTest.deleteInactiveReplicaTest-seed#[E1B754C76534C2C8]) [    ] o.a.s.c.CoreContainer Loading cores into CoreContainer [instanceDir=/home/jenkins/workspace/Lucene-Solr-5.4-Linux/solr/build/solr-core/test/J0/temp/solr.cloud.DeleteInactiveReplicaTest_E1B754C76534C2C8-001/control-001]
   [junit4]   2> 1278506 WARN  (TEST-DeleteInactiveReplicaTest.deleteInactiveReplicaTest-seed#[E1B754C76534C2C8]) [    ] o.a.s.c.CoreContainer Couldn't add files from /home/jenkins/workspace/Lucene-Solr-5.4-Linux/solr/build/solr-core/test/J0/temp/solr.cloud.DeleteInactiveReplicaTest_E1B754C76534C2C8-001/control-001/lib to classpath: /home/jenkins/workspace/Lucene-Solr-5.4-Linux/solr/build/solr-core/test/J0/temp/solr.cloud.DeleteInactiveReplicaTest_E1B754C76534C2C8-001/control-001/lib
   [junit4]   2> 1278506 INFO  (TEST-DeleteInactiveReplicaTest.deleteInactiveReplicaTest-seed#[E1B754C76534C2C8]) [    ] o.a.s.h.c.HttpShardHandlerFactory created with socketTimeout : 90000,urlScheme : ,connTimeout : 15000,maxConnectionsPerHost : 20,maxConnections : 10000,corePoolSize : 0,maximumPoolSize : 2147483647,maxThreadIdleTime : 5,sizeOfQueue : -1,fairnessPolicy : false,useRetries : false,
   [junit4]   2> 1278507 INFO  (TEST-DeleteInactiveReplicaTest.deleteInactiveReplicaTest-seed#[E1B754C76534C2C8]) [    ] o.a.s.u.UpdateShardHandler Creating UpdateShardHandler HTTP client with params: socketTimeout=340000&connTimeout=45000&retry=true
   [junit4]   2> 1278508 INFO  (TEST-DeleteInactiveReplicaTest.deleteInactiveReplicaTest-seed#[E1B754C76534C2C8]) [    ] o.a.s.l.LogWatcher SLF4J impl is org.slf4j.impl.Log4jLoggerFactory
   [junit4]   2> 1278508 INFO  (TEST-DeleteInactiveReplicaTest.deleteInactiveReplicaTest-seed#[E1B754C76534C2C8]) [    ] o.a.s.l.LogWatcher Registering Log Listener [Log4j (org.slf4j.impl.Log4jLoggerFactory)]
   [junit4]   2> 1278508 INFO  (TEST-DeleteInactiveReplicaTest.deleteInactiveReplicaTest-seed#[E1B754C76534C2C8]) [    ] o.a.s.c.ZkContainer Zookeeper client=127.0.0.1:58492/solr
   [junit4]   2> 1278508 INFO  (TEST-DeleteInactiveReplicaTest.deleteInactiveReplicaTest-seed#[E1B754C76534C2C8]) [    ] o.a.s.c.ZkController zkHost includes chroot
   [junit4]   2> 1278508 INFO  (TEST-DeleteInactiveReplicaTest.deleteInactiveReplicaTest-seed#[E1B754C76534C2C8]) [    ] o.a.s.c.c.SolrZkClient Using default ZkCredentialsProvider
   [junit4]   2> 1278508 INFO  (TEST-DeleteInactiveReplicaTest.deleteInactiveReplicaTest-seed#[E1B754C76534C2C8]) [    ] o.a.s.c.c.ConnectionManager Waiting for client to connect to ZooKeeper
   [junit4]   2> 1278509 INFO  (zkCallback-966-thread-1) [    ] o.a.s.c.c.ConnectionManager Watcher org.apache.solr.common.cloud.ConnectionManager@7acdb162 name:ZooKeeperConnection Watcher:127.0.0.1:58492 got event WatchedEvent state:SyncConnected type:None path:null path:null type:None
   [junit4]   2> 1278509 INFO  (TEST-DeleteInactiveReplicaTest.deleteInactiveReplicaTest-seed#[E1B754C76534C2C8]) [    ] o.a.s.c.c.ConnectionManager Client is connected to ZooKeeper
   [junit4]   2> 1278510 INFO  (TEST-DeleteInactiveReplicaTest.deleteInactiveReplicaTest-seed#[E1B754C76534C2C8]) [    ] o.a.s.c.c.SolrZkClient Using default ZkACLProvider
   [junit4]   2> 1278510 INFO  (TEST-DeleteInactiveReplicaTest.deleteInactiveReplicaTest-seed#[E1B754C76534C2C8]) [n:127.0.0.1:41464_    ] o.a.s.c.c.ConnectionManager Waiting for client to connect to ZooKeeper
   [junit4]   2> 1278511 INFO  (zkCallback-967-thread-1-processing-n:127.0.0.1:41464_) [n:127.0.0.1:41464_    ] o.a.s.c.c.ConnectionManager Watcher org.apache.solr.common.cloud.ConnectionManager@99b87bc name:ZooKeeperConnection Watcher:127.0.0.1:58492/solr got event WatchedEvent state:SyncConnected type:None path:null path:null type:None
   [junit4]   2> 1278511 INFO  (TEST-DeleteInactiveReplicaTest.deleteInactiveReplicaTest-seed#[E1B754C76534C2C8]) [n:127.0.0.1:41464_    ] o.a.s.c.c.ConnectionManager Client is connected to ZooKeeper
   [junit4]   2> 1278512 INFO  (TEST-DeleteInactiveReplicaTest.deleteInactiveReplicaTest-seed#[E1B754C76534C2C8]) [n:127.0.0.1:41464_    ] o.a.s.c.c.SolrZkClient makePath: /overseer/queue
   [junit4]   2> 1278513 INFO  (TEST-DeleteInactiveReplicaTest.deleteInactiveReplicaTest-seed#[E1B754C76534C2C8]) [n:127.0.0.1:41464_    ] o.a.s.c.c.SolrZkClient makePath: /overseer/collection-queue-work
   [junit4]   2> 1278514 INFO  (TEST-DeleteInactiveReplicaTest.deleteInactiveReplicaTest-seed#[E1B754C76534C2C8]) [n:127.0.0.1:41464_    ] o.a.s.c.c.SolrZkClient makePath: /overseer/collection-map-running
   [junit4]   2> 1278515 INFO  (TEST-DeleteInactiveReplicaTest.deleteInactiveReplicaTest-seed#[E1B754C76534C2C8]) [n:127.0.0.1:41464_    ] o.a.s.c.c.SolrZkClient makePath: /overseer/collection-map-completed
   [junit4]   2> 1278516 INFO  (TEST-DeleteInactiveReplicaTest.deleteInactiveReplicaTest-seed#[E1B754C76534C2C8]) [n:127.0.0.1:41464_    ] o.a.s.c.c.SolrZkClient makePath: /overseer/collection-map-failure
   [junit4]   2> 1278517 INFO  (TEST-DeleteInactiveReplicaTest.deleteInactiveReplicaTest-seed#[E1B754C76534C2C8]) [n:127.0.0.1:41464_    ] o.a.s.c.c.SolrZkClient makePath: /live_nodes
   [junit4]   2> 1278517 INFO  (TEST-DeleteInactiveReplicaTest.deleteInactiveReplicaTest-seed#[E1B754C76534C2C8]) [n:127.0.0.1:41464_    ] o.a.s.c.c.SolrZkClient makePath: /aliases.json
   [junit4]   2> 1278518 INFO  (TEST-DeleteInactiveReplicaTest.deleteInactiveReplicaTest-seed#[E1B754C76534C2C8]) [n:127.0.0.1:41464_    ] o.a.s.c.c.SolrZkClient makePath: /clusterstate.json
   [junit4]   2> 1278518 INFO  (TEST-DeleteInactiveReplicaTest.deleteInactiveReplicaTest-seed#[E1B754C76534C2C8]) [n:127.0.0.1:41464_    ] o.a.s.c.c.SolrZkClient makePath: /security.json
   [junit4]   2> 1278519 INFO  (TEST-DeleteInactiveReplicaTest.deleteInactiveReplicaTest-seed#[E1B754C76534C2C8]) [n:127.0.0.1:41464_    ] o.a.s.c.ZkController Register node as live in ZooKeeper:/live_nodes/127.0.0.1:41464_
   [junit4]   2> 1278519 INFO  (TEST-DeleteInactiveReplicaTest.deleteInactiveReplicaTest-seed#[E1B754C76534C2C8]) [n:127.0.0.1:41464_    ] o.a.s.c.c.SolrZkClient makePath: /live_nodes/127.0.0.1:41464_
   [junit4]   2> 1278520 INFO  (TEST-DeleteInactiveReplicaTest.deleteInactiveReplicaTest-seed#[E1B754C76534C2C8]) [n:127.0.0.1:41464_    ] o.a.s.c.c.SolrZkClient makePath: /overseer_elect
   [junit4]   2> 1278520 INFO  (TEST-DeleteInactiveReplicaTest.deleteInactiveReplicaTest-seed#[E1B754C76534C2C8]) [n:127.0.0.1:41464_    ] o.a.s.c.c.SolrZkClient makePath: /overseer_elect/election
   [junit4]   2> 1278521 INFO  (TEST-DeleteInactiveReplicaTest.deleteInactiveReplicaTest-seed#[E1B754C76534C2C8]) [n:127.0.0.1:41464_    ] o.a.s.c.Overseer Overseer (id=null) closing
   [junit4]   2> 1278521 INFO  (TEST-DeleteInactiveReplicaTest.deleteInactiveReplicaTest-seed#[E1B754C76534C2C8]) [n:127.0.0.1:41464_    ] o.a.s.c.LeaderElector Joined leadership election with path: /overseer_elect/election/94939838050271236-127.0.0.1:41464_-n_0000000000
   [junit4]   2> 1278522 INFO  (TEST-DeleteInactiveReplicaTest.deleteInactiveReplicaTest-seed#[E1B754C76534C2C8]) [n:127.0.0.1:41464_    ] o.a.s.c.OverseerElectionContext I am going to be the leader 127.0.0.1:41464_
   [junit4]   2> 1278522 INFO  (TEST-DeleteInactiveReplicaTest.deleteInactiveReplicaTest-seed#[E1B754C76534C2C8]) [n:127.0.0.1:41464_    ] o.a.s.c.c.SolrZkClient makePath: /overseer_elect/leader
   [junit4]   2> 1278522 INFO  (TEST-DeleteInactiveReplicaTest.deleteInactiveReplicaTest-seed#[E1B754C76534C2C8]) [n:127.0.0.1:41464_    ] o.a.s.c.Overseer Overseer (id=94939838050271236-127.0.0.1:41464_-n_0000000000) starting
   [junit4]   2> 1278523 INFO  (TEST-DeleteInactiveReplicaTest.deleteInactiveReplicaTest-seed#[E1B754C76534C2C8]) [n:127.0.0.1:41464_    ] o.a.s.c.c.SolrZkClient makePath: /overseer/queue-work
   [junit4]   2> 1278526 INFO  (TEST-DeleteInactiveReplicaTest.deleteInactiveReplicaTest-seed#[E1B754C76534C2C8]) [n:127.0.0.1:41464_    ] o.a.s.c.OverseerAutoReplicaFailoverThread Starting OverseerAutoReplicaFailoverThread autoReplicaFailoverWorkLoopDelay=10000 autoReplicaFailoverWaitAfterExpiration=30000 autoReplicaFailoverBadNodeExpiration=60000
   [junit4]   2> 1278526 INFO  (TEST-DeleteInactiveReplicaTest.deleteInactiveReplicaTest-seed#[E1B754C76534C2C8]) [n:127.0.0.1:41464_    ] o.a.s.c.c.ZkStateReader Updating cluster state from ZooKeeper... 
   [junit4]   2> 1278526 INFO  (OverseerCollectionConfigSetProcessor-94939838050271236-127.0.0.1:41464_-n_0000000000) [n:127.0.0.1:41464_    ] o.a.s.c.OverseerTaskProcessor Process current queue of overseer operations
   [junit4]   2> 1278526 INFO  (OverseerStateUpdate-94939838050271236-127.0.0.1:41464_-n_0000000000) [n:127.0.0.1:41464_    ] o.a.s.c.Overseer Starting to work on the main queue
   [junit4]   2> 1278541 INFO  (TEST-DeleteInactiveReplicaTest.deleteInactiveReplicaTest-seed#[E1B754C76534C2C8]) [n:127.0.0.1:41464_    ] o.a.s.c.CoreContainer Security conf doesn't exist. Skipping setup for authorization module.
   [junit4]   2> 1278541 INFO  (TEST-DeleteInactiveReplicaTest.deleteInactiveReplicaTest-seed#[E1B754C76534C2C8]) [n:127.0.0.1:41464_    ] o.a.s.c.CoreContainer No authentication plugin used.
   [junit4]   2> 1278541 INFO  (TEST-DeleteInactiveReplicaTest.deleteInactiveReplicaTest-seed#[E1B754C76534C2C8]) [n:127.0.0.1:41464_    ] o.a.s.c.CoresLocator Looking for core definitions underneath /home/jenkins/workspace/Lucene-Solr-5.4-Linux/solr/build/solr-core/test/J0/../../../../../../../../../home/jenkins/workspace/Lucene-Solr-5.4-Linux/solr/build/solr-core/test/J0/temp/solr.cloud.DeleteInactiveReplicaTest_E1B754C76534C2C8-001/control-001/cores
   [junit4]   2> 1278542 INFO  (TEST-DeleteInactiveReplicaTest.deleteInactiveReplicaTest-seed#[E1B754C76534C2C8]) [n:127.0.0.1:41464_    ] o.a.s.c.SolrCore Created CoreDescriptor: {absoluteInstDir=/home/jenkins/workspace/Lucene-Solr-5.4-Linux/solr/build/solr-core/test/J0/../../../../../../../../../home/jenkins/workspace/Lucene-Solr-5.4-Linux/solr/build/solr-core/test/J0/temp/solr.cloud.DeleteInactiveReplicaTest_E1B754C76534C2C8-001/control-001/cores/collection1/, loadOnStartup=true, configSetProperties=configsetprops.json, transient=false, config=solrconfig.xml, dataDir=data/, name=collection1, shard=, coreNodeName=, collection=control_collection, schema=schema.xml, instanceDir=/home/jenkins/workspace/Lucene-Solr-5.4-Linux/solr/build/solr-core/test/J0/../../../../../../../../../home/jenkins/workspace/Lucene-Solr-5.4-Linux/solr/build/solr-core/test/J0/temp/solr.cloud.DeleteInactiveReplicaTest_E1B754C76534C2C8-001/control-001/cores/collection1}
   [junit4]   2> 1278542 INFO  (TEST-DeleteInactiveReplicaTest.deleteInactiveReplicaTest-seed#[E1B754C76534C2C8]) [n:127.0.0.1:41464_    ] o.a.s.c.CoresLocator Found core collection1 in /home/jenkins/workspace/Lucene-Solr-5.4-Linux/solr/build/solr-core/test/J0/../../../../../../../../../home/jenkins/workspace/Lucene-Solr-5.4-Linux/solr/build/solr-core/test/J0/temp/solr.cloud.DeleteInactiveReplicaTest_E1B754C76534C2C8-001/control-001/cores/collection1/
   [junit4]   2> 1278542 INFO  (TEST-DeleteInactiveReplicaTest.deleteInactiveReplicaTest-seed#[E1B754C76534C2C8]) [n:127.0.0.1:41464_    ] o.a.s.c.CoresLocator Found 1 core definitions
   [junit4]   2> 1278543 INFO  (TEST-DeleteInactiveReplicaTest.deleteInactiveReplicaTest-seed#[E1B754C76534C2C8]) [n:127.0.0.1:41464_    ] o.a.s.s.SolrDispatchFilter user.dir=/home/jenkins/workspace/Lucene-Solr-5.4-Linux/solr/build/solr-core/test/J0
   [junit4]   2> 1278543 INFO  (TEST-DeleteInactiveReplicaTest.deleteInactiveReplicaTest-seed#[E1B754C76534C2C8]) [n:127.0.0.1:41464_    ] o.a.s.s.SolrDispatchFilter SolrDispatchFilter.init() done
   [junit4]   2> 1278543 INFO  (coreLoadExecutor-4066-thread-1-processing-n:127.0.0.1:41464_) [n:127.0.0.1:41464_ c:control_collection   x:collection1] o.a.s.c.ZkController publishing state=down
   [junit4]   2> 1278543 INFO  (coreLoadExecutor-4066-thread-1-processing-n:127.0.0.1:41464_) [n:127.0.0.1:41464_ c:control_collection   x:collection1] o.a.s.c.ZkController numShards not found on descriptor - reading it from system property
   [junit4]   2> 1278544 INFO  (OverseerStateUpdate-94939838050271236-127.0.0.1:41464_-n_0000000000) [n:127.0.0.1:41464_    ] o.a.s.c.Overseer processMessage: queueSize: 1, message = {
   [junit4]   2>   "numShards":"1",
   [junit4]   2>   "collection":"control_collection",
   [junit4]   2>   "state":"down",
   [junit4]   2>   "roles":null,
   [junit4]   2>   "operation":"state",
   [junit4]   2>   "base_url":"http://127.0.0.1:41464",
   [junit4]   2>   "shard":null,
   [junit4]   2>   "node_name":"127.0.0.1:41464_",
   [junit4]   2>   "core":"collection1"} current state version: 0
   [junit4]   2> 1278544 INFO  (coreLoadExecutor-4066-thread-1-processing-n:127.0.0.1:41464_) [n:127.0.0.1:41464_ c:control_collection   x:collection1] o.a.s.c.ZkController look for our core node name
   [junit4]   2> 1278544 INFO  (OverseerStateUpdate-94939838050271236-127.0.0.1:41464_-n_0000000000) [n:127.0.0.1:41464_    ] o.a.s.c.o.ReplicaMutator Update state numShards=1 message={
   [junit4]   2>   "numShards":"1",
   [junit4]   2>   "collection":"control_collection",
   [junit4]   2>   "state":"down",
   [junit4]   2>   "roles":null,
   [junit4]   2>   "operation":"state",
   [junit4]   2>   "base_url":"http://127.0.0.1:41464",
   [junit4]   2>   "shard":null,
   [junit4]   2>   "node_name":"127.0.0.1:41464_",
   [junit4]   2>   "core":"collection1"}
   [junit4]   2> 1278545 INFO  (OverseerStateUpdate-94939838050271236-127.0.0.1:41464_-n_0000000000) [n:127.0.0.1:41464_    ] o.a.s.c.o.ClusterStateMutator building a new cName: control_collection
   [junit4]   2> 1278545 INFO  (OverseerStateUpdate-94939838050271236-127.0.0.1:41464_-n_0000000000) [n:127.0.0.1:41464_    ] o.a.s.c.o.ReplicaMutator Assigning new node to shard shard=shard1
   [junit4]   2> 1278546 INFO  (zkCallback-967-thread-1-processing-n:127.0.0.1:41464_) [n:127.0.0.1:41464_    ] o.a.s.c.c.ZkStateReader A cluster state change: WatchedEvent state:SyncConnected type:NodeDataChanged path:/clusterstate.json, has occurred - updating... (live nodes size: 1)
   [junit4]   2> 1279544 INFO  (coreLoadExecutor-4066-thread-1-processing-n:127.0.0.1:41464_) [n:127.0.0.1:41464_ c:control_collection   x:collection1] o.a.s.c.ZkController waiting to find shard id in clusterstate for collection1
   [junit4]   2> 1279545 INFO  (coreLoadExecutor-4066-thread-1-processing-n:127.0.0.1:41464_) [n:127.0.0.1:41464_ c:control_collection   x:collection1] o.a.s.c.ZkController Check for collection zkNode:control_collection
   [junit4]   2> 1279545 INFO  (coreLoadExecutor-4066-thread-1-processing-n:127.0.0.1:41464_) [n:127.0.0.1:41464_ c:control_collection   x:collection1] o.a.s.c.ZkController Collection zkNode exists
   [junit4]   2> 1279545 INFO  (coreLoadExecutor-4066-thread-1-processing-n:127.0.0.1:41464_) [n:127.0.0.1:41464_ c:control_collection   x:collection1] o.a.s.c.c.ZkStateReader Load collection config from:/collections/control_collection
   [junit4]   2> 1279545 INFO  (coreLoadExecutor-4066-thread-1-processing-n:127.0.0.1:41464_) [n:127.0.0.1:41464_ c:control_collection   x:collection1] o.a.s.c.c.ZkStateReader path=/collections/control_collection configName=conf1 specified config exists in ZooKeeper
   [junit4]   2> 1279545 INFO  (coreLoadExecutor-4066-thread-1-processing-n:127.0.0.1:41464_) [n:127.0.0.1:41464_ c:control_collection   x:collection1] o.a.s.c.SolrResourceLoader new SolrResourceLoader for directory: '/home/jenkins/workspace/Lucene-Solr-5.4-Linux/solr/build/solr-core/test/J0/temp/solr.cloud.DeleteInactiveReplicaTest_E1B754C76534C2C8-001/control-001/cores/collection1'
   [junit4]   2> 1279545 INFO  (coreLoadExecutor-4066-thread-1-processing-n:127.0.0.1:41464_) [n:127.0.0.1:41464_ c:control_collection   x:collection1] o.a.s.c.SolrResourceLoader JNDI not configured for solr (NoInitialContextEx)
   [junit4]   2> 1279545 INFO  (coreLoadExecutor-4066-thread-1-processing-n:127.0.0.1:41464_) [n:127.0.0.1:41464_ c:control_collection   x:collection1] o.a.s.c.SolrResourceLoader solr home defaulted to 'solr/' (could not find system property or JNDI)
   [junit4]   2> 1279546 INFO  (coreLoadExecutor-4066-thread-1-processing-n:127.0.0.1:41464_) [n:127.0.0.1:41464_ c:control_collection   x:collection1] o.a.s.c.Config loaded config solrconfig.xml with version 0 
   [junit4]   2> 1279550 INFO  (coreLoadExecutor-4066-thread-1-processing-n:127.0.0.1:41464_) [n:127.0.0.1:41464_ c:control_collection   x:collection1] o.a.s.c.SolrConfig current version of requestparams : -1
   [junit4]   2> 1279569 INFO  (coreLoadExecutor-4066-thread-1-processing-n:127.0.0.1:41464_) [n:127.0.0.1:41464_ c:control_collection   x:collection1] o.a.s.c.SolrConfig Using Lucene MatchVersion: 5.4.0
   [junit4]   2> 1279592 INFO  (coreLoadExecutor-4066-thread-1-processing-n:127.0.0.1:41464_) [n:127.0.0.1:41464_ c:control_collection   x:collection1] o.a.s.c.Config Loaded SolrConfig: solrconfig.xml
   [junit4]   2> 1279597 INFO  (coreLoadExecutor-4066-thread-1-processing-n:127.0.0.1:41464_) [n:127.0.0.1:41464_ c:control_collection   x:collection1] o.a.s.s.IndexSchema [collection1] Schema name=test
   [junit4]   2> 1279778 INFO  (coreLoadExecutor-4066-thread-1-processing-n:127.0.0.1:41464_) [n:127.0.0.1:41464_ c:control_collection   x:collection1] o.a.s.s.OpenExchangeRatesOrgProvider Initialized with rates=open-exchange-rates.json, refreshInterval=1440.
   [junit4]   2> 1279783 INFO  (coreLoadExecutor-4066-thread-1-processing-n:127.0.0.1:41464_) [n:127.0.0.1:41464_ c:control_collection   x:collection1] o.a.s.s.IndexSchema default search field in schema is text
   [junit4]   2> 1279784 INFO  (coreLoadExecutor-4066-thread-1-processing-n:127.0.0.1:41464_) [n:127.0.0.1:41464_ c:control_collection   x:collection1] o.a.s.s.IndexSchema unique key field: id
   [junit4]   2> 1279789 INFO  (coreLoadExecutor-4066-thread-1-processing-n:127.0.0.1:41464_) [n:127.0.0.1:41464_ c:control_collection   x:collection1] o.a.s.s.FileExchangeRateProvider Reloading exchange rates from file currency.xml
   [junit4]   2> 1279790 INFO  (coreLoadExecutor-4066-thread-1-processing-n:127.0.0.1:41464_) [n:127.0.0.1:41464_ c:control_collection   x:collection1] o.a.s.s.FileExchangeRateProvider Reloading exchange rates from file currency.xml
   [junit4]   2> 1279792 INFO  (coreLoadExecutor-4066-thread-1-processing-n:127.0.0.1:41464_) [n:127.0.0.1:41464_ c:control_collection   x:collection1] o.a.s.s.OpenExchangeRatesOrgProvider Reloading exchange rates from open-exchange-rates.json
   [junit4]   2> 1279792 WARN  (coreLoadExecutor-4066-thread-1-processing-n:127.0.0.1:41464_) [n:127.0.0.1:41464_ c:control_collection   x:collection1] o.a.s.s.OpenExchangeRatesOrgProvider Unknown key IMPORTANT NOTE
   [junit4]   2> 1279793 WARN  (coreLoadExecutor-4066-thread-1-processing-n:127.0.0.1:41464_) [n:127.0.0.1:41464_ c:control_collection   x:collection1] o.a.s.s.OpenExchangeRatesOrgProvider Expected key, got STRING
   [junit4]   2> 1279793 INFO  (coreLoadExecutor-4066-thread-1-processing-n:127.0.0.1:41464_) [n:127.0.0.1:41464_ c:control_collection   x:collection1] o.a.s.s.OpenExchangeRatesOrgProvider Reloading exchange rates from open-exchange-rates.json
   [junit4]   2> 1279793 WARN  (coreLoadExecutor-4066-thread-1-processing-n:127.0.0.1:41464_) [n:127.0.0.1:41464_ c:control_collection   x:collection1] o.a.s.s.OpenExchangeRatesOrgProvider Unknown key IMPORTANT NOTE
   [junit4]   2> 1279793 WARN  (coreLoadExecutor-4066-thread-1-processing-n:127.0.0.1:41464_) [n:127.0.0.1:41464_ c:control_collection   x:collection1] o.a.s.s.OpenExchangeRatesOrgProvider Expected key, got STRING
   [junit4]   2> 1279794 INFO  (coreLoadExecutor-4066-thread-1-processing-n:127.0.0.1:41464_) [n:127.0.0.1:41464_ c:control_collection   x:collection1] o.a.s.c.ConfigSetProperties Did not find ConfigSet properties, assuming default properties: Can't find resource 'configsetprops.json' in classpath or '/configs/conf1', cwd=/home/jenkins/workspace/Lucene-Solr-5.4-Linux/solr/build/solr-core/test/J0
   [junit4]   2> 1279794 INFO  (coreLoadExecutor-4066-thread-1-processing-n:127.0.0.1:41464_) [n:127.0.0.1:41464_ c:control_collection   x:collection1] o.a.s.c.CoreContainer Creating SolrCore 'collection1' using configuration from collection control_collection
   [junit4]   2> 1279794 INFO  (coreLoadExecutor-4066-thread-1-processing-n:127.0.0.1:41464_) [n:127.0.0.1:41464_ c:control_collection s:shard1 r:core_node1 x:collection1] o.a.s.c.SolrCore org.apache.solr.core.MockDirectoryFactory
   [junit4]   2> 1279794 INFO  (coreLoadExecutor-4066-thread-1-processing-n:127.0.0.1:41464_) [n:127.0.0.1:41464_ c:control_collection s:shard1 r:core_node1 x:collection1] o.a.s.c.SolrCore [[collection1] ] Opening new SolrCore at [/home/jenkins/workspace/Lucene-Solr-5.4-Linux/solr/build/solr-core/test/J0/temp/solr.cloud.DeleteInactiveReplicaTest_E1B754C76534C2C8-001/control-001/cores/collection1], dataDir=[null]
   [junit4]   2> 1279794 INFO  (coreLoadExecutor-4066-thread-1-processing-n:127.0.0.1:41464_) [n:127.0.0.1:41464_ c:control_collection s:shard1 r:core_node1 x:collection1] o.a.s.c.JmxMonitoredMap JMX monitoring is enabled. Adding Solr mbeans to JMX Server: com.sun.jmx.mbeanserver.JmxMBeanServer@5ecd9204
   [junit4]   2> 1279794 INFO  (coreLoadExecutor-4066-thread-1-processing-n:127.0.0.1:41464_) [n:127.0.0.1:41464_ c:control_collection s:shard1 r:core_node1 x:collection1] o.a.s.c.CachingDirectoryFactory return new directory for /home/jenkins/workspace/Lucene-Solr-5.4-Linux/solr/build/solr-core/test/J0/../../../../../../../../../home/jenkins/workspace/Lucene-Solr-5.4-Linux/solr/build/solr-core/test/J0/temp/solr.cloud.DeleteInactiveReplicaTest_E1B754C76534C2C8-001/control-001/cores/collection1/data
   [junit4]   2> 1279795 INFO  (coreLoadExecutor-4066-thread-1-processing-n:127.0.0.1:41464_) [n:127.0.0.1:41464_ c:control_collection s:shard1 r:core_node1 x:collection1] o.a.s.c.SolrCore New index directory detected: old=null new=/home/jenkins/workspace/Lucene-Solr-5.4-Linux/solr/build/solr-core/test/J0/../../../../../../../../../home/jenkins/workspace/Lucene-Solr-5.4-Linux/solr/build/solr-core/test/J0/temp/solr.cloud.DeleteInactiveReplicaTest_E1B754C76534C2C8-001/control-001/cores/collection1/data/index/
   [junit4]   2> 1279795 WARN  (coreLoadExecutor-4066-thread-1-processing-n:127.0.0.1:41464_) [n:127.0.0.1:41464_ c:control_collection s:shard1 r:core_node1 x:collection1] o.a.s.c.SolrCore [collection1] Solr index directory '/home/jenkins/workspace/Lucene-Solr-5.4-Linux/solr/build/solr-core/test/J0/../../../../../../../../../home/jenkins/workspace/Lucene-Solr-5.4-Linux/solr/build/solr-core/test/J0/temp/solr.cloud.DeleteInactiveReplicaTest_E1B754C76534C2C8-001/control-001/cores/collection1/data/index' doesn't exist. Creating new index...
   [junit4]   2> 1279795 INFO  (coreLoadExecutor-4066-thread-1-processing-n:127.0.0.1:41464_) [n:127.0.0.1:41464_ c:control_collection s:shard1 r:core_node1 x:collection1] o.a.s.c.CachingDirectoryFactory return new directory for /home/jenkins/workspace/Lucene-Solr-5.4-Linux/solr/build/solr-core/test/J0/../../../../../../../../../home/jenkins/workspace/Lucene-Solr-5.4-Linux/solr/build/solr-core/test/J0/temp/solr.cloud.DeleteInactiveReplicaTest_E1B754C76534C2C8-001/control-001/cores/collection1/data/index
   [junit4]   2> 1279795 INFO  (coreLoadExecutor-4066-thread-1-processing-n:127.0.0.1:41464_) [n:127.0.0.1:41464_ c:control_collection s:shard1 r:core_node1 x:collection1] o.a.s.u.RandomMergePolicy RandomMergePolicy wrapping class org.apache.lucene.index.TieredMergePolicy: [TieredMergePolicy: maxMergeAtOnce=47, maxMergeAtOnceExplicit=31, maxMergedSegmentMB=83.515625, floorSegmentMB=0.818359375, forceMergeDeletesPctAllowed=0.20431504378444432, segmentsPerTier=45.0, maxCFSSegmentSizeMB=8.796093022207999E12, noCFSRatio=0.6662268170241558
   [junit4]   2> 1279795 INFO  (coreLoadExecutor-4066-thread-1-processing-n:127.0.0.1:41464_) [n:127.0.0.1:41464_ c:control_collection s:shard1 r:core_node1 x:collection1] o.a.s.c.SolrCore SolrDeletionPolicy.onCommit: commits: num=1
   [junit4]   2> 	commit{dir=MockDirectoryWrapper(NRTCachingDirectory(RAMDirectory@5653d9c lockFactory=org.apache.lucene.store.SingleInstanceLockFactory@39afcf88; maxCacheMB=0.7197265625 maxMergeSizeMB=0.548828125)),segFN=segments_1,generation=1}
   [junit4]   2> 1279795 INFO  (coreLoadExecutor-4066-thread-1-processing-n:127.0.0.1:41464_) [n:127.0.0.1:41464_ c:control_collection s:shard1 r:core_node1 x:collection1] o.a.s.c.SolrCore newest commit generation = 1
   [junit4]   2> 1279796 INFO  (OldIndexDirectoryCleanupThreadForCore-collection1) [n:127.0.0.1:41464_ c:control_collection s:shard1 r:core_node1 x:collection1] o.a.s.c.SolrCore Looking for old index directories to cleanup for core collection1 in /home/jenkins/workspace/Lucene-Solr-5.4-Linux/solr/build/solr-core/test/J0/../../../../../../../../../home/jenkins/workspace/Lucene-Solr-5.4-Linux/solr/build/solr-core/test/J0/temp/solr.cloud.DeleteInactiveReplicaTest_E1B754C76534C2C8-001/control-001/cores/collection1/data/
   [junit4]   2> 1279796 WARN  (OldIndexDirectoryCleanupThreadForCore-collection1) [n:127.0.0.1:41464_ c:control_collection s:shard1 r:core_node1 x:collection1] o.a.s.c.DirectoryFactory /home/jenkins/workspace/Lucene-Solr-5.4-Linux/solr/build/solr-core/test/J0/../../../../../../../../../home/jenkins/workspace/Lucene-Solr-5.4-Linux/solr/build/solr-core/test/J0/temp/solr.cloud.DeleteInactiveReplicaTest_E1B754C76534C2C8-001/control-001/cores/collection1/data/ does not point to a valid data directory; skipping clean-up of old index directories.
   [junit4]   2> 1279798 INFO  (coreLoadExecutor-4066-thread-1-processing-n:127.0.0.1:41464_) [n:127.0.0.1:41464_ c:control_collection s:shard1 r:core_node1 x:collection1] o.a.s.u.p.UpdateRequestProcessorChain creating updateRequestProcessorChain "nodistrib"
   [junit4]   2> 1279798 INFO  (coreLoadExecutor-4066-thread-1-processing-n:127.0.0.1:41464_) [n:127.0.0.1:41464_ c:control_collection s:shard1 r:core_node1 x:collection1] o.a.s.u.p.UpdateRequestProcessorChain creating updateRequestProcessorChain "dedupe"
   [junit4]   2> 1279798 INFO  (coreLoadExecutor-4066-thread-1-processing-n:127.0.0.1:41464_) [n:127.0.0.1:41464_ c:control_collection s:shard1 r:core_node1 x:collection1] o.a.s.u.p.UpdateRequestProcessorChain inserting DistributedUpdateProcessorFactory into updateRequestProcessorChain "dedupe"
   [junit4]   2> 1279798 INFO  (coreLoadExecutor-4066-thread-1-processing-n:127.0.0.1:41464_) [n:127.0.0.1:41464_ c:control_collection s:shard1 r:core_node1 x:collection1] o.a.s.u.p.UpdateRequestProcessorChain creating updateRequestProcessorChain "stored_sig"
   [junit4]   2> 1279799 INFO  (coreLoadExecutor-4066-thread-1-processing-n:127.0.0.1:41464_) [n:127.0.0.1:41464_ c:control_collection s:shard1 r:core_node1 x:collection1] o.a.s.u.p.UpdateRequestProcessorChain inserting DistributedUpdateProcessorFactory into updateRequestProcessorChain "stored_sig"
   [junit4]   2> 1279799 INFO  (coreLoadExecutor-4066-thread-1-processing-n:127.0.0.1:41464_) [n:127.0.0.1:41464_ c:control_collection s:shard1 r:core_node1 x:collection1] o.a.s.u.p.UpdateRequestProcessorChain creating updateRequestProcessorChain "distrib-dup-test-chain-explicit"
   [junit4]   2> 1279799 INFO  (coreLoadExecutor-4066-thread-1-processing-n:127.0.0.1:41464_) [n:127.0.0.1:41464_ c:control_collection s:shard1 r:core_node1 x:collection1] o.a.s.u.p.UpdateRequestProcessorChain creating updateRequestProcessorChain "distrib-dup-test-chain-implicit"
   [junit4]   2> 1279799 INFO  (coreLoadExecutor-4066-thread-1-processing-n:127.0.0.1:41464_) [n:127.0.0.1:41464_ c:control_collection s:shard1 r:core_node1 x:collection1] o.a.s.u.p.UpdateRequestProcessorChain inserting DistributedUpdateProcessorFactory into updateRequestProcessorChain "distrib-dup-test-chain-implicit"
   [junit4]   2> 1279799 INFO  (coreLoadExecutor-4066-thread-1-processing-n:127.0.0.1:41464_) [n:127.0.0.1:41464_ c:control_collection s:shard1 r:core_node1 x:collection1] o.a.s.c.SolrCore no updateRequestProcessorChain defined as default, creating implicit default
   [junit4]   2> 1279799 WARN  (coreLoadExecutor-4066-thread-1-processing-n:127.0.0.1:41464_) [n:127.0.0.1:41464_ c:control_collection s:shard1 r:core_node1 x:collection1] o.a.s.c.RequestHandlers INVALID paramSet a in requestHandler {type = requestHandler,name = /dump,class = DumpRequestHandler,args = {defaults={a=A,b=B}}}
   [junit4]   2> 1279801 INFO  (coreLoadExecutor-4066-thread-1-processing-n:127.0.0.1:41464_) [n:127.0.0.1:41464_ c:control_collection s:shard1 r:core_node1 x:collection1] o.a.s.h.l.XMLLoader xsltCacheLifetimeSeconds=60
   [junit4]   2> 1279802 INFO  (coreLoadExecutor-4066-thread-1-processing-n:127.0.0.1:41464_) [n:127.0.0.1:41464_ c:control_collection s:shard1 r:core_node1 x:collection1] o.a.s.h.l.XMLLoader xsltCacheLifetimeSeconds=60
   [junit4]   2> 1279803 INFO  (coreLoadExecutor-4066-thread-1-processing-n:127.0.0.1:41464_) [n:127.0.0.1:41464_ c:control_collection s:shard1 r:core_node1 x:collection1] o.a.s.h.l.XMLLoader xsltCacheLifetimeSeconds=60
   [junit4]   2> 1279803 INFO  (coreLoadExecutor-4066-thread-1-processing-n:127.0.0.1:41464_) [n:127.0.0.1:41464_ c:control_collection s:shard1 r:core_node1 x:collection1] o.a.s.h.l.XMLLoader xsltCacheLifetimeSeconds=60
   [junit4]   2> 1279806 INFO  (coreLoadExecutor-4066-thread-1-processing-n:127.0.0.1:41464_) [n:127.0.0.1:41464_ c:control_collection s:shard1 r:core_node1 x:collection1] o.a.s.c.RequestHandlers Registered paths: /admin/segments,/admin/ping,/update,/get,/admin/system,/update/json,/admin/plugins,standard,/schema,/update/json/docs,/admin/logging,/admin/luke,/admin/threads,/dump,/admin/properties,/admin/mbeans,/admin/file,/replication,/config,/update/csv
   [junit4]   2> 1279807 INFO  (coreLoadExecutor-4066-thread-1-processing-n:127.0.0.1:41464_) [n:127.0.0.1:41464_ c:control_collection s:shard1 r:core_node1 x:collection1] o.a.s.c.SolrCore Using default statsCache cache: org.apache.solr.search.stats.LocalStatsCache
   [junit4]   2> 1279808 INFO  (coreLoadExecutor-4066-thread-1-processing-n:127.0.0.1:41464_) [n:127.0.0.1:41464_ c:control_collection s:shard1 r:core_node1 x:collection1] o.a.s.u.UpdateHandler Using UpdateLog implementation: org.apache.solr.update.UpdateLog
   [junit4]   2> 1279808 INFO  (coreLoadExecutor-4066-thread-1-processing-n:127.0.0.1:41464_) [n:127.0.0.1:41464_ c:control_collection s:shard1 r:core_node1 x:collection1] o.a.s.u.UpdateLog Initializing UpdateLog: dataDir= defaultSyncLevel=FLUSH numRecordsToKeep=100 maxNumLogsToKeep=10 numVersionBuckets=65536
   [junit4]   2> 1279808 INFO  (coreLoadExecutor-4066-thread-1-processing-n:127.0.0.1:41464_) [n:127.0.0.1:41464_ c:control_collection s:shard1 r:core_node1 x:collection1] o.a.s.c.SolrCore Hard AutoCommit: disabled
   [junit4]   2> 1279808 INFO  (coreLoadExecutor-4066-thread-1-processing-n:127.0.0.1:41464_) [n:127.0.0.1:41464_ c:control_collection s:shard1 r:core_node1 x:collection1] o.a.s.c.SolrCore Soft AutoCommit: disabled
   [junit4]   2> 1279808 INFO  (coreLoadExecutor-4066-thread-1-processing-n:127.0.0.1:41464_) [n:127.0.0.1:41464_ c:control_collection s:shard1 r:core_node1 x:collection1] o.a.s.u.RandomMergePolicy RandomMergePolicy wrapping class org.apache.lucene.index.TieredMergePolicy: [TieredMergePolicy: maxMergeAtOnce=20, maxMergeAtOnceExplicit=46, maxMergedSegmentMB=17.6689453125, floorSegmentMB=0.853515625, forceMergeDeletesPctAllowed=14.626922811097648, segmentsPerTier=37.0, maxCFSSegmentSizeMB=8.796093022207999E12, noCFSRatio=0.0
   [junit4]   2> 1279809 INFO  (coreLoadExecutor-4066-thread-1-processing-n:127.0.0.1:41464_) [n:127.0.0.1:41464_ c:control_collection s:shard1 r:core_node1 x:collection1] o.a.s.c.SolrCore SolrDeletionPolicy.onInit: commits: num=1
   [junit4]   2> 	commit{dir=MockDirectoryWrapper(NRTCachingDirectory(RAMDirectory@5653d9c lockFactory=org.apache.lucene.store.SingleInstanceLockFactory@39afcf88; maxCacheMB=0.7197265625 maxMergeSizeMB=0.548828125)),segFN=segments_1,generation=1}
   [junit4]   2> 1279809 INFO  (coreLoadExecutor-4066-thread-1-processing-n:127.0.0.1:41464_) [n:127.0.0.1:41464_ c:control_collection s:shard1 r:core_node1 x:collection1] o.a.s.c.SolrCore newest commit generation = 1
   [junit4]   2> 1279809 INFO  (coreLoadExecutor-4066-thread-1-processing-n:127.0.0.1:41464_) [n:127.0.0.1:41464_ c:control_collection s:shard1 r:core_node1 x:collection1] o.a.s.s.SolrIndexSearcher Opening Searcher@7128fdae[collection1] main
   [junit4]   2> 1279809 INFO  (coreLoadExecutor-4066-thread-1-processing-n:127.0.0.1:41464_) [n:127.0.0.1:41464_ c:control_collection s:shard1 r:core_node1 x:collection1] o.a.s.c.c.ZkStateReader Load collection config from:/collections/control_collection
   [junit4]   2> 1279809 INFO  (coreLoadExecutor-4066-thread-1-processing-n:127.0.0.1:41464_) [n:127.0.0.1:41464_ c:control_collection s:shard1 r:core_node1 x:collection1] o.a.s.c.c.ZkStateReader path=/collections/control_collection configName=conf1 specified config exists in ZooKeeper
   [junit4]   2> 1279809 INFO  (coreLoadExecutor-4066-thread-1-processing-n:127.0.0.1:41464_) [n:127.0.0.1:41464_ c:control_collection s:shard1 r:core_node1 x:collection1] o.a.s.r.ManagedResourceStorage Setting up ZooKeeper-based storage for the RestManager with znodeBase: /configs/conf1
   [junit4]   2> 1279810 INFO  (coreLoadExecutor-4066-thread-1-processing-n:127.0.0.1:41464_) [n:127.0.0.1:41464_ c:control_collection s:shard1 r:core_node1 x:collection1] o.a.s.r.ManagedResourceStorage Configured ZooKeeperStorageIO with znodeBase: /configs/conf1
   [junit4]   2> 1279810 INFO  (coreLoadExecutor-4066-thread-1-processing-n:127.0.0.1:41464_) [n:127.0.0.1:41464_ c:control_collection s:shard1 r:core_node1 x:collection1] o.a.s.r.RestManager Initializing RestManager with initArgs: {}
   [junit4]   2> 1279810 INFO  (coreLoadExecutor-4066-thread-1-processing-n:127.0.0.1:41464_) [n:127.0.0.1:41464_ c:control_collection s:shard1 r:core_node1 x:collection1] o.a.s.r.ManagedResourceStorage Reading _rest_managed.json using ZooKeeperStorageIO:path=/configs/conf1
   [junit4]   2> 1279810 INFO  (coreLoadExecutor-4066-thread-1-processing-n:127.0.0.1:41464_) [n:127.0.0.1:41464_ c:control_collection s:shard1 r:core_node1 x:collection1] o.a.s.r.ManagedResourceStorage No data found for znode /configs/conf1/_rest_managed.json
   [junit4]   2> 1279810 INFO  (coreLoadExecutor-4066-thread-1-processing-n:127.0.0.1:41464_) [n:127.0.0.1:41464_ c:control_collection s:shard1 r:core_node1 x:collection1] o.a.s.r.ManagedResourceStorage Loaded null at path _rest_managed.json using ZooKeeperStorageIO:path=/configs/conf1
   [junit4]   2> 1279810 INFO  (coreLoadExecutor-4066-thread-1-processing-n:127.0.0.1:41464_) [n:127.0.0.1:41464_ c:control_collection s:shard1 r:core_node1 x:collection1] o.a.s.r.RestManager Initializing 0 registered ManagedResources
   [junit4]   2> 1279810 INFO  (coreLoadExecutor-4066-thread-1-processing-n:127.0.0.1:41464_) [n:127.0.0.1:41464_ c:control_collection s:shard1 r:core_node1 x:collection1] o.a.s.h.ReplicationHandler Commits will be reserved for  10000
   [junit4]   2> 1279811 INFO  (searcherExecutor-4067-thread-1-processing-c:control_collection r:core_node1 n:127.0.0.1:41464_ s:shard1 x:collection1) [n:127.0.0.1:41464_ c:control_collection s:shard1 r:core_node1 x:collection1] o.a.s.c.SolrCore [collection1] Registered new searcher Searcher@7128fdae[collection1] main{ExitableDirectoryReader(UninvertingDirectoryReader())}
   [junit4]   2> 1279811 INFO  (coreLoadExecutor-4066-thread-1-processing-n:127.0.0.1:41464_) [n:127.0.0.1:41464_ c:control_collection s:shard1 r:core_node1 x:collection1] o.a.s.u.UpdateLog Looking up max value of version field to seed version buckets
   [junit4]   2> 1279811 INFO  (coreLoadExecutor-4066-thread-1-processing-n:127.0.0.1:41464_) [n:127.0.0.1:41464_ c:control_collection s:shard1 r:core_node1 x:collection1] o.a.s.u.VersionInfo Refreshing highest value of _version_ for 65536 version buckets from index
   [junit4]   2> 1279811 INFO  (coreLoadExecutor-4066-thread-1-processing-n:127.0.0.1:41464_) [n:127.0.0.1:41464_ c:control_collection s:shard1 r:core_node1 x:collection1] o.a.s.u.VersionInfo No terms found for _version_, cannot seed version bucket highest value from index
   [junit4]   2> 1279811 INFO  (coreLoadExecutor-4066-thread-1-processing-n:127.0.0.1:41464_) [n:127.0.0.1:41464_ c:control_collection s:shard1 r:core_node1 x:collection1] o.a.s.u.UpdateLog Could not find max version in index or recent updates, using new clock 1519037410368815104
   [junit4]   2> 1279813 INFO  (coreLoadExecutor-4066-thread-1-processing-n:127.0.0.1:41464_) [n:127.0.0.1:41464_ c:control_collection s:shard1 r:core_node1 x:collection1] o.a.s.u.UpdateLog Took 1.0ms to seed version buckets with highest version 1519037410368815104
   [junit4]   2> 1279813 INFO  (coreLoadExecutor-4066-thread-1-processing-n:127.0.0.1:41464_) [n:127.0.0.1:41464_ c:control_collection s:shard1 r:core_node1 x:collection1] o.a.s.c.ZkController watch zkdir /configs/conf1
   [junit4]   2> 1279813 INFO  (coreLoadExecutor-4066-thread-1-processing-n:127.0.0.1:41464_) [n:127.0.0.1:41464_ c:control_collection s:shard1 r:core_node1 x:collection1] o.a.s.c.CoreContainer registering core: collection1
   [junit4]   2> 1279813 INFO  (coreZkRegister-4060-thread-1-processing-c:control_collection r:core_node1 n:127.0.0.1:41464_ s:shard1 x:collection1) [n:127.0.0.1:41464_ c:control_collection s:shard1 r:core_node1 x:collection1] o.a.s.c.ZkController Register replica - core:collection1 address:http://127.0.0.1:41464 collection:control_collection shard:shard1
   [junit4]   2> 1279814 INFO  (coreZkRegister-4060-thread-1-processing-c:control_collection r:core_node1 n:127.0.0.1:41464_ s:shard1 x:collection1) [n:127.0.0.1:41464_ c:control_collection s:shard1 r:core_node1 x:collection1] o.a.s.c.c.SolrZkClient makePath: /collections/control_collection/leader_elect/shard1/election
   [junit4]   2> 1279816 INFO  (coreZkRegister-4060-thread-1-processing-c:control_collection r:core_node1 n:127.0.0.1:41464_ s:shard1 x:collection1) [n:127.0.0.1:41464_ c:control_collection s:shard1 r:core_node1 x:collection1] o.a.s.c.LeaderElector Joined leadership election with path: /collections/control_collection/leader_elect/shard1/election/94939838050271236-core_node1-n_0000000000
   [junit4]   2> 1279816 INFO  (coreZkRegister-4060-thread-1-processing-c:control_collection r:core_node1 n:127.0.0.1:41464_ s:shard1 x:collection1) [n:127.0.0.1:41464_ c:control_collection s:shard1 r:core_node1 x:collection1] o.a.s.c.ShardLeaderElectionContext Running the leader process for shard shard1
   [junit4]   2> 1279817 INFO  (coreZkRegister-4060-thread-1-processing-c:control_collection r:core_node1 n:127.0.0.1:41464_ s:shard1 x:collection1) [n:127.0.0.1:41464_ c:control_collection s:shard1 r:core_node1 x:collection1] o.a.s.c.ShardLeaderElectionContext Enough replicas found to continue.
   [junit4]   2> 1279817 INFO  (coreZkRegister-4060-thread-1-processing-c:control_collection r:core_node1 n:127.0.0.1:41464_ s:shard1 x:collection1) [n:127.0.0.1:41464_ c:control_collection s:shard1 r:core_node1 x:collection1] o.a.s.c.ShardLeaderElectionContext I may be the new leader - try and sync
   [junit4]   2> 1279817 INFO  (coreZkRegister-4060-thread-1-processing-c:control_collection r:core_node1 n:127.0.0.1:41464_ s:shard1 x:collection1) [n:127.0.0.1:41464_ c:control_collection s:shard1 r:core_node1 x:collection1] o.a.s.c.SyncStrategy Sync replicas to http://127.0.0.1:41464/collection1/
   [junit4]   2> 1279817 INFO  (coreZkRegister-4060-thread-1-processing-c:control_collection r:core_node1 n:127.0.0.1:41464_ s:shard1 x:collection1) [n:127.0.0.1:41464_ c:control_collection s:shard1 r:core_node1 x:collection1] o.a.s.c.SyncStrategy Sync Success - now sync replicas to me
   [junit4]   2> 1279817 INFO  (coreZkRegister-4060-thread-1-processing-c:control_collection r:core_node1 n:127.0.0.1:41464_ s:shard1 x:collection1) [n:127.0.0.1:41464_ c:control_collection s:shard1 r:core_node1 x:collection1] o.a.s.c.SyncStrategy http://127.0.0.1:41464/collection1/ has no replicas
   [junit4]   2> 1279817 INFO  (OverseerStateUpdate-94939838050271236-127.0.0.1:41464_-n_0000000000) [n:127.0.0.1:41464_    ] o.a.s.c.Overseer processMessage: queueSize: 1, message = {
   [junit4]   2>   "operation":"leader",
   [junit4]   2>   "shard":"shard1",
   [junit4]   2>   "collection":"control_collection"} current state version: 1
   [junit4]   2> 1279818 INFO  (coreZkRegister-4060-thread-1-processing-c:control_collection r:core_node1 n:127.0.0.1:41464_ s:shard1 x:collection1) [n:127.0.0.1:41464_ c:control_collection s:shard1 r:core_node1 x:collection1] o.a.s.c.c.SolrZkClient makePath: /collections/control_collection/leaders/shard1
   [junit4]   2> 1279819 INFO  (coreZkRegister-4060-thread-1-processing-c:control_collection r:core_node1 n:127.0.0.1:41464_ s:shard1 x:collection1) [n:127.0.0.1:41464_ c:control_collection s:shard1 r:core_node1 x:collection1] o.a.s.c.ShardLeaderElectionContextBase Creating leader registration node
   [junit4]   2> 1279820 INFO  (coreZkRegister-4060-thread-1-processing-c:control_collection r:core_node1 n:127.0.0.1:41464_ s:shard1 x:collection1) [n:127.0.0.1:41464_ c:control_collection s:shard1 r:core_node1 x:collection1] o.a.s.c.ShardLeaderElectionContext I am the new leader: http://127.0.0.1:41464/collection1/ shard1
   [junit4]   2> 1279821 INFO  (OverseerStateUpdate-94939838050271236-127.0.0.1:41464_-n_0000000000) [n:127.0.0.1:41464_    ] o.a.s.c.Overseer processMessage: queueSize: 1, message = {
   [junit4]   2>   "operation":"leader",
   [junit4]   2>   "shard":"shard1",
   [junit4]   2>   "collection":"control_collection",
   [junit4]   2>   "base_url":"http://127.0.0.1:41464",
   [junit4]   2>   "core":"collection1",
   [junit4]   2>   "state":"active"} current state version: 1
   [junit4]   2> 1279922 INFO  (zkCallback-967-thread-1-processing-n:127.0.0.1:41464_) [n:127.0.0.1:41464_    ] o.a.s.c.c.ZkStateReader A cluster state change: WatchedEvent state:SyncConnected type:NodeDataChanged path:/clusterstate.json, has occurred - updating... (live nodes size: 1)
   [junit4]   2> 1279971 INFO  (coreZkRegister-4060-thread-1-processing-c:control_collection r:core_node1 n:127.0.0.1:41464_ s:shard1 x:collection1) [n:127.0.0.1:41464_ c:control_collection s:shard1 r:core_node1 x:collection1] o.a.s.c.ZkController We are http://127.0.0.1:41464/collection1/ and leader is http://127.0.0.1:41464/collection1/
   [junit4]   2> 1279971 INFO  (coreZkRegister-4060-thread-1-processing-c:control_collection r:core_node1 n:127.0.0.1:41464_ s:shard1 x:collection1) [n:127.0.0.1:41464_ c:control_collection s:shard1 r:core_node1 x:collection1] o.a.s.c.ZkController No LogReplay needed for core=collection1 baseURL=http://127.0.0.1:41464
   [junit4]   2> 1279971 INFO  (coreZkRegister-4060-thread-1-processing-c:control_collection r:core_node1 n:127.0.0.1:41464_ s:shard1 x:collection1) [n:127.0.0.1:41464_ c:control_collection s:shard1 r:core_node1 x:collection1] o.a.s.c.ZkController I am the leader, no recovery necessary
   [junit4]   2> 1279971 INFO  (coreZkRegister-4060-thread-1-processing-c:control_collection r:core_node1 n:127.0.0.1:41464_ s:shard1 x:collection1) [n:127.0.0.1:41464_ c:control_collection s:shard1 r:core_node1 x:collection1] o.a.s.c.ZkController publishing state=active
   [junit4]   2> 1279971 INFO  (coreZkRegister-4060-thread-1-processing-c:control_collection r:core_node1 n:127.0.0.1:41464_ s:shard1 x:collection1) [n:127.0.0.1:41464_ c:control_collection s:shard1 r:core_node1 x:collection1] o.a.s.c.ZkController numShards not found on descriptor - reading it from system property
   [junit4]   2> 1279973 INFO  (OverseerStateUpdate-94939838050271236-127.0.0.1:41464_-n_0000000000) [n:127.0.0.1:41464_    ] o.a.s.c.Overseer processMessage: queueSize: 1, message = {
   [junit4]   2>   "numShards":"1",
   [junit4]   2>   "collection":"control_collection",
   [junit4]   2>   "state":"active",
   [junit4]   2>   "roles":null,
   [junit4]   2>   "operation":"state",
   [junit4]   2>   "base_url":"http://127.0.0.1:41464",
   [junit4]   2>   "shard":"shard1",
   [junit4]   2>   "node_name":"127.0.0.1:41464_",
   [junit4]   2>   "core_node_name":"core_node1",
   [junit4]   2>   "core":"collection1"} current state version: 2
   [junit4]   2> 1279973 INFO  (OverseerStateUpdate-94939838050271236-127.0.0.1:41464_-n_0000000000) [n:127.0.0.1:41464_    ] o.a.s.c.o.ReplicaMutator Update state numShards=1 message={
   [junit4]   2>   "numShards":"1",
   [junit4]   2>   "collection":"control_collection",
   [junit4]   2>   "state":"active",
   [junit4]   2>   "roles":null,
   [junit4]   2>   "operation":"state",
   [junit4]   2>   "base_url":"http://127.0.0.1:41464",
   [junit4]   2>   "shard":"shard1",
   [junit4]   2>   "node_name":"127.0.0.1:41464_",
   [junit4]   2>   "core_node_name":"core_node1",
   [junit4]   2>   "core":"collection1"}
   [junit4]   2> 1280044 INFO  (TEST-DeleteInactiveReplicaTest.deleteInactiveReplicaTest-seed#[E1B754C76534C2C8]) [    ] o.a.s.c.c.SolrZkClient Using default ZkCredentialsProvider
   [junit4]   2> 1280045 INFO  (TEST-DeleteInactiveReplicaTest.deleteInactiveReplicaTest-seed#[E1B754C76534C2C8]) [    ] o.a.s.c.c.ConnectionManager Waiting for client to connect to ZooKeeper
   [junit4]   2> 1280046 INFO  (zkCallback-969-thread-1) [    ] o.a.s.c.c.ConnectionManager Watcher org.apache.solr.common.cloud.ConnectionManager@508124cf name:ZooKeeperConnection Watcher:127.0.0.1:58492/solr got event WatchedEvent state:SyncConnected type:None path:null path:null type:None
   [junit4]   2> 1280046 INFO  (TEST-DeleteInactiveReplicaTest.deleteInactiveReplicaTest-seed#[E1B754C76534C2C8]) [    ] o.a.s.c.c.ConnectionManager Client is connected to ZooKeeper
   [junit4]   2> 1280046 INFO  (TEST-DeleteInactiveReplicaTest.deleteInactiveReplicaTest-seed#[E1B754C76534C2C8]) [    ] o.a.s.c.c.SolrZkClient Using default ZkACLProvider
   [junit4]   2> 1280046 INFO  (TEST-DeleteInactiveReplicaTest.deleteInactiveReplicaTest-seed#[E1B754C76534C2C8]) [    ] o.a.s.c.c.ZkStateReader Updating cluster state from ZooKeeper... 
   [junit4]   2> 1280047 INFO  (TEST-DeleteInactiveReplicaTest.deleteInactiveReplicaTest-seed#[E1B754C76534C2C8]) [    ] o.a.s.c.ChaosMonkey monkey: init - expire sessions:false cause connection loss:false
   [junit4]   2> 1280074 INFO  (zkCallback-967-thread-1-processing-n:127.0.0.1:41464_) [n:127.0.0.1:41464_    ] o.a.s.c.c.ZkStateReader A cluster state change: WatchedEvent state:SyncConnected type:NodeDataChanged path:/clusterstate.json, has occurred - updating... (live nodes size: 1)
   [junit4]   2> 1280074 INFO  (zkCallback-969-thread-1) [    ] o.a.s.c.c.ZkStateReader A cluster state change: WatchedEvent state:SyncConnected type:NodeDataChanged path:/clusterstate.json, has occurred - updating... (live nodes size: 1)
   [junit4]   2> 1280095 INFO  (TEST-DeleteInactiveReplicaTest.deleteInactiveReplicaTest-seed#[E1B754C76534C2C8]) [    ] o.a.s.SolrTestCaseJ4 Writing core.properties file to /home/jenkins/workspace/Lucene-Solr-5.4-Linux/solr/build/solr-core/test/J0/temp/solr.cloud.DeleteInactiveReplicaTest_E1B754C76534C2C8-001/shard-1-001/cores/collection1
   [junit4]   2> 1280096 INFO  (TEST-DeleteInactiveReplicaTest.deleteInactiveReplicaTest-seed#[E1B754C76534C2C8]) [    ] o.a.s.c.AbstractFullDistribZkTestBase create jetty 1 in directory /home/jenkins/workspace/Lucene-Solr-5.4-Linux/solr/build/solr-core/test/J0/temp/solr.cloud.DeleteInactiveReplicaTest_E1B754C76534C2C8-001/shard-1-001
   [junit4]   2> 1280096 INFO  (TEST-DeleteInactiveReplicaTest.deleteInactiveReplicaTest-seed#[E1B754C76534C2C8]) [    ] o.e.j.s.Server jetty-9.2.13.v20150730
   [junit4]   2> 1280097 INFO  (TEST-DeleteInactiveReplicaTest.deleteInactiveReplicaTest-seed#[E1B754C76534C2C8]) [    ] o.e.j.s.h.ContextHandler Started o.e.j.s.ServletContextHandler@7638db2{/,null,AVAILABLE}
   [junit4]   2> 1280097 INFO  (TEST-DeleteInactiveReplicaTest.deleteInactiveReplicaTest-seed#[E1B754C76534C2C8]) [    ] o.e.j.s.ServerConnector Started ServerConnector@3669f876{HTTP/1.1}{127.0.0.1:33422}
   [junit4]   2> 1280098 INFO  (TEST-DeleteInactiveReplicaTest.deleteInactiveReplicaTest-seed#[E1B754C76534C2C8]) [    ] o.e.j.s.Server Started @1281562ms
   [junit4]   2> 1280098 INFO  (TEST-DeleteInactiveReplicaTest.deleteInactiveReplicaTest-seed#[E1B754C76534C2C8]) [    ] o.a.s.c.s.e.JettySolrRunner Jetty properties: {coreRootDirectory=/home/jenkins/workspace/Lucene-Solr-5.4-Linux/solr/build/solr-core/test/J0/temp/solr.cloud.DeleteInactiveReplicaTest_E1B754C76534C2C8-001/shard-1-001/cores, hostContext=/, solr.data.dir=/home/jenkins/workspace/Lucene-Solr-5.4-Linux/solr/build/solr-core/test/J0/temp/solr.cloud.DeleteInactiveReplicaTest_E1B754C76534C2C8-001/tempDir-001/jetty1, hostPort=33422, solrconfig=solrconfig.xml}
   [junit4]   2> 1280098 INFO  (TEST-DeleteInactiveReplicaTest.deleteInactiveReplicaTest-seed#[E1B754C76534C2C8]) [    ] o.a.s.s.SolrDispatchFilter SolrDispatchFilter.init(): sun.misc.Launcher$AppClassLoader@8f8acd0
   [junit4]   2> 1280098 INFO  (TEST-DeleteInactiveReplicaTest.deleteInactiveReplicaTest-seed#[E1B754C76534C2C8]) [    ] o.a.s.c.SolrResourceLoader new SolrResourceLoader for directory: '/home/jenkins/workspace/Lucene-Solr-5.4-Linux/solr/build/solr-core/test/J0/temp/solr.cloud.DeleteInactiveReplicaTest_E1B754C76534C2C8-001/shard-1-001'
   [junit4]   2> 1280098 INFO  (TEST-DeleteInactiveReplicaTest.deleteInactiveReplicaTest-seed#[E1B754C76534C2C8]) [    ] o.a.s.c.SolrResourceLoader JNDI not configured for solr (NoInitialContextEx)
   [junit4]   2> 1280098 INFO  (TEST-DeleteInactiveReplicaTest.deleteInactiveReplicaTest-seed#[E1B754C76534C2C8]) [    ] o.a.s.c.SolrResourceLoader solr home defaulted to 'solr/' (could not find system property or JNDI)
   [junit4]   2> 1280098 INFO  (TEST-DeleteInactiveReplicaTest.deleteInactiveReplicaTest-seed#[E1B754C76534C2C8]) [    ] o.a.s.c.c.SolrZkClient Using default ZkCredentialsProvider
   [junit4]   2> 1280099 INFO  (TEST-DeleteInactiveReplicaTest.deleteInactiveReplicaTest-seed#[E1B754C76534C2C8]) [    ] o.a.s.c.c.ConnectionManager Waiting for client to connect to ZooKeeper
   [junit4]   2> 1280100 INFO  (zkCallback-970-thread-1) [    ] o.a.s.c.c.ConnectionManager Watcher org.apache.solr.common.cloud.ConnectionManager@1817f2b name:ZooKeeperConnection Watcher:127.0.0.1:58492/solr got event WatchedEvent state:SyncConnected type:None path:null path:null type:None
   [junit4]   2> 1280100 INFO  (TEST-DeleteInactiveReplicaTest.deleteInactiveReplicaTest-seed#[E1B754C76534C2C8]) [    ] o.a.s.c.c.ConnectionManager Client is connected to ZooKeeper
   [junit4]   2> 1280100 INFO  (TEST-DeleteInactiveReplicaTest.deleteInactiveReplicaTest-seed#[E1B754C76534C2C8]) [    ] o.a.s.c.c.SolrZkClient Using default ZkACLProvider
   [junit4]   2> 1280101 INFO  (TEST-DeleteInactiveReplicaTest.deleteInactiveReplicaTest-seed#[E1B754C76534C2C8]) [    ] o.a.s.s.SolrDispatchFilter Loading solr.xml from SolrHome (not found in ZooKeeper)
   [junit4]   2> 1280101 INFO  (TEST-DeleteInactiveReplicaTest.deleteInactiveReplicaTest-seed#[E1B754C76534C2C8]) [    ] o.a.s.c.SolrXmlConfig Loading container configuration from /home/jenkins/workspace/Lucene-Solr-5.4-Linux/solr/build/solr-core/test/J0/temp/solr.cloud.DeleteInactiveReplicaTest_E1B754C76534C2C8-001/shard-1-001/solr.xml
   [junit4]   2> 1280114 INFO  (TEST-DeleteInactiveReplicaTest.deleteInactiveReplicaTest-seed#[E1B754C76534C2C8]) [    ] o.a.s.c.CoresLocator Config-defined core root directory: /home/jenkins/workspace/Lucene-Solr-5.4-Linux/solr/build/solr-core/test/J0/temp/solr.cloud.DeleteInactiveReplicaTest_E1B754C76534C2C8-001/shard-1-001/cores
   [junit4]   2> 1280115 INFO  (TEST-DeleteInactiveReplicaTest.deleteInactiveReplicaTest-seed#[E1B754C76534C2C8]) [    ] o.a.s.c.CoreContainer New CoreContainer 157911298
   [junit4]   2> 1280115 INFO  (TEST-DeleteInactiveReplicaTest.deleteInactiveReplicaTest-seed#[E1B754C76534C2C8]) [    ] o.a.s.c.CoreContainer Loading cores into CoreContainer [instanceDir=/home/jenkins/workspace/Lucene-Solr-5.4-Linux/solr/build/solr-core/test/J0/temp/solr.cloud.DeleteInactiveReplicaTest_E1B754C76534C2C8-001/shard-1-001]
   [junit4]   2> 1280115 WARN  (TEST-DeleteInactiveReplicaTest.deleteInactiveReplicaTest-seed#[E1B754C76534C2C8]) [    ] o.a.s.c.CoreContainer Couldn't add files from /home/jenkins/workspace/Lucene-Solr-5.4-Linux/solr/build/solr-core/test/J0/temp/solr.cloud.DeleteInactiveReplicaTest_E1B754C76534C2C8-001/shard-1-001/lib to classpath: /home/jenkins/workspace/Lucene-Solr-5.4-Linux/solr/build/solr-core/test/J0/temp/solr.cloud.DeleteInactiveReplicaTest_E1B754C76534C2C8-001/shard-1-001/lib
   [junit4]   2> 1280115 INFO  (TEST-DeleteInactiveReplicaTest.deleteInactiveReplicaTest-seed#[E1B754C76534C2C8]) [    ] o.a.s.h.c.HttpShardHandlerFactory created with socketTimeout : 90000,urlScheme : ,connTimeout : 15000,maxConnectionsPerHost : 20,maxConnections : 10000,corePoolSize : 0,maximumPoolSize : 2147483647,maxThreadIdleTime : 5,sizeOfQueue : -1,fairnessPolicy : false,useRetries : false,
   [junit4]   2> 1280116 INFO  (TEST-DeleteInactiveReplicaTest.deleteInactiveReplicaTest-seed#[E1B754C76534C2C8]) [    ] o.a.s.u.UpdateShardHandler Creating UpdateShardHandler HTTP client with params: socketTimeout=340000&connTimeout=45000&retry=true
   [junit4]   2> 1280117 INFO  (TEST-DeleteInactiveReplicaTest.deleteInactiveReplicaTest-seed#[E1B754C76534C2C8]) [    ] o.a.s.l.LogWatcher SLF4J impl is org.slf4j.impl.Log4jLoggerFactory
   [junit4]   2> 1280117 INFO  (TEST-DeleteInactiveReplicaTest.deleteInactiveReplicaTest-seed#[E1B754C76534C2C8]) [    ] o.a.s.l.LogWatcher Registering Log Listener [Log4j (org.slf4j.impl.Log4jLoggerFactory)]
   [junit4]   2> 1280117 INFO  (TEST-DeleteInactiveReplicaTest.deleteInactiveReplicaTest-seed#[E1B754C76534C2C8]) [    ] o.a.s.c.ZkContainer Zookeeper client=127.0.0.1:58492/solr
   [junit4]   2> 1280117 INFO  (TEST-DeleteInactiveReplicaTest.deleteInactiveReplicaTest-seed#[E1B754C76534C2C8]) [    ] o.a.s.c.ZkController zkHost includes chroot
   [junit4]   2> 1280118 INFO  (TEST-DeleteInactiveReplicaTest.deleteInactiveReplicaTest-seed#[E1B754C76534C2C8]) [    ] o.a.s.c.c.SolrZkClient Using default ZkCredentialsProvider
   [junit4]   2> 1280118 INFO  (TEST-DeleteInactiveReplicaTest.deleteInactiveReplicaTest-seed#[E1B754C76534C2C8]) [    ] o.a.s.c.c.ConnectionManager Waiting for client to connect to ZooKeeper
   [junit4]   2> 1280119 INFO  (zkCallback-972-thread-1) [    ] o.a.s.c.c.ConnectionManager Watcher org.apache.solr.common.cloud.ConnectionManager@a4ac25b name:ZooKeeperConnection Watcher:127.0.0.1:58492 got event WatchedEvent state:SyncConnected type:None path:null path:null type:None
   [junit4]   2> 1280119 INFO  (TEST-DeleteInactiveReplicaTest.deleteInactiveReplicaTest-seed#[E1B754C76534C2C8]) [    ] o.a.s.c.c.ConnectionManager Client is connected to ZooKeeper
   [junit4]   2> 1280119 INFO  (TEST-DeleteInactiveReplicaTest.deleteInactiveReplicaTest-seed#[E1B754C76534C2C8]) [    ] o.a.s.c.c.SolrZkClient Using default ZkACLProvider
   [junit4]   2> 1280120 INFO  (TEST-DeleteInactiveReplicaTest.deleteInactiveReplicaTest-seed#[E1B754C76534C2C8]) [n:127.0.0.1:33422_    ] o.a.s.c.c.ConnectionManager Waiting for client to connect to ZooKeeper
   [junit4]   2> 1280121 INFO  (zkCallback-973-thread-1-processing-n:127.0.0.1:33422_) [n:127.0.0.1:33422_    ] o.a.s.c.c.ConnectionManager Watcher org.apache.solr.common.cloud.ConnectionManager@34291486 name:ZooKeeperConnection Watcher:127.0.0.1:58492/solr got event WatchedEvent state:SyncConnected type:None path:null path:null type:None
   [junit4]   2> 1280121 INFO  (TEST-DeleteInactiveReplicaTest.deleteInactiveReplicaTest-seed#[E1B754C76534C2C8]) [n:127.0.0.1:33422_    ] o.a.s.c.c.ConnectionManager Client is connected to ZooKeeper
   [junit4]   2> 1280123 INFO  (TEST-DeleteInactiveReplicaTest.deleteInactiveReplicaTest-seed#[E1B754C76534C2C8]) [n:127.0.0.1:33422_    ] o.a.s.c.c.ZkStateReader Updating cluster state from ZooKeeper... 
   [junit4]   2> 1281126 INFO  (TEST-DeleteInactiveReplicaTest.deleteInactiveReplicaTest-seed#[E1B754C76534C2C8]) [n:127.0.0.1:33422_    ] o.a.s.c.ZkController Register node as live in ZooKeeper:/live_nodes/127.0.0.1:33422_
   [junit4]   2> 1281126 INFO  (TEST-DeleteInactiveReplicaTest.deleteInactiveReplicaTest-seed#[E1B754C76534C2C8]) [n:127.0.0.1:33422_    ] o.a.s.c.c.SolrZkClient makePath: /live_nodes/127.0.0.1:33422_
   [junit4]   2> 1281127 INFO  (zkCallback-973-thread-1-processing-n:127.0.0.1:33422_) [n:127.0.0.1:33422_    ] o.a.s.c.c.ZkStateReader A live node change: WatchedEvent state:SyncConnected type:NodeChildrenChanged path:/live_nodes, has occurred - updating... (live nodes size: 1)
   [junit4]   2> 1281127 INFO  (zkCallback-969-thread-1) [    ] o.a.s.c.c.ZkStateReader A live node change: WatchedEvent state:SyncConnected type:NodeChildrenChanged path:/live_nodes, has occurred - updating... (live nodes size: 1)
   [junit4]   2> 1281127 INFO  (zkCallback-967-thread-2-processing-n:127.0.0.1:41464_) [n:127.0.0.1:41464_    ] o.a.s.c.c.ZkStateReader A live node change: WatchedEvent state:SyncConnected type:NodeChildrenChanged path:/live_nodes, has occurred - updating... (live nodes size: 1)
   [junit4]   2> 1281127 INFO  (TEST-DeleteInactiveReplicaTest.deleteInactiveReplicaTest-seed#[E1B754C76534C2C8]) [n:127.0.0.1:33422_    ] o.a.s.c.Overseer Overseer (id=null) closing
   [junit4]   2> 1281127 INFO  (TEST-DeleteInactiveReplicaTest.deleteInactiveReplicaTest-seed#[E1B754C76534C2C8]) [n:127.0.0.1:33422_    ] o.a.s.c.LeaderElector Joined leadership election with path: /overseer_elect/election/94939838050271240-127.0.0.1:33422_-n_0000000001
   [junit4]   2> 1281128 INFO  (TEST-DeleteInactiveReplicaTest.deleteInactiveReplicaTest-seed#[E1B754C76534C2C8]) [n:127.0.0.1:33422_    ] o.a.s.c.LeaderElector Watching path /overseer_elect/election/94939838050271236-127.0.0.1:41464_-n_0000000000 to know if I could be the leader
   [junit4]   2> 1281144 INFO  (TEST-DeleteInactiveReplicaTest.deleteInactiveReplicaTest-seed#[E1B754C76534C2C8]) [n:127.0.0.1:33422_    ] o.a.s.c.CoreContainer Security conf doesn't exist. Skipping setup for authorization module.
   [junit4]   2> 1281144 INFO  (TEST-DeleteInactiveReplicaTest.deleteInactiveReplicaTest-seed#[E1B754C76534C2C8]) [n:127.0.0.1:33422_    ] o.a.s.c.CoreContainer No authentication plugin used.
   [junit4]   2> 1281144 INFO  (TEST-DeleteInactiveReplicaTest.deleteInactiveReplicaTest-seed#[E1B754C76534C2C8]) [n:127.0.0.1:33422_    ] o.a.s.c.CoresLocator Looking for core definitions underneath /home/jenkins/workspace/Lucene-Solr-5.4-Linux/solr/build/solr-core/test/J0/temp/solr.cloud.DeleteInactiveReplicaTest_E1B754C76534C2C8-001/shard-1-001/cores
   [junit4]   2> 1281145 INFO  (TEST-DeleteInactiveReplicaTest.deleteInactiveReplicaTest-seed#[E1B754C76534C2C8]) [n:127.0.0.1:33422_    ] o.a.s.c.SolrCore Created CoreDescriptor: {name=collection1, collection=collection1, dataDir=data/, transient=false, loadOnStartup=true, shard=, absoluteInstDir=/home/jenkins/workspace/Lucene-Solr-5.4-Linux/solr/build/solr-core/test/J0/temp/solr.cloud.DeleteInactiveReplicaTest_E1B754C76534C2C8-001/shard-1-001/cores/collection1/, config=solrconfig.xml, configSetProperties=configsetprops.json, coreNodeName=, instanceDir=/home/jenkins/workspace/Lucene-Solr-5.4-Linux/solr/build/solr-core/test/J0/temp/solr.cloud.DeleteInactiveReplicaTest_E1B754C76534C2C8-001/shard-1-001/cores/collection1, schema=schema.xml}
   [junit4]   2> 1281145 INFO  (TEST-DeleteInactiveReplicaTest.deleteInactiveReplicaTest-seed#[E1B754C76534C2C8]) [n:127.0.0.1:33422_    ] o.a.s.c.CoresLocator Found core collection1 in /home/jenkins/workspace/Lucene-Solr-5.4-Linux/solr/build/solr-core/test/J0/temp/solr.cloud.DeleteInactiveReplicaTest_E1B754C76534C2C8-001/shard-1-001/cores/collection1/
   [junit4]   2> 1281145 INFO  (TEST-DeleteInactiveReplicaTest.deleteInactiveReplicaTest-seed#[E1B754C76534C2C8]) [n:127.0.0.1:33422_    ] o.a.s.c.CoresLocator Found 1 core definitions
   [junit4]   2> 1281146 INFO  (TEST-DeleteInactiveReplicaTest.deleteInactiveReplicaTest-seed#[E1B754C76534C2C8]) [n:127.0.0.1:33422_    ] o.a.s.s.SolrDispatchFilter user.dir=/home/jenkins/workspace/Lucene-Solr-5.4-Linux/solr/build/solr-core/test/J0
   [junit4]   2> 1281146 INFO  (TEST-DeleteInactiveReplicaTest.deleteInactiveReplicaTest-seed#[E1B754C76534C2C8]) [n:127.0.0.1:33422_    ] o.a.s.s.SolrDispatchFilter SolrDispatchFilter.init() done
   [junit4]   2> 1281146 INFO  (coreLoadExecutor-4077-thread-1-processing-n:127.0.0.1:33422_) [n:127.0.0.1:33422_ c:collection1   x:collection1] o.a.s.c.ZkController publishing state=down
   [junit4]   2> 1281146 INFO  (coreLoadExecutor-4077-thread-1-processing-n:127.0.0.1:33422_) [n:127.0.0.1:33422_ c:collection1   x:collection1] o.a.s.c.ZkController numShards not found on descriptor - reading it from system property
   [junit4]   2> 1281147 INFO  (coreLoadExecutor-4077-thread-1-processing-n:127.0.0.1:33422_) [n:127.0.0.1:33422_ c:collection1   x:collection1] o.a.s.c.ZkController look for our core node name
   [junit4]   2> 1281147 INFO  (OverseerStateUpdate-94939838050271236-127.0.0.1:41464_-n_0000000000) [n:127.0.0.1:41464_    ] o.a.s.c.Overseer processMessage: queueSize: 1, message = {
   [junit4]   2>   "numShards":"2",
   [junit4]   2>   "collection":"collection1",
   [junit4]   2>   "state":"down",
   [junit4]   2>   "roles":null,
   [junit4]   2>   "operation":"state",
   [junit4]   2>   "base_url":"http://127.0.0.1:33422",
   [junit4]   2>   "shard":null,
   [junit4]   2>   "node_name":"127.0.0.1:33422_",
   [junit4]   2>   "core":"collection1"} current state version: 3
   [junit4]   2> 1281147 INFO  (OverseerStateUpdate-94939838050271236-127.0.0.1:41464_-n_0000000000) [n:127.0.0.1:41464_    ] o.a.s.c.o.ReplicaMutator Update state numShards=2 message={
   [junit4]   2>   "numShards":"2",
   [junit4]   2>   "collection":"collection1",
   [junit4]   2>   "state":"down",
   [junit4]   2>   "roles":null,
   [junit4]   2>   "operation":"state",
   [junit4]   2>   "base_url":"http://127.0.0.1:33422",
   [junit4]   2>   "shard":null,
   [junit4]   2>   "node_name":"127.0.0.1:33422_",
   [junit4]   2>   "core":"collection1"}
   [junit4]   2> 1281147 INFO  (OverseerStateUpdate-94939838050271236-127.0.0.1:41464_-n_0000000000) [n:127.0.0.1:41464_    ] o.a.s.c.o.ClusterStateMutator building a new cName: collection1
   [junit4]   2> 1281147 INFO  (OverseerStateUpdate-94939838050271236-127.0.0.1:41464_-n_0000000000) [n:127.0.0.1:41464_    ] o.a.s.c.o.ReplicaMutator Assigning new node to shard shard=shard2
   [junit4]   2> 1281249 INFO  (zkCallback-969-thread-1) [    ] o.a.s.c.c.ZkStateReader A cluster state change: WatchedEvent state:SyncConnected type:NodeDataChanged path:/clusterstate.json, has occurred - updating... (live nodes size: 2)
   [junit4]   2> 1281249 INFO  (zkCallback-967-thread-2-processing-n:127.0.0.1:41464_) [n:127.0.0.1:41464_    ] o.a.s.c.c.ZkStateReader A cluster state change: WatchedEvent state:SyncConnected type:NodeDataChanged path:/clusterstate.json, has occurred - updating... (live nodes size: 2)
   [junit4]   2> 1281249 INFO  (zkCallback-973-thread-1-processing-n:127.0.0.1:33422_) [n:127.0.0.1:33422_    ] o.a.s.c.c.ZkStateReader A cluster state change: WatchedEvent state:SyncConnected type:NodeDataChanged path:/clusterstate.json, has occurred - updating... (live nodes size: 2)
   [junit4]   2> 1282147 INFO  (coreLoadExecutor-4077-thread-1-processing-n:127.0.0.1:33422_) [n:127.0.0.1:33422_ c:collection1   x:collection1] o.a.s.c.ZkController waiting to find shard id in clusterstate for collection1
   [junit4]   2> 1282147 INFO  (coreLoadExecutor-4077-thread-1-processing-n:127.0.0.1:33422_) [n:127.0.0.1:33422_ c:collection1   x:collection1] o.a.s.c.ZkController Check for collection zkNode:collection1
   [junit4]   2> 1282147 INFO  (coreLoadExecutor-4077-thread-1-processing-n:127.0.0.1:33422_) [n:127.0.0.1:33422_ c:collection1   x:collection1] o.a.s.c.ZkController Collection zkNode exists
   [junit4]   2> 1282147 INFO  (coreLoadExecutor-4077-thread-1-processing-n:127.0.0.1:33422_) [n:127.0.0.1:33422_ c:collection1   x:collection1] o.a.s.c.c.ZkStateReader Load collection config from:/collections/collection1
   [junit4]   2> 1282148 INFO  (coreLoadExecutor-4077-thread-1-processing-n:127.0.0.1:33422_) [n:127.0.0.1:33422_ c:collection1   x:collection1] o.a.s.c.c.ZkStateReader path=/collections/collection1 configName=conf1 specified config exists in ZooKeeper
   [junit4]   2> 1282148 INFO  (coreLoadExecutor-4077-thread-1-processing-n:127.0.0.1:33422_) [n:127.0.0.1:33422_ c:collection1   x:collection1] o.a.s.c.SolrResourceLoader new SolrResourceLoader for directory: '/home/jenkins/workspace/Lucene-Solr-5.4-Linux/solr/build/solr-core/test/J0/temp/solr.cloud.DeleteInactiveReplicaTest_E1B754C76534C2C8-001/shard-1-001/cores/collection1'
   [junit4]   2> 1282148 INFO  (coreLoadExecutor-4077-thread-1-processing-n:127.0.0.1:33422_) [n:127.0.0.1:33422_ c:collection1   x:collection1] o.a.s.c.SolrResourceLoader JNDI not configured for solr (NoInitialContextEx)
   [junit4]   2> 1282148 INFO  (coreLoadExecutor-4077-thread-1-processing-n:127.0.0.1:33422_) [n:127.0.0.1:33422_ c:collection1   x:collection1] o.a.s.c.SolrResourceLoader solr home defaulted to 'solr/' (could not find system property or JNDI)
   [junit4]   2> 1282149 INFO  (coreLoadExecutor-4077-thread-1-processing-n:127.0.0.1:33422_) [n:127.0.0.1:33422_ c:collection1   x:collection1] o.a.s.c.Config loaded config solrconfig.xml with version 0 
   [junit4]   2> 1282154 INFO  (coreLoadExecutor-4077-thread-1-processing-n:127.0.0.1:33422_) [n:127.0.0.1:33422_ c:collection1   x:collection1] o.a.s.c.SolrConfig current version of requestparams : -1
   [junit4]   2> 1282167 INFO  (coreLoadExecutor-4077-thread-1-processing-n:127.0.0.1:33422_) [n:127.0.0.1:33422_ c:collection1   x:collection1] o.a.s.c.SolrConfig Using Lucene MatchVersion: 5.4.0
   [junit4]   2> 1282193 INFO  (coreLoadExecutor-4077-thread-1-processing-n:127.0.0.1:33422_) [n:127.0.0.1:33422_ c:collection1   x:collection1] o.a.s.c.Config Loaded SolrConfig: solrconfig.xml
   [junit4]   2> 1282199 INFO  (coreLoadExecutor-4077-thread-1-processing-n:127.0.0.1:33422_) [n:127.0.0.1:33422_ c:collection1   x:collection1] o.a.s.s.IndexSchema [collection1] Schema name=test
   [junit4]   2> 1282365 INFO  (coreLoadExecutor-4077-thread-1-processing-n:127.0.0.1:33422_) [n:127.0.0.1:33422_ c:collection1   x:collection1] o.a.s.s.OpenExchangeRatesOrgProvider Initialized with rates=open-exchange-rates.json, refreshInterval=1440.
   [junit4]   2> 1282371 INFO  (coreLoadExecutor-4077-thread-1-processing-n:127.0.0.1:33422_) [n:127.0.0.1:33422_ c:collection1   x:collection1] o.a.s.s.IndexSchema default search field in schema is text
   [junit4]   2> 1282372 INFO  (coreLoadExecutor-4077-thread-1-processing-n:127.0.0.1:33422_) [n:127.0.0.1:33422_ c:collection1   x:collection1] o.a.s.s.IndexSchema unique key field: id
   [junit4]   2> 1282377 INFO  (coreLoadExecutor-4077-thread-1-processing-n:127.0.0.1:33422_) [n:127.0.0.1:33422_ c:collection1   x:collection1] o.a.s.s.FileExchangeRateProvider Reloading exchange rates from file currency.xml
   [junit4]   2> 1282379 INFO  (coreLoadExecutor-4077-thread-1-processing-n:127.0.0.1:33422_) [n:127.0.0.1:33422_ c:collection1   x:collection1] o.a.s.s.FileExchangeRateProvider Reloading exchange rates from file currency.xml
   [junit4]   2> 1282381 INFO  (coreLoadExecutor-4077-thread-1-processing-n:127.0.0.1:33422_) [n:127.0.0.1:33422_ c:collection1   x:collection1] o.a.s.s.OpenExchangeRatesOrgProvider Reloading exchange rates from open-exchange-rates.json
   [junit4]   2> 1282381 WARN  (coreLoadExecutor-4077-thread-1-processing-n:127.0.0.1:33422_) [n:127.0.0.1:33422_ c:collection1   x:collection1] o.a.s.s.OpenExchangeRatesOrgProvider Unknown key IMPORTANT NOTE
   [junit4]   2> 1282381 WARN  (coreLoadExecutor-4077-thread-1-processing-n:127.0.0.1:33422_) [n:127.0.0.1:33422_ c:collection1   x:collection1] o.a.s.s.OpenExchangeRatesOrgProvider Expected key, got STRING
   [junit4]   2> 1282381 INFO  (coreLoadExecutor-4077-thread-1-processing-n:127.0.0.1:33422_) [n:127.0.0.1:33422_ c:collection1   x:collection1] o.a.s.s.OpenExchangeRatesOrgProvider Reloading exchange rates from open-exchange-rates.json
   [junit4]   2> 1282382 WARN  (coreLoadExecutor-4077-thread-1-processing-n:127.0.0.1:33422_) [n:127.0.0.1:33422_ c:collection1   x:collection1] o.a.s.s.OpenExchangeRatesOrgProvider Unknown key IMPORTANT NOTE
   [junit4]   2> 1282382 WARN  (coreLoadExecutor-4077-thread-1-processing-n:127.0.0.1:33422_) [n:127.0.0.1:33422_ c:collection1   x:collection1] o.a.s.s.OpenExchangeRatesOrgProvider Expected key, got STRING
   [junit4]   2> 1282382 INFO  (coreLoadExecutor-4077-thread-1-processing-n:127.0.0.1:33422_) [n:127.0.0.1:33422_ c:collection1   x:collection1] o.a.s.c.ConfigSetProperties Did not find ConfigSet proper

[...truncated too long message...]

492 58492
   [junit4]   2> 1356791 WARN  (Thread-3378) [    ] o.a.s.c.ZkTestServer Watch limit violations: 
   [junit4]   2> Maximum concurrent create/delete watches above limit:
   [junit4]   2> 
   [junit4]   2> 	8	/solr/aliases.json
   [junit4]   2> 	5	/solr/security.json
   [junit4]   2> 	5	/solr/configs/conf1
   [junit4]   2> 
   [junit4]   2> Maximum concurrent data watches above limit:
   [junit4]   2> 
   [junit4]   2> 	8	/solr/clusterstate.json
   [junit4]   2> 	3	/solr/overseer_elect/election/94939838050271236-127.0.0.1:41464_-n_0000000000
   [junit4]   2> 	2	/solr/overseer_elect/election/94939838050271243-127.0.0.1:58733_-n_0000000002
   [junit4]   2> 
   [junit4]   2> Maximum concurrent children watches above limit:
   [junit4]   2> 
   [junit4]   2> 	8	/solr/collections
   [junit4]   2> 	8	/solr/live_nodes
   [junit4]   2> 	2	/solr/overseer/collection-queue-work
   [junit4]   2> 	2	/solr/overseer/queue
   [junit4]   2> 
   [junit4]   2> NOTE: reproduce with: ant test  -Dtestcase=DeleteInactiveReplicaTest -Dtests.method=deleteInactiveReplicaTest -Dtests.seed=E1B754C76534C2C8 -Dtests.multiplier=3 -Dtests.slow=true -Dtests.locale=hr_HR -Dtests.timezone=America/St_Johns -Dtests.asserts=true -Dtests.file.encoding=UTF-8
   [junit4] ERROR   78.5s J0 | DeleteInactiveReplicaTest.deleteInactiveReplicaTest <<<
   [junit4]    > Throwable #1: org.apache.solr.client.solrj.SolrServerException: Server refused connection at: http://127.0.0.1:58733
   [junit4]    > 	at __randomizedtesting.SeedInfo.seed([E1B754C76534C2C8:2C89CF342A95B42A]:0)
   [junit4]    > 	at org.apache.solr.client.solrj.impl.HttpSolrClient.executeMethod(HttpSolrClient.java:581)
   [junit4]    > 	at org.apache.solr.client.solrj.impl.HttpSolrClient.request(HttpSolrClient.java:240)
   [junit4]    > 	at org.apache.solr.client.solrj.impl.HttpSolrClient.request(HttpSolrClient.java:229)
   [junit4]    > 	at org.apache.solr.client.solrj.SolrClient.request(SolrClient.java:1220)
   [junit4]    > 	at org.apache.solr.cloud.DeleteInactiveReplicaTest.deleteInactiveReplicaTest(DeleteInactiveReplicaTest.java:128)
   [junit4]    > 	at org.apache.solr.BaseDistributedSearchTestCase$ShardsRepeatRule$ShardsFixedStatement.callStatement(BaseDistributedSearchTestCase.java:963)
   [junit4]    > 	at org.apache.solr.BaseDistributedSearchTestCase$ShardsRepeatRule$ShardsStatement.evaluate(BaseDistributedSearchTestCase.java:938)
   [junit4]    > 	at java.lang.Thread.run(Thread.java:745)
   [junit4]    > Caused by: java.net.ConnectException: Connection refused
   [junit4]    > 	at java.net.PlainSocketImpl.socketConnect(Native Method)
   [junit4]    > 	at java.net.AbstractPlainSocketImpl.doConnect(AbstractPlainSocketImpl.java:339)
   [junit4]    > 	at java.net.AbstractPlainSocketImpl.connectToAddress(AbstractPlainSocketImpl.java:200)
   [junit4]    > 	at java.net.AbstractPlainSocketImpl.connect(AbstractPlainSocketImpl.java:182)
   [junit4]    > 	at java.net.SocksSocketImpl.connect(SocksSocketImpl.java:392)
   [junit4]    > 	at java.net.Socket.connect(Socket.java:579)
   [junit4]    > 	at org.apache.http.conn.scheme.PlainSocketFactory.connectSocket(PlainSocketFactory.java:117)
   [junit4]    > 	at org.apache.http.impl.conn.DefaultClientConnectionOperator.openConnection(DefaultClientConnectionOperator.java:177)
   [junit4]    > 	at org.apache.http.impl.conn.ManagedClientConnectionImpl.open(ManagedClientConnectionImpl.java:304)
   [junit4]    > 	at org.apache.http.impl.client.DefaultRequestDirector.tryConnect(DefaultRequestDirector.java:611)
   [junit4]    > 	at org.apache.http.impl.client.DefaultRequestDirector.execute(DefaultRequestDirector.java:446)
   [junit4]    > 	at org.apache.http.impl.client.AbstractHttpClient.doExecute(AbstractHttpClient.java:882)
   [junit4]    > 	at org.apache.http.impl.client.CloseableHttpClient.execute(CloseableHttpClient.java:82)
   [junit4]    > 	at org.apache.http.impl.client.CloseableHttpClient.execute(CloseableHttpClient.java:107)
   [junit4]    > 	at org.apache.http.impl.client.CloseableHttpClient.execute(CloseableHttpClient.java:55)
   [junit4]    > 	at org.apache.solr.client.solrj.impl.HttpSolrClient.executeMethod(HttpSolrClient.java:479)
   [junit4]    > 	... 45 more
   [junit4]   2> 1356793 INFO  (SUITE-DeleteInactiveReplicaTest-seed#[E1B754C76534C2C8]-worker) [n:127.0.0.1:46108_ c:collection1 s:shard1 r:core_node4 x:collection1] o.a.s.SolrTestCaseJ4 ###deleteCore
   [junit4]   2> NOTE: leaving temporary files on disk at: /home/jenkins/workspace/Lucene-Solr-5.4-Linux/solr/build/solr-core/test/J0/temp/solr.cloud.DeleteInactiveReplicaTest_E1B754C76534C2C8-001
   [junit4]   2> Nov 27, 2015 11:30:40 PM com.carrotsearch.randomizedtesting.ThreadLeakControl checkThreadLeaks
   [junit4]   2> WARNING: Will linger awaiting termination of 6 leaked thread(s).
   [junit4]   2> NOTE: test params are: codec=Asserting(Lucene54): {}, docValues:{}, sim=RandomSimilarityProvider(queryNorm=false,coord=no): {}, locale=hr_HR, timezone=America/St_Johns
   [junit4]   2> NOTE: Linux 3.19.0-33-generic amd64/Oracle Corporation 1.7.0_80 (64-bit)/cpus=12,threads=1,free=161483568,total=518979584
   [junit4]   2> NOTE: All tests run in this JVM: [AnalysisErrorHandlingTest, TestRawTransformer, TestLuceneMatchVersion, EchoParamsTest, TestRTGBase, TestRTimerTree, TestLazyCores, IndexSchemaRuntimeFieldTest, TestRandomFaceting, TestBulkSchemaAPI, TestJoin, HdfsDirectoryTest, CleanupOldIndexTest, TestRealTimeGet, HdfsWriteToMultipleCollectionsTest, TestIBSimilarityFactory, DistributedSuggestComponentTest, CopyFieldTest, DistribJoinFromCollectionTest, UUIDFieldTest, TestExceedMaxTermLength, TestPhraseSuggestions, TestReloadAndDeleteDocs, TestCursorMarkWithoutUniqueKey, TestPivotHelperCode, TestDocSet, TestEmbeddedSolrServerConstructors, AsyncMigrateRouteKeyTest, VMParamsZkACLAndCredentialsProvidersTest, TestOmitPositions, TestConfigReload, TestInitParams, TestSchemaManager, BasicDistributedZkTest, TestSearcherReuse, TestRemoveLastDynamicCopyField, BasicAuthIntegrationTest, TestFaceting, CachingDirectoryFactoryTest, TestDefaultSearchFieldResource, SolrCoreTest, DocValuesMissingTest, URLClassifyProcessorTest, DisMaxRequestHandlerTest, TestNRTOpen, HdfsLockFactoryTest, ActionThrottleTest, LeaderElectionIntegrationTest, TestRandomMergePolicy, ResponseLogComponentTest, TestReplicationHandler, TestBinaryField, TestAnalyzedSuggestions, CurrencyFieldOpenExchangeTest, DistributedFacetPivotSmallAdvancedTest, DocumentAnalysisRequestHandlerTest, AnalysisAfterCoreReloadTest, DeleteShardTest, SSLMigrationTest, DistributedSpellCheckComponentTest, TestFieldCollectionResource, HttpPartitionTest, ParsingFieldUpdateProcessorsTest, TestRandomDVFaceting, EnumFieldTest, PreAnalyzedFieldTest, TestReqParamsAPI, OverriddenZkACLAndCredentialsProvidersTest, ChangedSchemaMergeTest, FileBasedSpellCheckerTest, TestFastOutputStream, TestJsonFacets, HdfsDirectoryFactoryTest, TestSortByMinMaxFunction, SolrCloudExampleTest, TestRecoveryHdfs, ExitableDirectoryReaderTest, CoreMergeIndexesAdminHandlerTest, BasicZkTest, QueryEqualityTest, ReturnFieldsTest, PathHierarchyTokenizerFactoryTest, TestUniqueKeyFieldResource, TestLRUCache, TestFieldSortValues, DistributedDebugComponentTest, TestSolrConfigHandler, SegmentsInfoRequestHandlerTest, TestValueSourceCache, TestDocBasedVersionConstraints, SyncSliceTest, OpenCloseCoreStressTest, OverseerTest, FullSolrCloudDistribCmdsTest, ZkCLITest, TestDistributedSearch, TestSort, TestFunctionQuery, DirectUpdateHandlerTest, TestBadConfig, TestIndexSearcher, DistributedQueryElevationComponentTest, SimplePostToolTest, SignatureUpdateProcessorFactoryTest, SpellCheckCollatorTest, TestFoldingMultitermQuery, SuggesterTSTTest, TestTrie, PolyFieldTest, FieldMutatingUpdateProcessorTest, DefaultValueUpdateProcessorTest, StatelessScriptUpdateProcessorFactoryTest, TestRemoteStreaming, TestSolrDeletionPolicy1, DebugComponentTest, TestQueryUtils, StandardRequestHandlerTest, TestReversedWildcardFilterFactory, XmlUpdateRequestHandlerTest, TermVectorComponentTest, RequiredFieldsTest, LoggingHandlerTest, TestJmxIntegration, JSONWriterTest, BinaryUpdateRequestHandlerTest, PingRequestHandlerTest, TestMergePolicyConfig, TestSolrDeletionPolicy2, SampleTest, NumericFieldsTest, TestElisionMultitermQuery, TestConfig, OutputWriterTest, ExternalFileFieldSortTest, TestSolrCoreProperties, SpellPossibilityIteratorTest, TestCodecSupport, TestXIncludeConfig, TestLMJelinekMercerSimilarityFactory, TimeZoneUtilsTest, PluginInfoTest, TestSuggestSpellingConverter, DateFieldTest, CircularListTest, CursorPagingTest, CollectionReloadTest, ConcurrentDeleteAndCreateCollectionTest, ConfigSetsAPITest, DeleteInactiveReplicaTest]
   [junit4] Completed [417/551] on J0 in 78.75s, 1 test, 1 error <<< FAILURES!

[...truncated 443 lines...]
BUILD FAILED
/home/jenkins/workspace/Lucene-Solr-5.4-Linux/build.xml:785: The following error occurred while executing this line:
/home/jenkins/workspace/Lucene-Solr-5.4-Linux/build.xml:729: The following error occurred while executing this line:
/home/jenkins/workspace/Lucene-Solr-5.4-Linux/build.xml:59: The following error occurred while executing this line:
/home/jenkins/workspace/Lucene-Solr-5.4-Linux/solr/build.xml:233: The following error occurred while executing this line:
/home/jenkins/workspace/Lucene-Solr-5.4-Linux/solr/common-build.xml:526: The following error occurred while executing this line:
/home/jenkins/workspace/Lucene-Solr-5.4-Linux/lucene/common-build.xml:1452: The following error occurred while executing this line:
/home/jenkins/workspace/Lucene-Solr-5.4-Linux/lucene/common-build.xml:1006: There were test failures: 551 suites (7 ignored), 2177 tests, 1 error, 76 ignored (38 assumptions) [seed: E1B754C76534C2C8]

Total time: 55 minutes 2 seconds
Build step 'Invoke Ant' marked build as failure
Archiving artifacts
[WARNINGS] Skipping publisher since build result is FAILURE
Recording test results
Email was triggered for: Failure - Any
Sending email for trigger: Failure - Any



Mime
View raw message