lucene-dev mailing list archives

Site index · List index
Message view « Date » · « Thread »
Top « Date » · « Thread »
From Apache Jenkins Server <jenk...@builds.apache.org>
Subject [JENKINS] Lucene-Solr-NightlyTests-5.x - Build # 1023 - Still Failing
Date Sat, 21 Nov 2015 06:06:40 GMT
Build: https://builds.apache.org/job/Lucene-Solr-NightlyTests-5.x/1023/

13 tests failed.
FAILED:  org.apache.solr.cloud.BasicDistributedZkTest.test

Error Message:
commitWithin did not work on node: http://127.0.0.1:55429/_u/a/collection1 expected:<68> but was:<67>

Stack Trace:
java.lang.AssertionError: commitWithin did not work on node: http://127.0.0.1:55429/_u/a/collection1 expected:<68> but was:<67>
	at __randomizedtesting.SeedInfo.seed([21BCE81C1D8DC87E:A9E8D7C6B371A586]:0)
	at org.junit.Assert.fail(Assert.java:93)
	at org.junit.Assert.failNotEquals(Assert.java:647)
	at org.junit.Assert.assertEquals(Assert.java:128)
	at org.junit.Assert.assertEquals(Assert.java:472)
	at org.apache.solr.cloud.BasicDistributedZkTest.test(BasicDistributedZkTest.java:333)
	at sun.reflect.NativeMethodAccessorImpl.invoke0(Native Method)
	at sun.reflect.NativeMethodAccessorImpl.invoke(NativeMethodAccessorImpl.java:57)
	at sun.reflect.DelegatingMethodAccessorImpl.invoke(DelegatingMethodAccessorImpl.java:43)
	at java.lang.reflect.Method.invoke(Method.java:606)
	at com.carrotsearch.randomizedtesting.RandomizedRunner.invoke(RandomizedRunner.java:1764)
	at com.carrotsearch.randomizedtesting.RandomizedRunner$8.evaluate(RandomizedRunner.java:871)
	at com.carrotsearch.randomizedtesting.RandomizedRunner$9.evaluate(RandomizedRunner.java:907)
	at com.carrotsearch.randomizedtesting.RandomizedRunner$10.evaluate(RandomizedRunner.java:921)
	at org.apache.solr.BaseDistributedSearchTestCase$ShardsRepeatRule$ShardsFixedStatement.callStatement(BaseDistributedSearchTestCase.java:963)
	at org.apache.solr.BaseDistributedSearchTestCase$ShardsRepeatRule$ShardsStatement.evaluate(BaseDistributedSearchTestCase.java:938)
	at com.carrotsearch.randomizedtesting.rules.SystemPropertiesRestoreRule$1.evaluate(SystemPropertiesRestoreRule.java:57)
	at org.apache.lucene.util.TestRuleSetupTeardownChained$1.evaluate(TestRuleSetupTeardownChained.java:50)
	at org.apache.lucene.util.AbstractBeforeAfterRule$1.evaluate(AbstractBeforeAfterRule.java:46)
	at org.apache.lucene.util.TestRuleThreadAndTestName$1.evaluate(TestRuleThreadAndTestName.java:49)
	at org.apache.lucene.util.TestRuleIgnoreAfterMaxFailures$1.evaluate(TestRuleIgnoreAfterMaxFailures.java:65)
	at org.apache.lucene.util.TestRuleMarkFailure$1.evaluate(TestRuleMarkFailure.java:48)
	at com.carrotsearch.randomizedtesting.rules.StatementAdapter.evaluate(StatementAdapter.java:36)
	at com.carrotsearch.randomizedtesting.ThreadLeakControl$StatementRunner.run(ThreadLeakControl.java:367)
	at com.carrotsearch.randomizedtesting.ThreadLeakControl.forkTimeoutingTask(ThreadLeakControl.java:809)
	at com.carrotsearch.randomizedtesting.ThreadLeakControl$3.evaluate(ThreadLeakControl.java:460)
	at com.carrotsearch.randomizedtesting.RandomizedRunner.runSingleTest(RandomizedRunner.java:880)
	at com.carrotsearch.randomizedtesting.RandomizedRunner$5.evaluate(RandomizedRunner.java:781)
	at com.carrotsearch.randomizedtesting.RandomizedRunner$6.evaluate(RandomizedRunner.java:816)
	at com.carrotsearch.randomizedtesting.RandomizedRunner$7.evaluate(RandomizedRunner.java:827)
	at com.carrotsearch.randomizedtesting.rules.StatementAdapter.evaluate(StatementAdapter.java:36)
	at com.carrotsearch.randomizedtesting.rules.SystemPropertiesRestoreRule$1.evaluate(SystemPropertiesRestoreRule.java:57)
	at org.apache.lucene.util.AbstractBeforeAfterRule$1.evaluate(AbstractBeforeAfterRule.java:46)
	at com.carrotsearch.randomizedtesting.rules.StatementAdapter.evaluate(StatementAdapter.java:36)
	at org.apache.lucene.util.TestRuleStoreClassName$1.evaluate(TestRuleStoreClassName.java:42)
	at com.carrotsearch.randomizedtesting.rules.NoShadowingOrOverridesOnMethodsRule$1.evaluate(NoShadowingOrOverridesOnMethodsRule.java:40)
	at com.carrotsearch.randomizedtesting.rules.NoShadowingOrOverridesOnMethodsRule$1.evaluate(NoShadowingOrOverridesOnMethodsRule.java:40)
	at com.carrotsearch.randomizedtesting.rules.StatementAdapter.evaluate(StatementAdapter.java:36)
	at com.carrotsearch.randomizedtesting.rules.StatementAdapter.evaluate(StatementAdapter.java:36)
	at com.carrotsearch.randomizedtesting.rules.StatementAdapter.evaluate(StatementAdapter.java:36)
	at org.apache.lucene.util.TestRuleAssertionsRequired$1.evaluate(TestRuleAssertionsRequired.java:54)
	at org.apache.lucene.util.TestRuleMarkFailure$1.evaluate(TestRuleMarkFailure.java:48)
	at org.apache.lucene.util.TestRuleIgnoreAfterMaxFailures$1.evaluate(TestRuleIgnoreAfterMaxFailures.java:65)
	at org.apache.lucene.util.TestRuleIgnoreTestSuites$1.evaluate(TestRuleIgnoreTestSuites.java:55)
	at com.carrotsearch.randomizedtesting.rules.StatementAdapter.evaluate(StatementAdapter.java:36)
	at com.carrotsearch.randomizedtesting.ThreadLeakControl$StatementRunner.run(ThreadLeakControl.java:367)
	at java.lang.Thread.run(Thread.java:745)


FAILED:  org.apache.solr.cloud.CollectionsAPIDistributedZkTest.test

Error Message:
Test abandoned because suite timeout was reached.

Stack Trace:
java.lang.Exception: Test abandoned because suite timeout was reached.
	at __randomizedtesting.SeedInfo.seed([21BCE81C1D8DC87E]:0)


FAILED:  junit.framework.TestSuite.org.apache.solr.cloud.CollectionsAPIDistributedZkTest

Error Message:
Suite timeout exceeded (>= 7200000 msec).

Stack Trace:
java.lang.Exception: Suite timeout exceeded (>= 7200000 msec).
	at __randomizedtesting.SeedInfo.seed([21BCE81C1D8DC87E]:0)


FAILED:  junit.framework.TestSuite.org.apache.solr.cloud.CollectionsAPIDistributedZkTest

Error Message:
Captured an uncaught exception in thread: Thread[id=82049, name=OverseerThreadFactory-2368-thread-1, state=RUNNABLE, group=Overseer collection creation process.]

Stack Trace:
com.carrotsearch.randomizedtesting.UncaughtExceptionError: Captured an uncaught exception in thread: Thread[id=82049, name=OverseerThreadFactory-2368-thread-1, state=RUNNABLE, group=Overseer collection creation process.]
Caused by: java.lang.OutOfMemoryError: GC overhead limit exceeded


FAILED:  junit.framework.TestSuite.org.apache.solr.cloud.CollectionsAPIDistributedZkTest

Error Message:
Captured an uncaught exception in thread: Thread[id=82082, name=OverseerThreadFactory-2368-thread-2, state=RUNNABLE, group=Overseer collection creation process.]

Stack Trace:
com.carrotsearch.randomizedtesting.UncaughtExceptionError: Captured an uncaught exception in thread: Thread[id=82082, name=OverseerThreadFactory-2368-thread-2, state=RUNNABLE, group=Overseer collection creation process.]
Caused by: java.lang.OutOfMemoryError: GC overhead limit exceeded
	at __randomizedtesting.SeedInfo.seed([21BCE81C1D8DC87E]:0)
	at org.apache.solr.cloud.OverseerCollectionMessageHandler.processResponse(OverseerCollectionMessageHandler.java:2395)
	at org.apache.solr.cloud.OverseerCollectionMessageHandler.processResponse(OverseerCollectionMessageHandler.java:2389)
	at org.apache.solr.cloud.OverseerCollectionMessageHandler.processResponses(OverseerCollectionMessageHandler.java:2282)
	at org.apache.solr.cloud.OverseerCollectionMessageHandler.createCollection(OverseerCollectionMessageHandler.java:2104)
	at org.apache.solr.cloud.OverseerCollectionMessageHandler.processMessage(OverseerCollectionMessageHandler.java:221)
	at org.apache.solr.cloud.OverseerTaskProcessor$Runner.run(OverseerTaskProcessor.java:434)
	at org.apache.solr.common.util.ExecutorUtil$MDCAwareThreadPoolExecutor$1.run(ExecutorUtil.java:231)
	at java.util.concurrent.ThreadPoolExecutor.runWorker(ThreadPoolExecutor.java:1145)
	at java.util.concurrent.ThreadPoolExecutor$Worker.run(ThreadPoolExecutor.java:615)
	at java.lang.Thread.run(Thread.java:745)


FAILED:  junit.framework.TestSuite.org.apache.solr.cloud.CollectionsAPIDistributedZkTest

Error Message:
Captured an uncaught exception in thread: Thread[id=82048, name=Scheduler-311063407, state=RUNNABLE, group=TGRP-CollectionsAPIDistributedZkTest]

Stack Trace:
com.carrotsearch.randomizedtesting.UncaughtExceptionError: Captured an uncaught exception in thread: Thread[id=82048, name=Scheduler-311063407, state=RUNNABLE, group=TGRP-CollectionsAPIDistributedZkTest]
Caused by: java.lang.OutOfMemoryError: GC overhead limit exceeded


FAILED:  junit.framework.TestSuite.org.apache.solr.cloud.CollectionsAPIDistributedZkTest

Error Message:
Captured an uncaught exception in thread: Thread[id=82217, name=OverseerThreadFactory-2368-thread-5, state=RUNNABLE, group=Overseer collection creation process.]

Stack Trace:
com.carrotsearch.randomizedtesting.UncaughtExceptionError: Captured an uncaught exception in thread: Thread[id=82217, name=OverseerThreadFactory-2368-thread-5, state=RUNNABLE, group=Overseer collection creation process.]
Caused by: java.lang.OutOfMemoryError: GC overhead limit exceeded


FAILED:  junit.framework.TestSuite.org.apache.solr.cloud.CollectionsAPIDistributedZkTest

Error Message:
Captured an uncaught exception in thread: Thread[id=82476, name=collection4, state=RUNNABLE, group=TGRP-CollectionsAPIDistributedZkTest]

Stack Trace:
com.carrotsearch.randomizedtesting.UncaughtExceptionError: Captured an uncaught exception in thread: Thread[id=82476, name=collection4, state=RUNNABLE, group=TGRP-CollectionsAPIDistributedZkTest]
Caused by: java.lang.RuntimeException: org.apache.solr.client.solrj.SolrServerException: No live SolrServers available to handle this request:[http://127.0.0.1:53143, http://127.0.0.1:56163, http://127.0.0.1:58347, http://127.0.0.1:51284, http://127.0.0.1:48252]
	at __randomizedtesting.SeedInfo.seed([21BCE81C1D8DC87E]:0)
	at org.apache.solr.cloud.CollectionsAPIDistributedZkTest$1CollectionThread.run(CollectionsAPIDistributedZkTest.java:886)
Caused by: org.apache.solr.client.solrj.SolrServerException: No live SolrServers available to handle this request:[http://127.0.0.1:53143, http://127.0.0.1:56163, http://127.0.0.1:58347, http://127.0.0.1:51284, http://127.0.0.1:48252]
	at org.apache.solr.client.solrj.impl.LBHttpSolrClient.request(LBHttpSolrClient.java:352)
	at org.apache.solr.client.solrj.impl.CloudSolrClient.sendRequest(CloudSolrClient.java:1099)
	at org.apache.solr.client.solrj.impl.CloudSolrClient.requestWithRetryOnStaleState(CloudSolrClient.java:870)
	at org.apache.solr.client.solrj.impl.CloudSolrClient.request(CloudSolrClient.java:806)
	at org.apache.solr.client.solrj.SolrClient.request(SolrClient.java:1220)
	at org.apache.solr.cloud.AbstractFullDistribZkTestBase.createCollection(AbstractFullDistribZkTestBase.java:1573)
	at org.apache.solr.cloud.AbstractFullDistribZkTestBase.createCollection(AbstractFullDistribZkTestBase.java:1594)
	at org.apache.solr.cloud.CollectionsAPIDistributedZkTest$1CollectionThread.run(CollectionsAPIDistributedZkTest.java:876)
Caused by: org.apache.solr.client.solrj.impl.HttpSolrClient$RemoteSolrException: Error from server at http://127.0.0.1:53143: KeeperErrorCode = Session expired for /overseer/collection-queue-work/qnr-
	at org.apache.solr.client.solrj.impl.HttpSolrClient.executeMethod(HttpSolrClient.java:575)
	at org.apache.solr.client.solrj.impl.HttpSolrClient.request(HttpSolrClient.java:241)
	at org.apache.solr.client.solrj.impl.HttpSolrClient.request(HttpSolrClient.java:230)
	at org.apache.solr.client.solrj.impl.LBHttpSolrClient.doRequest(LBHttpSolrClient.java:372)
	at org.apache.solr.client.solrj.impl.LBHttpSolrClient.request(LBHttpSolrClient.java:325)
	... 7 more


FAILED:  junit.framework.TestSuite.org.apache.solr.cloud.CollectionsAPIDistributedZkTest

Error Message:
Captured an uncaught exception in thread: Thread[id=82474, name=collection2, state=RUNNABLE, group=TGRP-CollectionsAPIDistributedZkTest]

Stack Trace:
com.carrotsearch.randomizedtesting.UncaughtExceptionError: Captured an uncaught exception in thread: Thread[id=82474, name=collection2, state=RUNNABLE, group=TGRP-CollectionsAPIDistributedZkTest]
Caused by: java.lang.RuntimeException: org.apache.solr.client.solrj.SolrServerException: No live SolrServers available to handle this request:[http://127.0.0.1:53143, http://127.0.0.1:56163, http://127.0.0.1:58347, http://127.0.0.1:51284, http://127.0.0.1:48252]
	at __randomizedtesting.SeedInfo.seed([21BCE81C1D8DC87E]:0)
	at org.apache.solr.cloud.CollectionsAPIDistributedZkTest$1CollectionThread.run(CollectionsAPIDistributedZkTest.java:886)
Caused by: org.apache.solr.client.solrj.SolrServerException: No live SolrServers available to handle this request:[http://127.0.0.1:53143, http://127.0.0.1:56163, http://127.0.0.1:58347, http://127.0.0.1:51284, http://127.0.0.1:48252]
	at org.apache.solr.client.solrj.impl.LBHttpSolrClient.request(LBHttpSolrClient.java:352)
	at org.apache.solr.client.solrj.impl.CloudSolrClient.sendRequest(CloudSolrClient.java:1099)
	at org.apache.solr.client.solrj.impl.CloudSolrClient.requestWithRetryOnStaleState(CloudSolrClient.java:870)
	at org.apache.solr.client.solrj.impl.CloudSolrClient.request(CloudSolrClient.java:806)
	at org.apache.solr.client.solrj.SolrClient.request(SolrClient.java:1220)
	at org.apache.solr.cloud.AbstractFullDistribZkTestBase.createCollection(AbstractFullDistribZkTestBase.java:1573)
	at org.apache.solr.cloud.AbstractFullDistribZkTestBase.createCollection(AbstractFullDistribZkTestBase.java:1594)
	at org.apache.solr.cloud.CollectionsAPIDistributedZkTest$1CollectionThread.run(CollectionsAPIDistributedZkTest.java:876)
Caused by: org.apache.solr.client.solrj.SolrServerException: Timeout occured while waiting response from server at: http://127.0.0.1:53143
	at org.apache.solr.client.solrj.impl.HttpSolrClient.executeMethod(HttpSolrClient.java:585)
	at org.apache.solr.client.solrj.impl.HttpSolrClient.request(HttpSolrClient.java:241)
	at org.apache.solr.client.solrj.impl.HttpSolrClient.request(HttpSolrClient.java:230)
	at org.apache.solr.client.solrj.impl.LBHttpSolrClient.doRequest(LBHttpSolrClient.java:372)
	at org.apache.solr.client.solrj.impl.LBHttpSolrClient.request(LBHttpSolrClient.java:325)
	... 7 more
Caused by: java.net.SocketTimeoutException: Read timed out
	at java.net.SocketInputStream.socketRead0(Native Method)
	at java.net.SocketInputStream.read(SocketInputStream.java:152)
	at java.net.SocketInputStream.read(SocketInputStream.java:122)
	at org.apache.http.impl.io.AbstractSessionInputBuffer.fillBuffer(AbstractSessionInputBuffer.java:160)
	at org.apache.http.impl.io.SocketInputBuffer.fillBuffer(SocketInputBuffer.java:84)
	at org.apache.http.impl.io.AbstractSessionInputBuffer.readLine(AbstractSessionInputBuffer.java:273)
	at org.apache.http.impl.conn.DefaultHttpResponseParser.parseHead(DefaultHttpResponseParser.java:140)
	at org.apache.http.impl.conn.DefaultHttpResponseParser.parseHead(DefaultHttpResponseParser.java:57)
	at org.apache.http.impl.io.AbstractMessageParser.parse(AbstractMessageParser.java:261)
	at org.apache.http.impl.AbstractHttpClientConnection.receiveResponseHeader(AbstractHttpClientConnection.java:283)
	at org.apache.http.impl.conn.DefaultClientConnection.receiveResponseHeader(DefaultClientConnection.java:251)
	at org.apache.http.impl.conn.ManagedClientConnectionImpl.receiveResponseHeader(ManagedClientConnectionImpl.java:197)
	at org.apache.http.protocol.HttpRequestExecutor.doReceiveResponse(HttpRequestExecutor.java:272)
	at org.apache.http.protocol.HttpRequestExecutor.execute(HttpRequestExecutor.java:124)
	at org.apache.http.impl.client.DefaultRequestDirector.tryExecute(DefaultRequestDirector.java:685)
	at org.apache.http.impl.client.DefaultRequestDirector.execute(DefaultRequestDirector.java:487)
	at org.apache.http.impl.client.AbstractHttpClient.doExecute(AbstractHttpClient.java:882)
	at org.apache.http.impl.client.CloseableHttpClient.execute(CloseableHttpClient.java:82)
	at org.apache.http.impl.client.CloseableHttpClient.execute(CloseableHttpClient.java:107)
	at org.apache.http.impl.client.CloseableHttpClient.execute(CloseableHttpClient.java:55)
	at org.apache.solr.client.solrj.impl.HttpSolrClient.executeMethod(HttpSolrClient.java:480)
	... 11 more


FAILED:  junit.framework.TestSuite.org.apache.solr.cloud.CollectionsAPIDistributedZkTest

Error Message:
Captured an uncaught exception in thread: Thread[id=82473, name=collection1, state=RUNNABLE, group=TGRP-CollectionsAPIDistributedZkTest]

Stack Trace:
com.carrotsearch.randomizedtesting.UncaughtExceptionError: Captured an uncaught exception in thread: Thread[id=82473, name=collection1, state=RUNNABLE, group=TGRP-CollectionsAPIDistributedZkTest]
Caused by: java.lang.RuntimeException: org.apache.solr.client.solrj.SolrServerException: No live SolrServers available to handle this request:[http://127.0.0.1:53143, http://127.0.0.1:56163, http://127.0.0.1:58347, http://127.0.0.1:51284, http://127.0.0.1:48252]
	at __randomizedtesting.SeedInfo.seed([21BCE81C1D8DC87E]:0)
	at org.apache.solr.cloud.CollectionsAPIDistributedZkTest$1CollectionThread.run(CollectionsAPIDistributedZkTest.java:886)
Caused by: org.apache.solr.client.solrj.SolrServerException: No live SolrServers available to handle this request:[http://127.0.0.1:53143, http://127.0.0.1:56163, http://127.0.0.1:58347, http://127.0.0.1:51284, http://127.0.0.1:48252]
	at org.apache.solr.client.solrj.impl.LBHttpSolrClient.request(LBHttpSolrClient.java:352)
	at org.apache.solr.client.solrj.impl.CloudSolrClient.sendRequest(CloudSolrClient.java:1099)
	at org.apache.solr.client.solrj.impl.CloudSolrClient.requestWithRetryOnStaleState(CloudSolrClient.java:870)
	at org.apache.solr.client.solrj.impl.CloudSolrClient.request(CloudSolrClient.java:806)
	at org.apache.solr.client.solrj.SolrClient.request(SolrClient.java:1220)
	at org.apache.solr.cloud.AbstractFullDistribZkTestBase.createCollection(AbstractFullDistribZkTestBase.java:1573)
	at org.apache.solr.cloud.AbstractFullDistribZkTestBase.createCollection(AbstractFullDistribZkTestBase.java:1594)
	at org.apache.solr.cloud.CollectionsAPIDistributedZkTest$1CollectionThread.run(CollectionsAPIDistributedZkTest.java:876)
Caused by: org.apache.solr.client.solrj.SolrServerException: Timeout occured while waiting response from server at: http://127.0.0.1:53143
	at org.apache.solr.client.solrj.impl.HttpSolrClient.executeMethod(HttpSolrClient.java:585)
	at org.apache.solr.client.solrj.impl.HttpSolrClient.request(HttpSolrClient.java:241)
	at org.apache.solr.client.solrj.impl.HttpSolrClient.request(HttpSolrClient.java:230)
	at org.apache.solr.client.solrj.impl.LBHttpSolrClient.doRequest(LBHttpSolrClient.java:372)
	at org.apache.solr.client.solrj.impl.LBHttpSolrClient.request(LBHttpSolrClient.java:325)
	... 7 more
Caused by: java.net.SocketTimeoutException: Read timed out
	at java.net.SocketInputStream.socketRead0(Native Method)
	at java.net.SocketInputStream.read(SocketInputStream.java:152)
	at java.net.SocketInputStream.read(SocketInputStream.java:122)
	at org.apache.http.impl.io.AbstractSessionInputBuffer.fillBuffer(AbstractSessionInputBuffer.java:160)
	at org.apache.http.impl.io.SocketInputBuffer.fillBuffer(SocketInputBuffer.java:84)
	at org.apache.http.impl.io.AbstractSessionInputBuffer.readLine(AbstractSessionInputBuffer.java:273)
	at org.apache.http.impl.conn.DefaultHttpResponseParser.parseHead(DefaultHttpResponseParser.java:140)
	at org.apache.http.impl.conn.DefaultHttpResponseParser.parseHead(DefaultHttpResponseParser.java:57)
	at org.apache.http.impl.io.AbstractMessageParser.parse(AbstractMessageParser.java:261)
	at org.apache.http.impl.AbstractHttpClientConnection.receiveResponseHeader(AbstractHttpClientConnection.java:283)
	at org.apache.http.impl.conn.DefaultClientConnection.receiveResponseHeader(DefaultClientConnection.java:251)
	at org.apache.http.impl.conn.ManagedClientConnectionImpl.receiveResponseHeader(ManagedClientConnectionImpl.java:197)
	at org.apache.http.protocol.HttpRequestExecutor.doReceiveResponse(HttpRequestExecutor.java:272)
	at org.apache.http.protocol.HttpRequestExecutor.execute(HttpRequestExecutor.java:124)
	at org.apache.http.impl.client.DefaultRequestDirector.tryExecute(DefaultRequestDirector.java:685)
	at org.apache.http.impl.client.DefaultRequestDirector.execute(DefaultRequestDirector.java:487)
	at org.apache.http.impl.client.AbstractHttpClient.doExecute(AbstractHttpClient.java:882)
	at org.apache.http.impl.client.CloseableHttpClient.execute(CloseableHttpClient.java:82)
	at org.apache.http.impl.client.CloseableHttpClient.execute(CloseableHttpClient.java:107)
	at org.apache.http.impl.client.CloseableHttpClient.execute(CloseableHttpClient.java:55)
	at org.apache.solr.client.solrj.impl.HttpSolrClient.executeMethod(HttpSolrClient.java:480)
	... 11 more


FAILED:  junit.framework.TestSuite.org.apache.solr.cloud.CollectionsAPIDistributedZkTest

Error Message:
Captured an uncaught exception in thread: Thread[id=82475, name=collection3, state=RUNNABLE, group=TGRP-CollectionsAPIDistributedZkTest]

Stack Trace:
com.carrotsearch.randomizedtesting.UncaughtExceptionError: Captured an uncaught exception in thread: Thread[id=82475, name=collection3, state=RUNNABLE, group=TGRP-CollectionsAPIDistributedZkTest]
Caused by: java.lang.RuntimeException: org.apache.solr.client.solrj.SolrServerException: No live SolrServers available to handle this request:[http://127.0.0.1:53143, http://127.0.0.1:56163, http://127.0.0.1:58347, http://127.0.0.1:51284, http://127.0.0.1:48252]
	at __randomizedtesting.SeedInfo.seed([21BCE81C1D8DC87E]:0)
	at org.apache.solr.cloud.CollectionsAPIDistributedZkTest$1CollectionThread.run(CollectionsAPIDistributedZkTest.java:886)
Caused by: org.apache.solr.client.solrj.SolrServerException: No live SolrServers available to handle this request:[http://127.0.0.1:53143, http://127.0.0.1:56163, http://127.0.0.1:58347, http://127.0.0.1:51284, http://127.0.0.1:48252]
	at org.apache.solr.client.solrj.impl.LBHttpSolrClient.request(LBHttpSolrClient.java:352)
	at org.apache.solr.client.solrj.impl.CloudSolrClient.sendRequest(CloudSolrClient.java:1099)
	at org.apache.solr.client.solrj.impl.CloudSolrClient.requestWithRetryOnStaleState(CloudSolrClient.java:870)
	at org.apache.solr.client.solrj.impl.CloudSolrClient.request(CloudSolrClient.java:806)
	at org.apache.solr.client.solrj.SolrClient.request(SolrClient.java:1220)
	at org.apache.solr.cloud.AbstractFullDistribZkTestBase.createCollection(AbstractFullDistribZkTestBase.java:1573)
	at org.apache.solr.cloud.AbstractFullDistribZkTestBase.createCollection(AbstractFullDistribZkTestBase.java:1594)
	at org.apache.solr.cloud.CollectionsAPIDistributedZkTest$1CollectionThread.run(CollectionsAPIDistributedZkTest.java:876)
Caused by: org.apache.solr.client.solrj.SolrServerException: Timeout occured while waiting response from server at: http://127.0.0.1:53143
	at org.apache.solr.client.solrj.impl.HttpSolrClient.executeMethod(HttpSolrClient.java:585)
	at org.apache.solr.client.solrj.impl.HttpSolrClient.request(HttpSolrClient.java:241)
	at org.apache.solr.client.solrj.impl.HttpSolrClient.request(HttpSolrClient.java:230)
	at org.apache.solr.client.solrj.impl.LBHttpSolrClient.doRequest(LBHttpSolrClient.java:372)
	at org.apache.solr.client.solrj.impl.LBHttpSolrClient.request(LBHttpSolrClient.java:325)
	... 7 more
Caused by: java.net.SocketTimeoutException: Read timed out
	at java.net.SocketInputStream.socketRead0(Native Method)
	at java.net.SocketInputStream.read(SocketInputStream.java:152)
	at java.net.SocketInputStream.read(SocketInputStream.java:122)
	at org.apache.http.impl.io.AbstractSessionInputBuffer.fillBuffer(AbstractSessionInputBuffer.java:160)
	at org.apache.http.impl.io.SocketInputBuffer.fillBuffer(SocketInputBuffer.java:84)
	at org.apache.http.impl.io.AbstractSessionInputBuffer.readLine(AbstractSessionInputBuffer.java:273)
	at org.apache.http.impl.conn.DefaultHttpResponseParser.parseHead(DefaultHttpResponseParser.java:140)
	at org.apache.http.impl.conn.DefaultHttpResponseParser.parseHead(DefaultHttpResponseParser.java:57)
	at org.apache.http.impl.io.AbstractMessageParser.parse(AbstractMessageParser.java:261)
	at org.apache.http.impl.AbstractHttpClientConnection.receiveResponseHeader(AbstractHttpClientConnection.java:283)
	at org.apache.http.impl.conn.DefaultClientConnection.receiveResponseHeader(DefaultClientConnection.java:251)
	at org.apache.http.impl.conn.ManagedClientConnectionImpl.receiveResponseHeader(ManagedClientConnectionImpl.java:197)
	at org.apache.http.protocol.HttpRequestExecutor.doReceiveResponse(HttpRequestExecutor.java:272)
	at org.apache.http.protocol.HttpRequestExecutor.execute(HttpRequestExecutor.java:124)
	at org.apache.http.impl.client.DefaultRequestDirector.tryExecute(DefaultRequestDirector.java:685)
	at org.apache.http.impl.client.DefaultRequestDirector.execute(DefaultRequestDirector.java:487)
	at org.apache.http.impl.client.AbstractHttpClient.doExecute(AbstractHttpClient.java:882)
	at org.apache.http.impl.client.CloseableHttpClient.execute(CloseableHttpClient.java:82)
	at org.apache.http.impl.client.CloseableHttpClient.execute(CloseableHttpClient.java:107)
	at org.apache.http.impl.client.CloseableHttpClient.execute(CloseableHttpClient.java:55)
	at org.apache.solr.client.solrj.impl.HttpSolrClient.executeMethod(HttpSolrClient.java:480)
	... 11 more


FAILED:  junit.framework.TestSuite.org.apache.solr.cloud.CollectionsAPIDistributedZkTest

Error Message:
Captured an uncaught exception in thread: Thread[id=82472, name=collection0, state=RUNNABLE, group=TGRP-CollectionsAPIDistributedZkTest]

Stack Trace:
com.carrotsearch.randomizedtesting.UncaughtExceptionError: Captured an uncaught exception in thread: Thread[id=82472, name=collection0, state=RUNNABLE, group=TGRP-CollectionsAPIDistributedZkTest]
Caused by: java.lang.RuntimeException: org.apache.solr.client.solrj.SolrServerException: No live SolrServers available to handle this request:[http://127.0.0.1:53143, http://127.0.0.1:56163, http://127.0.0.1:58347, http://127.0.0.1:48252]
	at __randomizedtesting.SeedInfo.seed([21BCE81C1D8DC87E]:0)
	at org.apache.solr.cloud.CollectionsAPIDistributedZkTest$1CollectionThread.run(CollectionsAPIDistributedZkTest.java:886)
Caused by: org.apache.solr.client.solrj.SolrServerException: No live SolrServers available to handle this request:[http://127.0.0.1:53143, http://127.0.0.1:56163, http://127.0.0.1:58347, http://127.0.0.1:48252]
	at org.apache.solr.client.solrj.impl.LBHttpSolrClient.request(LBHttpSolrClient.java:352)
	at org.apache.solr.client.solrj.impl.CloudSolrClient.sendRequest(CloudSolrClient.java:1099)
	at org.apache.solr.client.solrj.impl.CloudSolrClient.requestWithRetryOnStaleState(CloudSolrClient.java:870)
	at org.apache.solr.client.solrj.impl.CloudSolrClient.request(CloudSolrClient.java:806)
	at org.apache.solr.client.solrj.SolrClient.request(SolrClient.java:1220)
	at org.apache.solr.cloud.CollectionsAPIDistributedZkTest$1CollectionThread.run(CollectionsAPIDistributedZkTest.java:883)
Caused by: org.apache.solr.client.solrj.impl.HttpSolrClient$RemoteSolrException: Error from server at http://127.0.0.1:53143: KeeperErrorCode = Session expired for /overseer/collection-queue-work/qnr-
	at org.apache.solr.client.solrj.impl.HttpSolrClient.executeMethod(HttpSolrClient.java:575)
	at org.apache.solr.client.solrj.impl.HttpSolrClient.request(HttpSolrClient.java:241)
	at org.apache.solr.client.solrj.impl.HttpSolrClient.request(HttpSolrClient.java:230)
	at org.apache.solr.client.solrj.impl.LBHttpSolrClient.doRequest(LBHttpSolrClient.java:372)
	at org.apache.solr.client.solrj.impl.LBHttpSolrClient.request(LBHttpSolrClient.java:325)
	... 5 more


FAILED:  org.apache.solr.cloud.hdfs.HdfsUnloadDistributedZkTest.test

Error Message:
Captured an uncaught exception in thread: Thread[id=231725, name=testExecutor-8483-thread-8, state=RUNNABLE, group=TGRP-HdfsUnloadDistributedZkTest]

Stack Trace:
com.carrotsearch.randomizedtesting.UncaughtExceptionError: Captured an uncaught exception in thread: Thread[id=231725, name=testExecutor-8483-thread-8, state=RUNNABLE, group=TGRP-HdfsUnloadDistributedZkTest]
Caused by: org.apache.solr.client.solrj.impl.HttpSolrClient$RemoteSolrException: Error from server at http://127.0.0.1:32849/l: Error CREATEing SolrCore 'multiunload7': Unable to create core [multiunload7] Caused by: Direct buffer memory
	at __randomizedtesting.SeedInfo.seed([21BCE81C1D8DC87E]:0)
	at org.apache.solr.client.solrj.impl.HttpSolrClient.executeMethod(HttpSolrClient.java:575)
	at org.apache.solr.client.solrj.impl.HttpSolrClient.request(HttpSolrClient.java:241)
	at org.apache.solr.client.solrj.impl.HttpSolrClient.request(HttpSolrClient.java:230)
	at org.apache.solr.client.solrj.SolrClient.request(SolrClient.java:1220)
	at org.apache.solr.cloud.BasicDistributedZkTest$1.run(BasicDistributedZkTest.java:550)
	at org.apache.solr.common.util.ExecutorUtil$MDCAwareThreadPoolExecutor$1.run(ExecutorUtil.java:231)
	at java.util.concurrent.ThreadPoolExecutor.runWorker(ThreadPoolExecutor.java:1145)
	at java.util.concurrent.ThreadPoolExecutor$Worker.run(ThreadPoolExecutor.java:615)
	at java.lang.Thread.run(Thread.java:745)




Build Log:
[...truncated 10766 lines...]
   [junit4] Suite: org.apache.solr.cloud.BasicDistributedZkTest
   [junit4]   2> Creating dataDir: /x1/jenkins/jenkins-slave/workspace/Lucene-Solr-NightlyTests-5.x/solr/build/solr-core/test/J2/temp/solr.cloud.BasicDistributedZkTest_21BCE81C1D8DC87E-001/init-core-data-001
   [junit4]   2> 1058571 INFO  (SUITE-BasicDistributedZkTest-seed#[21BCE81C1D8DC87E]-worker) [    ] o.a.s.BaseDistributedSearchTestCase Setting hostContext system property: /_u/a
   [junit4]   2> 1058575 INFO  (TEST-BasicDistributedZkTest.test-seed#[21BCE81C1D8DC87E]) [    ] o.a.s.c.ZkTestServer STARTING ZK TEST SERVER
   [junit4]   2> 1058587 INFO  (Thread-7732) [    ] o.a.s.c.ZkTestServer client port:0.0.0.0/0.0.0.0:0
   [junit4]   2> 1058587 INFO  (Thread-7732) [    ] o.a.s.c.ZkTestServer Starting server
   [junit4]   2> 1058676 INFO  (TEST-BasicDistributedZkTest.test-seed#[21BCE81C1D8DC87E]) [    ] o.a.s.c.ZkTestServer start zk server on port:35702
   [junit4]   2> 1058676 INFO  (TEST-BasicDistributedZkTest.test-seed#[21BCE81C1D8DC87E]) [    ] o.a.s.c.c.SolrZkClient Using default ZkCredentialsProvider
   [junit4]   2> 1058677 INFO  (TEST-BasicDistributedZkTest.test-seed#[21BCE81C1D8DC87E]) [    ] o.a.s.c.c.ConnectionManager Waiting for client to connect to ZooKeeper
   [junit4]   2> 1058680 INFO  (zkCallback-951-thread-1) [    ] o.a.s.c.c.ConnectionManager Watcher org.apache.solr.common.cloud.ConnectionManager@677b2773 name:ZooKeeperConnection Watcher:127.0.0.1:35702 got event WatchedEvent state:SyncConnected type:None path:null path:null type:None
   [junit4]   2> 1058680 INFO  (TEST-BasicDistributedZkTest.test-seed#[21BCE81C1D8DC87E]) [    ] o.a.s.c.c.ConnectionManager Client is connected to ZooKeeper
   [junit4]   2> 1058681 INFO  (TEST-BasicDistributedZkTest.test-seed#[21BCE81C1D8DC87E]) [    ] o.a.s.c.c.SolrZkClient Using default ZkACLProvider
   [junit4]   2> 1058681 INFO  (TEST-BasicDistributedZkTest.test-seed#[21BCE81C1D8DC87E]) [    ] o.a.s.c.c.SolrZkClient makePath: /solr
   [junit4]   2> 1058685 INFO  (TEST-BasicDistributedZkTest.test-seed#[21BCE81C1D8DC87E]) [    ] o.a.s.c.c.SolrZkClient Using default ZkCredentialsProvider
   [junit4]   2> 1058685 INFO  (TEST-BasicDistributedZkTest.test-seed#[21BCE81C1D8DC87E]) [    ] o.a.s.c.c.ConnectionManager Waiting for client to connect to ZooKeeper
   [junit4]   2> 1058687 INFO  (zkCallback-952-thread-1) [    ] o.a.s.c.c.ConnectionManager Watcher org.apache.solr.common.cloud.ConnectionManager@f890479 name:ZooKeeperConnection Watcher:127.0.0.1:35702/solr got event WatchedEvent state:SyncConnected type:None path:null path:null type:None
   [junit4]   2> 1058687 INFO  (TEST-BasicDistributedZkTest.test-seed#[21BCE81C1D8DC87E]) [    ] o.a.s.c.c.ConnectionManager Client is connected to ZooKeeper
   [junit4]   2> 1058687 INFO  (TEST-BasicDistributedZkTest.test-seed#[21BCE81C1D8DC87E]) [    ] o.a.s.c.c.SolrZkClient Using default ZkACLProvider
   [junit4]   2> 1058687 INFO  (TEST-BasicDistributedZkTest.test-seed#[21BCE81C1D8DC87E]) [    ] o.a.s.c.c.SolrZkClient makePath: /collections/collection1
   [junit4]   2> 1058690 INFO  (TEST-BasicDistributedZkTest.test-seed#[21BCE81C1D8DC87E]) [    ] o.a.s.c.c.SolrZkClient makePath: /collections/collection1/shards
   [junit4]   2> 1058693 INFO  (TEST-BasicDistributedZkTest.test-seed#[21BCE81C1D8DC87E]) [    ] o.a.s.c.c.SolrZkClient makePath: /collections/control_collection
   [junit4]   2> 1058694 INFO  (TEST-BasicDistributedZkTest.test-seed#[21BCE81C1D8DC87E]) [    ] o.a.s.c.c.SolrZkClient makePath: /collections/control_collection/shards
   [junit4]   2> 1058697 INFO  (TEST-BasicDistributedZkTest.test-seed#[21BCE81C1D8DC87E]) [    ] o.a.s.c.AbstractZkTestCase put /x1/jenkins/jenkins-slave/workspace/Lucene-Solr-NightlyTests-5.x/solr/core/src/test-files/solr/collection1/conf/solrconfig-tlog.xml to /configs/conf1/solrconfig.xml
   [junit4]   2> 1058697 INFO  (TEST-BasicDistributedZkTest.test-seed#[21BCE81C1D8DC87E]) [    ] o.a.s.c.c.SolrZkClient makePath: /configs/conf1/solrconfig.xml
   [junit4]   2> 1058701 INFO  (TEST-BasicDistributedZkTest.test-seed#[21BCE81C1D8DC87E]) [    ] o.a.s.c.AbstractZkTestCase put /x1/jenkins/jenkins-slave/workspace/Lucene-Solr-NightlyTests-5.x/solr/core/src/test-files/solr/collection1/conf/schema.xml to /configs/conf1/schema.xml
   [junit4]   2> 1058702 INFO  (TEST-BasicDistributedZkTest.test-seed#[21BCE81C1D8DC87E]) [    ] o.a.s.c.c.SolrZkClient makePath: /configs/conf1/schema.xml
   [junit4]   2> 1058707 INFO  (TEST-BasicDistributedZkTest.test-seed#[21BCE81C1D8DC87E]) [    ] o.a.s.c.AbstractZkTestCase put /x1/jenkins/jenkins-slave/workspace/Lucene-Solr-NightlyTests-5.x/solr/core/src/test-files/solr/collection1/conf/solrconfig.snippet.randomindexconfig.xml to /configs/conf1/solrconfig.snippet.randomindexconfig.xml
   [junit4]   2> 1058707 INFO  (TEST-BasicDistributedZkTest.test-seed#[21BCE81C1D8DC87E]) [    ] o.a.s.c.c.SolrZkClient makePath: /configs/conf1/solrconfig.snippet.randomindexconfig.xml
   [junit4]   2> 1058709 INFO  (TEST-BasicDistributedZkTest.test-seed#[21BCE81C1D8DC87E]) [    ] o.a.s.c.AbstractZkTestCase put /x1/jenkins/jenkins-slave/workspace/Lucene-Solr-NightlyTests-5.x/solr/core/src/test-files/solr/collection1/conf/stopwords.txt to /configs/conf1/stopwords.txt
   [junit4]   2> 1058709 INFO  (TEST-BasicDistributedZkTest.test-seed#[21BCE81C1D8DC87E]) [    ] o.a.s.c.c.SolrZkClient makePath: /configs/conf1/stopwords.txt
   [junit4]   2> 1058712 INFO  (TEST-BasicDistributedZkTest.test-seed#[21BCE81C1D8DC87E]) [    ] o.a.s.c.AbstractZkTestCase put /x1/jenkins/jenkins-slave/workspace/Lucene-Solr-NightlyTests-5.x/solr/core/src/test-files/solr/collection1/conf/protwords.txt to /configs/conf1/protwords.txt
   [junit4]   2> 1058712 INFO  (TEST-BasicDistributedZkTest.test-seed#[21BCE81C1D8DC87E]) [    ] o.a.s.c.c.SolrZkClient makePath: /configs/conf1/protwords.txt
   [junit4]   2> 1058716 INFO  (TEST-BasicDistributedZkTest.test-seed#[21BCE81C1D8DC87E]) [    ] o.a.s.c.AbstractZkTestCase put /x1/jenkins/jenkins-slave/workspace/Lucene-Solr-NightlyTests-5.x/solr/core/src/test-files/solr/collection1/conf/currency.xml to /configs/conf1/currency.xml
   [junit4]   2> 1058716 INFO  (TEST-BasicDistributedZkTest.test-seed#[21BCE81C1D8DC87E]) [    ] o.a.s.c.c.SolrZkClient makePath: /configs/conf1/currency.xml
   [junit4]   2> 1058717 INFO  (TEST-BasicDistributedZkTest.test-seed#[21BCE81C1D8DC87E]) [    ] o.a.s.c.AbstractZkTestCase put /x1/jenkins/jenkins-slave/workspace/Lucene-Solr-NightlyTests-5.x/solr/core/src/test-files/solr/collection1/conf/enumsConfig.xml to /configs/conf1/enumsConfig.xml
   [junit4]   2> 1058718 INFO  (TEST-BasicDistributedZkTest.test-seed#[21BCE81C1D8DC87E]) [    ] o.a.s.c.c.SolrZkClient makePath: /configs/conf1/enumsConfig.xml
   [junit4]   2> 1058720 INFO  (TEST-BasicDistributedZkTest.test-seed#[21BCE81C1D8DC87E]) [    ] o.a.s.c.AbstractZkTestCase put /x1/jenkins/jenkins-slave/workspace/Lucene-Solr-NightlyTests-5.x/solr/core/src/test-files/solr/collection1/conf/open-exchange-rates.json to /configs/conf1/open-exchange-rates.json
   [junit4]   2> 1058720 INFO  (TEST-BasicDistributedZkTest.test-seed#[21BCE81C1D8DC87E]) [    ] o.a.s.c.c.SolrZkClient makePath: /configs/conf1/open-exchange-rates.json
   [junit4]   2> 1058723 INFO  (TEST-BasicDistributedZkTest.test-seed#[21BCE81C1D8DC87E]) [    ] o.a.s.c.AbstractZkTestCase put /x1/jenkins/jenkins-slave/workspace/Lucene-Solr-NightlyTests-5.x/solr/core/src/test-files/solr/collection1/conf/mapping-ISOLatin1Accent.txt to /configs/conf1/mapping-ISOLatin1Accent.txt
   [junit4]   2> 1058723 INFO  (TEST-BasicDistributedZkTest.test-seed#[21BCE81C1D8DC87E]) [    ] o.a.s.c.c.SolrZkClient makePath: /configs/conf1/mapping-ISOLatin1Accent.txt
   [junit4]   2> 1058725 INFO  (TEST-BasicDistributedZkTest.test-seed#[21BCE81C1D8DC87E]) [    ] o.a.s.c.AbstractZkTestCase put /x1/jenkins/jenkins-slave/workspace/Lucene-Solr-NightlyTests-5.x/solr/core/src/test-files/solr/collection1/conf/old_synonyms.txt to /configs/conf1/old_synonyms.txt
   [junit4]   2> 1058725 INFO  (TEST-BasicDistributedZkTest.test-seed#[21BCE81C1D8DC87E]) [    ] o.a.s.c.c.SolrZkClient makePath: /configs/conf1/old_synonyms.txt
   [junit4]   2> 1058727 INFO  (TEST-BasicDistributedZkTest.test-seed#[21BCE81C1D8DC87E]) [    ] o.a.s.c.AbstractZkTestCase put /x1/jenkins/jenkins-slave/workspace/Lucene-Solr-NightlyTests-5.x/solr/core/src/test-files/solr/collection1/conf/synonyms.txt to /configs/conf1/synonyms.txt
   [junit4]   2> 1058727 INFO  (TEST-BasicDistributedZkTest.test-seed#[21BCE81C1D8DC87E]) [    ] o.a.s.c.c.SolrZkClient makePath: /configs/conf1/synonyms.txt
   [junit4]   2> 1059017 INFO  (TEST-BasicDistributedZkTest.test-seed#[21BCE81C1D8DC87E]) [    ] o.a.s.SolrTestCaseJ4 Writing core.properties file to /x1/jenkins/jenkins-slave/workspace/Lucene-Solr-NightlyTests-5.x/solr/build/solr-core/test/J2/temp/solr.cloud.BasicDistributedZkTest_21BCE81C1D8DC87E-001/control-001/cores/collection1
   [junit4]   2> 1059018 INFO  (TEST-BasicDistributedZkTest.test-seed#[21BCE81C1D8DC87E]) [    ] o.e.j.s.Server jetty-9.2.13.v20150730
   [junit4]   2> 1059020 INFO  (TEST-BasicDistributedZkTest.test-seed#[21BCE81C1D8DC87E]) [    ] o.e.j.s.h.ContextHandler Started o.e.j.s.ServletContextHandler@26fb18ab{/_u/a,null,AVAILABLE}
   [junit4]   2> 1059022 INFO  (TEST-BasicDistributedZkTest.test-seed#[21BCE81C1D8DC87E]) [    ] o.e.j.s.ServerConnector Started ServerConnector@2f10968b{HTTP/1.1}{127.0.0.1:58806}
   [junit4]   2> 1059022 INFO  (TEST-BasicDistributedZkTest.test-seed#[21BCE81C1D8DC87E]) [    ] o.e.j.s.Server Started @1061961ms
   [junit4]   2> 1059022 INFO  (TEST-BasicDistributedZkTest.test-seed#[21BCE81C1D8DC87E]) [    ] o.a.s.c.s.e.JettySolrRunner Jetty properties: {hostContext=/_u/a, coreRootDirectory=/x1/jenkins/jenkins-slave/workspace/Lucene-Solr-NightlyTests-5.x/solr/build/solr-core/test/J2/../../../../../../../../../../x1/jenkins/jenkins-slave/workspace/Lucene-Solr-NightlyTests-5.x/solr/build/solr-core/test/J2/temp/solr.cloud.BasicDistributedZkTest_21BCE81C1D8DC87E-001/control-001/cores, hostPort=58806, solr.data.dir=/x1/jenkins/jenkins-slave/workspace/Lucene-Solr-NightlyTests-5.x/solr/build/solr-core/test/J2/temp/solr.cloud.BasicDistributedZkTest_21BCE81C1D8DC87E-001/tempDir-001/control/data}
   [junit4]   2> 1059022 INFO  (TEST-BasicDistributedZkTest.test-seed#[21BCE81C1D8DC87E]) [    ] o.a.s.s.SolrDispatchFilter SolrDispatchFilter.init(): sun.misc.Launcher$AppClassLoader@3827de24
   [junit4]   2> 1059022 INFO  (TEST-BasicDistributedZkTest.test-seed#[21BCE81C1D8DC87E]) [    ] o.a.s.c.SolrResourceLoader new SolrResourceLoader for directory: '/x1/jenkins/jenkins-slave/workspace/Lucene-Solr-NightlyTests-5.x/solr/build/solr-core/test/J2/temp/solr.cloud.BasicDistributedZkTest_21BCE81C1D8DC87E-001/control-001'
   [junit4]   2> 1059022 INFO  (TEST-BasicDistributedZkTest.test-seed#[21BCE81C1D8DC87E]) [    ] o.a.s.c.SolrResourceLoader JNDI not configured for solr (NoInitialContextEx)
   [junit4]   2> 1059023 INFO  (TEST-BasicDistributedZkTest.test-seed#[21BCE81C1D8DC87E]) [    ] o.a.s.c.SolrResourceLoader solr home defaulted to 'solr/' (could not find system property or JNDI)
   [junit4]   2> 1059023 INFO  (TEST-BasicDistributedZkTest.test-seed#[21BCE81C1D8DC87E]) [    ] o.a.s.c.c.SolrZkClient Using default ZkCredentialsProvider
   [junit4]   2> 1059024 INFO  (TEST-BasicDistributedZkTest.test-seed#[21BCE81C1D8DC87E]) [    ] o.a.s.c.c.ConnectionManager Waiting for client to connect to ZooKeeper
   [junit4]   2> 1059027 INFO  (zkCallback-953-thread-1) [    ] o.a.s.c.c.ConnectionManager Watcher org.apache.solr.common.cloud.ConnectionManager@1b7cd4fc name:ZooKeeperConnection Watcher:127.0.0.1:35702/solr got event WatchedEvent state:SyncConnected type:None path:null path:null type:None
   [junit4]   2> 1059027 INFO  (TEST-BasicDistributedZkTest.test-seed#[21BCE81C1D8DC87E]) [    ] o.a.s.c.c.ConnectionManager Client is connected to ZooKeeper
   [junit4]   2> 1059028 INFO  (TEST-BasicDistributedZkTest.test-seed#[21BCE81C1D8DC87E]) [    ] o.a.s.c.c.SolrZkClient Using default ZkACLProvider
   [junit4]   2> 1059029 INFO  (TEST-BasicDistributedZkTest.test-seed#[21BCE81C1D8DC87E]) [    ] o.a.s.s.SolrDispatchFilter Loading solr.xml from SolrHome (not found in ZooKeeper)
   [junit4]   2> 1059029 INFO  (TEST-BasicDistributedZkTest.test-seed#[21BCE81C1D8DC87E]) [    ] o.a.s.c.SolrXmlConfig Loading container configuration from /x1/jenkins/jenkins-slave/workspace/Lucene-Solr-NightlyTests-5.x/solr/build/solr-core/test/J2/temp/solr.cloud.BasicDistributedZkTest_21BCE81C1D8DC87E-001/control-001/solr.xml
   [junit4]   2> 1059056 INFO  (TEST-BasicDistributedZkTest.test-seed#[21BCE81C1D8DC87E]) [    ] o.a.s.c.CoresLocator Config-defined core root directory: /x1/jenkins/jenkins-slave/workspace/Lucene-Solr-NightlyTests-5.x/solr/build/solr-core/test/J2/../../../../../../../../../../x1/jenkins/jenkins-slave/workspace/Lucene-Solr-NightlyTests-5.x/solr/build/solr-core/test/J2/temp/solr.cloud.BasicDistributedZkTest_21BCE81C1D8DC87E-001/control-001/cores
   [junit4]   2> 1059057 INFO  (TEST-BasicDistributedZkTest.test-seed#[21BCE81C1D8DC87E]) [    ] o.a.s.c.CoreContainer New CoreContainer 313840481
   [junit4]   2> 1059057 INFO  (TEST-BasicDistributedZkTest.test-seed#[21BCE81C1D8DC87E]) [    ] o.a.s.c.CoreContainer Loading cores into CoreContainer [instanceDir=/x1/jenkins/jenkins-slave/workspace/Lucene-Solr-NightlyTests-5.x/solr/build/solr-core/test/J2/temp/solr.cloud.BasicDistributedZkTest_21BCE81C1D8DC87E-001/control-001]
   [junit4]   2> 1059057 WARN  (TEST-BasicDistributedZkTest.test-seed#[21BCE81C1D8DC87E]) [    ] o.a.s.c.CoreContainer Couldn't add files from /x1/jenkins/jenkins-slave/workspace/Lucene-Solr-NightlyTests-5.x/solr/build/solr-core/test/J2/temp/solr.cloud.BasicDistributedZkTest_21BCE81C1D8DC87E-001/control-001/lib to classpath: /x1/jenkins/jenkins-slave/workspace/Lucene-Solr-NightlyTests-5.x/solr/build/solr-core/test/J2/temp/solr.cloud.BasicDistributedZkTest_21BCE81C1D8DC87E-001/control-001/lib
   [junit4]   2> 1059057 INFO  (TEST-BasicDistributedZkTest.test-seed#[21BCE81C1D8DC87E]) [    ] o.a.s.h.c.HttpShardHandlerFactory created with socketTimeout : 90000,urlScheme : ,connTimeout : 15000,maxConnectionsPerHost : 20,maxConnections : 10000,corePoolSize : 0,maximumPoolSize : 2147483647,maxThreadIdleTime : 5,sizeOfQueue : -1,fairnessPolicy : false,useRetries : false,
   [junit4]   2> 1059059 INFO  (TEST-BasicDistributedZkTest.test-seed#[21BCE81C1D8DC87E]) [    ] o.a.s.u.UpdateShardHandler Creating UpdateShardHandler HTTP client with params: socketTimeout=340000&connTimeout=45000&retry=true
   [junit4]   2> 1059059 INFO  (TEST-BasicDistributedZkTest.test-seed#[21BCE81C1D8DC87E]) [    ] o.a.s.l.LogWatcher SLF4J impl is org.slf4j.impl.Log4jLoggerFactory
   [junit4]   2> 1059059 INFO  (TEST-BasicDistributedZkTest.test-seed#[21BCE81C1D8DC87E]) [    ] o.a.s.l.LogWatcher Registering Log Listener [Log4j (org.slf4j.impl.Log4jLoggerFactory)]
   [junit4]   2> 1059060 INFO  (TEST-BasicDistributedZkTest.test-seed#[21BCE81C1D8DC87E]) [    ] o.a.s.c.ZkContainer Zookeeper client=127.0.0.1:35702/solr
   [junit4]   2> 1059060 INFO  (TEST-BasicDistributedZkTest.test-seed#[21BCE81C1D8DC87E]) [    ] o.a.s.c.ZkController zkHost includes chroot
   [junit4]   2> 1059060 INFO  (TEST-BasicDistributedZkTest.test-seed#[21BCE81C1D8DC87E]) [    ] o.a.s.c.c.SolrZkClient Using default ZkCredentialsProvider
   [junit4]   2> 1059064 INFO  (TEST-BasicDistributedZkTest.test-seed#[21BCE81C1D8DC87E]) [    ] o.a.s.c.c.ConnectionManager Waiting for client to connect to ZooKeeper
   [junit4]   2> 1059067 INFO  (zkCallback-955-thread-1) [    ] o.a.s.c.c.ConnectionManager Watcher org.apache.solr.common.cloud.ConnectionManager@3b261b3a name:ZooKeeperConnection Watcher:127.0.0.1:35702 got event WatchedEvent state:SyncConnected type:None path:null path:null type:None
   [junit4]   2> 1059067 INFO  (TEST-BasicDistributedZkTest.test-seed#[21BCE81C1D8DC87E]) [    ] o.a.s.c.c.ConnectionManager Client is connected to ZooKeeper
   [junit4]   2> 1059067 INFO  (TEST-BasicDistributedZkTest.test-seed#[21BCE81C1D8DC87E]) [    ] o.a.s.c.c.SolrZkClient Using default ZkACLProvider
   [junit4]   2> 1059070 INFO  (TEST-BasicDistributedZkTest.test-seed#[21BCE81C1D8DC87E]) [n:127.0.0.1:58806__u%2Fa    ] o.a.s.c.c.ConnectionManager Waiting for client to connect to ZooKeeper
   [junit4]   2> 1059071 INFO  (zkCallback-956-thread-1-processing-n:127.0.0.1:58806__u%2Fa) [n:127.0.0.1:58806__u%2Fa    ] o.a.s.c.c.ConnectionManager Watcher org.apache.solr.common.cloud.ConnectionManager@1ff98886 name:ZooKeeperConnection Watcher:127.0.0.1:35702/solr got event WatchedEvent state:SyncConnected type:None path:null path:null type:None
   [junit4]   2> 1059071 INFO  (TEST-BasicDistributedZkTest.test-seed#[21BCE81C1D8DC87E]) [n:127.0.0.1:58806__u%2Fa    ] o.a.s.c.c.ConnectionManager Client is connected to ZooKeeper
   [junit4]   2> 1059072 INFO  (TEST-BasicDistributedZkTest.test-seed#[21BCE81C1D8DC87E]) [n:127.0.0.1:58806__u%2Fa    ] o.a.s.c.c.SolrZkClient makePath: /overseer/queue
   [junit4]   2> 1059074 INFO  (TEST-BasicDistributedZkTest.test-seed#[21BCE81C1D8DC87E]) [n:127.0.0.1:58806__u%2Fa    ] o.a.s.c.c.SolrZkClient makePath: /overseer/collection-queue-work
   [junit4]   2> 1059078 INFO  (TEST-BasicDistributedZkTest.test-seed#[21BCE81C1D8DC87E]) [n:127.0.0.1:58806__u%2Fa    ] o.a.s.c.c.SolrZkClient makePath: /overseer/collection-map-running
   [junit4]   2> 1059082 INFO  (TEST-BasicDistributedZkTest.test-seed#[21BCE81C1D8DC87E]) [n:127.0.0.1:58806__u%2Fa    ] o.a.s.c.c.SolrZkClient makePath: /overseer/collection-map-completed
   [junit4]   2> 1059085 INFO  (TEST-BasicDistributedZkTest.test-seed#[21BCE81C1D8DC87E]) [n:127.0.0.1:58806__u%2Fa    ] o.a.s.c.c.SolrZkClient makePath: /overseer/collection-map-failure
   [junit4]   2> 1059088 INFO  (TEST-BasicDistributedZkTest.test-seed#[21BCE81C1D8DC87E]) [n:127.0.0.1:58806__u%2Fa    ] o.a.s.c.c.SolrZkClient makePath: /live_nodes
   [junit4]   2> 1059092 INFO  (TEST-BasicDistributedZkTest.test-seed#[21BCE81C1D8DC87E]) [n:127.0.0.1:58806__u%2Fa    ] o.a.s.c.c.SolrZkClient makePath: /aliases.json
   [junit4]   2> 1059094 INFO  (TEST-BasicDistributedZkTest.test-seed#[21BCE81C1D8DC87E]) [n:127.0.0.1:58806__u%2Fa    ] o.a.s.c.c.SolrZkClient makePath: /clusterstate.json
   [junit4]   2> 1059097 INFO  (TEST-BasicDistributedZkTest.test-seed#[21BCE81C1D8DC87E]) [n:127.0.0.1:58806__u%2Fa    ] o.a.s.c.c.SolrZkClient makePath: /security.json
   [junit4]   2> 1059099 INFO  (TEST-BasicDistributedZkTest.test-seed#[21BCE81C1D8DC87E]) [n:127.0.0.1:58806__u%2Fa    ] o.a.s.c.ZkController Register node as live in ZooKeeper:/live_nodes/127.0.0.1:58806__u%2Fa
   [junit4]   2> 1059100 INFO  (TEST-BasicDistributedZkTest.test-seed#[21BCE81C1D8DC87E]) [n:127.0.0.1:58806__u%2Fa    ] o.a.s.c.c.SolrZkClient makePath: /live_nodes/127.0.0.1:58806__u%2Fa
   [junit4]   2> 1059103 INFO  (TEST-BasicDistributedZkTest.test-seed#[21BCE81C1D8DC87E]) [n:127.0.0.1:58806__u%2Fa    ] o.a.s.c.c.SolrZkClient makePath: /overseer_elect
   [junit4]   2> 1059105 INFO  (TEST-BasicDistributedZkTest.test-seed#[21BCE81C1D8DC87E]) [n:127.0.0.1:58806__u%2Fa    ] o.a.s.c.c.SolrZkClient makePath: /overseer_elect/election
   [junit4]   2> 1059106 INFO  (TEST-BasicDistributedZkTest.test-seed#[21BCE81C1D8DC87E]) [n:127.0.0.1:58806__u%2Fa    ] o.a.s.c.Overseer Overseer (id=null) closing
   [junit4]   2> 1059107 INFO  (TEST-BasicDistributedZkTest.test-seed#[21BCE81C1D8DC87E]) [n:127.0.0.1:58806__u%2Fa    ] o.a.s.c.LeaderElector Joined leadership election with path: /overseer_elect/election/94901234297077764-127.0.0.1:58806__u%2Fa-n_0000000000
   [junit4]   2> 1059107 INFO  (TEST-BasicDistributedZkTest.test-seed#[21BCE81C1D8DC87E]) [n:127.0.0.1:58806__u%2Fa    ] o.a.s.c.OverseerElectionContext I am going to be the leader 127.0.0.1:58806__u%2Fa
   [junit4]   2> 1059107 INFO  (TEST-BasicDistributedZkTest.test-seed#[21BCE81C1D8DC87E]) [n:127.0.0.1:58806__u%2Fa    ] o.a.s.c.c.SolrZkClient makePath: /overseer_elect/leader
   [junit4]   2> 1059110 INFO  (TEST-BasicDistributedZkTest.test-seed#[21BCE81C1D8DC87E]) [n:127.0.0.1:58806__u%2Fa    ] o.a.s.c.Overseer Overseer (id=94901234297077764-127.0.0.1:58806__u%2Fa-n_0000000000) starting
   [junit4]   2> 1059112 INFO  (TEST-BasicDistributedZkTest.test-seed#[21BCE81C1D8DC87E]) [n:127.0.0.1:58806__u%2Fa    ] o.a.s.c.c.SolrZkClient makePath: /overseer/queue-work
   [junit4]   2> 1059118 INFO  (TEST-BasicDistributedZkTest.test-seed#[21BCE81C1D8DC87E]) [n:127.0.0.1:58806__u%2Fa    ] o.a.s.c.OverseerAutoReplicaFailoverThread Starting OverseerAutoReplicaFailoverThread autoReplicaFailoverWorkLoopDelay=10000 autoReplicaFailoverWaitAfterExpiration=30000 autoReplicaFailoverBadNodeExpiration=60000
   [junit4]   2> 1059118 INFO  (TEST-BasicDistributedZkTest.test-seed#[21BCE81C1D8DC87E]) [n:127.0.0.1:58806__u%2Fa    ] o.a.s.c.c.ZkStateReader Updating cluster state from ZooKeeper... 
   [junit4]   2> 1059119 INFO  (OverseerStateUpdate-94901234297077764-127.0.0.1:58806__u%2Fa-n_0000000000) [n:127.0.0.1:58806__u%2Fa    ] o.a.s.c.Overseer Starting to work on the main queue
   [junit4]   2> 1059119 INFO  (OverseerCollectionConfigSetProcessor-94901234297077764-127.0.0.1:58806__u%2Fa-n_0000000000) [n:127.0.0.1:58806__u%2Fa    ] o.a.s.c.OverseerTaskProcessor Process current queue of overseer operations
   [junit4]   2> 1059163 INFO  (TEST-BasicDistributedZkTest.test-seed#[21BCE81C1D8DC87E]) [n:127.0.0.1:58806__u%2Fa    ] o.a.s.c.CoreContainer Security conf doesn't exist. Skipping setup for authorization module.
   [junit4]   2> 1059163 INFO  (TEST-BasicDistributedZkTest.test-seed#[21BCE81C1D8DC87E]) [n:127.0.0.1:58806__u%2Fa    ] o.a.s.c.CoreContainer No authentication plugin used.
   [junit4]   2> 1059169 INFO  (TEST-BasicDistributedZkTest.test-seed#[21BCE81C1D8DC87E]) [n:127.0.0.1:58806__u%2Fa    ] o.a.s.c.CoresLocator Looking for core definitions underneath /x1/jenkins/jenkins-slave/workspace/Lucene-Solr-NightlyTests-5.x/solr/build/solr-core/test/J2/../../../../../../../../../../x1/jenkins/jenkins-slave/workspace/Lucene-Solr-NightlyTests-5.x/solr/build/solr-core/test/J2/temp/solr.cloud.BasicDistributedZkTest_21BCE81C1D8DC87E-001/control-001/cores
   [junit4]   2> 1059171 INFO  (TEST-BasicDistributedZkTest.test-seed#[21BCE81C1D8DC87E]) [n:127.0.0.1:58806__u%2Fa    ] o.a.s.c.SolrCore Created CoreDescriptor: {dataDir=data/, config=solrconfig.xml, shard=, instanceDir=/x1/jenkins/jenkins-slave/workspace/Lucene-Solr-NightlyTests-5.x/solr/build/solr-core/test/J2/../../../../../../../../../../x1/jenkins/jenkins-slave/workspace/Lucene-Solr-NightlyTests-5.x/solr/build/solr-core/test/J2/temp/solr.cloud.BasicDistributedZkTest_21BCE81C1D8DC87E-001/control-001/cores/collection1, collection=control_collection, coreNodeName=, absoluteInstDir=/x1/jenkins/jenkins-slave/workspace/Lucene-Solr-NightlyTests-5.x/solr/build/solr-core/test/J2/../../../../../../../../../../x1/jenkins/jenkins-slave/workspace/Lucene-Solr-NightlyTests-5.x/solr/build/solr-core/test/J2/temp/solr.cloud.BasicDistributedZkTest_21BCE81C1D8DC87E-001/control-001/cores/collection1/, schema=schema.xml, loadOnStartup=true, name=collection1, transient=false, configSetProperties=configsetprops.json}
   [junit4]   2> 1059173 INFO  (TEST-BasicDistributedZkTest.test-seed#[21BCE81C1D8DC87E]) [n:127.0.0.1:58806__u%2Fa    ] o.a.s.c.CoresLocator Found core collection1 in /x1/jenkins/jenkins-slave/workspace/Lucene-Solr-NightlyTests-5.x/solr/build/solr-core/test/J2/../../../../../../../../../../x1/jenkins/jenkins-slave/workspace/Lucene-Solr-NightlyTests-5.x/solr/build/solr-core/test/J2/temp/solr.cloud.BasicDistributedZkTest_21BCE81C1D8DC87E-001/control-001/cores/collection1/
   [junit4]   2> 1059175 INFO  (TEST-BasicDistributedZkTest.test-seed#[21BCE81C1D8DC87E]) [n:127.0.0.1:58806__u%2Fa    ] o.a.s.c.CoresLocator Found 1 core definitions
   [junit4]   2> 1059182 INFO  (coreLoadExecutor-2966-thread-1-processing-n:127.0.0.1:58806__u%2Fa) [n:127.0.0.1:58806__u%2Fa c:control_collection   x:collection1] o.a.s.c.ZkController publishing state=down
   [junit4]   2> 1059182 INFO  (coreLoadExecutor-2966-thread-1-processing-n:127.0.0.1:58806__u%2Fa) [n:127.0.0.1:58806__u%2Fa c:control_collection   x:collection1] o.a.s.c.ZkController numShards not found on descriptor - reading it from system property
   [junit4]   2> 1059185 INFO  (coreLoadExecutor-2966-thread-1-processing-n:127.0.0.1:58806__u%2Fa) [n:127.0.0.1:58806__u%2Fa c:control_collection   x:collection1] o.a.s.c.ZkController look for our core node name
   [junit4]   2> 1059187 INFO  (TEST-BasicDistributedZkTest.test-seed#[21BCE81C1D8DC87E]) [n:127.0.0.1:58806__u%2Fa    ] o.a.s.s.SolrDispatchFilter user.dir=/x1/jenkins/jenkins-slave/workspace/Lucene-Solr-NightlyTests-5.x/solr/build/solr-core/test/J2
   [junit4]   2> 1059187 INFO  (TEST-BasicDistributedZkTest.test-seed#[21BCE81C1D8DC87E]) [n:127.0.0.1:58806__u%2Fa    ] o.a.s.s.SolrDispatchFilter SolrDispatchFilter.init() done
   [junit4]   2> 1059187 INFO  (OverseerStateUpdate-94901234297077764-127.0.0.1:58806__u%2Fa-n_0000000000) [n:127.0.0.1:58806__u%2Fa    ] o.a.s.c.Overseer processMessage: queueSize: 1, message = {
   [junit4]   2>   "operation":"state",
   [junit4]   2>   "core":"collection1",
   [junit4]   2>   "base_url":"http://127.0.0.1:58806/_u/a",
   [junit4]   2>   "collection":"control_collection",
   [junit4]   2>   "shard":null,
   [junit4]   2>   "roles":null,
   [junit4]   2>   "node_name":"127.0.0.1:58806__u%2Fa",
   [junit4]   2>   "numShards":"1",
   [junit4]   2>   "state":"down"} current state version: 0
   [junit4]   2> 1059188 INFO  (OverseerStateUpdate-94901234297077764-127.0.0.1:58806__u%2Fa-n_0000000000) [n:127.0.0.1:58806__u%2Fa    ] o.a.s.c.o.ReplicaMutator Update state numShards=1 message={
   [junit4]   2>   "operation":"state",
   [junit4]   2>   "core":"collection1",
   [junit4]   2>   "base_url":"http://127.0.0.1:58806/_u/a",
   [junit4]   2>   "collection":"control_collection",
   [junit4]   2>   "shard":null,
   [junit4]   2>   "roles":null,
   [junit4]   2>   "node_name":"127.0.0.1:58806__u%2Fa",
   [junit4]   2>   "numShards":"1",
   [junit4]   2>   "state":"down"}
   [junit4]   2> 1059189 INFO  (OverseerStateUpdate-94901234297077764-127.0.0.1:58806__u%2Fa-n_0000000000) [n:127.0.0.1:58806__u%2Fa    ] o.a.s.c.o.ClusterStateMutator building a new cName: control_collection
   [junit4]   2> 1059189 INFO  (OverseerStateUpdate-94901234297077764-127.0.0.1:58806__u%2Fa-n_0000000000) [n:127.0.0.1:58806__u%2Fa    ] o.a.s.c.o.ReplicaMutator Assigning new node to shard shard=shard1
   [junit4]   2> 1059192 INFO  (zkCallback-956-thread-1-processing-n:127.0.0.1:58806__u%2Fa) [n:127.0.0.1:58806__u%2Fa    ] o.a.s.c.c.ZkStateReader A cluster state change: WatchedEvent state:SyncConnected type:NodeDataChanged path:/clusterstate.json, has occurred - updating... (live nodes size: 1)
   [junit4]   2> 1060186 INFO  (coreLoadExecutor-2966-thread-1-processing-n:127.0.0.1:58806__u%2Fa) [n:127.0.0.1:58806__u%2Fa c:control_collection   x:collection1] o.a.s.c.ZkController waiting to find shard id in clusterstate for collection1
   [junit4]   2> 1060186 INFO  (coreLoadExecutor-2966-thread-1-processing-n:127.0.0.1:58806__u%2Fa) [n:127.0.0.1:58806__u%2Fa c:control_collection   x:collection1] o.a.s.c.ZkController Check for collection zkNode:control_collection
   [junit4]   2> 1060187 INFO  (coreLoadExecutor-2966-thread-1-processing-n:127.0.0.1:58806__u%2Fa) [n:127.0.0.1:58806__u%2Fa c:control_collection   x:collection1] o.a.s.c.ZkController Collection zkNode exists
   [junit4]   2> 1060187 INFO  (coreLoadExecutor-2966-thread-1-processing-n:127.0.0.1:58806__u%2Fa) [n:127.0.0.1:58806__u%2Fa c:control_collection   x:collection1] o.a.s.c.c.ZkStateReader Load collection config from:/collections/control_collection
   [junit4]   2> 1060193 INFO  (coreLoadExecutor-2966-thread-1-processing-n:127.0.0.1:58806__u%2Fa) [n:127.0.0.1:58806__u%2Fa c:control_collection   x:collection1] o.a.s.c.c.ZkStateReader path=/collections/control_collection configName=conf1 specified config exists in ZooKeeper
   [junit4]   2> 1060193 INFO  (coreLoadExecutor-2966-thread-1-processing-n:127.0.0.1:58806__u%2Fa) [n:127.0.0.1:58806__u%2Fa c:control_collection   x:collection1] o.a.s.c.SolrResourceLoader new SolrResourceLoader for directory: '/x1/jenkins/jenkins-slave/workspace/Lucene-Solr-NightlyTests-5.x/solr/build/solr-core/test/J2/temp/solr.cloud.BasicDistributedZkTest_21BCE81C1D8DC87E-001/control-001/cores/collection1'
   [junit4]   2> 1060193 INFO  (coreLoadExecutor-2966-thread-1-processing-n:127.0.0.1:58806__u%2Fa) [n:127.0.0.1:58806__u%2Fa c:control_collection   x:collection1] o.a.s.c.SolrResourceLoader JNDI not configured for solr (NoInitialContextEx)
   [junit4]   2> 1060193 INFO  (coreLoadExecutor-2966-thread-1-processing-n:127.0.0.1:58806__u%2Fa) [n:127.0.0.1:58806__u%2Fa c:control_collection   x:collection1] o.a.s.c.SolrResourceLoader solr home defaulted to 'solr/' (could not find system property or JNDI)
   [junit4]   2> 1060195 INFO  (coreLoadExecutor-2966-thread-1-processing-n:127.0.0.1:58806__u%2Fa) [n:127.0.0.1:58806__u%2Fa c:control_collection   x:collection1] o.a.s.c.Config loaded config solrconfig.xml with version 0 
   [junit4]   2> 1060203 INFO  (coreLoadExecutor-2966-thread-1-processing-n:127.0.0.1:58806__u%2Fa) [n:127.0.0.1:58806__u%2Fa c:control_collection   x:collection1] o.a.s.c.SolrConfig current version of requestparams : -1
   [junit4]   2> 1060218 INFO  (coreLoadExecutor-2966-thread-1-processing-n:127.0.0.1:58806__u%2Fa) [n:127.0.0.1:58806__u%2Fa c:control_collection   x:collection1] o.a.s.c.SolrConfig Using Lucene MatchVersion: 5.4.0
   [junit4]   2> 1060256 INFO  (coreLoadExecutor-2966-thread-1-processing-n:127.0.0.1:58806__u%2Fa) [n:127.0.0.1:58806__u%2Fa c:control_collection   x:collection1] o.a.s.c.Config Loaded SolrConfig: solrconfig.xml
   [junit4]   2> 1060263 INFO  (coreLoadExecutor-2966-thread-1-processing-n:127.0.0.1:58806__u%2Fa) [n:127.0.0.1:58806__u%2Fa c:control_collection   x:collection1] o.a.s.s.IndexSchema [collection1] Schema name=test
   [junit4]   2> 1060526 INFO  (coreLoadExecutor-2966-thread-1-processing-n:127.0.0.1:58806__u%2Fa) [n:127.0.0.1:58806__u%2Fa c:control_collection   x:collection1] o.a.s.s.OpenExchangeRatesOrgProvider Initialized with rates=open-exchange-rates.json, refreshInterval=1440.
   [junit4]   2> 1060535 INFO  (coreLoadExecutor-2966-thread-1-processing-n:127.0.0.1:58806__u%2Fa) [n:127.0.0.1:58806__u%2Fa c:control_collection   x:collection1] o.a.s.s.IndexSchema default search field in schema is text
   [junit4]   2> 1060537 INFO  (coreLoadExecutor-2966-thread-1-processing-n:127.0.0.1:58806__u%2Fa) [n:127.0.0.1:58806__u%2Fa c:control_collection   x:collection1] o.a.s.s.IndexSchema unique key field: id
   [junit4]   2> 1060549 INFO  (coreLoadExecutor-2966-thread-1-processing-n:127.0.0.1:58806__u%2Fa) [n:127.0.0.1:58806__u%2Fa c:control_collection   x:collection1] o.a.s.s.FileExchangeRateProvider Reloading exchange rates from file currency.xml
   [junit4]   2> 1060553 INFO  (coreLoadExecutor-2966-thread-1-processing-n:127.0.0.1:58806__u%2Fa) [n:127.0.0.1:58806__u%2Fa c:control_collection   x:collection1] o.a.s.s.FileExchangeRateProvider Reloading exchange rates from file currency.xml
   [junit4]   2> 1060557 INFO  (coreLoadExecutor-2966-thread-1-processing-n:127.0.0.1:58806__u%2Fa) [n:127.0.0.1:58806__u%2Fa c:control_collection   x:collection1] o.a.s.s.OpenExchangeRatesOrgProvider Reloading exchange rates from open-exchange-rates.json
   [junit4]   2> 1060558 WARN  (coreLoadExecutor-2966-thread-1-processing-n:127.0.0.1:58806__u%2Fa) [n:127.0.0.1:58806__u%2Fa c:control_collection   x:collection1] o.a.s.s.OpenExchangeRatesOrgProvider Unknown key IMPORTANT NOTE
   [junit4]   2> 1060558 WARN  (coreLoadExecutor-2966-thread-1-processing-n:127.0.0.1:58806__u%2Fa) [n:127.0.0.1:58806__u%2Fa c:control_collection   x:collection1] o.a.s.s.OpenExchangeRatesOrgProvider Expected key, got STRING
   [junit4]   2> 1060558 INFO  (coreLoadExecutor-2966-thread-1-processing-n:127.0.0.1:58806__u%2Fa) [n:127.0.0.1:58806__u%2Fa c:control_collection   x:collection1] o.a.s.s.OpenExchangeRatesOrgProvider Reloading exchange rates from open-exchange-rates.json
   [junit4]   2> 1060560 WARN  (coreLoadExecutor-2966-thread-1-processing-n:127.0.0.1:58806__u%2Fa) [n:127.0.0.1:58806__u%2Fa c:control_collection   x:collection1] o.a.s.s.OpenExchangeRatesOrgProvider Unknown key IMPORTANT NOTE
   [junit4]   2> 1060560 WARN  (coreLoadExecutor-2966-thread-1-processing-n:127.0.0.1:58806__u%2Fa) [n:127.0.0.1:58806__u%2Fa c:control_collection   x:collection1] o.a.s.s.OpenExchangeRatesOrgProvider Expected key, got STRING
   [junit4]   2> 1060561 INFO  (coreLoadExecutor-2966-thread-1-processing-n:127.0.0.1:58806__u%2Fa) [n:127.0.0.1:58806__u%2Fa c:control_collection   x:collection1] o.a.s.c.ConfigSetProperties Did not find ConfigSet properties, assuming default properties: Can't find resource 'configsetprops.json' in classpath or '/configs/conf1', cwd=/x1/jenkins/jenkins-slave/workspace/Lucene-Solr-NightlyTests-5.x/solr/build/solr-core/test/J2
   [junit4]   2> 1060561 INFO  (coreLoadExecutor-2966-thread-1-processing-n:127.0.0.1:58806__u%2Fa) [n:127.0.0.1:58806__u%2Fa c:control_collection   x:collection1] o.a.s.c.CoreContainer Creating SolrCore 'collection1' using configuration from collection control_collection
   [junit4]   2> 1060562 INFO  (coreLoadExecutor-2966-thread-1-processing-n:127.0.0.1:58806__u%2Fa) [n:127.0.0.1:58806__u%2Fa c:control_collection s:shard1 r:core_node1 x:collection1] o.a.s.c.SolrCore org.apache.solr.core.MockDirectoryFactory
   [junit4]   2> 1060562 INFO  (coreLoadExecutor-2966-thread-1-processing-n:127.0.0.1:58806__u%2Fa) [n:127.0.0.1:58806__u%2Fa c:control_collection s:shard1 r:core_node1 x:collection1] o.a.s.c.SolrCore [[collection1] ] Opening new SolrCore at [/x1/jenkins/jenkins-slave/workspace/Lucene-Solr-NightlyTests-5.x/solr/build/solr-core/test/J2/temp/solr.cloud.BasicDistributedZkTest_21BCE81C1D8DC87E-001/control-001/cores/collection1], dataDir=[null]
   [junit4]   2> 1060562 INFO  (coreLoadExecutor-2966-thread-1-processing-n:127.0.0.1:58806__u%2Fa) [n:127.0.0.1:58806__u%2Fa c:control_collection s:shard1 r:core_node1 x:collection1] o.a.s.c.JmxMonitoredMap JMX monitoring is enabled. Adding Solr mbeans to JMX Server: com.sun.jmx.mbeanserver.JmxMBeanServer@346bc66
   [junit4]   2> 1060563 INFO  (coreLoadExecutor-2966-thread-1-processing-n:127.0.0.1:58806__u%2Fa) [n:127.0.0.1:58806__u%2Fa c:control_collection s:shard1 r:core_node1 x:collection1] o.a.s.c.CachingDirectoryFactory return new directory for /x1/jenkins/jenkins-slave/workspace/Lucene-Solr-NightlyTests-5.x/solr/build/solr-core/test/J2/../../../../../../../../../../x1/jenkins/jenkins-slave/workspace/Lucene-Solr-NightlyTests-5.x/solr/build/solr-core/test/J2/temp/solr.cloud.BasicDistributedZkTest_21BCE81C1D8DC87E-001/control-001/cores/collection1/data
   [junit4]   2> 1060563 INFO  (coreLoadExecutor-2966-thread-1-processing-n:127.0.0.1:58806__u%2Fa) [n:127.0.0.1:58806__u%2Fa c:control_collection s:shard1 r:core_node1 x:collection1] o.a.s.c.SolrCore New index directory detected: old=null new=/x1/jenkins/jenkins-slave/workspace/Lucene-Solr-NightlyTests-5.x/solr/build/solr-core/test/J2/../../../../../../../../../../x1/jenkins/jenkins-slave/workspace/Lucene-Solr-NightlyTests-5.x/solr/build/solr-core/test/J2/temp/solr.cloud.BasicDistributedZkTest_21BCE81C1D8DC87E-001/control-001/cores/collection1/data/index/
   [junit4]   2> 1060563 WARN  (coreLoadExecutor-2966-thread-1-processing-n:127.0.0.1:58806__u%2Fa) [n:127.0.0.1:58806__u%2Fa c:control_collection s:shard1 r:core_node1 x:collection1] o.a.s.c.SolrCore [collection1] Solr index directory '/x1/jenkins/jenkins-slave/workspace/Lucene-Solr-NightlyTests-5.x/solr/build/solr-core/test/J2/../../../../../../../../../../x1/jenkins/jenkins-slave/workspace/Lucene-Solr-NightlyTests-5.x/solr/build/solr-core/test/J2/temp/solr.cloud.BasicDistributedZkTest_21BCE81C1D8DC87E-001/control-001/cores/collection1/data/index' doesn't exist. Creating new index...
   [junit4]   2> 1060563 INFO  (coreLoadExecutor-2966-thread-1-processing-n:127.0.0.1:58806__u%2Fa) [n:127.0.0.1:58806__u%2Fa c:control_collection s:shard1 r:core_node1 x:collection1] o.a.s.c.CachingDirectoryFactory return new directory for /x1/jenkins/jenkins-slave/workspace/Lucene-Solr-NightlyTests-5.x/solr/build/solr-core/test/J2/../../../../../../../../../../x1/jenkins/jenkins-slave/workspace/Lucene-Solr-NightlyTests-5.x/solr/build/solr-core/test/J2/temp/solr.cloud.BasicDistributedZkTest_21BCE81C1D8DC87E-001/control-001/cores/collection1/data/index
   [junit4]   2> 1060564 INFO  (coreLoadExecutor-2966-thread-1-processing-n:127.0.0.1:58806__u%2Fa) [n:127.0.0.1:58806__u%2Fa c:control_collection s:shard1 r:core_node1 x:collection1] o.a.s.u.RandomMergePolicy RandomMergePolicy wrapping class org.apache.lucene.index.TieredMergePolicy: [TieredMergePolicy: maxMergeAtOnce=10, maxMergeAtOnceExplicit=28, maxMergedSegmentMB=0.919921875, floorSegmentMB=0.5556640625, forceMergeDeletesPctAllowed=23.150084970163487, segmentsPerTier=15.0, maxCFSSegmentSizeMB=8.796093022207999E12, noCFSRatio=1.0
   [junit4]   2> 1060564 INFO  (coreLoadExecutor-2966-thread-1-processing-n:127.0.0.1:58806__u%2Fa) [n:127.0.0.1:58806__u%2Fa c:control_collection s:shard1 r:core_node1 x:collection1] o.a.s.c.SolrCore SolrDeletionPolicy.onCommit: commits: num=1
   [junit4]   2> 	commit{dir=MockDirectoryWrapper(RAMDirectory@5ac61053 lockFactory=org.apache.lucene.store.SingleInstanceLockFactory@159e7b4),segFN=segments_1,generation=1}
   [junit4]   2> 1060564 INFO  (coreLoadExecutor-2966-thread-1-processing-n:127.0.0.1:58806__u%2Fa) [n:127.0.0.1:58806__u%2Fa c:control_collection s:shard1 r:core_node1 x:collection1] o.a.s.c.SolrCore newest commit generation = 1
   [junit4]   2> 1060564 INFO  (OldIndexDirectoryCleanupThreadForCore-collection1) [n:127.0.0.1:58806__u%2Fa c:control_collection s:shard1 r:core_node1 x:collection1] o.a.s.c.SolrCore Looking for old index directories to cleanup for core collection1 in /x1/jenkins/jenkins-slave/workspace/Lucene-Solr-NightlyTests-5.x/solr/build/solr-core/test/J2/../../../../../../../../../../x1/jenkins/jenkins-slave/workspace/Lucene-Solr-NightlyTests-5.x/solr/build/solr-core/test/J2/temp/solr.cloud.BasicDistributedZkTest_21BCE81C1D8DC87E-001/control-001/cores/collection1/data/
   [junit4]   2> 1060565 WARN  (OldIndexDirectoryCleanupThreadForCore-collection1) [n:127.0.0.1:58806__u%2Fa c:control_collection s:shard1 r:core_node1 x:collection1] o.a.s.c.DirectoryFactory /x1/jenkins/jenkins-slave/workspace/Lucene-Solr-NightlyTests-5.x/solr/build/solr-core/test/J2/../../../../../../../../../../x1/jenkins/jenkins-slave/workspace/Lucene-Solr-NightlyTests-5.x/solr/build/solr-core/test/J2/temp/solr.cloud.BasicDistributedZkTest_21BCE81C1D8DC87E-001/control-001/cores/collection1/data/ does not point to a valid data directory; skipping clean-up of old index directories.
   [junit4]   2> 1060572 INFO  (coreLoadExecutor-2966-thread-1-processing-n:127.0.0.1:58806__u%2Fa) [n:127.0.0.1:58806__u%2Fa c:control_collection s:shard1 r:core_node1 x:collection1] o.a.s.u.p.UpdateRequestProcessorChain creating updateRequestProcessorChain "nodistrib"
   [junit4]   2> 1060572 INFO  (coreLoadExecutor-2966-thread-1-processing-n:127.0.0.1:58806__u%2Fa) [n:127.0.0.1:58806__u%2Fa c:control_collection s:shard1 r:core_node1 x:collection1] o.a.s.u.p.UpdateRequestProcessorChain creating updateRequestProcessorChain "dedupe"
   [junit4]   2> 1060572 INFO  (coreLoadExecutor-2966-thread-1-processing-n:127.0.0.1:58806__u%2Fa) [n:127.0.0.1:58806__u%2Fa c:control_collection s:shard1 r:core_node1 x:collection1] o.a.s.u.p.UpdateRequestProcessorChain inserting DistributedUpdateProcessorFactory into updateRequestProcessorChain "dedupe"
   [junit4]   2> 1060572 INFO  (coreLoadExecutor-2966-thread-1-processing-n:127.0.0.1:58806__u%2Fa) [n:127.0.0.1:58806__u%2Fa c:control_collection s:shard1 r:core_node1 x:collection1] o.a.s.u.p.UpdateRequestProcessorChain creating updateRequestProcessorChain "stored_sig"
   [junit4]   2> 1060572 INFO  (coreLoadExecutor-2966-thread-1-processing-n:127.0.0.1:58806__u%2Fa) [n:127.0.0.1:58806__u%2Fa c:control_collection s:shard1 r:core_node1 x:collection1] o.a.s.u.p.UpdateRequestProcessorChain inserting DistributedUpdateProcessorFactory into updateRequestProcessorChain "stored_sig"
   [junit4]   2> 1060572 INFO  (coreLoadExecutor-2966-thread-1-processing-n:127.0.0.1:58806__u%2Fa) [n:127.0.0.1:58806__u%2Fa c:control_collection s:shard1 r:core_node1 x:collection1] o.a.s.u.p.UpdateRequestProcessorChain creating updateRequestProcessorChain "distrib-dup-test-chain-explicit"
   [junit4]   2> 1060572 INFO  (coreLoadExecutor-2966-thread-1-processing-n:127.0.0.1:58806__u%2Fa) [n:127.0.0.1:58806__u%2Fa c:control_collection s:shard1 r:core_node1 x:collection1] o.a.s.u.p.UpdateRequestProcessorChain creating updateRequestProcessorChain "distrib-dup-test-chain-implicit"
   [junit4]   2> 1060573 INFO  (coreLoadExecutor-2966-thread-1-processing-n:127.0.0.1:58806__u%2Fa) [n:127.0.0.1:58806__u%2Fa c:control_collection s:shard1 r:core_node1 x:collection1] o.a.s.u.p.UpdateRequestProcessorChain inserting DistributedUpdateProcessorFactory into updateRequestProcessorChain "distrib-dup-test-chain-implicit"
   [junit4]   2> 1060573 INFO  (coreLoadExecutor-2966-thread-1-processing-n:127.0.0.1:58806__u%2Fa) [n:127.0.0.1:58806__u%2Fa c:control_collection s:shard1 r:core_node1 x:collection1] o.a.s.c.SolrCore no updateRequestProcessorChain defined as default, creating implicit default
   [junit4]   2> 1060573 WARN  (coreLoadExecutor-2966-thread-1-processing-n:127.0.0.1:58806__u%2Fa) [n:127.0.0.1:58806__u%2Fa c:control_collection s:shard1 r:core_node1 x:collection1] o.a.s.c.RequestHandlers INVALID paramSet a in requestHandler {type = requestHandler,name = /dump,class = DumpRequestHandler,args = {defaults={a=A,b=B}}}
   [junit4]   2> 1060576 INFO  (coreLoadExecutor-2966-thread-1-processing-n:127.0.0.1:58806__u%2Fa) [n:127.0.0.1:58806__u%2Fa c:control_collection s:shard1 r:core_node1 x:collection1] o.a.s.h.l.XMLLoader xsltCacheLifetimeSeconds=60
   [junit4]   2> 1060577 INFO  (coreLoadExecutor-2966-thread-1-processing-n:127.0.0.1:58806__u%2Fa) [n:127.0.0.1:58806__u%2Fa c:control_collection s:shard1 r:core_node1 x:collection1] o.a.s.h.l.XMLLoader xsltCacheLifetimeSeconds=60
   [junit4]   2> 1060578 INFO  (coreLoadExecutor-2966-thread-1-processing-n:127.0.0.1:58806__u%2Fa) [n:127.0.0.1:58806__u%2Fa c:control_collection s:shard1 r:core_node1 x:collection1] o.a.s.h.l.XMLLoader xsltCacheLifetimeSeconds=60
   [junit4]   2> 1060580 INFO  (coreLoadExecutor-2966-thread-1-processing-n:127.0.0.1:58806__u%2Fa) [n:127.0.0.1:58806__u%2Fa c:control_collection s:shard1 r:core_node1 x:collection1] o.a.s.h.l.XMLLoader xsltCacheLifetimeSeconds=60
   [junit4]   2> 1060585 INFO  (coreLoadExecutor-2966-thread-1-processing-n:127.0.0.1:58806__u%2Fa) [n:127.0.0.1:58806__u%2Fa c:control_collection s:shard1 r:core_node1 x:collection1] o.a.s.c.RequestHandlers Registered paths: /admin/mbeans,/admin/luke,/admin/ping,/get,/update,/admin/plugins,/schema,/admin/logging,/admin/properties,/admin/file,/update/json,/replication,/update/csv,/update/json/docs,/config,/admin/system,/dump,standard,/admin/threads,/admin/segments
   [junit4]   2> 1060586 INFO  (coreLoadExecutor-2966-thread-1-processing-n:127.0.0.1:58806__u%2Fa) [n:127.0.0.1:58806__u%2Fa c:control_collection s:shard1 r:core_node1 x:collection1] o.a.s.c.SolrCore Using default statsCache cache: org.apache.solr.search.stats.LocalStatsCache
   [junit4]   2> 1060586 INFO  (coreLoadExecutor-2966-thread-1-processing-n:127.0.0.1:58806__u%2Fa) [n:127.0.0.1:58806__u%2Fa c:control_collection s:shard1 r:core_node1 x:collection1] o.a.s.u.UpdateHandler Using UpdateLog implementation: org.apache.solr.update.UpdateLog
   [junit4]   2> 1060586 INFO  (coreLoadExecutor-2966-thread-1-processing-n:127.0.0.1:58806__u%2Fa) [n:127.0.0.1:58806__u%2Fa c:control_collection s:shard1 r:core_node1 x:collection1] o.a.s.u.UpdateLog Initializing UpdateLog: dataDir= defaultSyncLevel=FLUSH numRecordsToKeep=100 maxNumLogsToKeep=10 numVersionBuckets=65536
   [junit4]   2> 1060588 INFO  (coreLoadExecutor-2966-thread-1-processing-n:127.0.0.1:58806__u%2Fa) [n:127.0.0.1:58806__u%2Fa c:control_collection s:shard1 r:core_node1 x:collection1] o.a.s.c.SolrCore Hard AutoCommit: disabled
   [junit4]   2> 1060588 INFO  (coreLoadExecutor-2966-thread-1-processing-n:127.0.0.1:58806__u%2Fa) [n:127.0.0.1:58806__u%2Fa c:control_collection s:shard1 r:core_node1 x:collection1] o.a.s.c.SolrCore Soft AutoCommit: disabled
   [junit4]   2> 1060588 INFO  (coreLoadExecutor-2966-thread-1-processing-n:127.0.0.1:58806__u%2Fa) [n:127.0.0.1:58806__u%2Fa c:control_collection s:shard1 r:core_node1 x:collection1] o.a.s.u.RandomMergePolicy RandomMergePolicy wrapping class org.apache.lucene.index.LogByteSizeMergePolicy: [LogByteSizeMergePolicy: minMergeSize=1677721, mergeFactor=6, maxMergeSize=2147483648, maxMergeSizeForForcedMerge=9223372036854775807, calibrateSizeByDeletes=true, maxMergeDocs=2147483647, maxCFSSegmentSizeMB=0.3857421875, noCFSRatio=0.16249597702253232]
   [junit4]   2> 1060589 INFO  (coreLoadExecutor-2966-thread-1-processing-n:127.0.0.1:58806__u%2Fa) [n:127.0.0.1:58806__u%2Fa c:control_collection s:shard1 r:core_node1 x:collection1] o.a.s.c.SolrCore SolrDeletionPolicy.onInit: commits: num=1
   [junit4]   2> 	commit{dir=MockDirectoryWrapper(RAMDirectory@5ac61053 lockFactory=org.apache.lucene.store.SingleInstanceLockFactory@159e7b4),segFN=segments_1,generation=1}
   [junit4]   2> 1060589 INFO  (coreLoadExecutor-2966-thread-1-processing-n:127.0.0.1:58806__u%2Fa) [n:127.0.0.1:58806__u%2Fa c:control_collection s:shard1 r:core_node1 x:collection1] o.a.s.c.SolrCore newest commit generation = 1
   [junit4]   2> 1060589 INFO  (coreLoadExecutor-2966-thread-1-processing-n:127.0.0.1:58806__u%2Fa) [n:127.0.0.1:58806__u%2Fa c:control_collection s:shard1 r:core_node1 x:collection1] o.a.s.s.SolrIndexSearcher Opening Searcher@3a817a0e[collection1] main
   [junit4]   2> 1060589 INFO  (coreLoadExecutor-2966-thread-1-processing-n:127.0.0.1:58806__u%2Fa) [n:127.0.0.1:58806__u%2Fa c:control_collection s:shard1 r:core_node1 x:collection1] o.a.s.c.c.ZkStateReader Load collection config from:/collections/control_collection
   [junit4]   2> 1060590 INFO  (coreLoadExecutor-2966-thread-1-processing-n:127.0.0.1:58806__u%2Fa) [n:127.0.0.1:58806__u%2Fa c:control_collection s:shard1 r:core_node1 x:collection1] o.a.s.c.c.ZkStateReader path=/collections/control_collection configName=conf1 specified config exists in ZooKeeper
   [junit4]   2> 1060590 INFO  (coreLoadExecutor-2966-thread-1-processing-n:127.0.0.1:58806__u%2Fa) [n:127.0.0.1:58806__u%2Fa c:control_collection s:shard1 r:core_node1 x:collection1] o.a.s.r.ManagedResourceStorage Setting up ZooKeeper-based storage for the RestManager with znodeBase: /configs/conf1
   [junit4]   2> 1060590 INFO  (coreLoadExecutor-2966-thread-1-processing-n:127.0.0.1:58806__u%2Fa) [n:127.0.0.1:58806__u%2Fa c:control_collection s:shard1 r:core_node1 x:collection1] o.a.s.r.ManagedResourceStorage Configured ZooKeeperStorageIO with znodeBase: /configs/conf1
   [junit4]   2> 1060590 INFO  (coreLoadExecutor-2966-thread-1-processing-n:127.0.0.1:58806__u%2Fa) [n:127.0.0.1:58806__u%2Fa c:control_collection s:shard1 r:core_node1 x:collection1] o.a.s.r.RestManager Initializing RestManager with initArgs: {}
   [junit4]   2> 1060590 INFO  (coreLoadExecutor-2966-thread-1-processing-n:127.0.0.1:58806__u%2Fa) [n:127.0.0.1:58806__u%2Fa c:control_collection s:shard1 r:core_node1 x:collection1] o.a.s.r.ManagedResourceStorage Reading _rest_managed.json using ZooKeeperStorageIO:path=/configs/conf1
   [junit4]   2> 1060591 INFO  (coreLoadExecutor-2966-thread-1-processing-n:127.0.0.1:58806__u%2Fa) [n:127.0.0.1:58806__u%2Fa c:control_collection s:shard1 r:core_node1 x:collection1] o.a.s.r.ManagedResourceStorage No data found for znode /configs/conf1/_rest_managed.json
   [junit4]   2> 1060591 INFO  (coreLoadExecutor-2966-thread-1-processing-n:127.0.0.1:58806__u%2Fa) [n:127.0.0.1:58806__u%2Fa c:control_collection s:shard1 r:core_node1 x:collection1] o.a.s.r.ManagedResourceStorage Loaded null at path _rest_managed.json using ZooKeeperStorageIO:path=/configs/conf1
   [junit4]   2> 1060591 INFO  (coreLoadExecutor-2966-thread-1-processing-n:127.0.0.1:58806__u%2Fa) [n:127.0.0.1:58806__u%2Fa c:control_collection s:shard1 r:core_node1 x:collection1] o.a.s.r.RestManager Initializing 0 registered ManagedResources
   [junit4]   2> 1060591 INFO  (coreLoadExecutor-2966-thread-1-processing-n:127.0.0.1:58806__u%2Fa) [n:127.0.0.1:58806__u%2Fa c:control_collection s:shard1 r:core_node1 x:collection1] o.a.s.h.ReplicationHandler Commits will be reserved for  10000
   [junit4]   2> 1060591 INFO  (coreLoadExecutor-2966-thread-1-processing-n:127.0.0.1:58806__u%2Fa) [n:127.0.0.1:58806__u%2Fa c:control_collection s:shard1 r:core_node1 x:collection1] o.a.s.u.UpdateLog Looking up max value of version field to seed version buckets
   [junit4]   2> 1060591 INFO  (coreLoadExecutor-2966-thread-1-processing-n:127.0.0.1:58806__u%2Fa) [n:127.0.0.1:58806__u%2Fa c:control_collection s:shard1 r:core_node1 x:collection1] o.a.s.u.VersionInfo Refreshing highest value of _version_ for 65536 version buckets from index
   [junit4]   2> 1060591 INFO  (coreLoadExecutor-2966-thread-1-processing-n:127.0.0.1:58806__u%2Fa) [n:127.0.0.1:58806__u%2Fa c:control_collection s:shard1 r:core_node1 x:collection1] o.a.s.u.VersionInfo No terms found for _version_, cannot seed version bucket highest value from index
   [junit4]   2> 1060592 INFO  (coreLoadExecutor-2966-thread-1-processing-n:127.0.0.1:58806__u%2Fa) [n:127.0.0.1:58806__u%2Fa c:control_collection s:shard1 r:core_node1 x:collection1] o.a.s.u.UpdateLog Could not find max version in index or recent updates, using new clock 1518419750852493312
   [junit4]   2> 1060594 INFO  (coreLoadExecutor-2966-thread-1-processing-n:127.0.0.1:58806__u%2Fa) [n:127.0.0.1:58806__u%2Fa c:control_collection s:shard1 r:core_node1 x:collection1] o.a.s.u.UpdateLog Took 2.0ms to seed version buckets with highest version 1518419750852493312
   [junit4]   2> 1060594 INFO  (coreLoadExecutor-2966-thread-1-processing-n:127.0.0.1:58806__u%2Fa) [n:127.0.0.1:58806__u%2Fa c:control_collection s:shard1 r:core_node1 x:collection1] o.a.s.c.ZkController watch zkdir /configs/conf1
   [junit4]   2> 1060594 INFO  (coreLoadExecutor-2966-thread-1-processing-n:127.0.0.1:58806__u%2Fa) [n:127.0.0.1:58806__u%2Fa c:control_collection s:shard1 r:core_node1 x:collection1] o.a.s.c.CoreContainer registering core: collection1
   [junit4]   2> 1060594 INFO  (coreZkRegister-2960-thread-1-processing-x:collection1 c:control_collection s:shard1 n:127.0.0.1:58806__u%2Fa r:core_node1) [n:127.0.0.1:58806__u%2Fa c:control_collection s:shard1 r:core_node1 x:collection1] o.a.s.c.ZkController Register replica - core:collection1 address:http://127.0.0.1:58806/_u/a collection:control_collection shard:shard1
   [junit4]   2> 1060595 INFO  (searcherExecutor-2967-thread-1-processing-x:collection1 c:control_collection s:shard1 n:127.0.0.1:58806__u%2Fa r:core_node1) [n:127.0.0.1:58806__u%2Fa c:control_collection s:shard1 r:core_node1 x:collection1] o.a.s.c.SolrCore [collection1] Registered new searcher Searcher@3a817a0e[collection1] main{ExitableDirectoryReader(UninvertingDirectoryReader())}
   [junit4]   2> 1060595 INFO  (coreZkRegister-2960-thread-1-processing-x:collection1 c:control_collection s:shard1 n:127.0.0.1:58806__u%2Fa r:core_node1) [n:127.0.0.1:58806__u%2Fa c:control_collection s:shard1 r:core_node1 x:collection1] o.a.s.c.c.SolrZkClient makePath: /collections/control_collection/leader_elect/shard1/election
   [junit4]   2> 1060600 INFO  (coreZkRegister-2960-thread-1-processing-x:collection1 c:control_collection s:shard1 n:127.0.0.1:58806__u%2Fa r:core_node1) [n:127.0.0.1:58806__u%2Fa c:control_collection s:shard1 r:core_node1 x:collection1] o.a.s.c.LeaderElector Joined leadership election with path: /collections/control_collection/leader_elect/shard1/election/94901234297077764-core_node1-n_0000000000
   [junit4]   2> 1060601 INFO  (coreZkRegister-2960-thread-1-processing-x:collection1 c:control_collection s:shard1 n:127.0.0.1:58806__u%2Fa r:core_node1) [n:127.0.0.1:58806__u%2Fa c:control_collection s:shard1 r:core_node1 x:collection1] o.a.s.c.ShardLeaderElectionContext Running the leader process for shard shard1
   [junit4]   2> 1060603 INFO  (OverseerStateUpdate-94901234297077764-127.0.0.1:58806__u%2Fa-n_0000000000) [n:127.0.0.1:58806__u%2Fa    ] o.a.s.c.Overseer processMessage: queueSize: 1, message = {
   [junit4]   2>   "operation":"leader",
   [junit4]   2>   "shard":"shard1",
   [junit4]   2>   "collection":"control_collection"} current state version: 1
   [junit4]   2> 1060606 INFO  (coreZkRegister-2960-thread-1-processing-x:collection1 c:control_collection s:shard1 n:127.0.0.1:58806__u%2Fa r:core_node1) [n:127.0.0.1:58806__u%2Fa c:control_collection s:shard1 r:core_node1 x:collection1] o.a.s.c.ShardLeaderElectionContext Enough replicas found to continue.
   [junit4]   2> 1060606 INFO  (coreZkRegister-2960-thread-1-processing-x:collection1 c:control_collection s:shard1 n:127.0.0.1:58806__u%2Fa r:core_node1) [n:127.0.0.1:58806__u%2Fa c:control_collection s:shard1 r:core_node1 x:collection1] o.a.s.c.ShardLeaderElectionContext I may be the new leader - try and sync
   [junit4]   2> 1060606 INFO  (coreZkRegister-2960-thread-1-processing-x:collection1 c:control_collection s:shard1 n:127.0.0.1:58806__u%2Fa r:core_node1) [n:127.0.0.1:58806__u%2Fa c:control_collection s:shard1 r:core_node1 x:collection1] o.a.s.c.SyncStrategy Sync replicas to http://127.0.0.1:58806/_u/a/collection1/
   [junit4]   2> 1060606 INFO  (coreZkRegister-2960-thread-1-processing-x:collection1 c:control_collection s:shard1 n:127.0.0.1:58806__u%2Fa r:core_node1) [n:127.0.0.1:58806__u%2Fa c:control_collection s:shard1 r:core_node1 x:collection1] o.a.s.c.SyncStrategy Sync Success - now sync replicas to me
   [junit4]   2> 1060606 INFO  (coreZkRegister-2960-thread-1-processing-x:collection1 c:control_collection s:shard1 n:127.0.0.1:58806__u%2Fa r:core_node1) [n:127.0.0.1:58806__u%2Fa c:control_collection s:shard1 r:core_node1 x:collection1] o.a.s.c.SyncStrategy http://127.0.0.1:58806/_u/a/collection1/ has no replicas
   [junit4]   2> 1060607 INFO  (coreZkRegister-2960-thread-1-processing-x:collection1 c:control_collection s:shard1 n:127.0.0.1:58806__u%2Fa r:core_node1) [n:127.0.0.1:58806__u%2Fa c:control_collection s:shard1 r:core_node1 x:collection1] o.a.s.c.c.SolrZkClient makePath: /collections/control_collection/leaders/shard1
   [junit4]   2> 1060611 INFO  (coreZkRegister-2960-thread-1-processing-x:collection1 c:control_collection s:shard1 n:127.0.0.1:58806__u%2Fa r:core_node1) [n:127.0.0.1:58806__u%2Fa c:control_collection s:shard1 r:core_node1 x:collection1] o.a.s.c.ShardLeaderElectionContextBase Creating leader registration node
   [junit4]   2> 1060613 INFO  (coreZkRegister-2960-thread-1-processing-x:collection1 c:control_collection s:shard1 n:127.0.0.1:58806__u%2Fa r:core_node1) [n:127.0.0.1:58806__u%2Fa c:control_collection s:shard1 r:core_node1 x:collection1] o.a.s.c.ShardLeaderElectionContext I am the new leader: http://127.0.0.1:58806/_u/a/collection1/ shard1
   [junit4]   2> 1060614 INFO  (OverseerStateUpdate-94901234297077764-127.0.0.1:58806__u%2Fa-n_0000000000) [n:127.0.0.1:58806__u%2Fa    ] o.a.s.c.Overseer processMessage: queueSize: 1, message = {
   [junit4]   2>   "operation":"leader",
   [junit4]   2>   "shard":"shard1",
   [junit4]   2>   "collection":"control_collection",
   [junit4]   2>   "base_url":"http://127.0.0.1:58806/_u/a",
   [junit4]   2>   "core":"collection1",
   [junit4]   2>   "state":"active"} current state version: 1
   [junit4]   2> 1060693 INFO  (TEST-BasicDistributedZkTest.test-seed#[21BCE81C1D8DC87E]) [    ] o.a.s.c.c.SolrZkClient Using default ZkCredentialsProvider
   [junit4]   2> 1060695 INFO  (TEST-BasicDistributedZkTest.test-seed#[21BCE81C1D8DC87E]) [    ] o.a.s.c.c.ConnectionManager Waiting for client to connect to ZooKeeper
   [junit4]   2> 1060698 INFO  (zkCallback-958-thread-1) [    ] o.a.s.c.c.ConnectionManager Watcher org.apache.solr.common.cloud.ConnectionManager@16260ac3 name:ZooKeeperConnection Watcher:127.0.0.1:35702/solr got event WatchedEvent state:SyncConnected type:None path:null path:null type:None
   [junit4]   2> 1060698 INFO  (TEST-BasicDistributedZkTest.test-seed#[21BCE81C1D8DC87E]) [    ] o.a.s.c.c.ConnectionManager Client is connected to ZooKeeper
   [junit4]   2> 1060698 INFO  (TEST-BasicDistributedZkTest.test-seed#[21BCE81C1D8DC87E]) [    ] o.a.s.c.c.SolrZkClient Using default ZkACLProvider
   [junit4]   2> 1060698 INFO  (TEST-BasicDistributedZkTest.test-seed#[21BCE81C1D8DC87E]) [    ] o.a.s.c.c.ZkStateReader Updating cluster state from ZooKeeper... 
   [junit4]   2> 1060702 INFO  (TEST-BasicDistributedZkTest.test-seed#[21BCE81C1D8DC87E]) [    ] o.a.s.c.ChaosMonkey monkey: init - expire sessions:false cause connection loss:false
   [junit4]   2> 1060717 INFO  (zkCallback-956-thread-1-processing-n:127.0.0.1:58806__u%2Fa) [n:127.0.0.1:58806__u%2Fa    ] o.a.s.c.c.ZkStateReader A cluster state change: WatchedEvent state:SyncConnected type:NodeDataChanged path:/clusterstate.json, has occurred - updating... (live nodes size: 1)
   [junit4]   2> 1060717 INFO  (zkCallback-958-thread-1) [    ] o.a.s.c.c.ZkStateReader A cluster state change: WatchedEvent state:SyncConnected type:NodeDataChanged path:/clusterstate.json, has occurred - updating... (live nodes size: 1)
   [junit4]   2> 1060765 INFO  (coreZkRegister-2960-thread-1-processing-x:collection1 c:control_collection s:shard1 n:127.0.0.1:58806__u%2Fa r:core_node1) [n:127.0.0.1:58806__u%2Fa c:control_collection s:shard1 r:core_node1 x:collection1] o.a.s.c.ZkController We are http://127.0.0.1:58806/_u/a/collection1/ and leader is http://127.0.0.1:58806/_u/a/collection1/
   [junit4]   2> 1060765 INFO  (coreZkRegister-2960-thread-1-processing-x:collection1 c:control_collection s:shard1 n:127.0.0.1:58806__u%2Fa r:core_node1) [n:127.0.0.1:58806__u%2Fa c:control_collection s:shard1 r:core_node1 x:collection1] o.a.s.c.ZkController No LogReplay needed for core=collection1 baseURL=http://127.0.0.1:58806/_u/a
   [junit4]   2> 1060765 INFO  (coreZkRegister-2960-thread-1-processing-x:collection1 c:control_collection s:shard1 n:127.0.0.1:58806__u%2Fa r:core_node1) [n:127.0.0.1:58806__u%2Fa c:control_collection s:shard1 r:core_node1 x:collection1] o.a.s.c.ZkController I am the leader, no recovery necessary
   [junit4]   2> 1060765 INFO  (coreZkRegister-2960-thread-1-processing-x:collection1 c:control_collection s:shard1 n:127.0.0.1:58806__u%2Fa r:core_node1) [n:127.0.0.1:58806__u%2Fa c:control_collection s:shard1 r:core_node1 x:collection1] o.a.s.c.ZkController publishing state=active
   [junit4]   2> 1060765 INFO  (coreZkRegister-2960-thread-1-processing-x:collection1 c:control_collection s:shard1 n:127.0.0.1:58806__u%2Fa r:core_node1) [n:127.0.0.1:58806__u%2Fa c:control_collection s:shard1 r:core_node1 x:collection1] o.a.s.c.ZkController numShards not found on descriptor - reading it from system property
   [junit4]   2> 1060767 INFO  (OverseerStateUpdate-94901234297077764-127.0.0.1:58806__u%2Fa-n_0000000000) [n:127.0.0.1:58806__u%2Fa    ] o.a.s.c.Overseer processMessage: queueSize: 1, message = {
   [junit4]   2>   "core_node_name":"core_node1",
   [junit4]   2>   "operation":"state",
   [junit4]   2>   "core":"collection1",
   [junit4]   2>   "base_url":"http://127.0.0.1:58806/_u/a",
   [junit4]   2>   "collection":"control_collection",
   [junit4]   2>   "shard":"shard1",
   [junit4]   2>   "roles":null,
   [junit4]   2>   "node_name":"127.0.0.1:58806__u%2Fa",
   [junit4]   2>   "numShards":"2",
   [junit4]   2>   "state":"active"} current state version: 2
   [junit4]   2> 1060767 INFO  (OverseerStateUpdate-94901234297077764-127.0.0.1:58806__u%2Fa-n_0000000000) [n:127.0.0.1:58806__u%2Fa    ] o.a.s.c.o.ReplicaMutator Update state numShards=2 message={
   [junit4]   2>   "core_node_name":"core_node1",
   [junit4]   2>   "operation":"state",
   [junit4]   2>   "core":"collection1",
   [junit4]   2>   "base_url":"http://127.0.0.1:58806/_u/a",
   [junit4]   2>   "collection":"control_collection",
   [junit4]   2>   "shard":"shard1",
   [junit4]   2>   "roles":null,
   [junit4]   2>   "node_name":"127.0.0.1:58806__u%2Fa",
   [junit4]   2>   "numShards":"2",
   [junit4]   2>   "state":"active"}
   [junit4]   2> 1060870 INFO  (zkCallback-958-thread-1) [    ] o.a.s.c.c.ZkStateReader A cluster state change: WatchedEvent state:SyncConnected type:NodeDataChanged path:/clusterstate.json, has occurred - updating... (live nodes size: 1)
   [junit4]   2> 1060870 INFO  (zkCallback-956-thread-1-processing-n:127.0.0.1:58806__u%2Fa) [n:127.0.0.1:58806__u%2Fa    ] o.a.s.c.c.ZkStateReader A cluster state change: WatchedEvent state:SyncConnected type:NodeDataChanged path:/cluste

[...truncated too long message...]

rg.apache.http.impl.client.CloseableHttpClient.execute(CloseableHttpClient.java:55)
   [junit4]    > 	at org.apache.solr.client.solrj.impl.HttpSolrClient.executeMethod(HttpSolrClient.java:480)
   [junit4]    > 	... 11 moreThrowable #9: com.carrotsearch.randomizedtesting.UncaughtExceptionError: Captured an uncaught exception in thread: Thread[id=82475, name=collection3, state=RUNNABLE, group=TGRP-CollectionsAPIDistributedZkTest]
   [junit4]    > Caused by: java.lang.RuntimeException: org.apache.solr.client.solrj.SolrServerException: No live SolrServers available to handle this request:[http://127.0.0.1:53143, http://127.0.0.1:56163, http://127.0.0.1:58347, http://127.0.0.1:51284, http://127.0.0.1:48252]
   [junit4]    > 	at __randomizedtesting.SeedInfo.seed([21BCE81C1D8DC87E]:0)
   [junit4]    > 	at org.apache.solr.cloud.CollectionsAPIDistributedZkTest$1CollectionThread.run(CollectionsAPIDistributedZkTest.java:886)
   [junit4]    > Caused by: org.apache.solr.client.solrj.SolrServerException: No live SolrServers available to handle this request:[http://127.0.0.1:53143, http://127.0.0.1:56163, http://127.0.0.1:58347, http://127.0.0.1:51284, http://127.0.0.1:48252]
   [junit4]    > 	at org.apache.solr.client.solrj.impl.LBHttpSolrClient.request(LBHttpSolrClient.java:352)
   [junit4]    > 	at org.apache.solr.client.solrj.impl.CloudSolrClient.sendRequest(CloudSolrClient.java:1099)
   [junit4]    > 	at org.apache.solr.client.solrj.impl.CloudSolrClient.requestWithRetryOnStaleState(CloudSolrClient.java:870)
   [junit4]    > 	at org.apache.solr.client.solrj.impl.CloudSolrClient.request(CloudSolrClient.java:806)
   [junit4]    > 	at org.apache.solr.client.solrj.SolrClient.request(SolrClient.java:1220)
   [junit4]    > 	at org.apache.solr.cloud.AbstractFullDistribZkTestBase.createCollection(AbstractFullDistribZkTestBase.java:1573)
   [junit4]    > 	at org.apache.solr.cloud.AbstractFullDistribZkTestBase.createCollection(AbstractFullDistribZkTestBase.java:1594)
   [junit4]    > 	at org.apache.solr.cloud.CollectionsAPIDistributedZkTest$1CollectionThread.run(CollectionsAPIDistributedZkTest.java:876)
   [junit4]    > Caused by: org.apache.solr.client.solrj.SolrServerException: Timeout occured while waiting response from server at: http://127.0.0.1:53143
   [junit4]    > 	at org.apache.solr.client.solrj.impl.HttpSolrClient.executeMethod(HttpSolrClient.java:585)
   [junit4]    > 	at org.apache.solr.client.solrj.impl.HttpSolrClient.request(HttpSolrClient.java:241)
   [junit4]    > 	at org.apache.solr.client.solrj.impl.HttpSolrClient.request(HttpSolrClient.java:230)
   [junit4]    > 	at org.apache.solr.client.solrj.impl.LBHttpSolrClient.doRequest(LBHttpSolrClient.java:372)
   [junit4]    > 	at org.apache.solr.client.solrj.impl.LBHttpSolrClient.request(LBHttpSolrClient.java:325)
   [junit4]    > 	... 7 more
   [junit4]    > Caused by: java.net.SocketTimeoutException: Read timed out
   [junit4]    > 	at java.net.SocketInputStream.socketRead0(Native Method)
   [junit4]    > 	at java.net.SocketInputStream.read(SocketInputStream.java:152)
   [junit4]    > 	at java.net.SocketInputStream.read(SocketInputStream.java:122)
   [junit4]    > 	at org.apache.http.impl.io.AbstractSessionInputBuffer.fillBuffer(AbstractSessionInputBuffer.java:160)
   [junit4]    > 	at org.apache.http.impl.io.SocketInputBuffer.fillBuffer(SocketInputBuffer.java:84)
   [junit4]    > 	at org.apache.http.impl.io.AbstractSessionInputBuffer.readLine(AbstractSessionInputBuffer.java:273)
   [junit4]    > 	at org.apache.http.impl.conn.DefaultHttpResponseParser.parseHead(DefaultHttpResponseParser.java:140)
   [junit4]    > 	at org.apache.http.impl.conn.DefaultHttpResponseParser.parseHead(DefaultHttpResponseParser.java:57)
   [junit4]    > 	at org.apache.http.impl.io.AbstractMessageParser.parse(AbstractMessageParser.java:261)
   [junit4]    > 	at org.apache.http.impl.AbstractHttpClientConnection.receiveResponseHeader(AbstractHttpClientConnection.java:283)
   [junit4]    > 	at org.apache.http.impl.conn.DefaultClientConnection.receiveResponseHeader(DefaultClientConnection.java:251)
   [junit4]    > 	at org.apache.http.impl.conn.ManagedClientConnectionImpl.receiveResponseHeader(ManagedClientConnectionImpl.java:197)
   [junit4]    > 	at org.apache.http.protocol.HttpRequestExecutor.doReceiveResponse(HttpRequestExecutor.java:272)
   [junit4]    > 	at org.apache.http.protocol.HttpRequestExecutor.execute(HttpRequestExecutor.java:124)
   [junit4]    > 	at org.apache.http.impl.client.DefaultRequestDirector.tryExecute(DefaultRequestDirector.java:685)
   [junit4]    > 	at org.apache.http.impl.client.DefaultRequestDirector.execute(DefaultRequestDirector.java:487)
   [junit4]    > 	at org.apache.http.impl.client.AbstractHttpClient.doExecute(AbstractHttpClient.java:882)
   [junit4]    > 	at org.apache.http.impl.client.CloseableHttpClient.execute(CloseableHttpClient.java:82)
   [junit4]    > 	at org.apache.http.impl.client.CloseableHttpClient.execute(CloseableHttpClient.java:107)
   [junit4]    > 	at org.apache.http.impl.client.CloseableHttpClient.execute(CloseableHttpClient.java:55)
   [junit4]    > 	at org.apache.solr.client.solrj.impl.HttpSolrClient.executeMethod(HttpSolrClient.java:480)
   [junit4]    > 	... 11 moreThrowable #10: com.carrotsearch.randomizedtesting.UncaughtExceptionError: Captured an uncaught exception in thread: Thread[id=82472, name=collection0, state=RUNNABLE, group=TGRP-CollectionsAPIDistributedZkTest]
   [junit4]    > Caused by: java.lang.RuntimeException: org.apache.solr.client.solrj.SolrServerException: No live SolrServers available to handle this request:[http://127.0.0.1:53143, http://127.0.0.1:56163, http://127.0.0.1:58347, http://127.0.0.1:48252]
   [junit4]    > 	at __randomizedtesting.SeedInfo.seed([21BCE81C1D8DC87E]:0)
   [junit4]    > 	at org.apache.solr.cloud.CollectionsAPIDistributedZkTest$1CollectionThread.run(CollectionsAPIDistributedZkTest.java:886)
   [junit4]    > Caused by: org.apache.solr.client.solrj.SolrServerException: No live SolrServers available to handle this request:[http://127.0.0.1:53143, http://127.0.0.1:56163, http://127.0.0.1:58347, http://127.0.0.1:48252]
   [junit4]    > 	at org.apache.solr.client.solrj.impl.LBHttpSolrClient.request(LBHttpSolrClient.java:352)
   [junit4]    > 	at org.apache.solr.client.solrj.impl.CloudSolrClient.sendRequest(CloudSolrClient.java:1099)
   [junit4]    > 	at org.apache.solr.client.solrj.impl.CloudSolrClient.requestWithRetryOnStaleState(CloudSolrClient.java:870)
   [junit4]    > 	at org.apache.solr.client.solrj.impl.CloudSolrClient.request(CloudSolrClient.java:806)
   [junit4]    > 	at org.apache.solr.client.solrj.SolrClient.request(SolrClient.java:1220)
   [junit4]    > 	at org.apache.solr.cloud.CollectionsAPIDistributedZkTest$1CollectionThread.run(CollectionsAPIDistributedZkTest.java:883)
   [junit4]    > Caused by: org.apache.solr.client.solrj.impl.HttpSolrClient$RemoteSolrException: Error from server at http://127.0.0.1:53143: KeeperErrorCode = Session expired for /overseer/collection-queue-work/qnr-
   [junit4]    > 	at org.apache.solr.client.solrj.impl.HttpSolrClient.executeMethod(HttpSolrClient.java:575)
   [junit4]    > 	at org.apache.solr.client.solrj.impl.HttpSolrClient.request(HttpSolrClient.java:241)
   [junit4]    > 	at org.apache.solr.client.solrj.impl.HttpSolrClient.request(HttpSolrClient.java:230)
   [junit4]    > 	at org.apache.solr.client.solrj.impl.LBHttpSolrClient.doRequest(LBHttpSolrClient.java:372)
   [junit4]    > 	at org.apache.solr.client.solrj.impl.LBHttpSolrClient.request(LBHttpSolrClient.java:325)
   [junit4]    > 	... 5 more
   [junit4] Completed [506/548] on J1 in 7229.31s, 1 test, 11 errors <<< FAILURES!

[...truncated 129 lines...]
   [junit4] JVM J1: stdout was not empty, see: /x1/jenkins/jenkins-slave/workspace/Lucene-Solr-NightlyTests-5.x/solr/build/solr-core/test/temp/junit4-J1-20151121_033414_270.sysout
   [junit4] >>> JVM J1: stdout (verbatim) ----
   [junit4] java.lang.OutOfMemoryError: GC overhead limit exceeded
   [junit4] Dumping heap to /x1/jenkins/jenkins-slave/workspace/Lucene-Solr-NightlyTests-5.x/heapdumps/java_pid11232.hprof ...
   [junit4] Heap dump file created [642691216 bytes in 15.265 secs]
   [junit4] <<< JVM J1: EOF ----

   [junit4] JVM J1: stderr was not empty, see: /x1/jenkins/jenkins-slave/workspace/Lucene-Solr-NightlyTests-5.x/solr/build/solr-core/test/temp/junit4-J1-20151121_033414_270.syserr
   [junit4] >>> JVM J1: stderr (verbatim) ----
   [junit4] 
   [junit4] Exception: java.lang.OutOfMemoryError thrown from the UncaughtExceptionHandler in thread "OverseerThreadFactory-2368-thread-1"
   [junit4] <<< JVM J1: EOF ----

[...truncated 13 lines...]
BUILD FAILED
/x1/jenkins/jenkins-slave/workspace/Lucene-Solr-NightlyTests-5.x/build.xml:792: The following error occurred while executing this line:
/x1/jenkins/jenkins-slave/workspace/Lucene-Solr-NightlyTests-5.x/build.xml:729: The following error occurred while executing this line:
/x1/jenkins/jenkins-slave/workspace/Lucene-Solr-NightlyTests-5.x/build.xml:59: The following error occurred while executing this line:
/x1/jenkins/jenkins-slave/workspace/Lucene-Solr-NightlyTests-5.x/solr/build.xml:233: The following error occurred while executing this line:
/x1/jenkins/jenkins-slave/workspace/Lucene-Solr-NightlyTests-5.x/solr/common-build.xml:526: The following error occurred while executing this line:
/x1/jenkins/jenkins-slave/workspace/Lucene-Solr-NightlyTests-5.x/lucene/common-build.xml:1452: The following error occurred while executing this line:
/x1/jenkins/jenkins-slave/workspace/Lucene-Solr-NightlyTests-5.x/lucene/common-build.xml:1006: There were test failures: 548 suites (7 ignored), 2165 tests, 10 suite-level errors, 2 errors, 1 failure, 159 ignored (18 assumptions) [seed: 21BCE81C1D8DC87E]

Total time: 278 minutes 25 seconds
Build step 'Invoke Ant' marked build as failure
Archiving artifacts
Recording test results
Email was triggered for: Failure - Any
Sending email for trigger: Failure - Any



Mime
View raw message